##TITLE=1H_06-2025
 CDCl3
 8 sc, 
 14.1.2025
##JCAMPDX= 6.0         $$ Bruker NMR JCAMP-DX V2.0
##DATA TYPE= NMR FID
##DATA CLASS= NTUPLES
##ORIGIN= UXNMR, Bruker Analytische Messtechnik GmbH
##OWNER= root
$$ XWIN-NMR		Version 3.5
$$ Tue Jan 14 14:04:10 2025 Russian Standard Time (UT+4h)  she@DPX200
##.OBSERVE FREQUENCY= 200.1315
##.OBSERVE NUCLEUS= ^1H
##.DELAY= (6, 6)
##.ACQUISITION MODE= SIMULTANEOUS
##.ACQUISITION SCHEME= undefined
##.AVERAGES= 8
##.DIGITISER RES= 18
##SPECTROMETER/DATA SYSTEM= spect
##.PULSE SEQUENCE= zg30
##.SOLVENT NAME= D2O
##.SHIFT REFERENCE= (INTERNAL, D2O, 0, 15.7039)
##AUDIT TRAIL= $$ (NUMBER, WHEN, WHO, WHERE, WHAT)
$$ ##TITLE= Audit trail, XWIN-NMR		Version 3.5
$$ ##JCAMPDX= 5.01
$$ ##ORIGIN= Bruker BioSpin GmbH
$$ ##OWNER= she
$$ F:/spectra/data/she/nmr/H-F/1/audita.txt
$$ ##AUDIT TRAIL=  $$ (NUMBER, WHEN, WHO, WHERE, WHAT)
(   1,<2025-01-14 14:00:42.82 +0400>,<she>,<DPX200>,
      <created by zg, POWCHK disabled, PULCHK disabled
       configuration hash MD5:
       00 E9 B6 7A A2 85 ED C7 34 08 36 98 17 FE 4E 26
       data hash MD5: 16K
       AB DB 6E F0 17 D4 9A CC 3C 5D DE 6E D2 81 4A 02>)
$$ ##END=
$$ 
$$ hash MD5
$$ A0 42 FB AF 45 16 15 F4 A1 44 C4 AF 30 6F C0 7A
##$RELAX= 
##$RELAX= 
##$RELAX= 
##$RELAX= 
##$RELAX= 
##$RELAX= 
$$ Bruker specific parameters
$$ --------------------------
##$DU= <F:/spectra>
##$EXPNO= 1
##$NAME= <H-F>
##$PROCNO= 1
##$TYPE= <nmr>
##$USER= <she>
##$AMP= (0..31)
100 100 100 100 100 100 100 100 100 100 100 100 100 100 100 100 100 100 
100 100 100 100 100 100 100 100 100 100 100 100 100 100 
##$AQSEQ= 0
##$AQ_mod= 1
##$AUNM= <au_zg>
##$AUTOPOS= <>
##$BF1= 200.13
##$BF2= 200.13
##$BF3= 200.13
##$BF4= 200.13
##$BF5= 200.13
##$BF6= 200.13
##$BF7= 200.13
##$BF8= 200.13
##$BYTORDA= 1
##$CFDGTYP= 0
##$CFRGTYP= 5
##$CHEMSTR= <none>
##$CNST= (0..31)
1 1 145 1 1 1 1 1 1 1 1 1 1 1 1 1 1 1 1 1 1 1 1 1 1 1 1 1 1 1 1 1 
##$CPDPRG= <>
##$CPDPRG1= <>
##$CPDPRG2= <>
##$CPDPRG3= <>
##$CPDPRG4= <mlev>
##$CPDPRG5= <mlev>
##$CPDPRG6= <mlev>
##$CPDPRG7= <mlev>
##$CPDPRG8= <mlev>
##$CPDPRGB= <>
##$CPDPRGT= <>
##$D= (0..31)
0 1.2 0 0 0 0 0 0 0 0.06 0 0.03 0 0 0 0 0.0002 0 0 0 0 0 0 0 0 0 0 0 0 
0 0 0 
##$DATE= 1736848842
##$DBL= (0..7)
120 120 120 120 120 120 120 120 
##$DBP= (0..7)
150 150 150 150 150 150 150 150 
##$DBP07= 0
##$DBPNAM0= <>
##$DBPNAM1= <>
##$DBPNAM2= <>
##$DBPNAM3= <>
##$DBPNAM4= <>
##$DBPNAM5= <>
##$DBPNAM6= <>
##$DBPNAM7= <>
##$DBPOAL= (0..7)
0.5 0.5 0.5 0.5 0.5 0.5 0.5 0.5 
##$DBPOFFS= (0..7)
0 0 0 0 0 0 0 0 
##$DE= 6
##$DECBNUC= <off>
##$DECIM= 24
##$DECNUC= <off>
##$DECSTAT= 4
##$DIGMOD= 1
##$DIGTYP= 9
##$DL= (0..7)
0 120 120 120 120 120 120 120 
##$DP= (0..7)
150 150 150 150 150 150 150 150 
##$DP07= 0
##$DPNAME0= <>
##$DPNAME1= <>
##$DPNAME2= <>
##$DPNAME3= <>
##$DPNAME4= <>
##$DPNAME5= <>
##$DPNAME6= <>
##$DPNAME7= <>
##$DPOAL= (0..7)
0.5 0.5 0.5 0.5 0.5 0.5 0.5 0.5 
##$DPOFFS= (0..7)
0 0 0 0 0 0 0 0 
##$DQDMODE= 0
##$DR= 18
##$DS= 0
##$DSLIST= <SSSSSSSSSSSSSSS>
##$DSPFIRM= 0
$$ [...]
##$SUBNAM2= <"">
##$SUBNAM3= <"">
##$SUBNAM4= <"">
##$SUBNAM5= <"">
##$SUBNAM6= <"">
##$SUBNAM7= <"">
##$SUBNAM8= <"">
##$SUBNAM9= <"">
##$SW= 24.0689530833862
##$SWIBOX= (0..15)
0 0 2 0 0 0 0 0 0 0 0 0 0 0 0 0 
##$SW_h= 4816.95568400771
##$TD= 16384
##$TD0= 1
##$TE= 0
##$TE2= 300
##$TE3= 300
##$TEG= 300
##$TL= (0..7)
0 120 120 120 120 120 120 120 
##$TP= (0..7)
150 150 150 150 150 150 150 150 
##$TP07= 0
##$TPNAME0= <>
##$TPNAME1= <>
##$TPNAME2= <>
##$TPNAME3= <>
##$TPNAME4= <>
##$TPNAME5= <>
##$TPNAME6= <>
##$TPNAME7= <>
##$TPOAL= (0..7)
0.5 0.5 0.5 0.5 0.5 0.5 0.5 0.5 
##$TPOFFS= (0..7)
0 0 0 0 0 0 0 0 
##$TUNHIN= 0
##$TUNHOUT= 0
##$TUNXOUT= 0
##$USERA1= <user>
##$USERA2= <user>
##$USERA3= <user>
##$USERA4= <user>
##$USERA5= <user>
##$V9= 5
##$VALIST= <valist>
##$VCLIST= <CCCCCCCCCCCCCCC>
##$VD= 0
##$VDLIST= <DDDDDDDDDDDDDDD>
##$VPLIST= <PPPPPPPPPPPPPPP>
##$VTLIST= <TTTTTTTTTTTTTTT>
##$WBST= 1024
##$WBSW= 4
##$XGAIN= (0..3)
0 0 0 0 
##$XL= 0
##$YL= 0
##$YMAX_a= 821508
##$YMIN_a= -812977
##$ZGOPTNS= <>
##$ZL1= 120
##$ZL2= 120
##$ZL3= 120
##$ZL4= 120
##$ABSF1= 10
##$ABSF2= 0
##$ABSG= 5
##$ABSL= 3
##$ALPHA= 0
##$AQORDER= 0
##$ASSFAC= 0
##$ASSFACI= 0
##$ASSFACX= 0
##$ASSWID= 0
##$AUNMP= <proc_1d>
##$AZFE= 0.1
##$AZFW= 0.1
##$BCFW= 1
##$BC_mod= 2
##$BYTORDP= 1
##$COROFFS= 0
##$CY= 11.3945322036743
##$DATMOD= 1
##$DC= 2
##$DFILT= <>
##$DTYPP= 0
##$F1P= 15.6554695791079
##$F2P= 12.8336369535428
##$FCOR= 0.5
##$FTSIZE= 0
##$FT_mod= 4
##$GAMMA= 1
##$GB= 0.15
##$INTBC= 1
##$INTSCL= 1
##$ISEN= 128
##$LB= 0.24
##$LEV0= 0
##$LPBIN= 0
##$MAXI= 10000
##$MC2= 0
##$MEAN= 0
##$ME_mod= 0
##$MI= 1.114404
##$NCOEF= 0
##$NC_proc= 0
##$NLEV= 6
##$NOISF1= 3.799351
##$NOISF2= 2.8
##$NSP= 1
##$NTH_PI= 0
##$NZP= 0
##$OFFSET= 15.70392
##$PC= 1
##$PHC0= -26729.29
##$PHC1= 8.187439
##$PH_mod= 1
##$PKNL= yes
##$PPARMOD= 0
##$PSCAL= 0
##$PSIGN= 0
##$REVERSE= no
##$SF= 200.130013532006
##$SI= 16384
##$SIGF1= 3
##$SIGF2= 2
##$SINO= 400
##$SIOLD= 16384
##$SREGLST= <1H.CDCl3>
##$SSB= 0
##$STSI= 0
##$STSR= 0
##$SW_p= 3612.71676300578
##$SYMM= 0
##$S_DEV= 0
##$TDeff= 0
##$TDoff= 0
##$TI= <>
##$TILT= no
##$TM1= 0
##$TM2= 0
##$TOPLEV= 0
##$USERP1= <user>
##$USERP2= <user>
##$USERP3= <user>
##$USERP4= <user>
##$USERP5= <user>
##$WDW= 1
##$XDIM= 8192
##$YMAX_p= 0
##$YMIN_p= 0
$$ End of Bruker specific parameters
$$ ---------------------------------
##NTUPLES= NMR FID
##VAR_NAME=  TIME,          FID/REAL,        FID/IMAG
##SYMBOL=    X,             R,               I
##VAR_TYPE=  INDEPENDENT,   DEPENDENT,       DEPENDENT
##VAR_FORM=  AFFN,          ASDF,            ASDF
##VAR_DIM=   8192,          8192,            8192
##UNITS=     SECONDS,       ARBITRARY UNITS, ARBITRARY UNITS
##FACTOR=    0.0002076,     1,               1
##FIRST=     0,             0,               0
##LAST=      1.7004516,     0,               0
##MIN=       0,             -812977,         0
##MAX=       1.7004516,     821508,          0
$$ Real data points
##PAGE= N=1
##DATA TABLE= (X++(R..R)), XYDATA
$$ plain form
0 0 0 0 0 0 0 8 0 0 0 8 -8 6 -8 16 -18 16 -22 32 -37 43 -50 61 -73 82 -95 112 -132 147 -166 192 -218 244
32 244 -276 312 -352 390 -434 485 -545 603 -664 739 -819 904 -1000 1104 -1224 1356 -1498
49 -1498 1661 -1849 2058 -2294 2570 -2883 3228 -3568 3760 -3165 -1941 66684 821508 180393
63 180393 -812977 -53071 692294 -73510 -589025 346087 721866 -272451 -602190 379283
73 379283 648631 -207168 -383711 329536 329193 -292244 -143203 457876 231197 -353926 -156777
84 -156777 355150 194414 -209568 -83372 190720 16563 -201497 30891 275203 20503
94 20503 -273848 -43488 269940 69364 -203026 19907 237161 -62211 -241747 167107
104 167107 361025 -119842 -324640 190391 371264 -152167 -243224 309259 268523 -360911
$$ packed form
0@%%%%%Qq%%Qj6J4j4K4l4L4l8N4o9Q0r3J11j34J55j77K07k44K79l13L58m10M62
32B44n20N88o64P42q24R19j030J148j267J403j558J723j904K104k328K580k854
49a498L159l510L907m352M864n453O111o796P328o925J224O8625P54824o41115
63A80393r93370P59906P45365p65804n15515R35112L75779r94317l29739R81473
73C79283K69348q55799j76543P13247l43o21437J49041O01079k26679n85123J97149
84a56777N11927j60736m03982J26196K74092j74157k18060K32388K44312k54700
94B0503k94351K30360L13428k00576k72390K22933K17254k99372j79536M08854
104A67107J93918m80867k04798N15031J80873n23431r1057N52483m0736o29434
$$ plain form
114 -360911 -216680 479633 262126 -457738 -195704 460268 113136 -454955 -5562 466460
124 466460 -105240 -532032 101174 484042 -154769 -477140 113950 319594 -234003 -302732
134 -302732 246367 208815 -346929 -263168 266330 182337 -261312 -170661 163116 44777 -193839
145 -193839 -27874 173997 -12499 -218617 -53897 164683 58280 -138223 -73586 79145
155 79145 12791 -104100 7972 134779 -20212 -183979 -7968 194397 25961 -174042
165 -174042 965 168243 -40656 -154053 129821 210160 -144704 -203273 194598 229549
175 229549 -166571 -143942 233320 124225 -241615 -45348 317835 55680 -302954 -9848
185 -9848 312904 -2468 -265622 70997 254520 -121063 -241515 162223 234734 -173147
$$ packed form
114c60911J44231O96313k17507p19864K62034O55972l47132n68091M49393M72022
124D66460n71700m26792O33206L82868o38811l22371N91090K05644n53597o8729
134c02732N49099l7552n55744Q3761N29498q3993m43649R0651L33777j18339k38616
145a93839J65965K01871j86496k06118J64720K18580j06403j96503O4637J52731
155G9145o6354j16891J12072J26807j54991j63767J76011K02365j68436k00003
165a74042J75007J67278k08899j13397K83874Q0339l54864n8569L97871L4951
175B29549l96120K2629L77262j09095l65840J96267L63183k62155l58634K93106
185i848L22752l15372k63154L36619J83523l75583j20452M03738P2511m07881
$$ plain form
195 -173147 -210579 164259 156758 -169753 -108168 177221 69606 -188308 -55308 185575 56560
206 56560 -157576 -41200 138324 30784 -109538 7272 124242 -7431 -122381 13232
216 13232 134713 8752 -116101 -7230 103658 -8007 -106619 22097 108969 -55973
226 -55973 -147564 44217 134080 -77523 -156062 60830 102848 -122611 -115998 124464 73152
237 73152 -180968 -95243 163240 55853 -183323 -45115 167922 -3317 -180947 34160
247 34160 186935 -57737 -180855 81666 174416 -84259 -131705 117759 116492 -122686 -78733
258 -78733 150747 78664 -137253 -52096 138767 42193 -121170 -14499 118879 -3607 -116762
269 -116762 15506 111866 -24022 -108037 19985 87795 -30103 -80628 30709 68569 -41690
$$ packed form
195a73147l7432L74838p501l26511O1585K85389j07615k57914J33000K40883j29015
206E6560k14136J16376J79524j07540j40322J16810J16970j31673j14950J35613
216A3232J21481j25961j24853J08871J10888j11665r8612J28716Q6872j64942
226e5973r1591J91781Q9863k11603p8539K16892M2018k25459O613K40462n1312
237G3152k54120Q5725K58483j07387k39176J38208K13037j71239j77630K15107
247C4160J52775k44672j23118K62521R2750k58675m7446K49464j267k39178M3953
258g8733K29480p2083k15917Q5157J90863r6574j63363J06671J33378j22486j13155
269a16762J32268R6360j35888q4015J28022O7810j17898n0525J11337L7860j10259
$$ plain form
280 -41690 -73956 39596 73908 -41528 -75791 43416 73797 -48515 -66407 62732 65060
291 65060 -71294 -57328 85439 57533 -86806 -46015 94524 37132 -98452 -22011 107206
302 107206 8864 -114061 3519 114296 -21446 -115054 33776 103471 -55028 -98607 64738
313 64738 82182 -81112 -76152 82363 58707 -90740 -49647 90037 33169 -95193 -23231
324 -23231 94127 9814 -93347 2375 90345 -12144 -83164 23064 78632 -26554 -67815
335 -67815 34876 65711 -33083 -55545 41124 57376 -38949 -49129 48752 53186 -45339 -42427
347 -42427 55290 43268 -52089 -30199 63089 32153 -59518 -21757 68477 24572 -64375 -13504
359 -13504 72478 11410 -70464 3015 78407 -9329 -77065 21653 77966 -28506 -70975 38794
$$ packed form
280d1690l2266J13552L4312j15436l4263J19207L0381j22312j7892J29139K328
291F5060j36354J3966J42767k7906j44339M0791J40539n7392j35584P6441J29217
302A07206r8342j22925J17580J10777j35742r3608J48830O9695j58499m3579J63345
313F4738J7444j63294M960J58515k3656j49447M1093J39684n6868j28362P1962
324b3231J17358q4313j03161R5722Q7970j02489p1020J06228N5568j05186m1261
335f7815J02691L0835r8794k2462R6669J6252r6325j0180R7881M434r8525K912
347d2427R7717j2022r5357K1890R3288l0936r1671L7761R0234m3905q8947N0871
359a3504Q5982o1068q1874P3479P5392q7736o7736R8718N6313j06472m2469J09769
$$ plain form
371 38794 64243 -47894 -58111 54816 50850 -62892 -47380 64675 36703 -71616 -30555
382 -30555 70717 14325 -78210 -7261 74959 -7089 -77352 10811 67375 -22516 -64227 26437
394 26437 55195 -35430 -53272 38372 48608 -42494 -44808 45006 38805 -46842 -29492 51932
406 51932 23903 -52486 -15941 55564 14682 -50896 -8293 51076 6288 -47900 247 50482
418 50482 -3849 -51883 8720 52960 -13969 -53025 17403 47658 -26023 -46491 28838 39320
430 39320 -38012 -40970 37055 33440 -44966 -34428 43344 24202 -52311 -22448 51762 10334
442 10334 -59165 -6773 56029 -4792 -57712 8869 51116 -18126 -49690 21270 43518 -27724
454 -27724 -41560 30269 36382 -35542 -33862 37350 27409 -41184 -22853 40384 13946 -42980 -10544
$$ packed form
371C8794K5449j12137j0217J12927l966j13742J5512J12055k7972j08319M1061
382c0555J01272n6392r2535P0949Q2220q2048p0263Q8163N6564q9891m1711R0664
394B6437K8758r0625j7842R1644J0236r1102k314Q9814o201q5647J7350Q1424
406E1932k8029p6389L6545P1505m0882o5578M2603N9369m4788n4188M8147N0235
418E0482n4331m8034O0603M4240o6929l9056P0428L0255p3681k0468P5329J0482
430C9320p7332k958P8025l615p8406J0538P7772j9142p6513K9863P4210m1428
442A0334o9499N2392O2802o0821n2920O6581M2247o9242l1564P0960K2248p1242
454b7724j3836P1829O113p1924J680P1212r941o8593J8331O3237k6438n6926L2436
$$ plain form
467 -10544 39239 2655 -41914 -4513 35507 -1860 -39113 -2130 31810 -7277 -38154 5223
479 5223 32940 -15301 -39661 12203 33249 -18657 -33779 18275 28430 -22476 -25455 28895
491 28895 28838 -27444 -22248 38463 30526 -28903 -12025 46182 19982 -33461 5359 55726 8765
504 8765 -36598 14601 53000 658 -29176 23126 41711 -14584 -26467 32417 36936 -26333
516 -26333 -28601 30935 25245 -30439 -17495 29919 5020 -39018 -8569 32011 46 -38100
528 -38100 -9901 23361 -943 -27443 -1451 21564 -8646 -29635 7893 32469 -6099 -30276
540 -30276 7648 29335 -5033 -18450 17216 23760 -17097 -21207 25315 29843 -21403 -27765 21550
553 21550 20996 -28089 -17764 29175 3088 -47448 -12942 36437 -3462 -48866 -8951 25229
$$ packed form
467a0544M9783l6584m4569L7401M0020l7367l7253L6983L3940l9087l0877M3377
479E223K7717m8241k4360N1864K1046n1906j5122N2054J0155n0906k979N4350
491B8895n7n6282N196O0711p937n9429J6878N8207k6200n3443L8820N0367m6961
504H765m5363N1199L8399n2342k9834N2302J8585n6295j1883N8884M519o3269
516b6333k268N9536n690n5684J2944M7414k4899m4038L0449M0580l1965l8146
528c8100K8199L3262k4304k6500K5992K3015l0210k0989L7528K4576l8568k4177
540c0276L7924K1687l4368j3417L5666O544m0857m110M6522M528n1246o362M9315
553B1550n54m9085J0325M6939k6087n0536L4506M9379l9899m5404L9915L4180
$$ plain form
565 25229 -17539 -39655 9543 24160 -30881 -40803 18850 28249 -26788 -27826 23304 15112 -28737
578 -28737 -5512 38359 9362 -31000 -489 36266 11768 -14559 7042 24269 1470 -10913
590 -10913 15472 29676 824 -19210 5971 26994 6421 -11383 5701 15541 -5501 -12163
602 -12163 15001 24336 -7986 -24162 8376 28171 -2260 -17497 14599 19138 -19686 -12707 35833
615 35833 22553 -30868 -15347 34126 15128 -24240 2463 31063 -8060 -33254 14635 39290
627 39290 -12531 -36946 10939 26165 -19164 -20477 24186 10242 -37877 -15847 32377 9551
639 9551 -31492 -10574 18174 -2748 -18436 6852 17800 -10068 -21994 4961 20965 1124
651 1124 -14128 -980 8792 -1862 -6060 6787 9780 -7433 -16874 -350 16041 2101 -19530
$$ packed form
565B5229m2768k2116M9198J4617n5041r922N9653R399n5037j038N1130q192m3849
578b8737K3225M3871k8997m0362L0511L6755k4498k6327K1601J7227k2799j2383
590a0913K6385J4204k8852k0034K5181K1023k0573j7804J7084R840k1042o662
602a2163K7164R335l2322j6176L2538J9795l0431j5237L2096M539l8824O979M8540
615C5833j3280n3421J5521M9473j8998l9368K6703K8600l9123k5194M7889K4655
627C9290n1821k4415M7885J5226m5329j313M4663j3944m8119K2030M8224k2826
639I551m1043K0918K8748k0922j5688K5288J0948k7868j1926K6955J6004j9841
651A124j5252J3148R772j0654m198J2847K993j7213r441J6524J6391j3940k1631
$$ plain form
664 -19530 -8766 10517 -4874 -20136 5609 17457 -19818 -30628 13705 23630 -18711 -20999
676 -20999 18394 10364 -25130 -2510 36894 7676 -32587 1247 40504 7060 -21168 17409
688 17409 32916 -13440 -17422 36687 33476 -22290 -16160 30584 17309 -18600 1784 25787 -5323
701 -5323 -27275 5372 25307 -4812 -24456 -2836 8991 -8046 -10769 6386 2957 -16294 -12152
714 -12152 7903 10131 -2180 -8070 -3159 6141 8357 1691 3305 11644 2609 -8899 9944 27660
728 27660 4123 -15978 7264 22414 -1942 -9090 17546 13720 -21008 -13637 24491 13628 -26437
741 -26437 -13996 19353 -2002 -29104 3248 23958 -19100 -35350 12492 23555 -20940 -21412
753 -21412 18582 8042 -25805 -3076 29963 3647 -25503 1959 26654 2719 -12188 12193
$$ packed form
664a9530J0764J9283j5391j5262K5745J1848l7275j0810M4333R925m2341k288
676b0999L9393q030l5494K2620L9404k9218m0263L3834L9257l3444k8228L8577
688A7409J5507m6356l982N4109l211n5766O130M6744j3275l5909K0384K4003l1110
701e323k1952L2647J9935l0119j9644K1620J1827j7037k723J7155l429j9251M142
714a2152K0055K228j2311n890M911R300K216o666J614Q339r035j1508J8843J7716
728B7660k3537k0101K3242J5150k4356p148K6636l826l4728P371L8128j0863m0065
741b6437J2441L3349k1355k7102L2352K0710m3058j6250M7842J1063m4495m72
753b1412L9994j0540l3847K2729L3039k6316k9150K7462K4695k3935j4907K4381
$$ plain form
765 12193 18051 -8432 -7999 19941 16550 -9245 -6190 10677 5121 -3623 2908 3791 -4827 -5647 -1312
780 -1312 276 1948 -2359 -12297 -7846 5535 837 -11769 -4388 5125 -7168 -13675 5912 13090
794 13090 -10909 -17721 9230 14450 -12123 -10161 17528 6147 -22489 -1463 27173 -537 -25956
807 -25956 4986 22096 -11063 -18588 15646 13331 -22303 -14193 20114 7760 -23154 -7869 17458
820 17458 -2117 -21396 3341 17354 -10193 -18794 9622 13554 -11448 -8392 12157 4202 -10251
833 -10251 997 11468 1036 -5237 2429 5623 1911 848 1373 1647 2862 1458 -1551 1461 5486
848 5486 85 -6183 1393 8779 -1808 -9631 4837 11031 -7701 -10247 12707 10329 -14661 -5522
862 -5522 19702 4317 -17920 3706 22043 -3512 -16373 11743 19174 -9877 -11743 17592 13913
$$ packed form
765A2193N858k6483M33K7940l391k5795L055J6867n556q744O531Q83q618q20M335
780a312J588J672m307r938M451J3381m698j2606P381R513j2293o507J9587P178
794A3090k3999o812K6951N220k6573J962K7689j1381k8636K1026K8636k7710k5419
807b5956L0942J7110l3159p525L4234k315l5634Q110L4307j2354l0914J5285K5327
820A7458j9575j9279K4737J4013k7547q601K8416L932k5002L056K0549p955j4453
833a0251J1248J0471j0432o273P666L194l712j063N25K74J215j404l009L012M025
848E486n401o268P576P386j0587p823J4468O194j8732k546K2954k378k4990R139
862e522K5224j5385k2237K1626J8337k5555j2861K8116P431k9051j866K9335l679
$$ plain form
875 13913 -15767 -7571 20527 7112 -18874 -1223 19304 -3657 -18926 6880 15123 -12336
887 -12336 -15481 9378 7035 -13866 -7513 7844 -1385 -13138 -2570 7033 -2588 -10472 -2462 3511
901 3511 -2158 -4784 404 849 -3562 -2822 855 1684 1152 -2195 -4987 1245 6872 -1901 -6810 4229
917 4229 5242 -8597 -4194 12103 2759 -14890 -2802 13521 -558 -13198 2917 11250 -8310
930 -8310 -13205 9930 12834 -12330 -13002 12353 8876 -14279 -4250 16518 -31 -18139 3341
943 3341 18225 -4057 -14056 6830 10703 -7884 -5971 11490 6026 -10897 -4535 11006 5162
956 5162 -7462 -1205 7380 -1033 -6212 4704 7825 -3357 -5698 2582 4015 512 530 121 -809
971 -809 859 584 263 4142 2661 -5765 -3381 7675 5269 -5512 -2439 6023 255 -6441 3229
$$ packed form
875A3913k9680Q196K8098j3415k5986J7651K0527k2961j5269K5806Q243k7459
887a2336l145K4859k343k0901O353J5357r229j1753J0568R603r621p884Q010N973
901C511n669k626N188M45m411P40L677Q29n32l347k792O232N627q773m909J1039
917D229J013j3839M403J6297r344j7649J2088J6323j4079j2640J6115Q333j9560
930h310m895K3135K904k5164o72K5355l477k3155J0029K0768j6549j8108K1480
943C341J4884k2282r999K0886L873j8587J913J7461n464j6923O362J5541n844
956E162j2624O257Q585q413n179J0916L121j1182k341Q280J433l503J8m09r30
971h09J668k75l21L879j481q426K384J1056k406j0781L073Q462n768o696R670
$$ plain form
986 3229 10068 -3243 -11938 3055 12182 -3528 -10081 6272 6922 -11338 -5831 14489 4346 -16171
1000 -16171 -4244 13253 224 -11564 2816 9163 -7441 -10481 7744 10335 -7827 -9805 6376
1013 6376 6309 -7167 -2742 9330 418 -10681 795 10838 111 -6877 1372 4275 -1886 -1308
1027 -1308 3895 2511 -2817 -3383 1326 4522 1037 -3818 -1953 1867 -190 -2652 678 2386 -2941
1042 -2941 -6350 -428 5356 -622 -8014 -1935 4795 -3310 -7498 4227 5843 -9367 -8657 8427
1056 8427 6093 -9313 -3966 8599 399 -9193 2600 11607 -1694 -10266 3572 11444 -1648
1069 -1648 -6463 6963 7794 -6887 -3546 12276 6215 -9115 -1874 10072 1994 -5578 3247 6606
1083 6606 -3210 -5078 4328 6311 -1899 -4717 1421 3703 -1350 -1852 3125 1684 -3925 -1759 3981
$$ packed form
986C229O839j3311q695J4993R127j5710o553J6353O50j8260N507K0320j0143k0517
1000a6171J1927J7497j3029j1788J4380O347j6604l040J8225K591j8162j978J6181
1013F376o7j3476M425J2072q912j1099J1476J0043j0727o988Q249K903o161N78
1027a308N203j384n328n66M709L196l485m855J865L820k057k462L330J708n327
1042b941l409N922N784n978p392O079O730q105m188J1725J616j5210P10J7084
1056H427k334j5406N347J2565q200r592J1793R007j3301q572J3838P872j3092
1069a648m815J3426Q31j4681L341J5822o061j5330P241J1946q078p572Q825L359
1083F606r816j868R406J983q210k818O138K282n053n02M977j441n609K166N740
$$ plain form
1098 3981 2703 -1563 -1823 437 2219 1375 -1006 956 3436 -1062 -3565 4081 6623 -2970 -4736
1113 -4736 5128 4867 -4062 -1489 6561 1484 -6731 -668 7949 1008 -7856 -749 6927 -2080 -8247
1128 -8247 2968 6277 -7571 -8909 5600 3829 -9776 -5662 5168 -1474 -9757 -1784 4639 -3995
1142 -3995 -9313 -1029 3674 -3927 -7076 387 2359 -5115 -4854 3359 1927 -5340 -2353 3674 786
1157 786 -2444 433 1980 267 -51 627 1461 2296 61 -1716 1929 3752 -1218 -2608 2551 2471 -2881
1174 -2881 -2181 2904 1375 -4573 -2972 3517 1287 -6256 -2756 5247 -118 -7521 773 6820 -3349
1189 -3349 -6737 5440 6608 -5060 -3248 7776 4637 -4300 833 8629 2813 -3907 2847 9136
1203 9136 1664 -4002 4007 7691 -1364 -3039 5777 4124 -4856 -1862 4994 352 -4843 -893 1157
$$ packed form
1098C981j278m266k60K260J782q44k381J962K480m498k503P646K542r593j766
1113d736R864k61q929K573Q050n077q215O063Q617o941q864P107P676r007o167
1128h247J1215L309j3848j338J4509j771j3605M114J0830o642q283P973O423q634
1142c995n318Q284M703p601l149P463J972p474K61Q213j432p267K987O027k888
1157G86l230K877J547j713l18O78Q34Q35k235j777L645J823m970j390N159q0n352
1174b881P00N085j529n948J601O489k230p543L500Q003n365p403Q294O047j0169
1189c349l388J2177J168j1668J812J1024l139q937N133P796n816o720O754O289
1203I136p472n666Q009L684r055j675Q816j653q980K994O856m642n195L950K050
$$ plain form
1218 1157 -2529 -3286 -948 -880 -2494 -3291 -2474 -550 -539 -2623 -2622 -423 88 -1095 -930 930 1378 -1146
1236 -1146 -1470 3311 4240 -1790 -1859 5252 3428 -3565 1095 7297 -570 -5761 3288 6597 -2952 -4698
1252 -4698 3656 2814 -5246 -2835 4949 1025 -7419 -2928 5382 -18 -7026 9 4733 -3874 -5648
1267 -5648 4756 4497 -5549 -3226 5193 1861 -3063 1490 4113 -851 -2053 2741 3922 255 -1268
1282 -1268 995 1914 383 532 1632 -144 -1553 450 843 -448 616 -22 -3060 -786 3277 -382
1298 -382 -3763 1178 2241 -3615 -1535 5305 1087 -5555 -342 5270 -219 -3761 2107 3742 -3288
1313 -3288 -3837 4283 4141 -4934 -4217 4502 1498 -6390 -671 5414 -3349 -7741 2316 4503 -5096
1328 -5096 -4772 3123 639 -5238 -367 4365 -768 -4263 776 4049 286 -1197 2703 2935 -922
$$ packed form
1218A157l686p57K338O8j614p97Q17J924J1k084JK199N11j183J65J860M48k524
1236a146l24M781R29o030o9P111j824o993M660O202p867n191R049L309r549j746
1252d698Q354q42q060K411P784l924q444M491Q310n400p008P035M724q607j774
1267e648J0404k59j0046K323Q419l332m924M553K623m964j202M794J181l667j523
1282a268K263R19j531J49J100j776j409K003L93j291J064o38l038K274M063l659
1298c82l381M941J063n856K080O840m218o642N213N612n489l542N868J635p030
1313c288n49Q120j42r075P17Q719l004p888N719O085q763m392J0057K187r599
1328e096L24P895k484n877M871M732n133l495N039L273l763j483L900K32l857
$$ plain form
1343 -922 723 5168 2723 -823 2293 3515 285 1760 4384 315 -1653 2842 2258 -1965 453
1358 453 2872 -2328 -4023 2064 2161 -4102 -3398 1723 -423 -4926 -1129 3469 -1800 -6227 570 4872
1374 4872 -2689 -4582 4123 3384 -5304 -958 7722 1135 -5717 2358 6667 -1683 -3047 4949 3431
1389 3431 -4165 -1633 4782 1196 -4597 -1120 2988 -1991 -5126 527 1664 -5102 -4942 1262 -848
1404 -848 -5861 -1890 886 -4366 -4355 1187 -616 -4675 -1016 1241 -2507 -2193 2203 572 -2922 -59
1420 -59 3039 -10 -1963 2018 3187 -1690 -1709 4215 2895 -3726 -444 5509 -215 -4770 2964 4963
1436 4963 -4100 -3545 5403 2054 -5529 -206 5422 -1151 -4639 2690 4568 -2626 -2820 4254 3368 -3401
1452 -3401 -659 5874 1630 -3755 2154 6040 -1148 -2480 5022 3695 -3411 364 5595 117 -2797
$$ packed form
1343i22J645M445k445l546L116J222l230J475K624m069j968M495n84m223K418
1358D53K419n200j695O087R7o263P04N121k146m503L797M598n269m427O797M302
1374D872p561j893Q705p39q688M346Q680o587o852Q075M309q350j364P996j518
1389C431p596K532O415l586n793L477M108m979l135N653J137o766J60O204k110
1404h48n013L971K776n252J1N542j803m059L659K257l748L14M396j631l494K863
1420e9L098l049j953L981J169m877j9N924j320o621L282N953n724m555P734J999
1436D963r063N55Q948l349p583N323N628o573l488P329J878p194j94P074q86o769
1452c401K742O533m244n385N909L886p188j332P502j327p106L775N231n478k914
$$ plain form
1467 -2797 2867 2995 -2383 -734 3335 428 -2652 576 2255 -1332 -1924 1913 1307 -2898 -1153 3174
1483 3174 -106 -3637 1290 3252 -3026 -2640 4359 1408 -5069 61 4808 -1905 -4077 3276 2851
1498 2851 -4612 -2305 4308 521 -4877 -477 3635 -1945 -4898 1563 3289 -4109 -4387 3290 1575
1513 1575 -5569 -1472 4344 -2089 -5671 2120 3487 -4185 -2835 3532 223 -4134 710 3440 -1871
1528 -1871 -3013 1843 2152 -1979 -1016 2495 185 -2998 641 3428 -1250 -2907 2161 1562 -3306 -71
1544 -71 3995 -1526 -4214 2466 2981 -3329 -1376 3643 -573 -4104 1514 3927 -2142 -3374 2273 2351
1560 2351 -2749 -1087 3908 524 -4534 313 5143 -803 -4249 2456 3304 -3794 -1717 5341 686
1575 686 -5285 571 4476 -1615 -3004 2825 1734 -3596 -1030 3725 696 -3316 -204 2635 -798
$$ packed form
1467b797N664J28n378J649M069k907l080L228J679l587n92L837o06m205J745M327
1483C174l280l531M927J962o278L86O999k951o477N130M747o713k172P353m25
1498B851p463K307O613l787n398M400M112n580k953O461J726p398k78P677j715
1513A575p144M097N816o433l582P791J367p672J350O367l309m357M844K730n311
1528a871j142M856L09m131R63L511k310l183L639K787m678j657N068n99m868L235
1544g1M066n521k688O680N15o310J953N019m216l531N618K413o069j232N647P8
1560B351n100J662M995l384n058M847M830n946l446O705Q48p098K077P058m655
1575F86n971N856L905o091j389N829j091n330K566M755l029m012L112K839l433
$$ plain form
1590 -798 -2121 2209 2132 -3091 -1576 3582 791 -3039 1136 2586 -2628 -1542 3958 1166 -3582 342
1606 342 3137 -1332 -1643 2966 1453 -3088 -715 3361 642 -2550 442 2618 -1495 -2474 2925 2777
1622 2777 -3591 -2117 3915 719 -3911 1215 3789 -2993 -3438 3664 2454 -3807 -1238 3132 -499
1637 -499 -3110 1393 2751 -2184 -3071 1774 2223 -2153 -1595 2221 99 -3446 579 3386 -1730 -3328
1653 -3328 1894 1394 -2857 -318 2828 -1542 -3255 1542 1966 -2213 -1184 1598 -637 -2313 755
1668 755 1919 -1435 -2349 1066 1474 -1785 -926 2360 -81 -3319 824 3600 -1433 -2706 2689 1815
1684 1815 -3019 14 4193 -612 -3259 1936 3157 -1457 -1284 2709 1365 -2204 135 3413 686
1699 686 -2437 765 3237 -453 -1765 2613 2374 -2500 -684 3879 694 -2518 1575 2811 -1445
$$ packed form
1590g98j323M330p7n223J515N158k791l830M175J450n214J086N500k792m748L924
1606C42K795m469l11M609j513m541K373M076k719l192K992K176m113r79N399j48
1622B777o368J474O032l196m630N126K574o782m45P102j210o261K569M370l631
1637d99k611M503J358m935q87M845M49m376N58L816k122l545M025K807n116j598
1653c328N222n00m251K539L146m370j713M797M24m179J029K782k235j676L068
1668G55J164l354r14L415M08l259Q59L286k441l238M143K776n033j273N395q74
1684A815m834L033M179m805k647N195J221m614J73L993j344l569K339L278k727
1699F86l123L202K472l690j312M378k39m874J816M563l185l212M093J236m256
$$ plain form
1714 -1445 -764 3139 1122 -1861 636 2445 -18 -706 1540 1530 -846 -451 2014 1141 -1319 89
1730 89 2180 -349 -1650 1711 1656 -2415 -867 2658 -366 -2900 1074 1887 -2625 -1786 2229 252
1746 252 -2944 -387 1860 -1087 -2373 469 1361 -1851 -2183 1326 1062 -2856 -1429 2270 -300 -3393
1762 -3393 447 2273 -2306 -2490 1997 681 -3137 -489 2148 -1074 -2359 853 1036 -1703 -1241 1155
1778 1155 410 -1654 -605 1266 -72 -1777 426 1569 -1398 -1476 1805 628 -2188 144 1944 -1382
1794 -1382 -1608 1854 874 -2191 -68 1980 -524 -1394 1293 1250 -1396 -788 1646 1052 -1315 -233 2057
1811 2057 223 -1792 1093 2695 -1129 -1763 2493 1707 -2127 143 2995 -454 -2079 1827 2242 -1521
1827 -1521 -1007 1796 443 -1743 166 1620 -548 -1938 372 1511 -946 -1730 895 385 -2346 -525
$$ packed form
1714a445O81L903k017k983K497J809k463o88K246j0k376L95K465q73k460J408
1730H9K091k529j301L361n5m071J548L525l024k534L974Q13m512Q39M015j977
1746B52l196K557K247k947j286K842Q92l212l32L509k64l918J427L699k570l093
1762c393L840J826m579j84M487j316l818K648K637l222j285L212J83k739M62K396
1778A155p45k064J049J871j338j705K203J143k967p8L281j177k816K332J800l326
1794a382k26L462r80l065K123K048k504q70K687m3k646O08K434n94k367J082K290
1811B057j834k015K885J602l824o34M256p86l834K270K852l449j625L906M15l763
1827a521N14K803j353k186J909J454k168j390K310J139k457p84K625n10k731J821
$$ plain form
1843 -525 2009 -790 -2545 729 1164 -1882 -731 1859 -553 -2124 813 1546 -1054 -827 1113 250
1859 250 -1213 192 1717 -84 -1529 375 1627 -548 -1119 1406 909 -2227 -461 2567 -264 -2581
1875 -2581 815 1532 -1981 -1074 2209 111 -2690 6 1989 -608 -1422 858 984 -1407 -875 1750
1891 1750 1094 -1762 -505 1928 118 -1513 1203 1824 -1767 -1208 2353 829 -2082 245 1597 -1336
1907 -1336 -1277 1793 647 -2135 -703 1124 -318 -1161 344 661 -1328 -1426 1038 1021 -1662 -860 1398
1924 1398 -212 -1778 1132 1771 -1965 -1593 2184 817 -1994 551 1990 -1374 -1621 1943 1433 -1690
1940 -1690 -835 1383 228 -1344 358 1636 -808 -1954 863 1981 -1149 -1356 1744 506 -2054
1955 -2054 629 2711 -879 -1776 1961 1653 -1221 380 2540 -34 -1299 1735 2375 -166 -278 1640
$$ packed form
1843e25K534k799j755L274M35l046J151K590k412j571K937P33k600K27J940q63
1859B50j463J405J525j801j445J904J252k175n71K525m97l136J766L028k831k317
1875b581L396P17l513R07L283k098k801K696J983k597q14K280J26k391N32K625
1891A750o56k856J257K433j810j631K716O21l591N59L561j524k911K327J352k933
1907a336N9L070j146k782J432J827j442q43J505L17j989r8K464j7k683Q02K258
1924A398j610j566K910O39l736L72L777j367k811K545J439l364k47L564n10l123
1940a690Q55K218j155j572J702J278k444j146K817J118l130k07L100j238k560
1955b054K683K082l590q97L737l08k874J601K160k574j265L034O40k541j12J918
$$ plain form
1971 1640 1083 -635 519 2299 491 -1455 810 2340 -486 -997 1874 754 -2220 229 2663
1986 2663 -838 -2180 1208 967 -1907 -392 1909 -440 -2296 330 1523 -853 -1375 832 625 -1791
2002 -1791 -883 1787 295 -2539 -337 1864 -1136 -2017 1413 751 -2885 -1102 2078 -848 -2763 288
2018 288 674 -2263 -1509 1251 -417 -2721 -994 845 -852 -2128 -99 440 -1920 -1983 1162 539 -2460
2035 -2460 -840 1647 -857 -2115 1313 1404 -2377 -1092 2352 216 -1957 782 1639 -1241 -1024 1891
2051 1891 1019 -1577 -257 1756 348 -1343 687 1903 -754 -1397 1898 1766 -1577 -338 2581 109
2067 109 -1834 1725 2438 -1392 -836 2678 993 -1451 1004 2364 -346 -895 1939 1825 -761 -395
2083 -395 2006 1007 -1253 411 2305 -254 -1737 1497 1919 -1559 -914 2346 290 -2330 742 2139
$$ packed form
1971A640n57j718J154J780j808j946K265J530k826n11K871j120k974K449K434
1986B663l501j342L388k41k874J515K301k349j856K626J193k376n22K207k07k416
2002a791R08K670j492k834K202K201l000q81L430o62l636J783L180k926j915L051
2018B88L86k937P54K760j668k304J727J839j697j276K029N39k360o3L145o23k999
2035b460J620K487k504j258L428R1l781J285L444k136k173K739Q57k880K17K915
2051A891q72k596J320K013j408j691K030J216k657o43L295j32l343J239K919k472
2067A09j943L559P13l830N56L514j685k444K455J360k710n49K834j14k586L66
2083c95K401r99k260J664J894k559j483L234M22l478O45L260k056k620L072J397
$$ plain form
2099 2139 -1534 -1658 1677 645 -2033 -246 1695 -520 -1914 484 1301 -1103 -1472 1106 834 -1835
2115 -1835 -768 1830 -111 -2343 565 1812 -1759 -1587 1913 473 -2530 0 1975 -1157 -2029
2130 -2029 1219 1016 -1874 -795 1532 -87 -1968 16 1476 -801 -1712 950 1258 -1667 -1053 1984
2146 1984 249 -2279 458 2258 -1255 -1695 2012 1161 -2152 -72 2307 -374 -1747 1129 1617 -1222
2162 -1222 -853 1661 672 -1422 -40 1789 12 -1675 743 1788 -1129 -1328 2038 933 -2216 -19
2178 -19 2327 -673 -2005 1511 1383 -1863 -631 2026 9 -1864 485 1648 -748 -1175 1178 1074
2194 1074 -1357 -731 1688 405 -1882 136 1861 -797 -1633 1498 1213 -2083 -536 2163 -270 -1989
2210 -1989 1017 1541 -1537 -862 1724 316 -1702 55 1623 -296 -1347 910 1343 -1137 -1004 1613
$$ packed form
2099B139l673j24L335j032k678J787J941k215j394K398Q17k404l69K578k72k669
2115a835J067K598j941k232K908J247l571J72L500j440l003K530J975l132q72
2130b029L248k03k890J079K327j619j881J984J460k277r11K662L08k925O14L037
2146A984j735k528K737J800l513m40L707q51l313K080K379k681j373K876M88k839
2162a222L69K514r89k094J382J829j777j687K418J045k917j99L366j105l149K197
2178a9K346l000j332L516j28l246J232K657k017j873K349J163k396m27K353j04
2194A074k431O26K419j283k287K018J725k658q36L131k85l296J547K699k433j719
2210a989L006N24l078O75K586j408k018J757J568j919j051K257M33k480J33K617
$$ plain form
2226 1613 854 -1791 -34 2100 -499 -1870 1433 1575 -1951 -861 2152 -19 -2036 520 1532
2241 1532 -1277 -1443 1250 552 -1751 -816 1148 -260 -1794 -142 1261 -1094 -2028 810 812 -2048 -1204
2258 -1204 1453 -489 -2473 330 1283 -1836 -1700 1299 73 -2106 -235 1170 -998 -1703 504 663
2274 663 -1405 -1191 699 71 -1756 -412 1233 -712 -2018 559 1076 -1738 -1266 1503 -200 -2294
2290 -2294 261 1648 -1356 -1553 1312 573 -1765 -185 1610 -169 -1389 597 1513 -486 -834 1298
2306 1298 1202 -1023 -265 2135 683 -1369 837 2243 -544 -885 2133 1321 -1355 428 2223 -24
2322 -24 -895 1345 1331 -725 -121 1517 673 -793 249 1362 175 -1035 685 1258 -892 -800 1449
2339 1449 491 -1603 127 1564 -922 -1507 1225 750 -1745 -363 1369 -535 -1551 471 899 -1290
$$ packed form
2226A613p59k645J757K134k599j371L303J42l526J090L013k171k017K556J012
2241A532k809j66K693o98k303R35J964j408j534J652J403k355r34K838Kk860Q44
2258a204K657j942j984K803R53l119J36K999j226k179J871J405k168p05K207J59
2274F63k068K14J890o28j827J344J645j945j306K577N17k814M72K769j703k094
2290b294K555J387l004j97K865p39k338J580J795j779j220J986R16j999l48K132
2306A298r6k225P58K400j452k052K206J406k787l41L018q12k676J783J795k247
2322b4q71K240j4k056O04J638q44j466J042J113j187j210J720N73k150R2K249
2339A449r58k094J730J437k486n85K732m75k495J382J732j904j016K022M28k189
$$ plain form
2355 -1290 -1115 796 310 -1419 -641 1070 -233 -1736 17 1115 -1103 -1683 1048 573 -2032 -700
2371 -700 1369 -633 -2001 636 937 -1576 -979 931 -134 -1675 -366 727 -615 -1299 216 504
2387 504 -920 -957 757 401 -1455 -332 1156 -409 -1340 832 1048 -1286 -387 1665 56 -1277 687
2404 687 1239 -740 -421 1329 561 -782 215 1275 163 -625 523 1150 -348 -631 1200 1018 -1136
2421 -1136 -351 1534 95 -1377 775 1226 -1282 -987 1399 234 -1605 35 1041 -705 -1173 431
2437 431 516 -1068 -935 602 123 -1229 -512 890 -290 -1410 266 978 -1034 -1019 1021 208 -1423
2454 -1423 221 1198 -825 -1067 849 437 -1030 -120 820 -329 -843 309 663 -517 -671 497 405
2471 405 -772 -350 1038 -16 -1183 353 1317 -659 -767 1311 508 -1334 278 1589 -410 -912
$$ packed form
2355a290J75J911m86j729P78J711j303j503J753J098k218n80K731m75k605J332
2371g00K069k002j368K637L01k513N97J910j065j541J309J093j342o84J515K88
2387E04j424l7J714l56j856J123J488j565r31K172K16k334Q99K052j609j333J964
2404F87N52j979L19J750p68j343R97J060j112p88J148O27j498k83J831j82k154
2421a136P85J885j439j472K152M51k508K95K386j165j839J640J006j746m68J604
2437D31Q5j584J33J537m79j352P17J402j180j120J676P12k012J5K040q13j631
2454a423J644R77k023k42J916m12j467R10R40j149n14J152L54j180j54J168r2
2471D05j177M22J388j054j167J536R64j976j08K078q03j842J612J311j999n02
$$ plain form
2487 -912 1065 1092 -649 0 1307 455 -652 368 1359 264 -679 639 1159 -254 -367 1399 806
2504 806 -1131 57 1442 -238 -980 864 803 -1166 -311 1124 -197 -1141 231 345 -764 -585 295
2521 295 -11 -1008 -599 436 -162 -1120 -304 396 -943 -1105 482 155 -1563 -705 870 -635 -1495 437
2539 437 319 -1458 -704 847 -264 -1329 -98 481 -642 -774 384 467 -816 -722 594 394 -995
2556 -995 -290 1053 -295 -1128 837 1088 -914 -453 1311 217 -860 707 1216 -414 -373 998 697
2573 697 -267 227 956 298 -203 480 1118 317 -318 792 1166 -189 151 1405 455 -671 799 1434
2591 1434 -275 -64 1463 528 -559 939 1288 -198 -218 988 711 -266 73 798 172 -656 -84 919
2609 919 -226 -984 226 623 -961 -836 769 -169 -1661 -188 704 -1198 -1325 343 -137 -1635 -685
$$ packed form
2487i12J977K7j741O49J307q52j107J020R91j095r43J318N20j413j13J766n93
2504H06j937J188J385j680p42J844o1j969Q55J435j321r44J372J14j109J79Q80
2521B95l06r97M09J035n98r58Q16P00j339j62J587l27j718Q58J575j505q60J932
2539D37j18j777P54J551j111j065J231N79j123j32J158Q3j283R4J316k00j389
2556i95P05J343j348q33J965K51k002M61J764j094j077J567N09j630M1J371l01
2573F97r64M94P29o58n01O83O38q01o35J110L74j355L40J254r50j126J470O35
2591A434j709K11J527r35j087J498L49j486k0J206k77r77L39P25o26q28N72J003
2609I19j145p58J210L97j584J25J605r38j492J473Q92j902j27J668m80j498R50
$$ plain form
2626 -685 338 -664 -1324 -324 50 -767 -956 -15 107 -1031 -869 448 -94 -1194 -294 446 -906 -1108
2644 -1108 516 154 -1393 -271 574 -712 -1002 378 89 -990 -356 394 -312 -769 -50 234 -361 -671
2662 -671 291 506 -501 -484 864 460 -848 292 1284 -286 -611 1216 947 -723 258 1519 159
2679 159 -493 981 1009 -237 -66 945 721 -283 215 894 370 -431 381 1061 -130 -576 858 821 -695
2698 -695 -4 1283 -74 -811 756 883 -608 -220 982 85 -709 417 565 -291 -428 348 331 -494
2716 -494 -325 455 148 -741 -142 687 -375 -926 441 512 -1050 -433 943 -346 -1179 301 633 -1016
2734 -1016 -579 726 -3 -958 -71 518 -305 -621 199 579 -382 -571 546 486 -765 -272 937 -10 -1116
2753 -1116 416 784 -835 -474 978 85 -995 245 757 -592 -594 555 274 -590 -187 536 122 -507
$$ packed form
2626f85J023j002o60J000L74q17j89R41J22j138J62J317n42j100R00P40j352k02
2644a108J624l62j547J122Q45j286k90J380k89j079O34P50p06m57P19K84n95l10
2662f71R62K15j007J7J348m04j308J140R92j570l25J827k69j670R81J261j360
2679A59o52J474K8j246J71J011k24j004M98O79n24q01Q12O80j191m46J434l7j516
2698f95O91J287j357p37J567J27j491L88J202q97p94J126J48q56j37P76j7q25
2716d94J69P80l07q89N99Q29j062n51J367P1j562O17J376j289q33J480L32j649
2734a016M37J305p29r55Q87N89q23l16Q20L80r61j89J117o0j251M93J209r47j106
2753a116J532L68j619L61J452q93j080J240N12j349kJ149k81q64M03P23m14o29
$$ plain form
2771 -507 111 574 -172 -582 342 699 -530 -264 951 93 -840 363 962 -606 -433 900 201 -869
2789 -869 281 808 -336 -498 519 449 -449 -278 575 177 -552 -135 702 50 -865 162 867 -632 -642
2808 -642 982 345 -1066 90 896 -453 -783 718 420 -773 -100 768 21 -600 217 573 -235 -363
2826 -363 355 534 -430 -359 761 222 -755 132 981 -328 -661 889 450 -809 78 966 -192 -563 660
2845 660 550 -581 -1 665 194 -516 191 632 -98 -502 353 530 -453 -522 738 326 -809 -9 896
2864 896 -446 -882 739 525 -983 -202 813 -229 -860 378 449 -608 -488 528 224 -582 -218 424
2882 424 66 -581 -7 764 -237 -775 489 558 -782 -217 893 -214 -976 479 641 -760 -360 704
2900 704 -4 -732 210 512 -438 -497 322 325 -473 -338 401 188 -613 -9 796 -309 -769 496 573 -749
$$ packed form
2771e07O18M63p46m10R24L57j229K66J215q58r33J203N99j568J73J333o99j070
2789h69J150N27j144j62J017p0q98J71Q53l98p29M17Q37o52r15J027P05j499j0
2808f42J624o37j411J156Q06j349l30J501k98j193O73Q68p47o21Q17L56q08j28
2826c63P18J79r64P1J120n39r77Q87Q49j309l33J550m39j259Q87Q88j158l71J223
2845F60j10j131N80O66m71p10P07M41p30m04Q55J77r83o9J260m12j135Q00R05
2864H96j342m36J621k14j508P81J015j042o31J238P1j057J20J016l04q06L64O42
2882D24l58o47N74P71j001n38J264O9j340N65J110j107p62J455J62j401M00J064
2900G04p08p28R42L02r50n9Q19Lp98J35P39k13q01O04Q05j105m60J265P7j322
$$ plain form
2920 -749 -288 962 -44 -992 420 753 -591 -399 762 114 -661 121 682 -101 -495 179 528 -221
2938 -221 -442 450 513 -623 -325 890 121 -776 283 821 -576 -455 962 248 -800 314 718 -389
2956 -389 -435 503 281 -381 -145 499 106 -485 -39 514 -118 -540 251 517 -587 -446 736 126 -878
2975 -878 256 872 -485 -612 750 176 -731 93 839 -176 -566 465 474 -347 -273 426 289 -417 -148
2994 -148 625 76 -776 156 743 -423 -680 708 228 -1045 -163 707 -479 -698 454 267 -833 -229
3012 -229 453 -255 -593 9 284 -341 -548 171 273 -528 -521 466 204 -807 -10 738 -410 -709 486 381
3032 381 -774 -135 736 -264 -689 339 297 -554 -221 446 11 -483 -93 369 -22 -545 188 477 -357
3051 -357 -527 439 424 -648 -42 789 -152 -698 633 712 -674 -63 907 171 -503 441 607 -234 -136 523
$$ packed form
2920g49M61J250j006r48J412L33j344J92J161o48p75P82N61p83l94O74L49p49
2938b21k21Q92O3j136K98J215p69q97J059N38j397J21J417p14j048J114M04j107
2956c89m6R38k22o62K36O44l93n91M46N53o32m22P91K66j104J41J182o10j004
2975h78J134O16j357j27J362n74r07Q24P46j015l90J031Rq21P4O99j37p06K69
2994a48P73n49q52R32N87j166k57J388m80j273Q82Q70j186k19J152j87j100O04
3012b29O82p08l38O02K75o25k07P19J02q01PR87k62j011P97P48j148k99J195j05
3032C81j155O39Q71j000m25J028m2q51L33O67m35m94L90M62l91n23P33K89q34
3051c57j70R66j5j072O06Q31r41n46J331P9j386O11R70p36o74R44J66q41R8O59
$$ plain form
3071 523 477 -104 -18 592 452 -310 156 826 95 -474 560 712 -386 -72 917 64 -636 501 700 -406
3091 -406 -89 638 147 -443 251 504 -80 -260 211 365 -92 -270 388 273 -473 -150 570 -61 -826 314
3111 314 559 -557 -468 641 -1 -822 79 514 -605 -482 290 5 -654 -232 184 -220 -672 -233 192
3130 192 -310 -706 -5 290 -650 -589 350 -44 -962 -40 588 -525 -550 536 130 -766 -39 531 -348 -372
3150 -372 244 282 -302 -122 358 191 -211 -105 430 112 -418 130 645 -326 -426 674 456 -533 157 795
3170 795 -271 -393 779 574 -415 126 672 131 -214 422 559 20 -13 402 541 12 -92 637 368 -364
3190 -364 162 811 -101 -479 642 526 -527 -68 709 -121 -538 291 386 -482 -259 330 -97 -434 -51 183
3210 183 -73 -397 -38 367 -235 -430 358 321 -549 -132 666 -107 -571 270 345 -511 -197 518 -142 -659 155
$$ packed form
3071E23m6n81Q6O10j40p62M66O70p31n69J034J52j098L14R89q53p00J137J99j106
3091d06L17P27m91n90O94K53n84j80M71J54m57j78O58j15p46L23P20o31p65J140
3111C14K45j116Q9J109o42q21R01M35j119J23P72k85o59M22M16m04m52M39M25
3130A92n02l96P01K95r40O1R39l94r18R22O28j113k5J086m06q96P27N70q79k4
3150c72O16L8n84J80M80j67m02J06N35l18n30N48N15r71j00J100k18r89O90O38
3170G95j066j22J172k05r89N41N46n41l45O36J37n39l3M15J39n29j04P29k69p32
3190c64N26O49r12l78J121j16j053M59P77q30m17Q29R5q68K23N89m27l37L83K34
3210A83k56l24L59M05o02j95P88l7q70M17P98p73m64Q41P5q56L14P15o60n17Q14
$$ plain form
3231 155 231 -416 -340 172 -21 -468 -310 141 -82 -629 -337 314 -342 -764 172 312 -791 -398 497 -129
3251 -129 -765 174 489 -419 -265 586 176 -348 119 439 -46 -138 335 333 -6 -157 362 427 -249 -76 537
3272 537 69 -503 277 603 -412 -323 570 127 -580 177 482 -331 -280 426 134 -335 1 374 42 -157
3292 -157 164 331 42 -253 300 474 -255 -236 603 154 -562 188 660 -312 -316 608 297 -531 70 524 -141
3313 -141 -377 303 337 -358 -227 256 122 -320 -50 302 88 -434 39 436 -283 -381 437 268 -594 2 619
3334 619 -252 -351 406 260 -552 -119 410 -173 -339 129 74 -296 -281 86 145 -245 -312 185 -8 -442 -60 458
3356 458 -286 -545 307 275 -604 -198 488 -201 -489 302 245 -432 -142 352 75 -263 70 314 24 -289 78
3377 78 319 -192 -351 322 266 -510 -152 580 -62 -575 333 299 -568 -330 413 -84 -454 256 319 -226 -225 297
$$ packed form
3231A55P6o47P6N12j93m47J58M51k23n47K92O51o56m22R36J40j103L93Q95o26
3251a29o36R39L15r08J54Q51m10n24M67L20m85r2M73kl39j51N19O5o76J73O13
3272E37m68n72P80L26j015Q9Q93m43p07P57L05q13N1P06k92m69L36L73l32j99
3292a57L21J67k89k95N53J74p29J9Q39m49p16P50M72r72mR24l11q28O01M54o65
3313a41k36O80L4o95J31M83j34m42K70L52k14n22M73L97p19r8Q18j69q62N96O17
3334F19q71r9P57j46q12M33N29n83j66M68n5l70J5L67N9l90o7M97j93m34L82N18
3356D58p44k59Q52l2q79M06O86o89k88P91n7o77K90M94k77l38L33K44k90l13L67
3377G8K41n11j59O73n6p76L58P32o42n13R08l4q67K38P43m97l70P10O3n45JN22
$$ plain form
3399 297 176 -218 -24 277 154 -250 -2 475 -54 -300 309 432 -433 -176 603 46 -463 298 441 -324
3419 -324 -107 534 16 -352 265 406 -73 -105 357 268 -84 -144 389 254 -201 -4 489 26 -350 257 478
3440 478 -299 -226 585 208 -523 174 397 -242 -273 328 90 -425 25 306 -59 -253 14 267 -75 -228 161
3461 161 246 -217 -201 424 138 -435 80 448 -310 -359 485 121 -490 101 441 -269 -269 387 135 -173 32 313
3483 313 36 -245 24 270 -35 -250 107 297 -236 -289 425 135 -431 3 484 -278 -334 411 217 -460 -7
3504 -7 408 -92 -239 216 237 -111 -196 160 106 -232 -88 250 82 -384 54 358 -207 -365 386 329 -511 -58
3526 -58 596 -274 -411 379 256 -346 -89 413 -115 -302 135 210 -183 -166 74 168 -197 -219 201 198 -453 -99
3548 -99 452 -64 -419 240 267 -421 -70 433 -132 -407 284 336 -361 -52 338 58 -169 139 304 34 -68
$$ packed form
3399B97j21l94J94L01j23m04K48M77n29k46O09J23q65K57P79n57n09P61J43p65
3419c24K17O41n18l68O17J41m79l2M62q9l52o0N33j35m55J97M93m63l76O07K21
3440D78p77P3Q11l77p31O97K23o39l1O01k38n15M50K81l65j94K67K53l42j53L89
3461A61Q5m63J6O25k86n73N15L68p58m9Q44l64o11N91L40p10%O56k52l08K05K81
3483C13k77k81K69K46l05k15L57J90n33n3P14k90n66M34M81p62n6P45j94o77M53
3504gM15n00j47M55K1l48q5L56n4l38J44L38j68m66M38L04n65j58P51n7q40M53
3526e8O54q70j37P90j23o02K57N02n28j87M37P5l93J7K40R4l65k2M20lo51L54
3548i9N51n16l55O59K7o88L51N03n65k75O91N2o97L09L90k80k27L08J65k70j02
$$ plain form
3569 -68 142 416 1 -114 389 399 -209 48 562 84 -320 345 464 -313 -67 531 39 -382 256 297 -156
3590 -156 -189 181 131 -105 8 227 87 -118 -33 289 -45 -363 211 285 -208 -155 529 16 -382 277 424 -331
3612 -331 -231 401 75 -387 40 285 -177 -255 169 56 -333 -265 137 36 -330 -239 265 -109 -522 -21 208
3633 208 -392 -400 280 37 -523 -32 336 -283 -314 252 65 -286 -13 281 -87 -189 102 206 -76 -284 85
3654 85 250 -184 -111 366 105 -356 49 469 -94 -175 427 215 -336 171 442 -48 -90 355 290 -120 150 480
3676 480 138 -37 123 328 112 -16 177 427 -73 -208 491 246 -367 64 571 -107 -161 481 307 -302
3696 -302 42 384 -121 -170 254 170 -107 -137 193 134 -81 -100 256 1 -306 -8 326 -168 -425 328 150 -413
3718 -413 -84 257 -149 -499 113 107 -418 -85 236 -156 -393 -15 69 -207 -244 -15 12 -263 -337 48 47 -447 -122
$$ packed form
3569f8K10K74m15j15N03J0o08K57N14m78m04O65J19p77K46N98m92m21O38M1m53
3590a56l3L70n0k36J13K19j40k05Q5L22l34l18N74P4m93N3O84n13l98O59J47p55
3612c31J00O32l26m62M27K45m62p8M24j13l89O8M02j01l66R1N04l74m13N01K29
3633B08o00qO80k43n60M91L68o19l1N66j87l51K73K94l68j02K91J04k82k08L69
3654H5J65m34P3M77k61m61M05M20n63q1O02k12n51N07K71m90m2M45o5m10K70L30
3676D80l42j75J60K05k16j28J93K50n00j35O99k45o13M31N07o78n4O42j74o09
3696c02L44L42n05m9M24q4k77l0L30n9k15j9L56k55l07K98L34m94k57P53j78n63
3718d13L29L41m06l50O12on25L33L21l92k37L78Q4k76l7K29K7k75p4L85jm94L25
$$ plain form
3741 -122 153 -215 -494 24 157 -490 -131 377 -134 -375 95 120 -262 -174 169 62 -245 -24 121 0 -148
3762 -148 38 227 -42 -258 238 255 -239 -61 363 49 -325 167 440 -260 -183 519 108 -276 219 225 -117
3783 -117 -104 121 204 -144 65 175 160 -88 -57 295 45 -195 199 348 -179 -141 410 58 -253 229 313 -150
3805 -150 -171 346 75 -191 194 320 -85 -168 128 102 -113 -120 147 131 -219 -186 301 44 -391 60 299 -188
3827 -188 -246 292 138 -373 -13 334 -222 -247 217 181 -208 -18 120 -19 -206 -24 131 40 -253 50 182
3848 182 -119 -132 207 45 -312 -13 264 -240 -324 297 -19 -427 -118 242 -176 -364 120 10 -277 -184 43
3869 43 27 -141 -92 140 -21 -315 -18 294 -157 -280 171 105 -272 -50 361 -199 -300 249 218 -353 -166 343
3891 343 -107 -347 135 100 -126 -160 71 128 -172 -121 131 141 -251 -136 285 -135 -329 238 301 -276 -71 405
$$ packed form
3741a22K75l68k79N18J33o47L59N08n11k41M70K5l82Q8L43j07l07K21J45j21j48
3762a48J86J89k69k16M96J7m94J78M24l14l74M92K73p00P7P02m11l84M95Ol42
3783a17J3K25Q3l48K09J10j5k48L1L52k50k40L94J49n27L8N51l52l11M82Q4m63
3805a50k1N17k71k66L85J26m05q3K96k6k15pK67j6l50L3M87k57m35M51K39m87
3827a88n8N38j54n11L60L47n56k5M64l6l89J90J38j39j87J82J55r1k93L03J32
3848A82l01j3L39j62l57K99K77n04q4O21l16m08L09L60m18j88M84j10k87R3K27
3869D3j6j68M9K32j61k94K97L12m51j23M51o6l77K22M11n60j01N49l1n71J87N09
3891C43m50k40M82l5k26l4K31N7l00N1K52J0l92J15M21m20j94N67O3n77K05M76
$$ plain form
3913 405 -29 -246 170 317 -149 -78 294 54 -79 157 293 -17 -39 123 246 -76 -50 186 213 -239 -18
3934 -18 433 -3 -317 228 230 -208 -128 304 -2 -276 156 284 -206 -12 221 13 -87 40 197 130 -101 -23
3956 -23 308 37 -153 49 278 -215 -261 332 44 -347 91 144 -260 -234 222 0 -313 -95 51 -188 -266 3
3978 3 56 -204 -180 56 -10 -192 -148 221 15 -297 -74 184 -227 -277 298 89 -385 -12 244 -229 -179 229 71
4001 71 -267 12 189 -84 -40 -34 103 -93 -142 97 156 -167 -187 199 92 -233 -5 324 -139 -238 223 223 -195
4024 -195 83 264 -76 -129 249 208 -49 -47 178 148 -53 18 126 94 -145 -22 260 10 -191 303 135 -253
4046 -253 43 387 -51 -134 169 208 -154 2 344 -55 -133 157 147 -43 -57 88 66 -36 -96 121 82 -147 -33
4069 -33 178 -93 -237 195 169 -263 -164 308 -126 -283 116 63 -322 -104 121 -140 -152 2 5 -133 -197 -47 -19
$$ packed form
3913D05m34k17M16J47m66P1L72k40j33K36J36l10k2J62J23l22K6K36K7m52K21
3934a8M51m36l14N45Km38Q0M32l06k74M32J28m90J94K33k08j00J27J57o7k31P8
3956b3L31k71j90K02K29m93m6N93k88l91M38N3m04K6M56k22l13K18J46k39p8K69
3978CN3k60K4K36o6j82M4L69k06l12K23K58m11n0N75k09m74L73K56m73N0M08j58
4001G1l38K79J77k73M4OJ37j96m9K39N9l23k0L86j07l25K28L29m63r9M61%m18
4024a95K78J81l40n3L78m1k57KK25l0k01P1J08l2k39J23K82k50k01M94j68l88
4046b53K96L44m38q3L03L9l62J56L42l99p8K90j0j90j4J45k2j02o0K17l9k29J14
4069c3K11k71j44M32k6m32R9M72m34j57L99n3l85K18K25k61j2J54Lj38o4J50K8
$$ plain form
4092 -19 -58 -246 6 106 -173 -147 185 -47 -315 84 253 -273 -150 321 -18 -309 180 82 -142 -72 196 27
4114 27 -176 15 83 -27 -162 21 148 4 -164 28 173 -182 -263 170 -54 -366 74 146 -253 -180 225 -32
4136 -32 -317 122 229 -90 -155 78 4 25 -32 96 137 -91 -81 254 -55 -132 161 237 -72 -21 214 131 -232 73
4160 73 337 -105 -50 226 31 -248 12 241 -79 -115 3 28 -78 -37 33 59 -22 -125 87 76 -134 -4 231
4183 231 -63 -119 271 111 -235 80 260 -4 -94 258 83 -57 105 202 -24 -53 5 74 45 -72 15 93 -129
4206 -129 -167 77 59 -248 -72 200 -138 -260 211 75 -270 -68 114 -105 -236 104 26 -213 -90 37 2
4227 2 -50 -123 108 16 -220 -60 176 -82 -216 57 136 -188 -122 191 -139 -308 149 96 -317 -155 57 -141 -268
4250 -268 79 -50 -43 -61 -25 -3 28 -56 -30 81 -79 -52 184 58 -145 127 234 -140 -104 228 -13 -197 170
$$ packed form
4092a9l9j88K52J00k79K6L32k32k68L99J69n26J23M71l39k91M89r8k24P0K68j69
4114B7k03J91O8j10j35J83J27j44j68J92J45l55q1M33k24l12M40P2l99P3M05k57
4136c2k85M39J07l19o5K33p4K1n7J28M1k28J0L35l09p7K93P6l09N1K35q3l63L05
4160G3K64m42N5K76j95k79K60K29l20l6J18K5j06M1P0K6q1j03K12j1k10J30K35
4183B31k94n6L90j60l46L15J80k64r0L52j75j40J62R7k26k9N8O9k9j17Q7P8k22
4206a29l8K44j8l07J76K72l38j22M71j36l45K02J82k19j31L40p8k39J23J27l5
4227Bn2p3K31r2k36J60K36k58j34K73P9l24O6L13l30j69M57n3m13J62K12j98j27
4250b68L47j29Pj8L6K2L1q4K6J11j60K7K36j26k03K72J07l74L6L32k41j84L67
$$ plain form
4273 170 149 -266 23 174 34 32 96 156 23 31 4 133 -16 -156 89 184 -59 -53 170 113 -241 80 294 -85
4297 -85 -45 234 -19 -224 133 151 -115 -97 25 -34 -35 -54 51 10 -3 -58 129 65 -119 84 157 -144 -142 140 54
4322 54 -237 -67 194 -106 -99 186 10 -200 -23 57 -80 -9 74 21 -27 -23 14 59 -8 -42 13 -32 -266 -110 150
4347 150 -173 -317 82 47 -276 -70 21 -185 -110 88 -90 -284 -83 209 -61 23 -48 -16 -59 -155 -55 126 -115
4370 -115 -249 121 116 -179 -20 221 4 -178 163 119 -157 28 207 -40 -180 99 76 -140 -12 97 -2 9
4392 9 55 38 103 -80 -11 92 44 -59 162 169 -159 -17 284 30 -257 100 227 -78 -64 253 32 -67 53 131
4416 131 -3 32 131 37 44 17 109 149 75 36 145 54 -125 158 253 -109 -69 208 122 -121 147 108 -168 -63 204
4441 204 47 -135 68 103 -20 -60 137 42 -100 -86 14 113 -126 -77 104 65 -274 10 135 -114 -125 158 0
$$ packed form
4273A70k1m15K89J51j40kO4O0j33Qk7J29j49j40K45R5k43OK23n7l54L21K14l79
4297h5M0K79k53k05L57J8k66J8J22n9jj9J05m1j3n5J87o4j84K03P3l01KK82q6
4322E4k91J70K61l00PK85j76k10J77Q0j37P1Q3n3m8ML7M5o7l4N5m5k34J56K60
4347A50l23j44L99l5l23K06R1k06P5J98j78j94K01K92k70Q4p1L2m3r6J00J81k41
4370a15j34L70nk95J59K41k17j82L41m4k76J85J79k47j40K79k3k16J28J09r9J1
4392IM6j7O5j83O9J03m8j03K21Pl28J42L01k54k87L57J27l05J4L17k21r9J20P8
4416A31j34L5R9r4Pk7R2M0p4l9J09r1j79K83R5l62M0K77q6k43K68l9k76J05K67
4441B04j57j82K03L5j23m0J97r5j42J4J00R9k39M9J81l9l39K84J25k49j1K83j58
$$ plain form
4464 0 -191 51 82 -161 -170 104 28 -109 -10 -29 -60 -30 -71 34 20 -87 17 89 -171 -206 140 65 -182 -7 132
4489 132 -131 -125 115 -4 -155 21 152 -128 -63 26 32 -41 34 66 42 -15 -128 118 -12 -165 -77 173 -76 -163
4513 -163 124 72 -176 37 276 -94 -107 159 17 -129 11 123 -90 -23 61 130 25 -9 82 85 46 -19 147 137
4537 137 -109 28 272 28 -133 162 177 -57 61 153 -59 -5 155 133 -103 17 124 56 -38 -48 28 -44 -16
4560 -16 7 121 13 -169 80 156 -103 -25 160 -51 -132 114 179 -145 -17 89 -163 -195 49 94 -61 -10 8
4583 8 41 21 -110 -19 12 -90 -96 -72 62 -174 -25 176 -183 -201 156 -34 -150 -15 67 -172 -113 66 -26 -83 65
4608 65 -15 -154 -97 27 89 10 -94 -47 69 -104 -91 91 63 -176 -34 118 -90 -66 81 65 -231 3 143
4631 143 -101 -29 152 20 -73 2 -2 54 -48 31 117 32 -144 0 97 -89 -73 151 71 -178 52 212 -25 -120
$$ packed form
4464@j91K42L1k43rK74p6j37R9j9l1L0m1J05j4j07J04P2k60l5L46p5k47J75J39
4489A32k63OK40j19j51J76J31k80O5Q9Op3P5L2k4n7j13K46j30j53Q8K50k49q7
4513a63K87n2k48K13K39l70j3K66j42j46J40J12k13O7Q4O9j05l4R1Ll9o5J66j0
4537A37k46J37K44k44j61K95J5k34J18R2k12N4J60k2k36J20J07o8r4j0P6p2K8
4560a6K3J14j08j82K49P6k59P8J85k11q1K46O5l24J28J06k52l2K44M5j55N1J8
4583HL3k0j31R1L1j02oK4J34k36J49K01l59j8L57j90j16J35Q2k39N9J79r2n7J48
4608F5q0j39N7J24O2p9j04M7J16j73J3J82k8k39J42J52k08K4J47j6k96K34J40
4631A43k44P2J81j32r3P5mN6j02P9Q6q5j76J44R7j86J6K24q0k49K30J60k37r5
$$ plain form
4655 -120 255 67 -43 27 130 -29 -107 74 31 -51 43 85 -26 -43 -11 151 25 -73 42 98 -24 -106 248 163
4679 163 -186 -9 130 -10 -171 177 14 -151 9 94 -76 -106 56 -38 -61 -100 -77 52 -13 -112 72 31 -107
4702 -107 -26 199 -101 -144 120 48 -254 -18 139 -24 -153 80 -18 -32 -45 106 73 -102 -19 34 -6 -55 -1 108
4726 108 -42 -98 41 29 -98 -80 82 -32 -190 57 127 -104 -42 133 -42 -85 8 27 -70 -48 32 41 -41 -46 23 -3
4752 -3 -71 -52 90 31 -88 -23 52 -85 -88 113 -7 -154 88 61 -122 -29 166 71 -140 102 81 -63 -54 39 67 -27
4778 -27 -36 81 170 -42 -39 188 84 -69 75 137 -132 -87 223 -40 -150 73 89 -57 -45 116 -61 -92 7 91
4802 91 -40 -31 68 35 37 38 -22 96 2 -61 99 18 -246 96 82 -139 -97 187 38 -211 -56 83 -37 -228 38
4827 38 -11 -106 7 -68 -20 61 -61 88 14 -87 -60 117 -45 -126 77 4 -191 -5 133 -67 -163 141 -14 -158
$$ packed form
4655a20L75j88j10P0J03j59p8J81m3q2R4M2j11j7L2J62j26r8J15N6j22q2L54q5
4679A63l49J77J39j40j61L48j63j65J60Q5j70l0J62r4k3l9K3J29o5r9J84m1j38
4702a07Q1K25l00m3K64p2l02K36J57j63j29K33r8j4j3J51l3j75Q3N3m0m9N4J09
4726A08j50n6J39j2j27J8J62j14j58K47P0k31O2J75j75m3R3J9r7K2Q0Rq2nO9k6
4752co8J9J42n9j19O5P5j37lK01j20j47K42k7j83R3J95r5k11K42k1j44RR3K8r4
4778b7rJ17Q9k12LK27j04j53J44O2k69M5L10k63j10K23J6j46J2J61j77l1R9Q4
4802I1j31RR9l3KJo0J18r4o3J60q1k64L42j4k21M2K84j49k49J55J39j20j91K66
4827C8m9r5J13p5M8Q1j22J49p4j01K7J77j62q1K03p3j95J86J38k00r6L04j55j44
$$ plain form
4851 -158 -3 -17 -66 -123 -63 13 -90 -9 -28 -5 8 -136 -46 -7 -157 -123 96 -115 -155 109 21 -239 -101 120 -30
4876 -30 -122 90 124 -9 -40 119 39 -29 62 27 34 -18 43 31 25 -76 44 -10 -80 6 143 19 -62 23 52 -213 -49
4903 -49 78 -53 -126 137 17 -72 -24 16 33 -22 20 14 75 -54 46 34 51 -114 30 178 -116 -7 149 108 -99
4928 -99 129 52 -54 -63 66 12 5 0 79 -47 -36 56 27 3 -16 -32 42 -21 -53 44 -96 -34 50 83 -103 -34 142 52
4956 52 -148 92 131 -64 -104 107 5 -166 41 60 -35 -113 -39 -56 -37 -64 25 54 -25 -177 84 12 -188 57 32
4981 32 -93 -94 53 -43 -141 25 123 -38 -110 213 -55 21 -9 41 14 -39 51 33 12 -64 43 140 -31 -35 108 73 -129
5008 -129 4 134 24 -66 163 25 -124 23 74 -40 -93 54 53 23 41 86 93 24 18 -13 54 -14 -75 94 -35 -150
5034 -150 71 58 -103 -2 88 -55 -72 107 12 -92 64 153 -134 52 67 86 -10 -7 -24 45 37 -55 94 43 -43 69
$$ packed form
4851a58J55j4m9n7O0P6j03Q1j9K3J3j44R0L9j50L4K19k11m0K64q8k60J38K21j50
4876c0r2K12L4j33l1J59q0o8R1l5Pn2O1j2oj01J20n4p0Q6J37j24q1Q5K9k65J64
4903d9J27j31p3K63j20q9M8M0J7n5M2oO1j29J00j2J7j65J44J48k94J09J56m1k07
4928i9K28p7j06rJ29n4pnP9j26J1R2k9k4j9j6P4o3l2R7j40O2Q4L3j86O9J76r0
4956E2k00K40L9j95m0K11j02j71K07J9r5p8P4j7J9k7Q9K9p9j52K61p2k00K45k5
4981C2j25jJ47r6r8J66R8j61p2L23k68P6l0N0k7n3R0j8k1p6J07R7j71mJ43l5k02
5008a29J33J30j10r0K29j38j49J47N1j14n3J47jl0J8M5Po9ol1O7o8o1J69j29j15
5034a50K21j3j61J01R0j43j7J79r5j04J56Q9k87J86J5J9r6Lj7O9qr2J49n1q6J12
$$ plain form
5060 69 168 31 -149 53 35 -31 -31 113 -136 -71 80 79 -81 -80 82 -36 -109 -62 33 -86 -11 23 83 -58 -133 10
5086 10 -6 -109 -12 86 -1 -163 -11 120 -143 -172 94 -7 -98 -17 36 -149 -47 129 -23 -61 -54 34 26 -46 -38 90
5112 90 -22 -76 76 -8 10 -32 -6 73 -32 83 -9 -78 -160 82 -19 -20 15 -1 -60 -17 34 128 -63 -30 22 78 -46
5139 -46 -14 68 69 -97 112 115 -88 -51 205 32 -116 25 58 -125 7 0 68 -54 95 8 27 -70 36 84 52 8
5165 8 47 65 -15 69 195 127 -84 56 81 -121 13 120 10 -97 81 30 -43 7 125 76 -85 67 42 41 10
5190 10 14 34 70 -93 28 94 0 -128 97 35 -68 -45 79 -121 -103 89 42 -126 -22 43 -93 -21 -2 25 -72
5215 -72 -54 67 13 16 7 72 -36 -36 31 98 27 -111 73 60 -160 68 126 29 2 118 104 -72 73 53 -7 -80 55
5242 55 23 8 -46 0 22 -41 -46 -1 62 24 -27 82 -57 -138 86 68 -78 -28 111 2 -49 49 6 -152 0 107
$$ packed form
5060F9R9j37j80K02j8o6%J44k49O5J51jj60JJ62j18p3M7R5j19P5L4O0j41p5J43
5086A0j6j03R7R8q7j62J52J31k63k9K66j01r1Q1N3j85J02J76j52l8PQ8qp2QJ28
5112I0j12n4J52q4J8m2K6P9j05J15r2o9q2K42j01jL5j6n9M3N1R4j91L3N2N6j24
5139d6L2Q2Jj66K09Lk03L7K56j73j48J41L3j83J32pO8j22J49q7J9r7J06M8l2m4
5165HL9J8q0Q4J26o8k11J40K5k02J34J07j10j07J78n1p3N0J18m9j61J52k5jl1
5190A0MK0L6j63J21O6r4j28K25o2j03K3J24k00J8J92m7j68J04O5j36P2J9K7r7
5215g2J8J21n4LrO5j08%O7O7p1j38J84j3k20K28N8r7k7J16j4j76J45k0o0p3J35
5242E5l2j5n4M6K2o3nM5O3l8n1J09j39q1K24j8j46N0J39j09n1R8m3j58J52J07
$$ plain form
5268 107 -59 -44 101 31 33 2 43 85 153 4 53 31 -15 -13 160 130 -119 30 121 -20 21 102 17 -6 109 63 -69
5295 -69 31 -1 -71 -123 13 61 20 61 -25 91 13 -158 -55 53 -101 -69 83 32 -63 -36 76 -110 -66 24 -78
5320 -78 -184 -27 5 -36 27 -30 68 -75 -50 -30 70 -95 -35 20 -16 -204 46 18 -208 -44 36 -85 -70 19 -37
5345 -37 -80 0 113 84 -32 91 83 -56 -93 -19 57 -1 25 64 45 -51 -45 77 39 -131 -44 124 -42 -76 52 -48
5371 -48 -97 16 34 -92 3 75 -95 -36 24 -25 36 11 -12 59 95 -25 6 65 -22 22 57 40 24 108 200 53 -80
5398 -80 83 37 -45 23 95 47 12 -3 17 -104 -63 -56 -1 9 -38 -41 -3 -27 16 -22 -66 -147 -7 70 -112 -51 48 -50 -93
5427 -93 25 -71 -37 22 81 -79 -57 31 42 -96 11 -2 -31 19 -26 118 -10 -46 4 36 -37 -9 24 56 -72 -4 88
5454 88 -87 1 73 -20 -76 20 -48 -25 -3 -56 23 -25 -54 -85 16 8 -117 -36 118 -24 -84 68 -8 -71 6 -40 -77 -53
$$ packed form
5268A07j66J5J45p0Kl1M1M2O8j49M9k2m6KJ73l0k49J49R1j41M1Q1q5k3J15m6j32
5295f9J00l2p0n2J36M8m1M1q6J16p8j71J03J08j54L2J52n1r5K7J12j86M4R0j02
5320g8j06J57L2m1O3n7R8j43K5K0J00j65O0N5l6j88K50k8k26J64Q0j21J5Q9n6
5345c7m3Q0J13k9j16J23qj39l7P4P6n8K6L9j9r6OJ22l8j70Q7J68j66l4J28j00
5371d8m9J13J8j26R5P2j70N9O0m9O1k5k3P1L6j20L1N9q7M4L5j7j6Q4R2j47j33
5398h0J63m6q2O8P2m8l5j5K0j21M1PN5J0m7lL8k4M3l8m4q1J40P7j82O1R9r8m3
5427i3J18r6L4N9N9j60K2Q8J1j38J07j3k9N0m5J44j28l6N0L2p3K8L3L2j28O8R2
5454H8j75Q8P2r3n6R6o8K3K2n3P9m8k9l1J01qj25Q1J54j42o0J52p6o3P7m6l7K4
$$ plain form
5482 -53 13 -8 -133 34 124 30 -30 17 -7 81 -56 52 19 -33 -146 17 50 -1 36 108 -83 36 62 39 -19 -10 85
5509 85 -84 -44 47 4 -85 -12 98 -74 -16 36 -2 8 21 23 15 11 -53 -19 35 -54 61 81 -81 -36 90 -12 -88 97
5537 97 67 -62 9 115 -10 -36 4 -54 -3 -15 26 43 19 -36 26 63 -46 -65 52 32 -138 54 111 -33 -20 41
5563 41 50 -60 63 54 -20 -59 37 -31 -15 -47 -12 20 9 -18 -23 3 -20 18 53 -99 -45 -20 4 -44 -38 -49 -67 -8 2 6 -132
5594 -132 -23 52 -33 -92 30 -4 -68 -58 -58 -4 24 -75 39 16 -34 -51 72 45 -108 34 45 -29 75 22 -6 9 45
5621 45 53 10 85 109 11 16 79 -34 33 41 12 49 -68 -23 30 70 -42 40 97 -73 -84 151 134 -50 -1 70 45 -30 36
5650 36 -17 -63 3 137 -4 14 19 54 18 -31 12 73 44 -4 30 12 -22 -18 85 59 -5 67 21 -6 -11 70 -27 -67 14 41
5680 41 -2 -21 -23 -70 19 -36 55 -28 -57 43 13 40 -78 84 88 -55 -80 24 37 -14 16 -63 -88 -9 -42 -33 -7 21 32
$$ packed form
5482e3O6k1j25J67R0r4o0M7k4Q8j37J08l3n2j13J63L3n1L7P2j91J19K6k3n8RR5
5509H5j69M0R1m3q9P3J10j72N8N2l8J0J3Kqmo4L4N4q9J15K0j62M5J26j02p6J85
5537I7l0j29P1J06j25k6M0n8N1j2M1J7k4n5O2L7j09j9J17k0j70J92N7j44J3O1
5563D1Rj10J23rp4l9R6o8J6l2L5L2j1k7nK6k3L8L5j52N4K5K4m8Oj1j8N9J0Mj38
5594a32J09P5q5n9J22l4o4J0%N4K8r9J14k3n0j7J23k7j53J42J1p4J04n3k8J5L6
5621D5Qm3P5K4r8NO3j13O7Qk9L7j17M5N3M0j12Q2N7j70j1K35j7j84M9P1k5p5O6
5650C6n3m6O6J34j41J8NL5l6m9M3O1k9m8L4j8l4MJ03k6o4P2m6k7nQ1r7m0Q1K7
5680D1m3j9km7Q9n5R1q3k9J00l0K7j18J62Mj43k5J04J3n1L0p9k5P9l3RK6K8J1
$$ plain form
5709 32 -64 27 -55 25 29 -12 -6 97 -64 -77 -23 25 -87 -88 63 -79 -54 64 -41 1 64 92 -20 -5 85 -62 52
5736 52 11 26 -34 -7 7 45 82 -47 14 -24 -57 67 109 -20 -10 17 83 -14 -36 106 -54 0 19 52 -1 -51 -10 76
5764 76 -7 -55 -13 50 56 18 -13 -12 75 47 -21 36 -129 26 50 -11 28 62 -10 63 108 2 41 77 97 64 -17 15 64 23
5794 23 -91 18 20 -47 -133 68 19 -97 1 -22 31 -59 -24 -16 -91 72 26 -52 -119 -33 -16 -87 52 -70 38 -91 -5
5821 -5 -34 14 92 5 117 -77 -36 62 35 10 21 16 -35 -42 90 41 -26 -7 15 -69 82 121 2 23 -43 -2 -34 -7 -43
5850 -43 -9 -5 6 1 61 44 -113 72 -13 -121 -103 -42 -26 -22 54 5 -116 26 103 48 -24 69 49 -45 23 33 -31 26 32 22
5880 22 72 -30 -65 67 4 -32 39 84 -15 48 103 -46 104 114 -46 -64 56 23 -19 -13 -32 41 -22 20 16 -6 91 65
5908 65 116 111 -10 -70 8 49 -58 1 10 106 -78 173 1 -78 3 -18 2 -148 139 7 -71 -73 -75 -48 -12 29 -87 49
$$ packed form
5709C2r6R1q2Q0Mm1OJ03j61j3N4M8j12jJ51j42K5J18j05M2O3K8j12J5R0j47J14
5736E2m1J5o0K7J4L8L7j29O1l8l3J24M2j29J0K7O6r7k2J42j60N4J9L3n3n0M1Q6
5764G6q3m8M2O3Ol8l1JQ7k8o8N7j65J55K4o1L9L4p2P3M5j06L9L6K0l3q1L2M9m1
5794B3j14J09Ko7q6K01m9j16R8k3N3r0L5Qp5J63m6p8o7Q6J7p1J39j22J08j29Q6
5821ek9M8P8q7J12j94M1R8k7k5J1nn1pJ32m9o7J9K2q4J51L9j19K1o6M1l2K7l6
5850d3L4MJ1nO0j7j57J85q5j08J8O1J6MP6m9j21J42P7n5p2R3k0r4O8J0o4N7Oj0
5880B2N0j02l5J32o3l6P1M5r9O3N5j49J50J0j60j8J20l3m2Oj9P3o3M2mk2R7k6
5908F5N1nj21o0P8M1j07N9RR6j84K51j72p9Q1k1K0j50K87j32p8kkK7L6M1j16J36
$$ plain form
5936 49 -20 -105 8 39 -60 85 49 -41 47 17 -40 0 42 46 25 91 47 -72 -32 -58 49 -71 -48 -8 -42 5 -59 -15
5964 -15 -19 -30 -21 57 26 11 39 40 -10 33 78 -64 -41 117 -10 -48 -12 -9 16 0 23 -3 21 10 31 88 -2 -17 17 41 34
5995 34 -42 -6 41 -58 35 29 -27 62 91 20 20 55 91 58 89 109 -3 73 76 31 74 -36 43 32 39 -27 -55 44 9 25 98
6026 98 9 -75 51 13 -59 43 -12 -54 34 94 -3 3 -2 -84 -15 11 -96 -104 -25 44 0 0 -8 -147 27 53 -66 -19 11 -53
6056 -53 -3 -14 39 -76 -27 -15 -25 -108 -66 34 -24 -53 -42 -49 56 65 -22 3 -26 -41 -12 78 -113 21 59 -35 3 74 -9
6085 -9 -43 36 -14 -84 -83 -5 -68 -100 -10 -66 -14 -76 -53 54 -73 -24 -38 -1 -27 -126 -32 40 27 74 64 -17 -69 33 -50 -63
6115 -63 32 43 -48 14 51 -19 8 30 40 -17 67 13 37 16 8 27 94 -9 -49 -45 83 79 -64 73 41 -2 68 -15 -45 76
6145 76 80 -30 -93 55 -85 51 -17 5 17 -9 -8 53 89 -35 -6 28 -59 -31 23 29 -95 -25 4 -51 35 -20 40 -78
$$ packed form
5936D9o9q5J13L1r9J45l6r0Q8l0n7M0M2Mk1O6m4j19M0k6J07j20K3M0l4M7o4M4
5964a5mj1RP8l1j5K8Jn0M3M5j42K3J58j27l8L6LK5j6K3k6K4j1K1N7r0j5L4K4p
5995C4p6L6M7r9R3on6Q9K9p1%L5L6l3L1K0j12P6Lm5M3j10P9j1Po6k8R9l5J6P3
6026I8q9q4J26l8p2J02n5m2Q8O0r7Onq2O9K6j07qP9O9m4%qj39J74K6j19M7L0o4
6056e3N0j1N3j15M9J2j0q3M2J00n8k9J1pJ05Rq7K5k9j5K9R0j91J34L8r4L8P1q3
6085il4P9n0p0JP8o3l2R0n6N2o2K3J07j27M9j4L7k6r9R4P2j3M7j0q1n2J02q3j3
6115f3R5J1r1O2L7p0K7K2J0n7Q4n4K4k1qJ9O7j03m0MJ28mj43J37l2m3P0q3l0J21
6145G6Mj10o3J48j40J36o8K2J2k6JO1L6j24K9L4q7K8N4Oj24P0K9n5Q6n5O0j18
$$ plain form
6173 -78 -7 2 -19 37 -26 -6 3 83 7 21 7 -58 -64 27 -97 -27 59 8 -87 61 -115 35 -68 30 -47 -100 64 -11 -31
6202 -31 10 -52 -27 -110 -77 -12 -18 -93 30 83 -25 -62 28 31 -49 -7 26 -12 20 62 74 5 15 -5 27 -25 -63 32 42 3
6232 3 -26 73 -11 74 30 34 5 15 4 26 -40 29 73 48 28 20 106 -38 29 -30 -93 -87 -20 -28 26 27 14 55 -90 32 33 1
6264 1 35 -55 -35 -75 -62 47 75 -109 0 59 -32 -26 62 -44 -33 -10 9 -61 28 -43 44 63 -8 -27 37 11 -65 -86 -10
6293 -10 30 16 88 -64 -107 38 28 -44 24 21 14 -79 7 -112 -33 -23 10 -82 -17 -96 -3 -39 56 2 -21 -72 -9 -56 -4 84
6323 84 -135 -20 29 -62 44 -33 -55 -28 -16 -84 -46 9 67 -149 -42 22 -76 -9 7 -39 -7 -13 29 -25 -21 -28 25 0 -94
6352 -94 -27 73 -57 -73 -2 124 43 92 -32 -44 1 38 -19 12 128 18 36 44 -25 -21 30 19 -7 -14 12 -21 85 11
6380 11 -37 -13 39 21 -20 90 65 30 33 19 45 -70 61 28 2 -59 42 27 12 47 -24 30 36 -15 62 128 -70 -5 18
$$ packed form
6173g8P1Rk1N6o3K0RQ0p6J4j4o5oR1j24P0Q6n1r5J48j76J50j03R8p7n3J64p5k0
6202c1M1o2K5q3L3O5op5J23N3j08l7R0Lq0M2L3l8L2M2J2o9J0k0L2n2l8R5J0l9
6232Ck9R9q4Q5m4Mk9J0j1K2o6O9M4k5k0qQ6j44O7n9o3OO7qN4Jj3M1j45J22Jl2
6264AL4r0K0m0J3J09K8j84J09N9r1OQ8j06J1K3J9p0Q9p1Q7J9p1j9O4k6p6k1P6
6293a0M0j4P2j52m3J45j0p2O8lpr3Q6j19P9J0L3r2O5p9R3l6R5n4k3n1O3m7N2Q8
6323H4k19J15M9r1J06p7k2K7J2o8L8N5N8k16J07O4r8O7J6m6L2oM2n4MpN3k5r4
6352i4O7J00j30j6P1J26q1M9j24j2M5L7n7L1J16j10J8Qo9MN1j1k6pK6l3J06p4
6380A1m8K4N2j8m1J10k5l5Lj4K6j15J31l3k6o1J01j5j5L5p1N4On1P7O6j98O5K3
$$ plain form
6409 18 45 -35 9 -45 -32 94 47 -28 31 121 -89 83 25 -4 20 -110 -29 -35 32 -57 -76 -47 -22 47 -7 104 66 -48
6437 -48 55 -74 -34 29 20 -8 44 -50 -24 23 -73 17 -17 -49 -87 -62 -9 -106 5 11 7 -87 48 17 -25 46 -30 -73 126
6466 126 24 -32 -59 162 40 -76 -48 -51 3 -10 9 -102 -4 11 -51 -73 -53 -8 -29 68 42 -14 -3 30 15 31 78 -25
6494 -25 14 27 15 -21 52 19 -29 -45 -48 -30 22 10 86 50 10 19 53 -10 -37 116 6 -119 49 128 -31 -59 -109 -34 -68
6523 -68 87 77 -14 1 -27 -52 -30 -14 -31 -29 -23 -114 28 -11 -35 -62 25 -16 31 54 5 9 -26 -75 18 -77 41 9 -44 -13
6553 -13 27 -25 -66 -1 3 -53 -34 29 -65 -19 64 2 -61 -14 13 -8 -33 -31 -28 49 -1 -125 77 -6 -74 -29 4 -79 -73 19 -103
6584 -103 13 -33 96 41 10 47 8 -55 -55 -50 -27 -4 42 3 10 -1 -34 53 -89 26 3 13 -65 -4 26 -109 72 66 -19
6613 -19 -18 6 -29 -25 -37 -5 -48 -11 7 32 55 -4 -9 -12 106 18 -8 55 25 56 -15 -28 -134 83 68 -27 -24 17 25 83 9 -42
$$ packed form
6409A8K7q0M4n4J3J26m7p5N9R0k10J72n8k9K4j30Q1oO7q9j9K9K5O9n4J11l8j14
6437d8J03j29M0O3rk8N2r4K6M7r6R0l4l2l8K5N3r7J11Omr4J35l1m2P1p6m3J99
6466A26j02n6k7K21j22j16K8lN4j3J9j11R8J5o2k2K0M5k1R7k6n6J1L3j5J6M7j03
6494b5L9J3j2l6P3l3m8j6lJ8N2j2P6l6m0RL4o3k7J53j10j25J68P9j59k8n0P5l4
6523f8J55j0r1J5k8k5K2J6j7KOr1J42l9k4k7Q7m1M7K3m9Ml5m9R3r5J18l2n3L1
6553a3M0n2m1O5Mn6J9O3r4M6Q3o2o3M7K7k1k5KLP7n0j24K02q3o8M5L3q3OR2j22
6584a03J16m6J29n5l1L7l9o3%NK3K3M6l9Pj1l3Q7j42J15k3J0p8O1L0j35J81oq5
6613a9JK4l5Mj2L2m3L7J8K5K3n9nlJ18q8k6O3l0L1p1j3j06K17j5r5LM1QN8p4n1
$$ plain form
6645 -42 -20 -10 -80 28 65 32 -112 27 -34 -33 23 -25 -23 -64 -17 27 -12 89 -58 -34 50 -86 8 -32 -24 -71 -93 40
6673 40 -48 -6 -6 27 -60 19 -16 -40 -11 -52 42 39 15 -106 74 -8 28 -18 30 -29 -18 -64 4 5 -15 -9 28 -17 -31 -21 25
6704 25 -24 -16 -11 -57 23 67 18 -1 63 72 78 -23 -25 -60 -13 -1 1 -14 -42 75 -65 -14 35 36 10 69 -12 23 -21 43 -5 88
6736 88 27 13 17 43 -27 -15 119 64 -103 47 45 65 -57 -38 -64 -29 45 69 10 8 -13 8 35 -73 -55 21 82 -5 13
6765 13 26 -89 -36 126 6 -69 35 -46 68 85 -50 36 -19 -26 81 -41 -17 51 -23 54 28 25 -66 8 71 9 -1
6792 -1 -21 -79 122 25 17 45 39 -43 -125 12 -89 -49 81 34 -1 -6 -10 6 -89 107 23 46 -40 -53 106 -61 -105 -35 65
6821 65 -100 -79 25 -39 -28 33 -36 -49 45 6 -49 51 8 3 20 3 -71 -10 23 -45 -58 73 -91 -11 17 -58 18 35
6849 35 -3 -92 63 89 -21 -6 53 -28 38 23 -1 -10 3 65 49 37 55 -3 -111 -11 -6 16 60 98 27 40 -57 34 -5
$$ packed form
6645d2K2J0p0J08L7l3j44J39o1JN6m8Km1M7M4l9J01j47K4Q4j36R4m0Qm7k2J33
6673D0q8M2%L3q7P9l5k4K9m1R4lk4j21J80q2L6m6M8n9J1m6O8Jk0OL7m5j4J0M6
6704B5m9QNm6Q0M4m9j9O4ROj01kl5M7J2Kj5k8J17j40N1M9Jk6N9q1L5m4O4m8R3
6736H8o1j4MK6p0J2J34n5j67J50kK0j22J9k6L5P4K4n9kk1K1K7j08J8P6O1q7J8
6765A3J3j15N3J62j20p5J04q1J14J7j35Q6n5pJ07j22K4O8p4P7k6lr1P4O3o2j0
6792ak0n8K01r7qK8oq2q2J37j01M0J30m7l5nmJ6r5J96q4K3q6j3J59j67m4P0J00
6821F5j65K1J04o4J1O1o9j3R4l9n5J00m3nJ7j7p4O1L3o8j3J31j64Q0K8p5P6J7
6849C5l8q9J55K6j10J5N9q1O6j5k4rJ3O2j6j2J8n8j08J00NK2M4L8p1J3r7R1l9
$$ plain form
6878 -5 52 -53 -76 13 28 -52 -20 75 -35 127 73 -56 -69 -67 -46 -13 3 -35 7 33 -11 -73 16 -5 -49 68 1 0 39
6907 39 -49 55 -6 -18 -38 22 32 -28 -55 -28 -29 -93 27 81 34 71 34 -82 0 129 -9 -109 -86 -15 -57 5 35 4
6935 4 36 73 -23 -43 10 4 -66 -19 12 46 30 -17 38 -97 -1 10 -48 54 -53 -7 -57 0 -32 45 -36 43 7 -34 -31 38
6965 38 -35 -27 -61 59 16 54 -49 -2 0 -12 -32 -15 49 -43 -42 -36 45 -13 -66 -15 -83 -84 27 -26 9 -14 -32 -38 21 -2 40 -19
6997 -19 63 -21 -13 95 -45 -45 -60 7 32 -7 63 -16 -17 -40 1 -38 7 -30 43 -18 -19 50 -45 -25 1 -22 39 13 -67 -57 -66 -44
7029 -44 -4 -9 -48 40 -44 14 -27 -10 -54 -49 44 -33 20 -31 -51 -68 42 47 11 44 20 -20 -33 23 -49 -69 -49 25 -104 -38 -8
7060 -8 63 2 -26 -41 37 -7 -26 -7 21 -16 -26 17 20 41 -56 -25 -45 24 37 -81 -21 -4 7 7 2 15 31 -4 51 49 55 29 -29
7093 -29 39 34 -11 54 -76 -56 64 42 -89 33 11 -29 -21 44 -37 -43 -26 -15 -7 -12 16 -68 9 74 26 72 14 14 16 -4 -29 -56
$$ packed form
6878eN7j05k3Q9J5q0L2R5j10J62n4j29j3KK1L3J6l8M2K6m4o2Q9k1m4J17o7jL9
6907C9q8J04o1j2k0O0J0o0k7K7jo4J20N4m7L7l7j16Q2J29j38j00K3P1m2O2L0l1
6935DL2L7r6k0N3op0M7L1L4j6m7N5j35R6J1n8J02j07M6n0N7l2P7q1P9l6m1LO9
6965C8p3Ql4J20m3L8j03M7Kj2k0J7O4r2JOQ1n8n3N1o8jJ11n3L5k3j8oN9k3M2n9
6997a9Q2q4QJ08j40%j5O7K5l9P0p9jk3M1l9M5l7P3o1jO9r5K0K6k3O1k6q0J0rK2
7029d4M0nl9Q8q4N8m1J7m4NR3p7N3n1k0j7J10Nl6L3k4m0j3N6p2k0K0P4j29O6L0
7060hP1o1k8j5P8m4j9J9K8l7j0M3LK1r7L1k0O9J3j18O0J7J1%nJ3J6l5N5kOk6n8
7093b9O8nm5O5j30K0J20k2j31J22k2m0QO5q1oJ7J1QnK8q4P7O5m8M6n8%Kk0k5k7
$$ plain form
7125 -56 57 14 142 -67 41 14 -41 -12 43 -17 17 -28 8 -26 3 4 47 62 -57 -6 -45 -30 -19 -61 -46 42 76 3
7153 3 -75 -42 -88 -18 39 52 -8 -16 36 -88 -37 -23 -48 -45 24 -16 -13 -30 -21 -41 -7 -64 3 -112 -12 -52 44 85 -43 -15 39
7184 39 78 -121 -66 -70 -67 -15 -48 12 8 61 -44 -18 2 45 7 1 31 -14 26 42 -35 -2 24 -49 68 54 -83 11 31 45
7214 45 3 -33 70 -51 -10 69 -109 -74 142 -60 -81 -32 -1 2 56 60 -120 40 4 9 47 46 -52 -14 -7 -22 -64 -46 4
7243 4 16 -4 29 40 48 8 -79 -13 19 92 41 -18 31 64 140 34 -24 80 -44 0 -46 -30 0 -70 -53 -82 19 56 2
7272 2 -28 -31 19 -18 -36 -20 -73 -52 25 -38 -8 3 6 0 -58 13 27 -42 2 -37 -36 34 -5 -25 5 -36 4 34 39 35 -66 33 35 -16
7306 -16 5 60 8 -21 30 30 -10 -36 -30 -35 42 -65 -65 -66 41 6 -105 -5 9 7 -23 3 -38 60 -35 -25 121 -38 10 17 78
7337 78 1 54 -15 29 3 18 13 12 54 43 -9 -14 -12 52 -67 57 90 5 24 -27 -18 -34 0 7 -61 -21 6 83 67 -36 61 -7
$$ packed form
7125e6J13m3J28k09J08k7n5K9N5o0L4m5L6l4K9JM3J5j19N1l9J5J1m2J5Q8L4p3
7153Cp8L3m6P0N7J3o0qN2j24N1J4k5LO9m0Lj7Rk0L4n7O7j15J00m0R6M1j28K8N4
7184C9L9j99N5mLN2l3O0mN3j05K6K0M3l8oL0m5M0J6p7L3K6p3J17j4j37R4K0J4
7214D5m2l6J03j21M1P9j78L5K16k02k1M9L1LN4Mj80J60l6NL8jr8L8Pj5m2J8N0
7243DJ2k0L3J1Qm0q7O6L2P3n1n9M9L3P6j06n8J04j24M4m6J6L0p0J7k9J01L7n4
7272Bl0lN0l7j8J6n3K1P7o3L0J1Lon8P1J4o9M4l9JP0l9k0L0m1M0L0Nmj01R9Kn1
7306a6K1N5n2k9N1%m0k6OnP7j07%jJ07l5j11J00J4kl0K6m1R8r5J0J46j59M8PO1
7337G8p7N3o9M4k6J5njM2j1n2nKO4j19J24L3q5J9n1Rj6L4Po8M0K7P7j6j03R7o8
$$ plain form
7369 -7 73 49 41 -71 70 -35 -61 44 46 -39 -111 134 12 -5 -53 -119 -60 14 -67 1 31 -67 -41 26 -13 29 -17 12 33
7398 33 -30 31 -66 102 62 9 -60 10 17 17 38 30 -70 -40 10 -39 0 -58 47 -85 -27 -19 -37 55 -30 21 -41 14 -66 -34
7428 -34 -14 -62 -77 9 -9 49 49 -84 31 -43 -97 34 -16 0 -44 10 -25 -76 10 34 5 69 -41 0 11 -11 -8 30 -19
7457 -19 13 -78 23 39 -23 22 45 -42 -95 -26 26 -40 42 3 12 -16 -1 40 29 34 -28 -58 12 -9 57 23 -19 10 93 -17
7487 -17 -37 -14 52 45 -17 -47 -15 53 9 34 -34 -13 -50 -126 -90 70 -41 58 34 -66 81 -70 36 -35 20 -1 1 46
7515 46 28 -32 83 61 -31 -27 -47 -24 -35 -3 -3 124 41 -28 40 -54 98 -77 28 31 -4 7 3 105 -25 72 -53 110
7543 110 -34 -22 8 -61 59 -4 -10 -3 7 -15 107 -50 -58 -72 -21 -114 -96 -16 0 26 -53 -38 9 60 81 26 -24 -2 -42
7572 -42 7 22 -43 -5 -6 -55 15 -37 8 -27 17 32 -2 36 3 -9 93 -3 57 -19 -68 -26 59 27 -46 -118 -38 -77 35 61
$$ packed form
7369gQ0k4qj12J41j05k6J05Kq5p2K45j22j7m8o6N9P4q1O8L0r8K6O7l9M2m6K9K1
7398C3o3O1r7J68m0n3o9P0P%K1qj00L0N0m9L9n8J05j32N8Qj8R2q5N1o2N5q0L2
7428c4K0m8j5Q6j8N8%j33J15p4n4J31n0J6m4N4l5n1Q6K4k9O4j10M1J1k2LL8m9
7457a9L2r1J01J6o2M5K3q7n3O9N2o6Q2l9Rk8J5M1j1No2l0P0k1O6l4m2K9Q3j10
7487a7k0K3O6po2l0L2O8m4K5o8K1l7p6L6J60j11R9k4j00J47j51J06p1N5k1KM5
7515D6j8o0J15k2r2Mk0K3j1L2%J27q3o9O8r4J52j75J05Ll5J1mJ02j30R7j25J63
7543A10j44J2L0o9J20o3oPJ0k2J22j57qj4N1r3J8Q0J6K6p9J5M7N1K1n5n0K2m0
7572d2M9J5o5L8jm9P0n2M5l5M4J5l4L8l3j2J02r6O0p6m9M2Q5l2p3p2Q0l9J12K6
$$ plain form
7602 61 80 89 31 15 32 -60 -35 -29 -48 78 30 7 47 -13 -23 36 -36 -44 66 -29 17 -31 38 -99 -50 14 -32 -13 39 69
7632 69 65 35 -57 8 -57 -7 -28 -43 -4 16 16 -106 -13 59 7 27 28 -11 -36 -27 -53 -37 -62 0 -49 99 -8 -38 -23 14 -30
7663 -30 -46 -54 14 67 -72 -27 -31 -33 1 62 73 28 -19 -37 -99 12 -3 -37 -53 48 -53 20 56 -9 -28 36 -3 43 12 73
7693 73 55 4 77 80 43 68 -10 -20 27 3 -70 6 29 -8 51 -27 -43 -10 -2 -82 -26 -7 57 -58 -41 25 -10 27 -11 28 55
7724 55 -37 34 -84 -15 31 -80 -14 70 -10 -1 -54 -43 -73 4 69 55 52 26 -32 22 -44 -41 -16 61 13 30 36 27 36 54 -105 4
7756 4 -9 -60 15 -12 -57 -88 6 -48 15 12 -12 0 -42 22 27 60 -13 -27 3 6 29 -49 -54 -8 3 -6 3 72 9 -31 -68 -97 -16 -64
7790 -64 10 -68 26 -12 33 28 -112 31 -49 18 -19 -23 -108 -16 18 -111 32 -23 -12 20 13 12 -82 96 -3 56 -82 -11 -58
7819 -58 12 34 -44 15 7 29 83 -31 -49 76 -22 -52 12 37 -53 -16 -98 15 -13 -20 20 69 53 -28 47 28 -17 33 -62 45
$$ packed form
7602F1J9Rn8j6J7r2K5Oj9J26m8k3M0o0j0N9p2qJ10r5M6m8O9j37M9O4m6J9N2L0
7632F9ml0r2O5o5N0k1j5L9K0%j22R3P2n2K0Jl9k5Rk6J6k5O2m9J48j07l0J5L7m4
7663c0j6qO8N3j39M5mkL4O1J1m5m7j8o2J11j5l4j6J01j01P3L6o5j9O4l9M6l1O1
7693G3j8n1P3Ll7K5p8j0M7k4p3P6K3l7N9p8j6L3Qq0N6J9O4j15J7O6l5L7l8L9K7
7724E5r2P1j18O9M6j11O6Q4q0Rn3J1l0P7O5j4lk6n8N4o6LK5P7m8J7OrRJ8j59J09
7756Dj3n1P5k7m5l1R4n4O3lk4J2m2O4NL3p3j4L0LK3p8nM6J1rRO9o3m0l7k9Q1m8
7790f4P4p8R4l8M5nj40J43q0O7l7mq5R2L4j29J43n5J1L2pjr4J78r9N9j38P1m7
7819e8P0K2p8N9qK2N4j14j8J25r8l0O4K5r0L7q2J13k8pM0M9j6q1P5j9m5N0r5J07
$$ plain form
7849 45 2 11 -54 60 -49 -90 -75 69 -18 35 64 -43 12 56 13 -23 -69 -51 27 23 51 -23 -1 -36 -10 -57 68 -20 -92
7878 -92 -2 11 14 -4 -15 36 48 16 -11 -27 24 -37 -71 15 7 0 -14 -68 99 38 -44 -39 -90 -3 -42 77 -7 -93 38 -29 11
7909 11 -3 134 -15 -142 11 82 13 29 -11 -63 57 15 99 -29 -38 5 31 59 49 54 -35 -88 -80 20 -65 -36 -64 -36
7937 -36 -129 19 12 -6 -2 -21 14 -22 23 -38 -43 -38 36 -42 -40 -28 -68 29 6 -21 57 43 -3 -62 34 -8 4 29 66 34 20 10
7969 10 57 63 25 19 56 -14 77 -74 19 4 31 -3 3 16 -4 20 -24 -106 23 61 -49 4 61 -20 -9 -1 -20 36 -74 -146
7999 -146 29 -11 6 -24 -77 -3 19 -40 56 -60 19 -33 -5 74 -42 16 41 0 25 -59 -88 9 -64 9 28 -49 7 18
8027 18 -35 34 52 -3 -35 3 6 56 2 -68 48 -96 23 -45 -71 19 -67 19 38 87 -31 -108 -7 -15 29 -53 1 32 38
8056 38 -60 25 2 -2 35 -27 -6 10 12 -35 -42 -4 -32 63 -9 -74 2 -50 102 0 71 42 48 96 14 -68 -32 -22 26 -22 -30 29
$$ packed form
7849D5m3Ro5J14j09m1J5J44q7N3K9j07N5M4m3l6m6J8P8mK8p4K2l5K6m7J25q8p2
7878i2R0J3Lj8j1N1J2l2k7j6N1o1l4Q6qpj4n4J67o1q2Nn1Q7l9J19q4q6J31o7M0
7909A1j4J37j49j27J53P1o9J6m0n2J20m2Q4j28rM3K6K8j0Nq9n3QJ00q5K9k8K8
7937c6r3J48pj8Mj9L5l6M5o1nNP4p8KJ2m0R7k3k7P8j4m6n9R6m2J2K5L7l2j4j0
7969A0M7Ol8oL7p0R1j51R3j5K7l4OJ3k0K4m4q2J29L8j10N3N7q1J1Qj9N6j10p2
7999a46J75m0J7l0n3P4K2n9R6j16P9n2K8P9j16N8K5m1K5q4k9R7p3P3J9p7N6J1
8027A8n3O9J8n5l2L8LN0n4p0J16j44J19o8k6R0q6Q6J9M9j18p7J01qM4q2N4L1O
8056C8r8Q5k3mL7o2K1J6Km7pL8k8R5p2o5P6n2J52j02P1k9OM8q2q2L6J0M8m8qN9
$$ plain form
8088 29 -37 23 12 20 2 31 31 2 34 35 -29 -70 -42 7 -34 -66 -55 30 3 31 -24 25 12 19 -3 54 35 -36 -46 -86 -31 88
8120 88 32 -36 -39 -32 -55 -27 -8 32 47 -71 55 52 67 -24 -32 -20 -10 -28 8 -13 -42 5 5 -6 28 36 -43 14 54 -33 -59 -8
8152 -8 -51 -38 -42 2 -63 -38 -41 -18 -64 -3 81 -16 -26 -12 23 63 32 29 -63 -12 -91 -22 25 -32 -14 15 -17 -59 19 17 -51 -23 -85
8185 -85 -2 5 -18 6 -26 -26
$$ packed form
8088B9o6O0j1Qj8K9%k9L2Jo4m1K8M9m1l2J1Q5k7K8n5M9j3Pk2N7j9p1j0m0N5J19
8120H8n6o8lPk3K8J9M0J5j18J26lJ5r1qJ2J0j8L6k1k9M7%j1L4Qp9N7M0q7k6N1
8152hm3J3mM4o5K5lK3m6O1Q4r7j0J4L5M0l1lr2N1p9O9M7n7J8K9l2m2P8ko8K8o2
8185h5Q3Pk3K4l2%
8191b6
$$ Imaginary data points
##PAGE= N=2
##DATA TABLE= (X++(I..I)), XYDATA
$$ plain form
0 0 0 0 0 -8 16 -16 16 -24 40 -45 48 -64 88 -104 125 -152 189 -224 257 -304 360 -421 484 -557 643 -738
26 -738 837 -950 1079 -1220 1372 -1540 1728 -1933 2158 -2400 2672 -2969 3294 -3648 4041 -4475
42 -4475 4954 -5482 6077 -6744 7494 -8343 9327 -10469 11817 -13434 15423 -17935 21215
55 21215 -25707 32262 -42761 62264 -110561 465380 433202 -782482 10873 788473 84230
66 84230 -591132 300149 703219 -239241 -611312 409302 685088 -234488 -493954 290219
76 290219 357728 -300129 -239173 368360 155465 -432438 -213830 355254 176085 -279382
86 -279382 -150041 183845 31196 -203679 -1083 229103 -16832 -278166 -28197 286905
96 286905 74200 -223244 -20507 225434 -29381 -221863 130310 309899 -145712 -351211
$$ packed form
0@%%%qK4l2L2m0O4q5R3j12J52j92K29k77L41m13M81n61O64p81R05j041J200j381
26g38J575j787K029k299K592k912L268l661M091m558N072n641O263o942P689q516
42d475R429j0436J1559j2821J4238j5837J7670j9796K2286k5251K8857l3358L9150
55B1215m6922N7969p5023J05025j72825N75941l2178j215684P93355P77600p04243
66H4230o75362Q91281M03070r42460l72071J020614K75786r19576k59466P84173
76B90219O7509o57857O0956O07533k12895n87903K18608N69084j79169m55467
86b79382J29341L33886j52649k34875K02596K30186k45935k61334K49969L15102
96B86905k12705k97444K02737K45941k54815j92482L52173J79589m55611k05499
$$ plain form
106 -351211 149126 349350 -169506 -312818 217764 239779 -354091 -263303 397588 209013
116 209013 -509349 -269933 426880 127002 -487964 -94558 420665 -92307 -535189 78643
126 78643 487762 -153609 -510615 107512 378335 -188096 -321313 231195 245098 -304659
136 -304659 -233787 316712 230438 -261725 -175346 216930 119379 -158480 -14444 198804 16912
147 16912 -184556 -3041 212704 77357 -133043 -51225 124415 64083 -68123 17244 133806
158 133806 -921 -142613 27672 213412 38685 -169925 -3041 183285 -3632 -143146
168 -143146 100688 194235 -128849 -199578 179845 227448 -174871 -185897 201093 136933 -234440
179 -234440 -82170 279293 44253 -319747 -38704 306572 2487 -293463 30446 252918
$$ packed form
106c51211N00337K00224n18856j43312N30582K2015n93870R0788O60891j88575
116B09013p18362K39416O96813k99878o14966L93406N15223n12972m42882O13832
126G8643M09119o41371l57006O18127K70823n66431j33217N52508J3903n49757
136c04659P0872N50499q6274m92163Q6379L92276r7551k77859J44036K13248j81892
147A6912k01468J81515K15745j35347k10400Q1818J75640o0332j32206Q5367J16562
158A33806j34727j41692J70285J85740j74727k08610J66884J86326j86917j39514
168a43146K43834R3547l23084p0729L79423M7603m02319j1026L86990o4160l71373
179b34440J52270L61463k35040l64000K81043L45276l04085k95950L23909K22472
$$ plain form
189 252918 -102884 -252361 140553 236411 -172174 -226065 169271 185725 -165742 -131563 173007
200 173007 87282 -181571 -56952 192194 57576 -172922 -51369 145521 34882 -124451
210 -124451 -14595 110393 -15931 -131631 1909 118442 -14761 -139802 -23304 95738
220 95738 -12383 -117599 -500 90692 -54855 -141930 39333 132857 -68932 -154601 61300
231 61300 125323 -93284 -109376 125352 97543 -148411 -76785 182719 86545 -163700 -40933
242 -40933 187306 34772 -159748 33579 197635 -35020 -174344 80902 189384 -73427
252 -73427 -145505 107897 129595 -116311 -93925 139363 78320 -145902 -66459 137383 45874
263 45874 -132394 -32181 115146 496 -121369 7381 112086 -22878 -113023 19912
$$ packed form
189B52918l55802j49477L92914R5858m08585n3891L95336J6454l51467L4179L04570
200A73007q5725k68853J24619K49146j34618k30498J21553J96890j10639j59333
210a24451J09856J24988j26324j15700J33540J16533j33203j25041J16498J19042
220I5738j08121j05216J17099R1192j45547q7075J81263R3524k01789q5669K15901
231F1300O4023k18607j6092K34728k7809k45954P1626K59504r6174k50245J22767
242d0933K28239j52534j94520J93327J64056k32655j39324K55246J08482k62811
252g3427p2078K53402K1698k45906K2386K33288o1043k24222P9443K03842r1509
263D5874j78268J00213J47327j14650j21865J28750J04705j34964r0145J32935
$$ plain form
273 19912 96329 -26220 -84456 30296 74439 -35014 -68910 42813 75629 -39047 -73581
284 -73581 44099 77618 -42699 -67805 57209 66857 -66535 -60737 79051 57878 -86415
295 -86415 -52461 89959 40793 -98042 -31716 100666 13525 -112669 -4236 113352 -13943
306 -13943 -117054 25719 108220 -45590 -101713 60386 90878 -72955 -78661 82788 68527
317 68527 -85365 -52394 92813 43920 -89974 -25495 97394 19113 -91206 -724 95457
328 95457 -4001 -83513 21154 83954 -22375 -70647 33578 69428 -31229 -57707 39544
339 39544 58332 -38282 -51683 45231 52732 -45661 -46748 51191 43493 -53396 -36828 57265 30556
352 30556 -61865 -27385 63362 22104 -67969 -21235 66162 10551 -73566 -6664 71924 -8892
$$ packed form
273A9912P6417j22549n8236J14752M4143j09453l3896J11723L2816j14676l4534
284g3581J17680L3519j20317k5106J25014R648j33392N798J39788k1173j44293
295h6415L3954J42420m9166j38835O6326J32382q7141j26194J08433J17588j27295
306a3943j03111J42773Q2501j53810n6123J62099L0492j63833n706J61449j4261
317F8527j53892L2971J45207m8893j33894O4479J22889p8281j10319R0482R6181
328I5457r9458p9512J04667O2800j06329m8272J04225L5850j00657k6478R7251
339C9544J8788r6614j3401R6914P501r8393j087R7939p698r6889J6568R4093k6709
352C0556r2421L4480R0747m1258r0073M6734Q7397n5611q4117O6902P8588q0816
$$ plain form
364 -8892 -81123 12230 74546 -28597 -78292 30206 64473 -46534 -64513 47953 50865 -62586
376 -62586 -52421 61057 39798 -70585 -36300 69001 20480 -76395 -12113 76046 -798
387 -798 -76947 9022 72682 -16527 -65483 25119 60318 -29925 -52645 38615 52505 -39186
399 -39186 -45587 45029 43329 -44547 -32987 50536 27450 -51660 -19481 54293 14915 -53865
411 -53865 -12054 50132 6238 -50715 -4856 46957 -4310 -53483 3973 50237 -13724 -55908
423 -55908 12807 47787 -24213 -49508 25316 40804 -35342 -41625 36360 36016 -41909 -34878 43643
436 43643 29537 -47476 -22900 52781 17239 -54766 -7492 59205 2333 -55568 8510 56038
448 56038 -12288 -49223 21066 47649 -23553 -41608 29843 39583 -32598 -35106 36547 30413 -39773
$$ packed form
364h892p2231R3353O2316j03143m9695J08498L4267j11007j7979J12466K912j13451
376f2586J0165J13478k1259j10383L4285J05301m8521r6875O4282Q8159p6844
387g98p6149Q5969O3660q9209m8956R0602L5199r0243k2720R1260J3890r1691
399c9186o401R0616j700q7876J1560Q3523k3086p9110L2179P3774l9378o8780
411e3865M1811O2186m3894n6953M5859N1813n1267m9173N7456M6264o3961m2184
423e5908O8715L4980p2000k5295P4824J5488p6146o283P7985l44p7925P031P8521
436D3643j4106p7013K4576P5681l5542p2005M7274O6697n6872n7901O4078M7528
448E6038o8326l6935P0289K6583p1202j8055P1451R740p2181k508P1653o134p0186
$$ plain form
461 -39773 -25708 40338 17769 -42445 -12863 40430 5513 -41395 -3961 38507 1247 -37088
473 -37088 140 36111 -1304 -33208 8362 38261 -7014 -32640 18337 41670 -10193 -27900
485 -27900 24718 37867 -13040 -19245 33342 34676 -20522 -17845 40679 34172 -26539 -15190 43367
498 43367 21466 -35326 -3615 47389 3072 -46002 2746 43837 -9294 -44556 6446 29575
510 29575 -25145 -40795 16199 23702 -38368 -42200 19633 18363 -39536 -30259 21649 3157 -41611
523 -41611 -12754 30216 -976 -39810 -8575 28373 3345 -25922 -666 24149 -3172 -24248
535 -24248 10209 33125 -5567 -30391 8008 31235 -5154 -23613 10395 19489 -18968 -24311
547 -24311 18923 22310 -27794 -34161 16161 19624 -29706 -24983 22736 4475 -43897 -12451 38486
$$ packed form
461c9773J4065O6046k2569o0214K9582N3293l4917m6908L7434M2468l7260l8335
473c7088L7228L5971l7415l1904M1570K9899m5275k5626N0977K3333n1863j7707
485b7900N2618J3149n0907o205N2587J334n5198K677N8524o507o0711J1349N8557
498D3367k1901n6792L1711N1004m4317m9074M8748M1091n3131l5262N1002K3129
510B9575n4720j5650N6994P503o2070l832O1833j270n7899R277N1908j8492m4768
523d1611K8857M2970l1192l8834L1235L6948k5028k9267K5256K4815k7321k1076
535b4248L4457K2916l8692k4824L8399K3227l6389j8459L4008R094l8457n343
547b4311M3234L387n0104o367N0322L463m9330M723M7719j8261m8372L1446N0937
$$ plain form
560 38486 1141 -46323 -5477 35721 -4272 -31322 15059 33676 -17581 -28588 30392 41037
572 41037 -16380 -21817 31756 29000 -17969 -1874 41518 14416 -28258 1950 40652 12464
584 12464 -20179 1702 22539 169 -14354 9378 21320 -7566 -25270 1752 22498 -681
596 -681 -21105 -3081 10401 -8287 -15835 8098 15260 -14970 -27646 5383 24302 -7222 -25760
609 -25760 4751 15051 -19755 -18246 25498 14534 -37590 -23054 29284 12469 -32544 -10547
621 -10547 22992 -9892 -35954 8144 32730 -17826 -42756 7844 28892 -17081 -25487 19258
633 19258 12870 -33018 -13653 35575 12729 -32593 -10422 25044 4743 -16840 5940 18202
645 18202 -8907 -19921 8005 21772 -2420 -19261 -3485 9226 -2347 -9434 1838 4253
$$ packed form
560C8486l7345m7464M0846M1198l9993k7050M6381J8617n1257j1007N8980J0645
572D1037n7417n437N3573k756m6969J6095M3392k7102m2674L0208L8702k8188
584A2464l2643K1881K0837k2370j4523K3732J1942k8886j7704K7022K0746k3179
596f81k0424J8024J3482j8688p548K3933P162l0230j2676L3029J8919l1524j8538
609b5760L0511J0300l4806J509M3744j0964n2124J4536N2338j6815m5013K1997
621a0547L3539l2884k6062M4098K4586n0556k4930N0600K1048m5973q406M4745
633A9258o388m5888J9365M9228k2846m5322K2171L5466k0301k1583K2780J2262
645A8202k7109j1014K7926J3767k4192j6841J5776J2711j1573p087J1272K415
$$ plain form
657 4253 -11244 -16921 446 13697 -1428 -20782 -8517 13150 1636 -14914 5824 19649
669 19649 -11194 -21539 20959 32641 -10827 -17100 24321 22377 -14252 1524 38661 11809
681 11809 -28582 3128 43117 8935 -26269 8245 29290 -13843 -24103 25544 24502 -32723
693 -32723 -28916 22466 12626 -29627 -13589 15400 -10784 -33018 -288 20892 -10917 -30809
705 -30809 -4051 12919 -5036 -11498 5863 5704 -11639 -6223 14835 14167 -2110 -6105 2744 11002
719 11002 10490 2335 723 7401 2166 -7977 5583 19577 -2986 -23427 -543 17374 -7001
732 -7001 -19153 5244 6059 -24861 -19017 17801 8560 -31331 -19816 17801 1966 -27827 -516
745 -516 23855 -13791 -31490 15658 30460 -15700 -21472 21477 17060 -19139 -1739 31702 6339
$$ packed form
657D253j5497n677J7367J3251j5125j9354J2265K1667j1514j6550K0738J3825
669A9649l0843j0345M2498J1682m3468o273M1421j944l6629J5776L7137k6852
681A1809m0391L1710L9989l4182l5204L4514K1045m3133j0260M9647j042n7225
693c2723L807N1382r840m2253J6038K8989k6184k2234L2730K1180l1809j9892
705c0809K6758J6970j7955o462J7361j59j7343N416K1058o68j6277l995Q849Q258
719A1002n12q155j612O678n235j0143J3560J3994k2563k0441K2884J7917k4375
732g001j2152K4397Q15l0920N844L6818r241l9891J1515L7617j5835k9793K7311
745e16K4371l7646j7699M7148J4802m6160n772M2949m417l6199J7400L3441k5363
$$ plain form
758 6339 -24841 2362 29464 3524 -16912 6494 16032 -9789 -12581 14403 11503 -16614 -13958
771 -13958 7557 3036 -9993 -4218 -164 -8274 -8474 -1309 -236 -1689 -4429 -10328 -5425 7090
785 7090 3090 -10178 -4071 7410 -1742 -9244 7067 13645 -8310 -15288 10505 17164 -9714 -11956
799 -11956 15105 8433 -19815 -3430 25345 488 -27156 2437 24116 -8046 -20403 13430
811 13430 15738 -19209 -13417 22207 11904 -20856 -6775 21656 4543 -17457 4901 21623
823 21623 -4665 -15890 12693 18971 -8054 -8527 14211 8351 -9176 602 12670 998 -7302
836 -7302 1693 6012 135 -2114 -287 62 422 -374 -2585 -386 2993 -1237 -6182 343 7459 -1408
852 -1408 -9028 3584 10890 -5446 -9786 11236 11456 -12681 -6951 18362 6018 -18060 542
$$ packed form
758F339l1180K7203K7102k5940k0436K3406R538k5821k792K6984k900k8117K656
771a3958K1515m521j3029N775M054q110k00P165J073j453k740n899M903J2515
785G090m000j3268O107J1481r152p502J6311O578k1955o978K5793O659k6878k242
799a1956K7061o672k8248J6385K8775k4857k7644K9593K1679l2162j2357L3833
811A3430K308l4947N792L5624j0303l2760J4081K8431j7113k2000K2358J6722
823B1623k6288j1225K8583O278k7025m73K2738n860j7527R778J2068j1672q300
836g302Q995M319n877k249J827L49L60p96k211K199L379m230m945O525P116q867
852a408p620J2612P306j6336m340K1022K20k4137N730K5313j2344k4078J8602
$$ plain form
865 542 20804 -3309 -19202 7560 17396 -11597 -16519 12345 11195 -18705 -13117 15785 4697
878 4697 -22752 -7354 16072 -4442 -22388 2279 14054 -12727 -18207 8594 9153 -13690 -8886
891 -8886 9508 1798 -11228 -733 10035 17 -8476 688 7820 1305 -3004 2294 3922 -820
905 -820 -396 3797 3482 1211 -961 -2193 2592 6927 -558 -6473 3261 6494 -5917 -4313 10752
920 10752 3727 -13742 -2829 14698 1526 -13157 1939 12431 -5181 -11567 9988 13935 -10557
933 -10557 -12389 13213 12148 -12244 -5630 16432 2951 -16527 2970 19539 -2875 -15507 6288
946 6288 13190 -6556 -7384 10387 6330 -11027 -4794 11496 5374 -9013 -3190 7473 165 -6497
960 -6497 3206 7120 -4281 -7016 3114 5082 -864 -1680 -376 -1005 400 1099 -173 1558 1010 -5377
$$ packed form
865E42K0262k4113j5893K6762R836k8993m922K8864j150k9900N588K8902j1088
878D697k7449J5398K3426k0514j7946K4667J1775k6781n480K6801N59k2843M804
891h886J8394p710j3026J0495J0768j0018q493R164P132o515m309N298J628m742
905h20M24M193l15k271k172j232M785M335p485n915R734L233j2411J604J5065
920A0752p025j7469J0913J7527j3172j4683J5096J0492j7612o386K1555L947k4492
933a0557j832K5602j065k4392O614K2062j3481j9478J9497J6569k2414j2632K1795
946F288O902j9746q28J7771m057j7357O233J6290o122j4387N823J0663p308o662
960f497R703L914j1401k735J0130J968n946q16J304o29J405O99j272J731n48o387
$$ plain form
976 -5377 -3140 6886 4391 -7058 -4570 5258 1013 -6430 1182 7597 -4058 -11969 2470 11692
990 11692 -3802 -12109 3830 7663 -9640 -7000 12532 4416 -16467 -5046 14410 1970 -12753
1003 -12753 876 9890 -5505 -9808 7945 10648 -7820 -10132 7249 8563 -6085 -4010 8711
1016 8711 1695 -9741 760 11532 110 -8759 828 5707 -1515 -2461 3026 1385 -3915 -3256
1030 -3256 1686 3548 -722 -5070 -2587 2020 108 -3066 -362 1482 -2783 -5028 741 5514 -473
1045 -473 -6970 -1007 6415 -142 -5556 4330 7374 -6040 -6292 10390 8966 -7396 -3597 10495
1059 10495 3959 -6952 3091 12080 -604 -9391 4327 12542 -927 -7773 5131 7971 -6171
1072 -6171 -4963 10216 5193 -10884 -4268 9444 1605 -8170 171 5230 -4383 -6638 3091 4927
$$ packed form
976e377K237J0026k495j1449K488R828m245p443P612O415j1655p911J4439R222
990A1692j5494q307J5939L833j7303K640J9532q116k0883J1421J9456j2440j4723
1003a2753J3629R014j5395m303J7753K703j8468k312J7381J314j4648K075J2721
1016H711p016j1436J0501J0772j1422q869R587M879p222r46N487j641n300O59
1030c256M942J862m270m348K483M607j912l174K704J844m265k245N769M773n987
1045d73o497N963P422o557n414R886L044j3414k52J6682j424j6362L799J4092
1059A0495o536j0911J0043Q989j2684q787J3718Q215j3469o846J2904K840j4142
1072f171J208J5179n023j6077O616J3712p839r775Q341N059r613k255R729J836
$$ plain form
1086 4927 -4056 -6610 708 3417 -1879 -3444 1477 960 -4195 -2037 3790 1974 -3138 -2560 786
1101 786 1878 562 -1482 -547 1931 -1068 -3584 2461 4934 -3894 -6329 3520 4263 -5300 -4126 4278
1117 4278 287 -8000 -2463 5918 -722 -9710 -2843 5576 -2410 -9436 570 5301 -7252 -9555
1131 -9555 4989 4831 -9189 -6262 6166 1025 -8273 -623 6805 -1383 -6813 1844 6993 -586
1145 -586 -4350 3159 6021 -1237 -1912 6000 5308 -2596 -236 6542 3482 -1206 1742 3869 1406 443
1161 443 1602 1805 1751 123 -1459 1467 3137 -1455 -3146 1859 2426 -2875 -2556 2734 1634 -3721
1177 -3721 -2171 4115 2343 -4496 -1586 6636 2333 -5337 1528 8600 -549 -5448 6172 8544 -3591
1192 -3591 -3312 8095 5332 -4728 -650 7440 1753 -5648 469 6674 -876 -7125 405 4923 -3834
$$ packed form
1086D927q983k554P318K709n296j565M921n17n155K158N827j816n112N78L346
1101G86J092j316k044R35K478k999k516O045K473q828k435R849P43r563J174Q404
1117D278l991q287N537Q381o640q988O867Q419p986p026J0006M731j2553k303
1131i555J4544j58j4020K927J2428n141r298P650P428q188n430Q657N149p579
1145e86l764P509K862p258o75P912o92p904K360O778l060m688K948K127k463r63
1161D43J159K03n4j628j582K926J670m592j691N005N67n301L19N290j100n355
1177c721J550O286j772o839K910Q222m303p670O865P072r149m899J1620K372j2135
1192c591K79J1407k763j0060M078Q090n687p401O117O205p550o249P530M518q757
$$ plain form
1207 -3834 -6801 1963 1849 -7231 -4949 3073 -814 -6873 -2510 1181 -2443 -3523 -336 172 -1623
1222 -1623 -1614 -254 1444 1292 -648 -464 1864 2324 802 640 2137 2239 123 -326 3134 3718 -1779
1239 -1779 -2655 3815 3028 -4292 -1293 5208 -1385 -7286 1337 5600 -3968 -6616 2406 2934 -5168 -3476
1255 -3476 4575 1372 -6592 -2238 6442 1715 -6018 180 6356 -1329 -4523 5229 5994 -4474 -3249
1270 -3249 6177 3335 -3511 321 3833 -1032 -2863 1924 2934 -1583 -3184 -319 932 -874 -1379
1285 -1379 -220 -1420 -2597 -613 612 -1100 -989 -620 -2354 -869 2963 128 -3822 583 2981
1300 2981 -2308 -1749 4668 1316 -5443 -662 5475 87 -4619 942 3394 -3131 -4248 3301 3460
1315 3460 -5349 -5071 4078 2261 -6014 -1673 5368 -1821 -6968 2849 6353 -3505 -4337 4610 3287
$$ packed form
1207c834k967Q764j14r080K282Q022l887o059M363L691l624j080L187N08j795
1222a623RJ360J698j52j940J84K328M60j522j62J497J02k116m49L460N84n497
1239a779q76O470p87p320K999O501o593n901Q623M263r568k648R022N28q102J692
1255c476Q051l203p964M354Q680m727p733O198O176p685l194R752P65j0468J225
1270c249R426k842o846L832L512m865j831M787J010m517j601K865J251j806n05
1285a379J159j200j177J984J225j712J11L69j734J485L832k835l950M405K398
1300B981n289N59O417l352o759M781O137n388m706N561K452o525j117P549J59
1315C460q809K78R149j817q275M341P041p189n147R817L504r858q32Q947j323
$$ plain form
1330 3287 -3364 708 5945 980 -3192 2119 5542 1143 -1191 2347 3196 -880 -221 3771 1408
1345 1408 -2949 -277 1885 -1452 -1596 1202 -1933 -4411 -144 560 -4032 -2583 785 -3170 -5075
1360 -5075 772 1640 -4390 -3902 1836 662 -3895 -744 3841 -335 -4879 1396 6057 -1285 -4467
1375 -4467 3786 4571 -4487 -1953 6864 1187 -6907 345 5829 -2557 -5496 2506 2112 -5746 -3761
1390 -3761 3190 -76 -6365 -2821 2166 -1882 -5428 -83 2098 -3988 -4217 2586 1636 -3911 -587
1405 -587 3578 -949 -2107 3662 2931 -1930 990 4314 557 -230 3994 2846 -1148 1208 4429 1309
1421 1309 -1291 2108 3504 -974 -1670 3689 2992 -3536 -1354 5066 602 -4874 1883 5224 -3318
1436 -3318 -4023 5233 3267 -5138 -611 6126 -63 -4519 2673 5379 -2042 -3063 4133 3735 -3228
$$ packed form
1330C287o651M072N237m965m172N311L423m399k334L538Q49m076O59L992k363
1345A408m357K672K162l337j44K798l135k478M267P04m592J449L368l955j905
1360e075N847Q68o030M88N738j174m557L151M585m176m544O275M661p342l182
1375d467Q253P85r058K534Q817n677q094P252N484q386k939Q002l94p858J985
1390c761O951l266o289L544M987m048l546N345K181o086k29O803r50n547L324
1405e87M165m527j158N769p31m861K920L324l757p87M224j148l994K356L221l120
1421A309k600L399J396m478o96N359o97o528K182O420m464n476O757L341q542
1436c318p05R256j966q405M527O737o189m456P192K706p421j021P196l98o963
$$ plain form
1451 -3228 -1562 5070 1592 -4572 421 5078 -1762 -4509 2911 2822 -4830 -2187 3888 -884 -4915
1466 -4915 623 2043 -3627 -2824 2018 -366 -4003 -777 1653 -1768 -2802 936 993 -3020 -1809 2617
1482 2617 59 -3896 253 3027 -2603 -3415 3382 1675 -5333 -1181 4439 -1723 -5152 1996 2780
1497 2780 -4752 -3278 3879 701 -5316 -1252 3631 -1355 -4767 1198 3658 -3289 -4236 3553 2936
1512 2936 -4474 -1517 5173 -226 -5018 2543 5214 -2909 -2796 4299 2004 -3410 858 4297 -888
1527 -888 -2847 2300 2993 -1523 -1292 2379 850 -2582 429 3422 -884 -3238 1748 2394 -2725 -810
1543 -810 3667 -780 -4211 2024 3749 -2870 -2155 3615 457 -3809 1367 4280 -1724 -3583 2326
1558 2326 3099 -2279 -1596 3421 1123 -4161 25 5193 -361 -4684 1630 3942 -3012 -2415 4700 1216
$$ packed form
1451c228J666O632l478o164M993M657o840k747P420q9p652K643O075m772m031
1466d915N538J420n670Q03M842k384l637L226K430l421j034L738N7m013J211M426
1482B617k558l955M149K774n630q12O797j707p008M152N620o162l429P148P84
1497B780p532J474P157l178o017M064M883m986l412N965K460o947r47P789o17
1512B936p410K957O690n399m792P561K671q123J13P095k295n414M268L439n185
1527h88j959N147O93m516K31L671j529l432L011K993m306k354M986O46n119J915
1543h10M477m447l431O235J725o619P15N770l158m266N176K913o004j859N909
1558B326P73n378O83N017k298n284M186N168n554m323O314K312o954N97P115l484
$$ plain form
1574 1216 -5553 -112 4915 -1074 -3730 2199 2250 -3308 -1225 3770 760 -3512 -461 2909 -241
1589 -241 -2418 1504 2091 -2686 -1795 3461 1417 -3300 160 2891 -1855 -1942 3397 1408 -3767 -297
1605 -297 3446 -831 -2246 2171 1465 -3135 -1045 3321 672 -3041 -206 2441 -1101 -2618 2146
1620 2146 2443 -3474 -2767 3561 1311 -4219 0 3576 -2456 -3859 3197 2704 -4112 -2141 3322 192
1636 192 -3371 795 2690 -1932 -3179 1840 2534 -2137 -1981 2066 686 -2957 194 3447 -1227 -3466
1652 -3466 1868 2530 -2341 -724 2955 -618 -3050 1771 2783 -1775 -1352 2093 534 -1706 993
1667 993 2517 -821 -1879 1477 2316 -889 -766 2494 837 -2390 974 3970 -680 -2815 2563 2695
1683 2695 -2524 -470 4065 62 -3351 1580 3583 -1495 -1994 2363 1466 -2349 -391 2944 501
$$ packed form
1574A216o769N441N027n989k656N929N1n558K083M995l010m272L051L370l150
1589b41k177L922N87m777Q91N256k044m717L460K731m746q7N339j989n175L470
1605b97L743m277j415M417p06m600K090M366k649l713K835K647l542j517M764
1620B146K97n917P07O328k250n530M219L576o032j403P056m93o816J971N463l130
1636A92l563M166J895m622j247N019O94m671J56M047j380l643L151L253m674k239
1652c466N334O62m871J617L679l573k432M821J012m558M23L445j559k240K699
1667I93J524l338j058L356Q39l205J23L260j657l227L364K996m650k135N378J32
1683B695n219K054M535m003l413M931K003n078m99M357q97l815J958L335k443
$$ plain form
1698 501 -2865 88 2899 -352 -2353 1646 2213 -2516 -1431 3300 622 -3251 498 2601 -1590
1713 -1590 -1852 2207 767 -2725 -402 1910 -619 -1967 410 584 -1644 -1426 896 151 -2323 -1258
1729 -1258 1111 -897 -2713 277 905 -2893 -2083 1858 -374 -3509 -33 1693 -2452 -2508 1747 415
1745 415 -3231 -802 1968 -790 -2548 540 1653 -1403 -1991 1473 1567 -2180 -1335 2504 729 -2806
1761 -2806 455 3022 -1293 -2300 2368 1739 -2552 -462 2739 -292 -2106 1197 1776 -1168 -1004 1577
1777 1577 911 -1323 -447 1566 377 -1432 361 1760 -836 -1527 1726 1292 -1833 -60 2372 -492
1793 -492 -1675 1935 1562 -1816 -149 2490 136 -1436 1257 1559 -1057 -690 1883 1213 -1106 -297
1809 -297 1860 529 -1671 573 2275 -984 -2141 1718 1641 -2412 -1023 2333 -656 -3024 828 1678
$$ packed form
1698E01l366K953K811l251k001L999N67m729J085M731k678l873L749K103m191
1713a590k62M059j440l492K323K312k529j348K377J74k228K18K322p45k474J065
1729a258K369k008j816K990O28l798Q10L941k232l135L476J726m145n6M255j332
1745D15l646K429K770k758j758L088J113l056n88L464R4l747Q45L839j775l535
1761b806L261K567m315j007M668o29m291K090L201l031j814L303N79k944J64K581
1777A577o66k234Q76K013j189j809J793J399k596o91L253m34l125J773K432k864
1793d92j183L610l73l378J667K639k354j572K693L02k616L67K573o70k319Q09
1809b97K157j331k200K244J702l259j157L859p7m053J389L356k989k368L852Q50
$$ plain form
1825 1678 -2171 -2175 1158 107 -2341 -660 1080 -936 -2340 -9 1306 -922 -1906 587 757 -1669
1841 -1669 -629 2103 -47 -2303 894 2147 -1005 -720 2207 331 -1742 1147 2294 -613 -987
1856 -987 1443 825 -955 107 1476 -51 -1686 184 1462 -531 -1535 702 794 -2147 -873 2202
1872 2202 -103 -2914 335 1766 -1641 -1528 2095 402 -2619 -59 2294 -186 -1566 880 1243
1887 1243 -949 -696 1768 1208 -1486 -583 2059 632 -1528 658 1870 -1378 -1469 2142 1108 -2318
1903 -2318 -363 1765 -951 -1425 1551 754 -2183 -864 1340 -65 -1343 145 645 -1081 -1216 1100
1919 1100 1104 -1443 -1136 1435 479 -1536 803 1952 -1455 -1676 2264 1542 -1861 19 2232 -719 -1512
1936 -1512 1936 1940 -1521 -871 1766 828 -985 346 1715 -289 -1561 1052 2331 -656 -1415 1715
$$ packed form
1825A678l849mL333j051k448J681J740k016j404K331J315k228r84K493J70k426
1841a669J040K732k150k256L197J253l152K85K927j876k073K889J147k907l74
1856i87K430o18j780J062J369j527j635J870J278j993j004K237R2k941J274L075
1872B202k305k811L249J431l407J13L623j693l021K560K353k480j380K446L63
1887A243k192K53K464n60k694R03K642j427k160K186J212l248r1L611j034l426
1903b318J955K128k716m74K976p97k937J319K204j405j278J488N00j726j35K316
1919A100Mk547L07K571r56k015K339J149l407k21L940p22l403J880K213k951p93
1936a512L448Ml461O50K637r38j813J331J369k004j272K613J279k987p59L130
$$ plain form
1952 1715 1224 -1612 380 2779 -578 -2160 1625 1974 -1453 -548 1994 -247 -1849 963 1726 -1137
1968 -1137 -1574 600 488 -1361 -614 1062 -448 -2314 -427 1505 -1124 -2078 735 427 -2450 -717
1984 -717 2101 -989 -2828 639 1184 -2034 -1045 1723 -431 -2472 153 1573 -852 -1790 462 600
2000 600 -1674 -1195 1329 124 -2620 -932 1726 -863 -2498 687 915 -2668 -1393 2095 -267 -2745
2016 -2745 213 1424 -1448 -1211 1714 506 -1923 -206 1912 328 -971 821 1752 -412 -594 2267
2032 2267 1853 -1190 -63 2838 779 -1086 1880 2523 -1205 -545 3077 1296 -1580 981 2501 -487
2048 -487 -752 2188 1488 -1261 -331 2063 682 -1092 604 2009 -290 -1356 1711 2029 -1421 -698
2064 -698 2464 611 -1861 1179 2563 -1213 -1415 2410 1245 -1806 166 2111 -451 -1569 1230
$$ packed form
1952A715m91k836J992K399l357j582L785L49l427R05K542k241j602K812P63k863
1968a137m37K174j12j849P47J676j510j866J887J932k629r54K813l08k877J733
1984g17K818l090j839L467N45l218R89K768k154k041K625J420k425r38K252J38
2000F00k274M79K524j205k744J688K658k589j635L185K28l583J275L488k362k478
2016b745K958J211k872K37K925j208k429J717K118j584j299J792R31k164j82K861
2032B267m14l043J127K901k059j865K966O43l728O60L622j781k876K561J520k988
2048d87k65K940p00k749R30K394j381j774J696J405k299j066L067L18l450P23
2064f98L162j853k472L040J384l776k02L825j165l051J972J945k562j118K799
$$ plain form
2079 1230 1467 -1343 -1230 1252 613 -1758 -534 1582 -613 -2347 518 1558 -1837 -1835 1578 197
2095 197 -2762 -50 1927 -1476 -2221 1403 878 -2202 -751 1642 -389 -2027 371 1422 -902 -1471
2111 -1471 1046 1114 -1538 -876 1830 177 -2128 427 2215 -1183 -1780 1804 1069 -2262 -166 2339
2127 2339 -488 -1970 1348 1515 -1550 -729 1783 511 -1618 181 1838 -207 -1405 992 1671 -984
2143 -984 -1007 2009 973 -1996 280 2542 -682 -1806 1871 1609 -1976 -382 2455 -26 -1877 1009
2159 1009 1691 -1078 -1192 1489 784 -1436 -391 1678 94 -1734 306 1757 -980 -1641 1488 1033
2175 1033 -2109 -519 2338 -471 -2249 1056 1630 -1735 -1088 2023 280 -2019 154 1724 -644
2190 -644 -1376 961 1154 -1271 -949 1575 592 -1877 -257 1909 -567 -1961 1117 1352 -1919 -1017 2185
$$ packed form
2079A230K37k810J13K482o39k371J224K116k195j734K865J040l395KL413j381
2095A97k959K712J977l403p45L624n25l080J451K393k031j638K398J051k324n69
2111a471K517O8k652O62K706j653k305K555J788l398n97L584p35l331K096K505
2127B339k827j482L318J67l065Q21K512j272k129J799J657k045j198K397O79k655
2143i84k3L016j036k969K276K262l224j124L677k62l585J594K837k481j851K886
2159A009O82k769j14K681p05k220J045K069j584j828K040J451k737o61L129m55
2175A033l142J590K857k809j778L305N74l365O47L111j743k299K173J570k368
2190f44p32K337J93k425L22K524r83k469J620K166k476j394L078K35l271R02L202
$$ plain form
2207 2185 -43 -2259 570 1628 -1393 -1272 1467 551 -1929 -389 1541 -360 -1599 329 1086 -1168
2223 -1168 -1313 1143 752 -1952 -785 1717 -427 -2235 768 1450 -1945 -1463 1791 195 -2423 -37
2239 -37 1528 -1169 -1749 1058 765 -1720 -1080 1151 -59 -1762 -297 1235 -763 -1953 713 1200
2255 1200 -1726 -1253 1560 148 -2187 186 1753 -1300 -1582 1425 688 -1754 -182 1543 -498 -1474
2271 -1474 760 1205 -831 -807 1140 816 -1018 -99 1785 204 -1309 997 2058 -717 -750 2066 1041
2288 1041 -1565 694 2551 -376 -1193 1924 1600 -1104 1 2045 429 -1086 816 1794 -260 -790
2304 -790 1166 1325 -830 -496 1814 662 -1592 255 1996 -575 -1412 1414 926 -1705 -421 1759
2320 1759 -325 -1715 657 974 -1187 -874 1042 216 -1421 -433 867 -233 -1422 106 800 -1042
$$ packed form
2207B185k228k216K829J058l021J21K739r16k480J540J930j901j239J928P57k254
2223a168j45K456l91k704J167K502k144j808L003O82l395M82L254j596k618K386
2239c7J565k697n80K807k93k485O40K231j210j703J465J532j998j190K666M87
2255A200k926M73K813j412k335K373J567l053k82L007p37k442J572J725k041r76
2271a474K234M45k036K4J947l24j834R19J884j581j513K306J061k775l3K816j025
2288A041k606K259J857k927q17L117l24k704J105K044j616j515J902R78k054n30
2304g90J956J59k155L34K310j152k254J847J741k571q37K826m88k631J284K180
2320A759k084j390K372L17k161L13J916q26j637R88J300j100j189J528O94j842
$$ plain form
2336 -1042 -1361 891 375 -1915 -549 1342 -928 -1956 675 662 -2022 -1038 1098 -555 -2019 18
2352 18 727 -1299 -1453 596 289 -1468 -863 894 -64 -1585 -106 1253 -748 -1584 942 1152 -1574
2369 -1574 -574 1924 81 -1661 760 1616 -903 -722 1637 702 -1059 234 1501 57 -690 693
2385 693 1219 -278 -574 1064 929 -883 -160 1555 184 -1149 850 1387 -903 -562 1615 360 -1339
2402 -1339 476 1417 -652 -774 1042 519 -1045 -146 1136 24 -952 163 848 -540 -927 719 880
2419 880 -1167 -723 1289 183 -1634 341 1367 -1101 -1282 1334 528 -1598 -260 1167 -479 -1212
$$ packed form
2336a042l19K252n16k290J366J891k270j028K631j3k684R84K136j653j464K037
2352A8P09k026j54K049l07j757O05J757r58j521J479J359k001q36K526K10k726
2369a574J000K498j843j742K421Q56k519J81K359r35j761J293J267j444p47J383
2385F93N26j497k96J638j35j812P23J715j371j333J999N37k290L41K177j255j699
2402a339J815R41k069j22J816n23j564Q99J282j112r76J115O85j388l87J646J61
2419H80k047M44K012j106j817J975J026k468j81K616q06k126J338J427j646p33
$$ [...]
8191a8
##END NTUPLES=NMR FID
##END=
