##TITLE=1H_05-2025-Bay
 CDCl3
 8 sc, 
 13.1.2025
##JCAMPDX= 6.0         $$ Bruker NMR JCAMP-DX V2.0
##DATA TYPE= NMR FID
##DATA CLASS= NTUPLES
##ORIGIN= UXNMR, Bruker Analytische Messtechnik GmbH
##OWNER= root
$$ XWIN-NMR		Version 3.5
$$ Mon Jan 13 14:30:01 2025 Russian Standard Time (UT+4h)  she@DPX200
##.OBSERVE FREQUENCY= 200.1315
##.OBSERVE NUCLEUS= ^1H
##.DELAY= (6, 6)
##.ACQUISITION MODE= SIMULTANEOUS
##.ACQUISITION SCHEME= undefined
##.AVERAGES= 8
##.DIGITISER RES= 18
##SPECTROMETER/DATA SYSTEM= spect
##.PULSE SEQUENCE= zg30
##.SOLVENT NAME= CDCl3
##.SHIFT REFERENCE= (INTERNAL, CDCl3, 0, 15.7039)
##AUDIT TRAIL= $$ (NUMBER, WHEN, WHO, WHERE, WHAT)
$$ ##TITLE= Audit trail, XWIN-NMR		Version 3.5
$$ ##JCAMPDX= 5.01
$$ ##ORIGIN= Bruker BioSpin GmbH
$$ ##OWNER= she
$$ F:/spectra/data/she/nmr/H-F/1/audita.txt
$$ ##AUDIT TRAIL=  $$ (NUMBER, WHEN, WHO, WHERE, WHAT)
(   1,<2025-01-13 14:24:26.60 +0400>,<she>,<DPX200>,
      <created by zg, POWCHK disabled, PULCHK disabled
       configuration hash MD5:
       00 E9 B6 7A A2 85 ED C7 34 08 36 98 17 FE 4E 26
       data hash MD5: 16K
       DB B5 1A 89 35 2A E7 2C 75 82 9E D0 F6 82 7F B1>)
$$ ##END=
$$ 
$$ hash MD5
$$ D3 91 0F EA BE 43 5A 3C 74 8A 29 F1 F1 F8 14 B1
##$RELAX= 
##$RELAX= 
##$RELAX= 
##$RELAX= 
##$RELAX= 
##$RELAX= 
$$ Bruker specific parameters
$$ --------------------------
##$DU= <F:/spectra>
##$EXPNO= 1
##$NAME= <H-F>
##$PROCNO= 1
##$TYPE= <nmr>
##$USER= <she>
##$AMP= (0..31)
100 100 100 100 100 100 100 100 100 100 100 100 100 100 100 100 100 100 
100 100 100 100 100 100 100 100 100 100 100 100 100 100 
##$AQSEQ= 0
##$AQ_mod= 1
##$AUNM= <au_zg>
##$AUTOPOS= <>
##$BF1= 200.13
##$BF2= 200.13
##$BF3= 200.13
##$BF4= 200.13
##$BF5= 200.13
##$BF6= 200.13
##$BF7= 200.13
##$BF8= 200.13
##$BYTORDA= 1
##$CFDGTYP= 0
##$CFRGTYP= 5
##$CHEMSTR= <none>
##$CNST= (0..31)
1 1 145 1 1 1 1 1 1 1 1 1 1 1 1 1 1 1 1 1 1 1 1 1 1 1 1 1 1 1 1 1 
##$CPDPRG= <>
##$CPDPRG1= <>
##$CPDPRG2= <>
##$CPDPRG3= <>
##$CPDPRG4= <mlev>
##$CPDPRG5= <mlev>
##$CPDPRG6= <mlev>
##$CPDPRG7= <mlev>
##$CPDPRG8= <mlev>
##$CPDPRGB= <>
##$CPDPRGT= <>
##$D= (0..31)
0 1.2 0 0 0 0 0 0 0 0.06 0 0.03 0 0 0 0 0.0002 0 0 0 0 0 0 0 0 0 0 0 0 
0 0 0 
##$DATE= 1736763866
##$DBL= (0..7)
120 120 120 120 120 120 120 120 
##$DBP= (0..7)
150 150 150 150 150 150 150 150 
##$DBP07= 0
##$DBPNAM0= <>
##$DBPNAM1= <>
##$DBPNAM2= <>
##$DBPNAM3= <>
##$DBPNAM4= <>
##$DBPNAM5= <>
##$DBPNAM6= <>
##$DBPNAM7= <>
##$DBPOAL= (0..7)
0.5 0.5 0.5 0.5 0.5 0.5 0.5 0.5 
##$DBPOFFS= (0..7)
0 0 0 0 0 0 0 0 
##$DE= 6
##$DECBNUC= <off>
##$DECIM= 24
##$DECNUC= <off>
##$DECSTAT= 4
##$DIGMOD= 1
##$DIGTYP= 9
##$DL= (0..7)
0 120 120 120 120 120 120 120 
##$DP= (0..7)
150 150 150 150 150 150 150 150 
##$DP07= 0
##$DPNAME0= <>
##$DPNAME1= <>
##$DPNAME2= <>
##$DPNAME3= <>
##$DPNAME4= <>
##$DPNAME5= <>
##$DPNAME6= <>
##$DPNAME7= <>
##$DPOAL= (0..7)
0.5 0.5 0.5 0.5 0.5 0.5 0.5 0.5 
##$DPOFFS= (0..7)
0 0 0 0 0 0 0 0 
##$DQDMODE= 0
##$DR= 18
##$DS= 0
##$DSLIST= <SSSSSSSSSSSSSSS>
$$ [...]
##$SUBNAM2= <"">
##$SUBNAM3= <"">
##$SUBNAM4= <"">
##$SUBNAM5= <"">
##$SUBNAM6= <"">
##$SUBNAM7= <"">
##$SUBNAM8= <"">
##$SUBNAM9= <"">
##$SW= 24.0689530833862
##$SWIBOX= (0..15)
0 0 2 0 0 0 0 0 0 0 0 0 0 0 0 0 
##$SW_h= 4816.95568400771
##$TD= 16384
##$TD0= 1
##$TE= 0
##$TE2= 300
##$TE3= 300
##$TEG= 300
##$TL= (0..7)
0 120 120 120 120 120 120 120 
##$TP= (0..7)
150 150 150 150 150 150 150 150 
##$TP07= 0
##$TPNAME0= <>
##$TPNAME1= <>
##$TPNAME2= <>
##$TPNAME3= <>
##$TPNAME4= <>
##$TPNAME5= <>
##$TPNAME6= <>
##$TPNAME7= <>
##$TPOAL= (0..7)
0.5 0.5 0.5 0.5 0.5 0.5 0.5 0.5 
##$TPOFFS= (0..7)
0 0 0 0 0 0 0 0 
##$TUNHIN= 0
##$TUNHOUT= 0
##$TUNXOUT= 0
##$USERA1= <user>
##$USERA2= <user>
##$USERA3= <user>
##$USERA4= <user>
##$USERA5= <user>
##$V9= 5
##$VALIST= <valist>
##$VCLIST= <CCCCCCCCCCCCCCC>
##$VD= 0
##$VDLIST= <DDDDDDDDDDDDDDD>
##$VPLIST= <PPPPPPPPPPPPPPP>
##$VTLIST= <TTTTTTTTTTTTTTT>
##$WBST= 1024
##$WBSW= 4
##$XGAIN= (0..3)
0 0 0 0 
##$XL= 0
##$YL= 0
##$YMAX_a= 641542
##$YMIN_a= -572535
##$ZGOPTNS= <>
##$ZL1= 120
##$ZL2= 120
##$ZL3= 120
##$ZL4= 120
##$ABSF1= 10
##$ABSF2= 0
##$ABSG= 5
##$ABSL= 3
##$ALPHA= 0
##$AQORDER= 0
##$ASSFAC= 0
##$ASSFACI= 0
##$ASSFACX= 0
##$ASSWID= 0
##$AUNMP= <proc_1d>
##$AZFE= 0.1
##$AZFW= 0.1
##$BCFW= 1
##$BC_mod= 2
##$BYTORDP= 1
##$COROFFS= 0
##$CY= 11.3945322036743
##$DATMOD= 1
##$DC= 2
##$DFILT= <>
##$DTYPP= 0
##$F1P= 15.6554695791079
##$F2P= 12.8336369535428
##$FCOR= 0.5
##$FTSIZE= 0
##$FT_mod= 4
##$GAMMA= 1
##$GB= 0.15
##$INTBC= 1
##$INTSCL= 1
##$ISEN= 128
##$LB= 0.24
##$LEV0= 0
##$LPBIN= 0
##$MAXI= 10000
##$MC2= 0
##$MEAN= 0
##$ME_mod= 0
##$MI= 1.114404
##$NCOEF= 0
##$NC_proc= 0
##$NLEV= 6
##$NOISF1= 3.799351
##$NOISF2= 2.8
##$NSP= 1
##$NTH_PI= 0
##$NZP= 0
##$OFFSET= 15.70392
##$PC= 1
##$PHC0= -26724.92
##$PHC1= 5.987441
##$PH_mod= 1
##$PKNL= yes
##$PPARMOD= 0
##$PSCAL= 0
##$PSIGN= 0
##$REVERSE= no
##$SF= 200.130013532006
##$SI= 16384
##$SIGF1= 3
##$SIGF2= 2
##$SINO= 400
##$SIOLD= 16384
##$SREGLST= <1H.CDCl3>
##$SSB= 0
##$STSI= 0
##$STSR= 0
##$SW_p= 3612.71676300578
##$SYMM= 0
##$S_DEV= 0
##$TDeff= 0
##$TDoff= 0
##$TI= <>
##$TILT= no
##$TM1= 0
##$TM2= 0
##$TOPLEV= 0
##$USERP1= <user>
##$USERP2= <user>
##$USERP3= <user>
##$USERP4= <user>
##$USERP5= <user>
##$WDW= 1
##$XDIM= 8192
##$YMAX_p= 0
##$YMIN_p= 0
$$ End of Bruker specific parameters
$$ ---------------------------------
##NTUPLES= NMR FID
##VAR_NAME=  TIME,          FID/REAL,        FID/IMAG
##SYMBOL=    X,             R,               I
##VAR_TYPE=  INDEPENDENT,   DEPENDENT,       DEPENDENT
##VAR_FORM=  AFFN,          ASDF,            ASDF
##VAR_DIM=   8192,          8192,            8192
##UNITS=     SECONDS,       ARBITRARY UNITS, ARBITRARY UNITS
##FACTOR=    0.0002076,     1,               1
##FIRST=     0,             0,               0
##LAST=      1.7004516,     0,               0
##MIN=       0,             -572535,         0
##MAX=       1.7004516,     641542,          0
$$ Real data points
##PAGE= N=1
##DATA TABLE= (X++(R..R)), XYDATA
0 0 0 0 0 0 0 0 0 4 0 0 0 4 -8 16 -16 20 -22 28 -36 44 -56 66 -77 90 -104 124 -146 168 -192 219 -252 284
32 284 -323 366 -410 460 -514 575 -643 717 -795 883 -974 1076 -1190 1314 -1448 1594 -1753
49 -1753 1926 -2116 2320 -2537 2757 -2959 3091 -3024 2391 43 -9986 95456 633384 -399342
63 -399342 15605 527775 -497387 173343 134508 -572535 385598 83218 -461504 522618
73 522618 37985 -339437 348078 -159613 -174497 279869 -260656 41758 319814 -270557
83 -270557 52113 228644 -236253 28195 93032 -143035 113961 13981 -141293 187691
93 187691 1768 -177620 191182 11472 -155698 147703 -75761 -86142 169976 -176751
103 -176751 6977 259972 -237054 31484 218410 -293490 75580 102497 -279809 266131
113 266131 21452 -273781 381954 -105220 -290083 352288 -205701 -129254 340621 -270601
123 -270601 81618 286980 -395274 144145 184668 -403265 197705 105858 -252767 271738
133 271738 -43742 -171209 279552 -187455 -139905 265932 -168721 -49267 200474 -120547
143 -120547 32480 74711 -152580 74533 32624 -160688 94038 76616 -110333 67471
153 67471 55384 -76895 43516 -25501 -71458 99201 -48028 -72253 160885 -40153 -82720
164 -82720 132672 -81484 -44720 101050 -136959 63459 116767 -188130 125877 80497 -217639
175 -217639 138517 -6677 -158072 196343 -90605 -73465 237761 -176658 -36981 204824
185 204824 -214555 29226 141105 -201199 128911 57893 -198666 188445 -14722 -172276
195 -172276 197340 -58161 -98263 164428 -106949 -21463 129244 -139187 28823 109777
205 109777 -134833 38711 70156 -109573 50355 29228 -77584 83861 758 -81297 85192
216 85192 -20532 -88834 78576 -12287 -47530 90072 -31244 -25448 84804 -93704 -21658
227 -21658 97014 -107092 22765 102311 -103546 60142 36642 -127033 96816 -16644
237 -16644 -109677 151037 -35720 -73406 144145 -91061 -39713 108442 -133999 34314 100886
248 100886 -141534 89581 59501 -143725 100362 -6507 -105498 122449 -50127 -50782 129015
259 129015 -86953 -24153 102004 -99381 9551 73237 -88679 47727 37906 -88636 65224
270 65224 7975 -78657 73123 -5043 -53019 67589 -24226 -34695 59399 -40489 -19847 64077
282 64077 -46507 -10613 61604 -57058 -82 50419 -65583 26342 38921 -72099 49867
293 49867 19023 -75499 64047 -2591 -62057 77856 -27124 -41820 82879 -58288 -19509
304 -19509 79906 -78434 13589 66022 -86435 44366 33183 -86558 66787 -65 -69474
315 -69474 82551 -24795 -45191 80779 -49881 -22880 68749 -65817 5784 57479 -69073
326 -69073 31611 36118 -69517 44817 8629 -60179 54631 -7671 -40363 58958 -20299
337 -20299 -26692 52187 -35291 -17010 47472 -42784 -806 46784 -45925 13800 34941 -52421
349 -52421 23672 17658 -52392 38117 7917 -44857 49682 -4521 -40443 50881 -23769 -30976
361 -30976 54233 -38836 -9066 57136 -51848 10314 43706 -63002 25573 23101 -59087 45756
373 45756 6323 -47452 58531 -14373 -39584 58232 -34376 -23195 56247 -45977 2952 48119
385 48119 -56248 22396 29366 -59535 35967 11322 -47816 46267 -5659 -34620 48212 -23288
397 -23288 -24395 47582 -32780 -9726 44344 -38387 5186 31949 -44218 19089 19243 -42555 30881
410 30881 9503 -37150 33258 -2956 -31272 34895 -12458 -20531 41036 -21626 -12508 39413
422 39413 -34447 -4511 32509 -39077 12427 25703 -38114 25862 12366 -40305 31310 -858
434 -858 -35562 39246 -9783 -23587 43636 -24633 -13072 39281 -38939 2049 32926 -41878
446 -41878 19595 21926 -39768 29284 5397 -35619 33875 -8044 -26602 37524 -18105 -15758
458 -15758 37330 -26704 -3588 32099 -32144 8020 20669 -34241 16684 9647 -29929 24515
470 24515 4489 -23709 25953 -3740 -22154 23344 -12160 -14420 29371 -15097 -3582 30042
482 30042 -25112 -3254 18597 -31166 5983 17655 -21922 23125 13771 -26727 21320 -4226
494 -4226 -34871 24203 -6951 -16172 38471 -12102 -4698 29546 -36120 -3859 20740 -34980 16209
507 16209 23787 -22605 24675 2483 -31295 20790 -14266 -24504 35760 -7647 -7073 34246 -19383
520 -19383 -5293 14282 -31635 8030 15144 -23864 20128 13831 -22641 12078 1496 -18756
532 -18756 15132 -3114 -11086 23537 -10653 -14655 23393 -13422 -9608 22252 -11893 233 13555
545 13555 -22161 6069 12248 -25172 16385 17724 -24075 15516 2024 -26111 18503 -11292
557 -11292 -11877 36912 -15149 -4875 30484 -28966 -6701 14030 -26754 16065 14120 -20763 28761
570 28761 1426 -32227 20320 -9189 -19643 26999 -8177 3084 25164 -25714 620 12382
582 12382 -30543 5218 14911 -10581 14848 6129 -10602 10653 -8860 -18281 15171 -975 -11813
595 -11813 18566 2729 -7922 8517 -9143 -4664 9625 -14906 -87 20408 -13310 -1291
607 -1291 19818 -14133 181 7150 -20253 12969 -353 -22620 28852 384 -18332 26835
619 26835 -9039 -11408 15083 -23073 4363 18272 -26643 16244 19201 -27836 13270 3778 -21332
632 -21332 18896 -9690 -8020 29345 -18796 -5908 23083 -20531 -2299 11234 -12907 9790
644 9790 2734 -12789 14778 842 -15229 11986 4010 -10945 4896 -1168 -5334 4581 -5065
657 -5065 -532 13451 -3240 -7266 11700 -4140 -13449 9474 -2568 -1821 14232 -12219 3698
670 3698 11399 -27107 5962 12865 -18140 17832 6877 -11470 18098 -17321 -15893 21708 -19956
683 -19956 -2955 29874 -13847 6515 10659 -26350 12864 -3626 -23889 30903 41 -13275
695 -13275 24426 -12847 -8996 8434 -20592 9154 13967 -15955 14556 10098 -17935 3330 -339
708 -339 -7671 8435 -3426 118 11171 -9649 -6983 7207 -1581 -3609 6514 6811 -2909 -1362
722 -1362 -3972 -6523 5438 -6329 -741 20079 -7372 -4817 11189 -15172 -1910 5066 -11043
735 -11043 17531 4889 -14966 18332 -6225 -20321 14995 -9268 -2282 20025 -15576 9445
747 9445 12520 -28499 11619 5897 -19665 19637 -1685 -7932 17748 -18413 -4635 16646 -17910
760 -17910 4862 16380 -11546 7385 563 -14032 9677 -6252 -7827 17045 -2697 -3263 7240
773 7240 -6439 -2006 -1788 -3328 6249 2772 201 1235 2301 -3578 -9113 3888 572 -4667 8468
788 8468 135 -511 5947 -10225 1101 7503 -13581 5833 8644 -12784 8952 86 -10817 14880
802 14880 -9227 -5559 19068 -15612 -124 13989 -17057 8832 5213 -14868 15817 -4587
814 -4587 -13513 16912 -9079 -6074 16576 -9989 2809 10075 -15812 6669 2385 -15277 12095
827 12095 375 -6443 12190 -5482 -2158 5568 -9239 1707 3975 -4183 3675 2255 -1585 -290
841 -290 -895 -1253 -1194 1440 -111 -552 4011 -1991 -1850 5285 -4520 -1087 6131 -8018 2192 4613
857 4613 -10763 8829 1941 -9346 13617 -5582 -7088 12448 -13096 -244 11886 -12999 8539
870 8539 7285 -13984 10176 -2341 -13534 13784 -5364 -5189 17351 -9079 -445 9833 -16239
883 -16239 4255 3991 -12989 13069 1817 -7270 11284 -5867 -5072 5500 -8251 1679 6476
896 6476 -5178 4219 4027 -5682 718 -390 -3399 2060 -505 331 3338 -447 -1358 265 1531 -3506
912 -3506 -1161 4719 -4112 847 3486 -5568 5846 -780 -6640 10030 -4724 -5831 9763 -7060
926 -7060 -766 7721 -8742 5543 4834 -12226 8474 1505 -12118 10886 -2045 -5912 12294
939 12294 -8724 -131 10141 -13998 3855 6588 -11279 7504 1495 -6131 8808 -4689 -4194
952 -4194 8558 -6572 -2448 7446 -4841 999 3574 -4825 4259 -478 -5471 5037 -793 -3287
966 -3287 2676 572 328 -462 139 452 -478 -444 -2742 2963 1180 -5106 5002 1574 -4908 3795 -1687
983 -1687 -2135 4477 -5349 825 7481 -7768 1185 6853 -8791 3002 2062 -7371 9007 -3086
997 -3086 -5616 12346 -6947 -3968 9283 -8011 1127 4506 -7654 6764 1255 -8746 8069
1010 8069 -368 -7336 7201 -1957 -2487 6061 -6072 1471 4843 -8376 3253 3623 -5138 3132
1024 3132 345 -1723 2255 -2536 -838 3253 -1040 -1849 3101 469 -3374 785 -190 -1368 1761
1039 1761 -733 675 3794 -2690 -2139 3778 -3445 -2735 4793 -2420 1363 3919 -6011 4049 520
1054 520 -8906 6722 83 -4626 8096 -2596 -1121 5134 -8252 334 4973 -7977 3760 5712
1068 5712 -5706 4905 -16 -6113 6087 -4857 -3563 8968 -4904 -219 6106 -5454 1455
1081 1455 574 -5038 4254 -189 -3432 5116 210 -3181 2556 -832 -1756 1747 -2215 474 2562
1096 2562 -2923 687 2546 -1557 -348 1467 -307 -1436 569 -1358 -398 2421 -2880 1856 3794
1111 3794 -4717 1950 1176 -5022 2859 -880 -1991 5862 -1963 -1426 5172 -4905 -2642 3802 -5240
1126 -5240 1842 4661 -4311 6032 1030 -6894 4950 -3654 -4998 5848 -2990 1490 5728 -4240
1140 -4240 1753 1305 -6704 1385 1049 -3235 4590 1549 -1611 3716 -3081 -2828 2335 -3678 387 3460
1156 3460 -965 1948 760 -1615 -206 -1025 -1084 56 1499 -462 144 1963 -2340 60 1606 -2405
1172 -2405 1718 998 -2467 1755 -580 -2799 3165 -113 -1757 4643 -2005 -2401 3455 -5104 278
1187 278 3966 -4357 4937 2213 -5177 4092 -2824 -4752 4328 -2311 635 5815 -2890 772 2090
1202 2090 -6462 467 1564 -3766 4935 1577 -2161 4079 -3779 -2693 2569 -3587 1547 3510 -901
1217 -901 1848 -456 -2384 -342 -1238 -678 1706 1877 -36 548 268 -2171 -939 169 -167 1366 1357
1234 1357 -673 639 -257 -3621 1300 956 -2249 4091 -111 -1614 3112 -4632 -193 3142 -4528
1249 -4528 3100 2676 -3659 2854 -1184 -3336 3515 -2341 -992 5502 -2983 -786 3470 -4774 946
1264 946 1596 -3736 4885 -341 -3201 4540 -3005 -1913 2821 -2228 1709 1415 -2217 1881 -522 -2883
1280 -2883 1174 502 -451 1330 459 332 33 -1858 111 -5 -664 646 351 1619 -978 -1117 2067
1297 2067 -2388 122 1479 -2040 2689 -1076 -2071 3939 -2579 -1044 3408 -2748 512 1316 -3222
1312 -3222 2648 599 -3289 4311 -372 -3387 3587 -2847 -1118 3452 -3946 2965 2589 -4738 3340
1327 3340 -749 -3706 3159 -1765 636 3554 -2656 858 1087 -3970 282 820 -908 2793 456
1342 456 -152 1691 -3082 -1396 505 -1601 1880 897 1198 1901 -2732 65 -939 -2419 1837 -521
1358 -521 1804 2583 -2517 1444 -392 -3677 1571 -434 -432 3431 -1537 52 2441 -4167 592 2286
1374 2286 -3554 3146 295 -3135 3852 -3383 -1111 4666 -3547 1926 2551 -4037 2021 -1482 -3141
1389 -3141 3738 -1112 -34 4287 -2059 -678 683 -4056 819 825 -1458 4537 285 -1135 2000 -3665
1405 -3665 -948 1 -2203 3338 691 267 2538 -2197 -487 -913 -2424 1835 -209 285 2910 -1152
1421 -1152 -110 462 -2839 837 236 -1912 3251 -379 -1398 3321 -2905 -16 2195 -4054 2685
1436 2685 337 -3409 4162 -1761 -1083 3939 -3169 922 1756 -4074 1859 287 -2588 3688 -262
1451 -262 -1199 3327 -2874 -979 1975 -3845 1886 1656 -2142 3959 -1054 -1685 2236 -3650 182 1253
1467 1253 -2044 2913 134 -772 2110 -2093 -552 770 -1994 1104 568 -965 2186 -617 -1025 2062
1483 2062 -2229 55 1311 -2749 2349 -212 -1891 3744 -2149 -229 2465 -3639 1547 343 -3081
1498 -3081 3503 -696 -1163 3575 -2127 -456 1766 -3435 1102 1357 -2950 3399 400 -2342 3346
1513 3346 -2500 -1114 2496 -3690 2120 1705 -2973 3331 -832 -1724 2242 -2600 467 1646 -2350
1528 -2350 1778 662 -1696 1629 -784 -669 1687 -1907 516 1502 -2397 1479 179 -1497 2313
1543 2313 -1871 355 2028 -3216 1753 446 -2196 2610 -1478 -34 2346 -3010 1044 1361 -2839
1558 -2839 1745 180 -1535 2481 -1447 -694 2837 -3058 240 2331 -3188 1993 339 -2282 3414
1573 3414 -2241 -819 3246 -3105 845 1468 -2395 2117 -680 -1454 2680 -1651 -675 2136 -1738 245
1589 245 916 -1811 1731 -290 -1588 2624 -1495 -662 1763 -2041 1352 27 -1674 2818 -1382 -620
1605 -620 2008 -2043 870 89 -1694 2197 -836 -946 2338 -1255 -347 1238 -1929 974 470 -2227
1621 -2227 2694 -286 -1857 2843 -1938 -292 1695 -3005 2112 543 -2590 3078 -764 -1218 1992
1636 1992 -2101 361 1079 -2300 1672 819 -1892 1774 -173 -1307 1573 -1666 109 1739 -2330
1651 -2330 1576 932 -1945 1811 -1175 -461 1494 -2282 1260 962 -1560 1650 -402 -552 947 -1719
1667 -1719 384 887 -1524 1173 829 -1136 1288 -678 -926 1429 -2130 314 1803 -2146 1854 340
1683 340 -1705 2025 -2030 -493 1983 -2416 1230 1294 -1535 1801 -450 -1220 1447 -1579 -600 1884
1699 1884 -1415 473 1610 -1586 1336 -179 -1861 1785 -1552 -725 2107 -1546 1200 942 -1511
1714 -1511 1628 -1100 -1244 1214 -1245 310 1090 -529 1087 107 -1115 623 -913 -964 1159 -603
1730 -603 604 1357 -1061 1198 -365 -1766 1311 -1556 -121 1734 -1352 1678 398 -1550 1529
1745 1529 -1369 -925 1328 -1215 502 1309 -1143 886 356 -1684 1072 -509 -1248 1878 -930 100
1761 100 1784 -1933 1047 297 -2094 1682 -932 -663 1799 -1288 662 907 -1269 969 -257 -1071
1777 -1071 933 -520 -438 1131 -642 192 868 -1229 632 52 -1237 1349 -638 -267 1249 -1197
1793 -1197 955 106 -1341 1246 -914 -477 1162 -971 826 605 -1012 962 -310 -1141 869 -517
1809 -517 -457 1353 -768 382 939 -1873 899 43 -1546 1790 -632 -159 1609 -1790 561 275 -1899
1826 -1899 1269 -73 -395 1507 -565 43 640 -1497 35 547 -1091 909 451 -676 1168 -961
1842 -961 -469 1089 -1500 790 802 -967 1231 -723 -492 866 -1527 537 663 -802 887 -151
1858 -151 -412 689 -858 -40 993 -773 316 627 -1135 515 -300 -877 1567 -921 -5 1649 -1536
1875 -1536 577 86 -1423 1396 -827 -377 1630 -1238 185 750 -1087 631 54 -690 1263 -267
1891 -267 -770 1218 -889 -463 918 -1076 910 310 -1330 1616 -736 -714 1340 -1058 639 323 -1146
1908 -1146 1212 -715 -928 997 -583 144 728 -506 696 25 -1134 791 -157 -850 1124 -426
1924 -426 61 724 -1470 940 65 -1483 1619 -546 -136 1244 -1254 782 124 -1603 1041 -284
1940 -284 -850 1035 -338 63 929 -892 529 614 -1660 632 146 -1004 1290 -552 116 1318 -1751
1957 -1751 602 269 -1583 1082 -276 -24 1399 -976 470 451 -1744 232 -119 -645 1077 48
1973 48 251 1214 -1102 -274 515 -1690 510 215 -599 1722 -741 -32 1272 -1795 449 177 -1099
1990 -1099 1373 -502 -10 1416 -1223 110 545 -1290 352 64 -717 1284 -184 -243 1681 -964
2006 -964 -283 756 -1677 546 -65 -969 1959 -580 -142 1483 -1515 60 -120 -1325 1211 -260
2022 -260 -146 1679 -563 -261 348 -1430 3 135 -894 1577 367 -442 1430 -1060 -662 506 -1707
2039 -1707 892 236 -816 2081 -429 -244 930 -1544 234 170 -1228 1273 20 -530 1304 -440
2055 -440 -392 602 -1264 189 455 -1301 1288 319 -728 1619 -972 -213 707 -1934 743 226 -1107
2072 -1107 1787 -242 -119 1082 -1417 120 211 -1341 882 328 -540 1318 -346 -519 807 -1338
2088 -1338 43 802 -1168 1221 317 -842 1457 -1143 -368 955 -1598 882 451 -955 1425 -477
2104 -477 -397 916 -1107 137 695 -1020 699 379 -907 981 -360 -674 1162 -1084 113 959 -1368
2121 -1368 1103 71 -1048 1466 -1026 -273 1077 -1445 685 462 -1043 1180 -271 -453 950 -888
2137 -888 -188 824 -1018 585 547 -966 1066 -297 -876 1186 -1185 61 1024 -1383 1151 144
2153 144 -984 1311 -979 -291 976 -1173 595 551 -962 955 -179 -722 1016 -687 -247 1075
2169 1075 -938 294 638 -1213 1037 -261 -892 1391 -1016 -21 1057 -1379 886 149 -987 1246
2185 1246 -701 -311 1024 -998 188 562 -959 723 69 -811 995 -441 -528 1162 -1016 130
2201 130 770 -1274 1028 -73 -953 1296 -947 -101 893 -1237 765 219 -860 1045 -477 -536 815
2218 815 -918 -62 606 -834 741 354 -766 1057 -450 -739 1000 -1123 67 810 -1171 1205
2234 1205 99 -822 1280 -981 -328 660 -1185 657 442 -717 1138 -151 -607 636 -900 -422
2250 -422 696 -863 658 838 -826 1112 -121 -941 818 -1202 -161 858 -1029 1090 344 -685
2266 -685 1097 -805 -449 571 -1125 389 533 -581 883 185 -600 619 -720 -543 650 -857
2282 -857 512 900 -758 1100 -174 -921 826 -1273 -199 758 -987 1038 451 -595 1008 -687
2298 -687 -607 536 -956 124 800 -624 685 307 -908 641 -565 -699 1031 -744 392 1074 -944
2315 -944 830 -250 -965 760 -899 -116 986 -719 722 423 -608 608 -513 -640 506 -539
2331 -539 77 815 -428 413 330 -971 561 -368 -630 974 -635 336 881 -900 749 -255 -931 773
2349 773 -732 -35 882 -541 698 484 -743 438 -379 -733 619 -434 -71 1028 -568 312 429
2366 429 -1164 630 -208 -666 1086 -586 248 875 -961 545 -96 -942 657 -476 -174 909 -354
2383 -354 289 543 -694 179 -19 -835 509 -145 -361 948 -506 122 487 -925 504 -145 -593 995
2401 995 -526 5 568 -761 364 -97 -588 643 -243 -151 784 -327 -11 404 -667 200 152 -669 774
2420 774 -58 -455 818 -644 -7 517 -885 785 120 -664 924 -536 -278 469 -798 219 316 -514
2438 -514 634 179 -384 543 -291 -381 478 -657 137 490 -768 563 1 -551 725 -630 -37 552
2456 552 -697 608 233 -454 577 -423 -251 267 -609 166 297 -322 549 272 -311 418 -373 -498 426
2475 426 -679 101 619 -570 731 95 -529 668 -811 -119 602 -650 558 359 -473 460 -469 -451
2493 -451 360 -528 -24 743 -232 353 382 -675 281 -325 -674 749 -335 111 764 -597 480 -58 -665
2512 -665 519 -526 -127 588 -309 307 201 -438 117 -266 -513 407 -55 -58 692 -202 113 185 -771 290
2532 290 -323 -586 815 -278 234 645 -498 465 -178 -711 431 -476 -83 583 -172 353 290 -588 126
2551 126 -200 -701 458 95 -61 910 -180 76 299 -1060 110 -205 -602 831 -133 265 705 -525
2569 -525 205 -143 -798 196 -106 -36 635 41 79 326 -580 -215 58 -594 407 269 -3 820 -263 -37
2589 -37 180 -1005 82 -136 -344 836 -26 356 580 -554 11 -279 -658 201 -39 88 698 64 12
2608 12 322 -673 -266 88 -568 620 251 -59 932 -459 -199 127 -1011 148 10 -247 927 89 147
2627 147 479 -531 -192 -85 -624 133 239 -34 601 97 -315 392 -554 -289 280 -508 501 265 -192
2646 -192 771 -326 -210 174 -794 100 -60 -202 626 103 93 356 -333 -224 -129 -554 166 243 -169 693 151
2667 151 -257 414 -714 -138 281 -630 630 294 -224 716 -488 -216 139 -755 245 198 -217 598 102
2686 102 -201 263 -354 -253 199 -432 94 424 -389 467 56 -430 530 -488 -202 326 -569 473 152
2705 152 -222 469 -273 -128 181 -472 115 154 -186 326 130 -173 214 -285 -246 277 -356 148 464 -376 436
2726 436 20 -437 456 -486 -3 457 -456 394 18 -278 310 -330 -147 354 -257 108 316 -320 179 55
2746 55 -467 365 -92 -266 559 -328 9 408 -530 391 -77 -406 619 -385 -35 357 -445 303 91 -298
2766 -298 353 -84 -175 224 -188 -43 296 -287 118 278 -399 336 -107 -363 387 -402 70 334 -459 454
2786 454 28 -319 450 -342 -1 358 -334 242 23 -278 321 37 -159 320 -122 -170 307 -397 35 304
2806 304 -474 554 63 -364 508 -427 -83 257 -601 326 103 -233 524 -171 -31 261 -345 -36 107 -261
2826 -261 235 157 -199 404 -32 -260 345 -391 -40 284 -420 425 5 -230 468 -383 -56 196 -455 293
2846 293 -2 -236 429 -43 -82 276 -202 -16 145 -316 162 183 -334 347 -92 -277 430 -342 161 266 -484
2867 -484 411 -40 -376 410 -388 10 278 -390 183 199 -297 232 -9 -255 208 -108 -110 292 -328 79 321
2888 321 -374 320 -87 -412 464 -443 -17 374 -399 364 53 -240 274 -328 -44 233 -294 161 150 -145
2908 -145 217 8 -308 200 -181 -275 352 -271 201 324 -391 431 -109 -311 491 -494 60 287 -387 311
2928 311 16 -238 359 -240 -108 314 -250 7 209 -213 197 147 -380 268 -190 -394 418 -405 85 407
2948 407 -394 509 -14 -331 348 -363 -30 229 -294 234 43 -192 236 -101 -154 203 -113 -59 317 -198 153
2969 153 137 -409 293 -121 -244 511 -296 73 326 -367 353 -36 -237 391 -249 13 194 -296 167 111 -270
2990 -270 168 41 -248 292 -137 -143 373 -307 96 201 -426 256 -44 -376 399 -336 83 390 -366 334 -6
3011 -6 -224 206 -270 -125 230 -185 33 250 -162 145 117 -334 183 -116 -194 366 -294 84 179 -356 276 -52
3033 -52 -339 346 -315 68 343 -292 234 39 -260 55 -195 -246 182 -86 74 342 -142 138 104 -406 207
3054 207 -176 -227 464 -254 144 360 -418 262 -79 -366 288 -203 91 323 -189 170 21 -354 60 -80
3074 -80 -202 267 4 -56 432 -225 21 172 -457 219 -105 -258 387 -241 71 300 -301 238 -69 -234 187
3095 187 -183 16 267 -155 109 101 -230 37 -5 -253 210 -64 -78 470 -175 121 188 -495 188 -155 -238 466
3117 466 -100 175 333 -286 110 -141 -308 197 -106 -85 292 8 -22 173 -317 -111 35 -335 371 85 -74
3138 -74 462 -221 18 13 -538 194 5 -185 447 -58 -1 245 -234 62 5 -199 169 12 -130 228 -18 -118
3160 -118 211 -200 34 157 -381 293 56 -109 366 -230 89 104 -410 157 -149 -260 352 25 95 252 -238
3181 -238 21 -34 -283 -68 99 -105 290 36 -175 207 -337 -114 186 -313 349 54 -185 274 -251 -92
3201 -92 95 -322 191 81 -1 263 9 -40 139 -166 -113 130 -189 91 186 -233 187 -82 -266 298 -263 -49
3223 -49 95 -321 207 -28 -194 283 -213 47 139 -260 144 11 -58 177 98 -115 234 -111 -208 142 -220 -33
3245 -33 187 -170 262 -20 -239 309 -371 -59 163 -247 214 15 -124 191 -224 -102 36 -153 62 170
3265 170 -84 50 93 -168 65 -38 -150 250 -162 3 205 -312 192 -23 -242 289 -195 55 161 -203
3285 -203 130 -39 -77 210 -77 -56 46 -153 -24 60 -81 64 157 -230 156 -91 -202 192 -187 48 279
3306 279 -282 285 -55 -220 192 -326 -43 209 -211 123 59 -169 151 -3 -147 155 -33 -104 223 -195 11
3327 11 161 -249 205 47 -222 255 -234 -7 240 -191 227 50 -52 183 -153 0 49 -129 56 68 -103
3348 -103 115 26 -181 81 -107 -88 184 -151 46 167 -258 237 -29 -151 253 -242 -47 147 -233 135 34
3369 34 -183 180 -49 -27 133 -131 -37 44 -200 20 135 -217 233 -10 -134 295 -248 -61 130 -290 299
3390 299 -72 -139 261 -202 -7 103 -169 74 4 -145 127 1 -89 152 -99 -69 227 -159 -21 68 -248 170
3412 170 13 -157 271 -169 10 134 -248 174 -27 -115 182 -139 31 101 -132 104 104 -23 22 70 -152 171
3434 171 8 -128 187 -89 -14 93 -261 149 -32 -148 244 -160 21 166 -211 131 4 -128 146 -51
3454 -51 -90 98 -67 -28 86 -133 64 134 -173 164 -1 -184 155 -153 71 164 -247 208 51 -131 261 -234
3476 -234 -7 7 -193 134 -59 -47 196 -95 -82 62 -130 -109 81 -104 66 108 -188 118 -47 -152 157 -177
3498 -177 0 113 -189 274 5 -58 219 -109 -20 101 -164 33 4 -50 110 26 -82 56 -53 -138 139 -231
3520 -231 -11 122 -213 155 -58 -231 185 -208 66 147 -176 200 20 -105 191 -61 -3 56 -114 19 53
3541 53 -66 71 86 -16 183 -91 -180 144 -137 21 133 -146 218 -88 -180 166 -173 -18 168 -166 226
3562 226 95 -65 61 -189 -178 70 -55 24 176 -58 99 39 -209 109 -79 -163 158 -147 130 184 -175 186
3584 186 -161 -165 146 -157 36 184 -41 150 13 -166 55 -82 -93 53 -49 -55 131 -102 110 135 -244 138
3606 138 -77 -113 169 -158 36 137 -175 181 -68 -20 116 -163 -43 102 -99 110 75 -129 4 -31 -147
3627 -147 85 -79 13 234 -134 65 171 -283 118 -34 -141 192 -166 65 144 -188 81 -55 -102 42 -34
3648 -34 -38 79 6 32 31 -97 -72 2 -168 32 -35 -44 212 -169 28 56 -245 36 -39 -158 258 -59 147 140 -112
3673 -112 -38 -106 -151 40 -3 -3 199 53 36 83 -217 -42 -16 -214 228 83 -8 214 -142 -57 73 -345 116 -110
3697 -110 -54 195 -63 84 99 -152 -5 -4 -146 76 5 -133 91 -33 -61 174 -146 -50 35 -135 105 55 -23
3720 -23 222 -147 -33 1 -224 23 -62 -44 118 37 28 62 -61 -54 -18 -82 12 39 -96 137 126 -24 103 -190 14
3745 14 108 -202 119 -17 -29 185 -126 67 0 -211 29 -7 -38 144 31 -46 96 -85 -96 109 -160 1 134
3768 134 -60 118 -33 -101 142 -149 8 51 -145 171 -44 -46 116 -69 23 48 -112 18 17 8 131 86 -100 29
3792 29 16 -44 55 -96 82 137 -89 136 20 -125 162 -149 21 7 -154 97 -97 -19 83 -72 -54 56 -114
3815 -114 -19 59 -85 74 100 -107 117 -36 -162 140 -142 20 100 -100 158 -33 -84 171 -112 63 35 -90
3837 -90 150 -40 -76 22 -59 -59 107 -40 -4 22 -73 60 47 -107 115 51 -95 143 -162 38 53 -213 157 23
3861 23 -25 138 -98 -57 49 -111 5 -48 -59 123 30 -65 66 -71 -71 112 -59 87 31 -77 61 6 -79 125
3885 125 -97 3 96 -129 109 -38 -60 72 -67 -9 55 -75 -31 22 -83 1 117 -4 122 -34 -136 94
3907 94 -160 65 73 -72 113 22 -83 96 -53 21 56 -112 110 -34 -79 22 -40 -14 -16 -111 32 66 -16 35 77
3932 77 -125 62 -52 -85 121 -151 34 45 -125 112 0 -132 147 -162 -22 41 -74 62 46 -42 90 51
3954 51 -92 -7 -46 -102 80 -26 77 83 -130 98 -46 -105 76 -118 8 109 -64 144 14 -72 6 -134 -94
3977 -94 17 3 48 31 -54 45 14 -102 5 -50 -77 80 -56 30 96 -164 75 -49 -109 178 -135 13 39 -95
4001 -95 97 -26 -30 37 -81 -63 47 -60 83 110 -68 47 43 -130 -10 -28 -84 93 -89 5 53 -118 104 -48
4025 -48 -74 24 -111 74 65 -55 110 9 -53 15 -45 -86 -11 -22 -35 88 -19 64 79 -122 87 -71 -128 113 -69
4050 -69 21 33 -29 81 -65 -168 58 -71 -36 44 39 108 72 -18 24 13 -126 7 41 2 113 -26 29 16 -133 52
4076 52 -30 -81 91 -75 51 49 -133 76 -20 -28 90 -29 33 86 -3 -40 85 -40 -38 68 -75 70 -15 -151 84
4101 84 -90 30 21 -169 164 -54 -95 107 -76 35 44 -77 3 15 -18 -22 8 -30 -10 9 1 90 -48 10 13 -67 33
4128 33 -64 -148 130 -35 76 101 -101 101 12 -66 64 -45 38 120 3 49 -49 -2 51 -35 -51 33 21 -29 80 -94
4154 -94 -36 91 -135 114 -12 -40 52 -41 38 31 -162 131 20 -13 70 7 -37 -64 -1 -36 43 -14 24 6 -63 24 -27
4181 -27 -79 145 -49 44 21 -70 76 -6 -88 93 -129 8 -37 -54 89 -26 -152 -26 19 -17 43 14 12 -11 -64 -11
4207 -11 5 -148 77 20 -47 131 -21 -13 61 -119 109 -55 -43 88 -25 -22 -26 -27 -53 87 -39 2 47 -75 -50 51
4233 51 -16 56 -18 -44 73 -86 140 28 -75 160 -34 22 25 -146 66 -29 -107 58 -47 76 26 -10 -44 -24 -87
4258 -87 -74 44 -25 73 37 -35 85 -64 8 16 -154 21 -21 -30 110 -69 28 77 -9 53 37 -1 58 -21 5 63 -23 -32
4286 -32 24 -59 -43 86 -53 83 34 -28 121 -47 -11 32 -28 99 -49 -78 125 5 -18 -7 -66 35 -2 -101 9
4311 9 -3 -8 110 1 -56 28 -35 -21 95 -70 48 -17 -65 86 -54 -31 10 -93 73 -35 -1 49 -58 -22 56 8
4337 8 20 9 -33 -5 68 -6 41 -35 -28 108 -44 -71 17 -37 34 22 -78 8 -94 -12 96 -64 27 12 -34 140 23
4364 23 -14 -34 -49 -97 117 -65 -50 60 -80 87 -76 -74 74 -109 33 44 -61 40 -2 -3 122 -62 37 81 -73
4389 -73 10 18 -6 52 51 13 49 18 -92 9 -62 -19 67 -58 29 11 -6 111 -114 9 46 -74 62 -51 -8 103
4415 103 -4 -5 14 -18 -8 -24 -43 -2 -55 -65 34 47 -12 27 -80 22 77 -64 95 0 -84 82 -104 -9 21 -100
4441 -100 53 -11 -23 94 -18 35 13 -11 -19 39 -50 30 44 -43 108 39 -83 -18 -38 -49 15 -78 72 26 -14 53 -96
4468 -96 -35 18 -147 13 15 -9 36 -23 -13 39 18 -51 100 -70 -36 99 -29 84 51 -71 1 -88 -36 91 -48 -5
4494 -5 -25 -70 -18 -51 46 -41 -69 -29 45 -5 3 67 -38 43 -94 -47 70 -11 100 8 -110 74 -60 -59 24 -128 12
4521 12 29 -47 84 -49 23 25 7 -103 15 -46 -48 41 -63 6 43 -94 57 -15 -111 9 15 24 85 -65 31 -71 -112
4548 -112 9 -47 51 34 8 58 26 -17 57 19 11 38 -46 -40 52 -42 42 74 -16 43 -4 -105 98 -61 25 23 -33 88 57
4577 57 -20 71 -104 33 -6 -44 23 -6 24 5 27 -43 10 58 -64 22 -59 56 23 -99 60 5 -11 61 -66 -50 91
4604 91 -30 -10 10 -35 16 14 14 -18 -25 58 62 8 20 83 -58 20 19 -95 51 -7 16 90 17 65 -11 -53 15 -42 -2 24 -29
4635 -29 -57 -4 47 -21 7 2 33 -26 -64 53 -51 15 103 -149 26 -4 -91 49 -1 26 57 -28 39 36 -45 -22 30 33 43
4664 43 26 14 -23 4 28 -46 -48 40 2 -21 59 -11 49 119 -86 47 -15 -45 47 -44 2 25 -108 32 -45 -95 56 6
4692 6 21 85 5 -58 14 -8 14 61 15 29 -17 -20 77 -45 81 25 -116 14 -59 -31 82 -64 -73 49 -24 -9 -71 -20
4720 -20 -3 -72 -43 -46 -71 -88 29 -49 -17 29 -76 -2 14 -71 80 -42 -56 31 -17 33 -10 -34 19 -26 58 -28 -43 36 -28
4749 -28 -50 2 -20 22 6 -74 20 13 -15 43 86 -83 13 -47 -26 103 -17 62 86 35 56 -43 -84 46 -3 0 3 -28 -58 -5
4779 -5 -52 -48 -34 23 -23 -38 -55 3 -71 27 36 -70 44 2 -26 16 17 0 12 -34 -50 -3 17 44 14 -6 37 25 50 23 -47
4810 -47 -30 11 -55 24 2 -35 70 -43 -14 34 -25 -23 -29 -34 57 -46 -35 20 7 -7 -7 -32 25 -1 3 36 -28 6 49 -11 -55
4841 -55 41 -66 25 -2 -15 79 -122 31 0 -51 -65 -34 -66 45 -13 67 -15 -39 -2 -103 7 -2 -24 -9 -34 37 -64
4868 -64 89 -23 -35 -6 -95 71 -1 25 93 -63 -36 -14 -98 12 -62 -25 38 62 -53 -61 -48 -16 27 -28 -58 9 -20 5
4896 5 74 -6 55 20 8 -9 -92 8 -2 43 65 -112 30 26 -12 -28 -20 -45 47 -28 0 96 39 -18 -13 -77 -35 10 -18 43 30
4927 30 -104 24 -28 -5 32 -96 73 15 -46 66 45 -9 -35 -64 -66 -19 -3 16 28 -13 -49 -22 -30 151 29 -21 68 -55
4955 -55 33 -2 -7 82 -66 0 86 -58 52 58 -67 3 -102 0 -45 -39 -48 42 -27 17 0 -49 73 94 -15 62 -9 -4 82
4984 82 -62 66 34 -32 8 2 -13 34 -6 2 -15 -15 -66 19 -22 -75 -79 -31 -52 -46 76 19 -6 49 -13 -9 -23 -9 -64 18 -44 58
5016 58 -14 -17 40 -37 -14 -29 -28 4 35 -35 13 6 -57 -59 -2 -31 9 -62 -22 53 -60 48 -21 1 3 -29 -67 -36 -17 12 53 -8
5048 -8 33 29 -15 -40 -82 -20 31 -7 4 60 -51 68 30 -18 0 -110 18 56 -47 9 18 0 18 18 -54 51 -39 -7 5
5077 5 8 3 -51 1 -43 28 -1 -30 32 -13 16 -18 1 10 -60 94 18 -36 9 9 -12 50 -93 -3 17 -8 6 -14 22 47 10 1
5109 1 33 -1 -6 62 35 33 -35 -3 -11 -39 -30 -41 -21 36 -13 -20 19 -49 14 26 10 18 -49 7 21 34 72 -19 -3 27 47 -59 -33
5142 -33 -41 -20 -13 -67 -38 -50 22 41 -13 -73 -36 -81 -6 -21 -4 20 -6 -33 -32 51 -73 -8 17 -45 84 -15 -48 -3 -104 34
5172 34 2 -9 35 37 -22 58 -12 44 24 -34 -10 -43 -41 -19 4 -19 -15 12 14 30 -55 -33 8 -72 -62 -34 2 -3 -6 43 -51 -43 -40 8
5206 8 -1 14 -50 5 -69 -69 55 -3 25 -14 -57 36 39 -24 16 -26 -5 -3 14 -61 -17 -53 19 50 -46 60 31 -15 11 -19 -1 8
5238 8 8 29 -12 -42 27 5 -101 -11 56 -22 108 -50 -11 26 -38 39 -9 -126 16 -66 13 -20 -21 102 -26 0 29 -29
5266 -29 -23 8 -41 -10 56 7 -54 -47 -60 -8 31 -59 -24 -10 -25 -13 35 45 4 -36 41 -12 4 -17 -39 19 19 -84 -22 28 -1
5297 -1 -29 -54 -8 -21 -107 24 71 -28 20 -13 -76 7 25 -37 30 -2 43 -56 -35 38 -12 -32 77 9 -14 -15 -40 42 9 3 -5
5328 -5 32 -44 52 -6 -64 48 -93 58 46 -19 74 4 92 63 -64 77 15 -65 26 5 4 15 -90 -20 10 -15 6 24
5356 24 -5 -22 -3 -36 58 3 -8 -21 -32 31 -25 -26 13 -15 -14 -5 10 -7 6 -5 12 -40 -38 45 -39 18 -10 -27 72 -11 -110 -84
5388 -84 96 -47 -21 74 22 32 -36 -18 20 -35 48 1 15 17 11 50 -22 20 7 54 7 -4 -30 -24 -13 -44 -46 6 -26 -5 0 4
5420 4 25 35 41 -4 -58 36 18 6 52 10 40 25 -49 49 20 -52 -11 66 -42 -22 -8 -25 83 -6 5 69 -58 6 -21 5
5450 5 32 -13 16 10 -88 -10 8 17 72 26 43 -12 -38 22 -25 -35 -29 -5 30 18 -7 -26 -26 -22 44 -18 -42 54 -10 -2 -28 17 11 -63
5484 -63 -34 34 -20 2 35 -12 -58 79 17 -58 57 9 29 -61 -34 49 3 -1 -64 -40 -2 23 -25 26 23 32 46 -39 -6 3 -38
5515 -38 43 -17 8 23 9 34 76 -42 34 38 -21 45 36 7 19 28 1 69 -65 21 3 -25 29 -7 -26 27 -64 26 -11 -48 43
5546 43 -9 36 13 64 -5 13 -25 7 -27 39 29 -11 -42 -9 2 -18 51 -74 -18 14 -4 -28 -4 51 -15 43 -25 22 -4 -12
5576 -12 4 0 12 58 -29 87 48 14 46 -111 -36 -9 -45 -3 45 -31 -9 2 -8 16 -14 81 30 31 -11 -14 17 32 -13 -35 -19
5607 -19 30 14 -33 -12 -13 16 0 47 -19 -45 -7 -60 5 23 -25 -19 -3 -72 -40 -1 -19 19 -59 1 54 -4 20 -38 2 69 -40
5638 -40 -16 54 -29 48 26 -7 74 -84 40 -15 -5 80 -6 -3 -6 13 21 65 -5 68 0 9 6 -23 -2 -29 -65 -86 -36 20 41 -13
5670 -13 -1 -3 -23 -8 34 -1 -22 28 -64 4 15 34 55 -23 -16 -9 11 -58 -26 -4 52 27 -11 80 4 -61 -14 -28 -14 12 -45 90
5702 90 32 46 45 0 35 -28 62 63 33 30 43 -9 24 -27 31 -52 17 1 19 -93 -13 -74 -24 15 49 21 -21 96 -30 89
5732 89 18 63 29 25 31 58 24 -26 -8 34 -7 -35 1 21 -26 -61 -17 -8 -31 -5 -10 30 1 36 25 21 21 -22 43 23 -52 -47 -24 64
5766 64 15 21 9 39 -5 -30 7 -11 -30 -20 27 -28 59 -50 -14 59 -26 -36 -27 -59 25 -51 -40 -10 8 -55 -38 -12 27 30 14
5797 14 15 -35 -13 42 8 44 12 -48 10 51 -13 -33 21 51 26 23 51 -41 27 17 -21 2 14 -12 2 -9 56 -4 20 13 -7 -4
5829 -4 1 49 -47 27 -12 -78 42 22 -5 3 -4 -4 -2 -57 39 -2 -74 -4 -13 35 10 10 -13 -18 -5 -11 -3 62 31 -13 -55 -18 36 -29 45
5864 45 -98 29 33 15 79 40 40 18 13 10 39 -35 43 -29 11 -59 29 31 27 -38 10 -80 -55 40 -27 3 50 -17 21 13 -4 63 -36
5897 -36 2 29 1 3 -15 -36 -41 -28 -9 67 -43 -21 -5 13 -30 67 -27 17 10 -46 4 -16 -3 50 -15 0 -17 31 26 7 67 26
5929 26 39 -24 -32 31 -70 -5 72 16 59 -30 49 -12 -71 51 -19 -16 34 -21 -18 -15 48 19 5 -18 13 -38 -22 21 25 9 44 -7
5961 -7 -32 74 -61 -9 -64 7 57 22 16 0 -23 7 54 0 -35 14 3 -27 -13 39 -26 -10 -20 -83 -11 70 69 -58 52 -58
5991 -58 51 28 -42 -24 44 -10 1 -6 16 -6 -74 -8 11 86 10 55 21 18 55 30 -9 8 -15 -24 -38 0 -18 16 -25 12 45
6022 45 -84 -6 5 1 -20 49 21 51 -50 18 26 53 52 -18 8 -16 -33 -2 15 -5 43 -56 28 -38 -10 25 -49 -13 -36 -5 45
6053 45 -27 33 16 15 -33 29 21 20 25 -4 -38 -1 64 -48 -74 22 51 -27 -3 -14 14 5 -2 36 -38 30 41 -64 3 14 5 79 66
6086 66 16 2 5 9 -2 0 20 -18 84 35 35 -1 62 61 -10 24 32 44 14 -20 -15 -27 -35 -2 -5 6 1 -39 72 -73 12 8 -51 -6
6120 -6 27 -23 -51 -5 23 30 -27 17 29 34 -15 7 14 -22 34 -19 10 46 -41 42 71 1 58 1 9 -15 23 56 4 26 -20 14 32
6153 32 30 -21 16 15 49 -12 -13 -20 -57 11 49 -6 45 72 -23 12 8 -31 -25 -8 -12 11 -81 51 22 -41 25 42 46 -17 -55 22 8 49
6187 49 85 2 31 12 50 10 -19 39 10 29 13 13 29 3 -75 2 9 35 -13 20 30 0 59 -8 -13 21 16 66 28 3 16 0
6219 0 26 -8 -52 -14 94 28 -78 43 9 -5 30 -37 -8 13 30 32 -50 8 -33 -47 4 18 -21 40 63 -16 16 -20 -46 12
6249 12 82 49 -2 -30 -4 -12 16 18 11 -16 -79 -28 -43 37 -27 36 -37 41 -13 -38 1 24 28 42 -29 -12 -6 60 6 -16 55 20 -16
6282 -16 62 43 35 -3 -24 -18 41 -34 32 1 58 39 6 -28 30 44 -39 22 44 5 -17 9 36 16 43 -47 -22 36 1 -1 -52 -15
6314 -15 -38 -70 -14 47 61 -20 73 -16 32 15 -28 22 22 31 4 -33 -5 -2 16 52 18 -21 -46 -33 6 -2 -28 -39 -69 41 25 -31
6346 -31 -3 -3 -5 -5 32 -44 -55 -17 -4 38 -74 -74 18 -50 18 -22 26 -45 70 -24 -61 -26 30 66 -18 -34 -38 29 -14 -14 30 27 3
6379 3 51 28 7 40 31 31 25 25 16 10 -33 -9 -7 -7 -22 4 -55 -23 -36 -20 -58 16 13 -54 -8 -48 -8 -50 35 -43 -42 -34 -25 44 -39 -1 28
6416 28 -15 -24 -12 -39 48 28 -31 -11 -1 68 -74 61 5 -13 -17 -13 30 -38 40 21 -4 -12 -6 -38 1 24 22 21 45 67 -18 -7 45
6449 45 -29 47 4 22 13 23 -20 -14 -22 -15 -31 34 -4 16 -5 38 -21 -8 15 36 17 2 36 13 -21 6 -12 24 37 27 29 11 10
6482 10 17 44 76 -45 22 -24 -19 -23 -32 -92 19 -8 36 54 -5 30 -10 23 -65 -25 -21 31 8 -7 -24 13 49 66 -11 31 7 11
6514 11 -7 -48 -16 41 15 12 36 14 43 2 -7 12 36 7 9 23 15 -45 15 -23 32 38 -47 -9 46 -35 -5 -75 -20 18 -64 -23 0
6547 0 13 29 -59 1 62 1 45 -19 8 -29 -60 69 12 -39 -43 -10 -17 -15 -40 -3 -40 -28 13 -32 30 -30 8 22 0 -7 12 82
6579 82 55 8 30 20 32 -9 -38 33 3 -19 73 10 -40 -3 47 5 -39 -63 34 -38 -42 -62 -8 -54 -59 -10 -20 -4 11 -48 -6
6610 -6 -52 -26 -30 -42 -20 -16 -6 38 59 -64 34 13 44 -19 18 4 -10 27 4 82 -43 -7 67 -39 2 16 -10 10 -13 -47
6640 -47 76 -42 -4 43 -15 -33 -1 33 56 -27 -57 -15 -51 53 35 41 20 35 1 -40 15 -55 43 20 29 41 -51 -27 -51 8
6670 8 34 -28 -27 27 -10 27 10 55 43 -5 -22 -26 52 32 47 -54 -53 -67 -49 26 35 52 -73 -62 -6 20 -8 -24 -49 -25 61 17
6702 17 -9 -11 10 7 22 -17 -15 -43 4 -10 48 -3 72 0 10 6 8 26 -73 -29 -29 33 17 40 -29 -11 41 57 -59 75 25 -37
6734 -37 -2 11 17 18 39 5 -13 -37 -26 -17 9 -28 -45 18 -37 23 -19 -21 -20 42 49 -69 12 45 -34 5 -33 36 10 68 -47 -18
6766 -18 -1 15 -10 -18 21 8 -52 52 36 23 51 16 14 63 4 34 -26 26 10 26 -9 -54 18 20 -66 -84 15 15 1 15 0 4
6798 4 61 20 33 30 23 8 -6 -61 -84 -22 -56 -29 8 -38 48 27 23 -18 -15 -34 -35 -29 61 0 22 -3 10 -10 -10 1 -25 6 53 2
6832 2 19 11 25 -60 -9 -3 -18 -4 20 24 44 -27 19 35 -3 73 7 -52 -10 -9 17 39 16 56 47 -12 -7 31 50 60 -35 -16 -4 6
6866 6 -28 -49 -23 42 -45 -27 -41 -9 -31 -22 -21 26 6 -59 -12 -23 2 23 -1 54 42 -21 -41 24 60 -17 15 -23 -15 7 -25 -43
6898 -43 -28 54 1 6 -37 53 11 -35 3 2 -26 48 -10 47 5 -24 31 -8 20 25 3 76 -41 19 -35 -77 53 -2 -61 -65 -3
6929 -3 -15 2 36 -87 -42 26 3 -44 -6 22 39 -38 -50 13 7 7 -10 -76 19 57 -9 -8 -38 -11 17 -35 -39 25 20 -20 -18 -67 11
6962 11 11 5 -24 41 15 -43 23 -33 -13 91 -40 22 34 -12 -25 -9 -66 8 -19 -48 -10 -17 19 47 -23 -89 18 7 -47 -6
6992 -6 18 -22 41 25 45 34 -5 58 6 -31 -3 47 -35 22 29 43 13 -76 -2 23 -50 16 40 62 -6 -97 38 -43 23 -20 52
7023 52 39 50 -10 -67 -35 32 24 -1 -16 22 32 22 19 -41 0 14 46 32 32 -24 17 -6 -49 22 -25 -34 -27 59 64 -11 -3 9 39 10
7057 10 53 -20 -25 -30 46 35 60 -13 -3 2 -1 107 14 46 21 -29 20 59 -8 4 53 15 -16 -34 17 21 -31 72 91 10 -1 -67
7089 -67 -46 -43 -8 -34 -15 -7 -6 43 -50 74 -6 17 14 2 -26 -37 -20 -14 14 -36 20 40 -65 -30 -28 55 81 4 26 5 -22 24
7121 24 -22 15 43 68 3 66 20 -8 -7 -45 -46 20 2 3 6 26 -12 -15 -13 7 17 -41 -4 1 -13 -65 -19 -3 -15 27 -20 -14 -50 -15
7155 -15 -10 9 -28 5 -42 19 17 60 56 4 34 2 21 -7 45 5 -6 78 -36 -14 38 -51 -30 -45 -48 50 29 -18 -10 -16 -8 -1 31 -4
7189 -4 -1 -21 82 32 56 21 -41 9 57 8 9 -38 25 -37 1 -49 -21 -12 6 -49 29 -37 35 64 -7 -6 -22 -9 29 -36 -19 -68
7221 -68 -9 28 20 -37 -7 1 24 60 -64 38 51 -21 -26 -11 18 -15 11 64 16 31 -2 28 -46 23 71 -4 -30 14 4 57 -10
7252 -10 26 2 38 29 -8 23 2 -9 -4 -8 17 -27 15 -24 -21 32 -14 7 3 -32 -8 43 -15 -39 -6 46 -15 -1 16 20 10 27 43
7285 43 41 30 -3 -11 42 -24 -38 -18 39 17 -15 -18 -20 -63 24 31 20 24 -10 7 29 -4 -15 10 -24 -17 74 -13 -69 -12 -9 48 24 32 61
7320 61 -1 -69 16 23 -21 -24 -4 20 37 15 8 68 -4 -11 36 -1 40 3 4 -32 -99 -41 -41 -9 -38 -28 28 72 -58 7 49 -35 34
7353 34 -2 -34 20 89 36 26 0 -96 41 -22 -56 -24 -15 18 6 -3 -54 42 5 -34 7 20 -33 55 13 -12 36 -44 67 -1
7383 -1 45 29 -25 55 22 -25 -19 -54 -12 23 -26 19 33 -50 23 -50 12 32 6 -75 20 -26 -109 45 55 17 -10 -11 30 21 27 12
7415 12 40 24 6 -2 -15 -8 17 17 34 44 7 -5 11 -2 42 47 7 9 -18 35 -76 35 1 -28 -46 -1 -11 32 13 -30 -18 -7
7447 -7 16 -8 28 -65 13 25 35 -62 -10 2 -33 10 27 -30 -38 -42 -3 -23 -6 -10 -50 -27 42 0 -32 -3 55 -13 44 41 -14 -20 -68
7480 -68 -83 0 -13 3 -11 55 36 -19 75 -5 17 -35 -41 -48 -27 -14 -9 58 1 36 17 -100 -55 -14 -23 -28 8 -15 -1 -36 30 -28
7512 -28 6 16 -52 -16 -22 -59 36 62 1 -31 -59 -16 16 2 -40 17 -28 -4 -44 26 -50 1 31 69 -2 60 5 -40 4 -15 50
7543 50 0 39 6 9 -23 84 -10 -56 20 -29 23 30 -4 17 48 13 -58 -17 11 15 8 36 -12 -18 -19 -5 21 14 42 -13 -70 -11 52
7576 52 -34 -32 -58 -32 -11 -67 -28 -28 -37 -23 34 24 -60 33 -24 14 -34 55 -27 20 17 9 46 -6 36 -65 36 -5 -36 -22 82
7607 82 18 19 66 13 -25 6 -44 39 -14 -13 -2 -50 -35 0 58 -46 13 -8 0 -21 -25 63 -46 -43 -6 -50 -76 48 6 -6 -5 -9
7639 -9 -79 -14 40 -16 18 -10 -12 -55 -32 -16 17 21 -26 22 10 19 14 18 -16 -9 11 4 -26 27 13 77 -44 21 54 -13 2 -3 -36 -24
7673 -24 -7 23 -11 -7 -56 -46 -31 32 54 21 -4 37 0 41 48 -18 -23 -65 -34 92 -59 19 -10 -58 29 4 -7 2 -3 -38 -11 -43
7705 -43 -6 -4 6 16 30 -12 49 -40 -40 -11 -56 -56 36 -20 -1 19 -16 -16 23 30 11 -22 -52 53 9 -9 -27 12 19 45 30 -38 6
7738 6 12 12 34 -18 25 -28 15 -9 44 26 -37 1 56 25 -3 36 -19 -19 0 61 21 10 14 19 -35 -15 57 -60 -33 18 64 -21 -17
7771 -17 -27 -6 -49 4 18 -16 -4 -27 27 18 6 65 54 59 -34 78 -10 69 17 -26 -52 47 39 -41 24 -23 -24 35 -13 11 -28 -12
7803 -12 -3 9 16 20 98 -50 -35 0 -20 -2 27 37 -10 -6 30 -19 -23 -88 86 23 -9 -1 47 11 -36 -43 -18 -12 -48 -59 -59 23 59 29
7837 29 29 18 11 14 14 -1 13 -1 -6 27 18 -37 1 -8 6 16 67 -26 2 -71 -15 -9 -34 15 82 57 11 48 -20 -2 -43 25 35 -9
7871 -9 -3 4 -17 -28 11 -1 -32 66 -12 -2 27 -22 -3 4 15 41 -12 4 -13 -43 21 -6 -27 11 30 11 12 0 -31 8 49 -16 -12
7904 -12 12 -64 -60 47 61 51 45 6 10 16 61 40 -26 -55 24 -64 5 11 -37 63 53 -6 18 -47 35 2 -24 -48 30 15 -77 -43
7936 -43 -72 -37 14 -41 48 -44 -99 -40 43 16 10 -122 13 50 -29 -13 31 27 -52 -17 47 -81 -32 -5 8 -64 60 -49 37
7965 37 1 -23 13 -17 4 -42 -34 49 27 -6 -27 17 -61 -17 43 25 12 39 -45 9 -10 -28 -57 1 2 49 -13 26 -17 -21 6 4
7997 4 -49 -2 24 -13 18 -38 33 2 34 31 14 -55 -60 68 -30 -5 15 53 -28 17 18 -5 -27 -6 -28 11 -17 -15 58 -47 49 -12
8029 -12 -4 -32 -42 -79 14 9 -13 32 28 -17 19 17 -15 18 -16 -43 42 16 -5 27 24 21 -8 -16 0 19 21 51 23 -25 19 -33 61 -2
8063 -2 -34 13 -71 -45 -7 34 -25 15 49 23 21 7 11 -39 10 19 -17 -32 51 1 12 -20 41 24 27 0 60 -31 -25 -27 50 20 -46 -59
8097 -59 -30 -12 35 -43 -20 37 -71 -27 42 -32 -38 -4 29 20 -19 -7 -52 39 26 14 11 -19 -25 0 31 24 -21 2 -3 21 9 29 49
8130 49 27 93 8 59 18 27 31 -28 -6 9 -33 -3 32 28 -18 -23 -15 1 79 8 -57 -12 -38 25 17 8 38 40 -64 42 15 -54 37
8163 37 20 44 10 -26 -51 -34 5 -5 -51 -24 9 -31 5 -6 0 52 -14 15 -45 -5 29 -26 12 47 33 -17 73 -3
8191c
$$ Imaginary data points
##PAGE= N=2
##DATA TABLE= (X++(I..I)), XYDATA
0 0 0 0 0 -8 16 -16 24 -24 32 -40 56 -72 96 -112 136 -160 192 -232 277 -326 378 -440 509 -588 677 -776
26 -776 885 -1003 1136 -1284 1447 -1625 1823 -2038 2272 -2530 2815 -3127 3469 -3842 4255 -4709
42 -4709 5211 -5769 6392 -7091 7878 -8770 9795 -10989 12395 -14078 16137 -18722 22077
55 22077 -26623 33151 -43343 61529 -103515 377583 -20460 -411362 641542 -377775
65 -377775 -186424 382093 -451460 148048 441465 -503493 305176 284040 -513909 200116
75 200116 84834 -338340 298786 -59204 -136527 359515 -184948 -154766 289510 -197046
85 -197046 -103958 190238 -116045 22281 107396 -152892 102960 90093 -209935 106434 106931
96 106931 -211377 84412 45196 -152180 157865 -38451 -108599 266041 -138207 -149299 267944
107 267944 -206760 -93893 251698 -224920 95395 204820 -337237 205112 103232 -420352
117 -420352 277642 45511 -297041 356006 -87055 -167776 350300 -296987 -97058 348293
127 348293 -337253 24472 313060 -279966 122902 129787 -285409 200129 -13805 -255964
137 -255964 279089 -24312 -173606 233566 -60449 -95023 120715 -127262 -3311 109873
147 109873 -136720 42578 137687 -115073 1554 89406 -94734 -7776 29736 -76097 72730
158 72730 25978 -98550 121901 23886 -145474 101719 -3297 -113338 120307 -51655
168 -51655 -30667 166607 -147329 -3431 164604 -213942 34758 131102 -188849 133297
178 133297 50509 -172799 203569 -61023 -174344 230694 -114869 -106581 222815 -148426
188 -148426 -5197 166163 -206470 79755 113039 -222679 134082 63437 -181158 144984
198 144984 -12524 -114330 150196 -74617 -58859 150949 -101064 -36874 121454 -92737
208 -92737 -4802 84772 -79752 34723 47211 -101348 47210 33509 -102180 60951 46004
219 46004 -72887 64652 9928 -75906 67061 -40132 -70615 115456 -46746 -44418 131152
230 131152 -78772 -27963 88501 -121121 34149 73862 -126357 104603 49065 -137880
240 -137880 111322 -14608 -117598 126165 -58520 -47220 150922 -106491 -6945 123882
250 123882 -147710 26599 82319 -131336 84595 34468 -108270 112668 -24384 -93979
260 -93979 115356 -50185 -53807 107067 -63329 -13319 78493 -85900 17325 58231 -87861
271 -87861 42139 43008 -75846 46980 15152 -61932 51682 -3803 -47077 62852 -14874
282 -14874 -44722 64351 -27801 -38170 65735 -40009 -15838 65582 -60297 5060 56458
293 56458 -77274 26730 44999 -77891 49552 22204 -75089 67627 -9239 -64823 85936
304 85936 -35603 -41401 90834 -62703 -13355 75090 -82850 21654 54246 -84728 52890
315 52890 27372 -78850 65976 -4323 -64146 73808 -27205 -38274 77200 -46709 -15454
326 -15454 64707 -64353 5833 47202 -65692 29965 31587 -57650 42265 10947 -52210 43809
338 43809 -6623 -42313 50367 -15042 -28683 55291 -26922 -20088 49349 -41408 -7291 43041
350 43041 -46609 13015 37786 -49669 25509 24646 -55483 32923 10128 -51042 48194 -3467
362 -3467 -39552 60015 -25952 -30074 58784 -46523 -11565 53500 -53011 15063 41445 -57527
374 -57527 32392 20189 -61212 44210 2781 -50506 57010 -13741 -32926 59635 -36957 -16202
386 -16202 53064 -51616 4902 43495 -52037 23143 25503 -50239 33536 6268 -44824 43462
398 43462 -5320 -34836 47604 -18171 -23993 43614 -31484 -7885 39312 -38242 7729 31336
410 31336 -41749 15037 20069 -39175 23568 11843 -33572 32791 -12 -33388 36879 -13607
422 -13607 -27361 41466 -21300 -11757 40847 -31210 73 30949 -41284 11061 24067 -40863
434 -40863 24819 16377 -38787 32988 -553 -36264 39469 -16278 -23542 45414 -27107 -7464
446 -7464 39980 -37305 4982 27293 -40816 17804 16672 -37231 28506 5553 -32548 34718
458 34718 -6640 -25170 36580 -18385 -14841 32501 -27124 -1846 27059 -28639 10166 20655
470 20655 -29240 13057 11068 -29497 16344 6369 -22690 26010 468 -20587 26970 -14100
482 -14100 -21378 26218 -17246 -6441 31514 -15954 3947 21930 -31448 2338 12599 -34853
494 -34853 17562 18761 -23596 29980 3319 -28347 24995 -20873 -22103 35244 -18445 -598
506 -598 37585 -24164 594 14190 -36887 9954 10830 -26840 32205 11975 -25096 26318 -9794
519 -9794 -26143 20359 -17742 -3738 30049 -18224 4650 22500 -26158 -642 13073 -19575
531 -19575 8714 10115 -16062 15929 1162 -23224 19996 648 -19478 22151 -2271 -13727
543 -13727 15906 -13957 -5411 21564 -17485 2216 25818 -24703 -2078 15299 -27147 10684
555 10684 11400 -18858 30730 -614 -26411 26803 -16966 -23274 26977 -12861 2736 27609 -22303
568 -22303 8003 12918 -38295 10806 13445 -24024 24898 7631 -15378 21210 -19016 -16975 22042
581 22042 -19613 -2175 28440 -9106 2471 9925 -17157 1301 213 -17747 13965 11145 -14116
594 -14116 12731 8100 -16227 3607 -2053 -9377 11489 -4718 -5331 21249 -6216 -12568 18998
607 18998 -8835 -13063 13372 -13842 2437 14814 -21035 17829 15265 -28592 16358 3707
619 3707 -25269 15782 -7854 -7740 27075 -17388 -1285 27802 -27192 -3327 18680 -23133 10712
632 10712 8514 -17792 24592 -6135 -21753 25117 -10732 -14197 20045 -8050 468 10685 -13957
645 -13957 7157 7872 -17519 6459 9885 -13745 1185 4924 -6530 4548 1024 -2722 10782
658 10782 -1110 -11929 7056 1411 -14700 8130 7093 -7400 11223 -5675 -8797 14462 -18027
671 -18027 -3618 25462 -14196 4535 15768 -20387 6121 -3736 -22721 23674 -820 -13528
683 -13528 31796 -7016 -14551 15489 -22883 -5 15620 -22534 21968 15301 -26916 15705
695 15705 -2451 -21852 14516 -7901 856 22818 -14329 1115 14523 -20657 -3526 9266
707 9266 -7810 6798 3161 -5544 8911 -5951 -10223 9836 2591 -4402 4952 5074 -5644 -5859
721 -5859 -892 -4235 5525 2643 -3719 15852 -3153 -15929 10626 -7601 -8139 14239 -5585 7547
735 7547 11328 -20213 6612 4641 -24352 13513 7072 -10817 20419 -7665 -8158 17765 -24026
748 -24026 -1097 21165 -19933 10143 11121 -18502 12935 -6709 -14455 21978 -7824 -5855 21297
761 21297 -11169 -5118 7112 -14952 5669 5422 -10353 15115 2850 -11948 6415 -4039 -5354
774 -5354 3707 -1271 5925 3811 -3268 -828 -765 -2871 -6766 3705 6684 -4512 5644 3345 -6335
789 -6335 3752 -5954 -4384 10782 -8315 -1301 13873 -11386 279 8553 -13370 9243 2062
802 2062 -13720 17737 -5938 -12122 18942 -11485 -2972 14524 -15860 6760 6710 -18517 13609
815 13609 2720 -13655 16730 -2913 -8787 12671 -12578 -2682 11538 -13799 6850 9933 -11519
828 -11519 8405 -304 -9376 7271 -5371 -1931 8335 -3785 850 3386 -3534 -1229 -456 -552
842 -552 45 1566 1394 -1028 2393 -469 -3878 4049 -1349 -4550 6498 -3993 -3120 8503 -7710
857 -7710 2244 8851 -11684 7200 2487 -13983 11477 -3664 -8136 16289 -7885 -2013 12742
870 12742 -14696 1508 7116 -15055 10396 5681 -11510 14602 -2598 -11734 11787 -10807 -3776
883 -3776 13333 -10872 6592 9457 -12932 6411 -255 -10596 7466 -2482 -1892 9577 -4110
896 -4110 -902 5125 -6619 -1877 2786 -2776 2273 1965 -848 2647 -811 -2583 23 929 -1598
911 -1598 -1997 4904 -1218 -2523 5370 -4236 935 3839 -8212 6262 1468 -10012 9182 -838
925 -838 -6513 9775 -5089 -1776 8765 -11052 1689 8539 -12694 6041 6423 -10782 9592
938 9592 -1667 -8481 11972 -8825 -3874 12913 -9732 1513 7936 -9058 5015 695 -8331
951 -8331 8060 -1531 -6393 8623 -1753 -3534 5510 -4187 342 2925 -6198 3446 2585 -4777 2812
966 2812 1566 -1176 -263 -532 690 -886 -242 -1078 1388 2937 -4560 2072 4045 -6205 1523 1847
982 1847 -4103 4092 -1461 -2583 7893 -4678 -4187 8701 -6275 -2439 7254 -6968 4374 3518
996 3518 -9426 9514 -809 -10115 10193 -3195 -4727 8334 -5903 1380 5764 -9554 4065
1009 4065 4913 -9299 4995 3051 -6230 5505 -2367 -3249 7023 -6106 -797 7167 -5441 474
1023 474 3045 -3320 1659 -647 -1855 3389 -137 -2564 2038 1114 -3717 164 1850 -1382 1679
1038 1679 787 -822 2425 -1909 -3748 3286 -553 -3757 5146 394 -2368 4380 -4811 -704 4414
1053 4414 -8020 3900 5837 -6917 5522 886 -6329 4860 -4656 -3290 8251 -4697 -267
1066 -267 8666 -5970 -368 3513 -7688 3617 1094 -6135 8866 -747 -5361 7009 -3992 -2744
1080 -2744 3910 -4466 2560 3074 -4392 3365 1971 -4873 1313 1017 -2904 1780 -222 -872 3154 -1855
1096 -1855 -916 3226 -1481 -1447 1379 -175 -1741 276 311 -748 2540 -981 -701 4190 -4144 -1386
1112 -1386 3592 -4575 1357 2944 -3053 4294 256 -4714 3902 -2263 -4928 5315 -1280 -906 6748
1127 6748 -3768 531 3363 -8615 2161 1853 -6254 6643 1339 -2433 5884 -4010 -2760 3019
1141 3019 -5634 194 4817 -2424 2665 3131 -3993 1096 -1168 -4520 3304 -577 -801 4897 -963
1156 -963 -541 909 -2607 -527 -68 -343 854 1511 116 -973 1539 -1391 -1408 2516 -1610 36 2063
1173 2063 -2674 454 1229 -2722 2240 1857 -2951 2737 -106 -4681 3268 -1707 -2093 6188 -2810 546
1189 546 4219 -6730 1006 1241 -5606 4915 1566 -1968 5374 -2339 -3442 2716 -4676 -1141 5151
1204 5151 -2395 2469 3561 -4731 1596 -1319 -4571 4095 -624 -193 4777 -1780 -845 -88 -3009 103
1220 103 518 213 2030 1641 -823 -1028 -156 -1891 -730 1457 588 942 940 -1198 -795 148 -2460 608
1238 608 3134 -2017 1965 1496 -4018 2062 -1885 -2445 5124 -2524 165 4621 -4501 273 1369 -4135
1254 -4135 3033 804 -2678 4745 -1200 -3929 3870 -2737 -1628 4342 -3047 2095 2356 -5316 3110
1269 3110 -153 -4000 3948 -572 -479 2469 -2622 309 781 -2796 1243 1956 -759 842 434 -930
1285 -930 -295 -1529 -110 1185 -473 845 515 384 -370 -2006 1786 -587 -1395 2697 -1539 704
1301 704 993 -3261 3044 -266 -3110 3811 -1268 -1679 2727 -2379 727 2473 -3570 2109 1772 -4930
1317 -4930 2408 288 -3106 4386 -1705 -388 4320 -5143 439 2352 -4592 2921 1083 -1538 3587
1332 3587 -2291 -1792 2053 -3114 -275 3019 -599 1582 933 -2196 641 -2071 -2203 2441 -205 1312
1348 1312 1942 -832 805 -2697 -1621 1181 -1762 2239 1464 -102 2262 -2951 -1101 1124 -3365
1363 -3365 1371 2133 -1238 2588 -499 -2259 2339 -2556 -1411 4132 -2659 497 2625 -4219 2428
1378 2428 21 -3355 5323 -1538 -1626 3881 -4264 -249 1632 -3343 3574 1362 -2134 3374 -1622
1393 -1622 -3265 1523 -2291 245 3453 -1267 2515 1253 -3924 876 -2126 -2061 2706 -859 2481
1408 2481 2205 -2077 1353 -1966 -2212 877 -1466 2026 1755 -836 2090 -986 -2070 863 -1902 119
1424 119 2109 -1600 1969 1261 -3063 2322 -1032 -2455 3362 -2813 141 3158 -3958 2637 1147
1439 1147 -3361 3767 -1658 -2091 3128 -3363 225 2881 -2803 2269 1519 -3169 2208 -1181 -2954
1454 -2954 3151 -1790 61 3865 -2656 1511 658 -3958 2216 -1462 -1313 3507 -1490 1377 1504 -2575
1470 -2575 1373 -1096 -1924 1801 -910 363 1794 -1301 1034 353 -2205 1700 -702 -1404 2500 -1852
1486 -1852 683 1993 -2875 2653 -82 -2883 3085 -2455 -701 2674 -3032 2267 1587 -2972 2775
1501 2775 -816 -2710 2418 -1956 -472 3228 -2416 1394 2266 -3859 1856 -149 -3108 3381 -1727
1516 -1727 -243 3705 -3428 1231 1252 -3458 2220 -733 -1147 2885 -1815 294 1940 -2324 726 502
1532 502 -1582 1605 -657 -822 2298 -1873 15 1778 -2149 1545 -198 -1628 2711 -2284 -160
1547 -160 2462 -2752 1655 481 -1975 2663 -1898 -909 2689 -2456 380 1896 -2196 1477 136
1562 136 -2208 2628 -1317 -1824 3501 -2194 -149 2456 -2974 2116 148 -2905 3645 -1601 -1517 3103
1578 3103 -2335 661 1213 -2410 2121 -175 -2020 2382 -788 -1134 1837 -1401 489 1147 -2253 1778
1594 1778 132 -2248 2237 -1149 -274 1716 -2127 1967 286 -2282 2301 -1197 -678 1504 -1806
1609 -1806 1391 537 -1961 2063 -251 -1736 1656 -1039 -328 1722 -2010 1258 1391 -2936 2008 -90
1625 -90 -2249 2505 -1836 170 2497 -2995 1694 981 -2843 1926 -831 -1032 2147 -1687 483 1995
1641 1995 -2220 662 1041 -2061 1220 -211 -1046 2274 -1541 -211 2109 -2420 734 476 -1688 1921
1657 1921 -1188 -135 2170 -1978 619 639 -1701 924 -756 -449 1677 -1103 193 1605 -1486 252
1673 252 328 -1637 1374 -651 -766 2695 -1538 60 1646 -2580 1120 -214 -1849 2721 -1155 -360
1689 -360 2471 -1912 399 604 -2111 1179 -199 -1266 2231 -333 -773 1966 -1334 -358 973 -2290
1705 -2290 1212 330 -1706 2551 -522 -536 1776 -1930 457 190 -1871 1624 -148 -471 1732 -589
1721 -589 26 309 -1539 188 107 -1063 1427 447 -326 1490 -1155 -327 431 -2198 1081 195 -984
1738 -984 2424 -771 18 1214 -2299 637 -3 -1647 1837 -188 -386 1713 -1095 -201 855 -1806
1754 -1806 399 836 -1463 1613 268 -1251 1904 -1335 -631 1408 -2064 934 764 -1548 1962 -359
1770 -359 -602 1458 -1425 66 568 -1313 701 366 -784 1056 -84 -616 979 -895 -269 883
1786 883 -1240 843 464 -1106 1424 -804 -319 963 -1643 861 351 -1076 1542 -427 -181 1078
1802 1078 -1250 141 388 -1318 806 458 -735 1225 -189 -739 1178 -1443 -114 1285 -1615 1175
1818 1175 656 -1433 1519 -1209 -720 1389 -1628 812 1204 -1040 1181 -188 -989 733 -970 -402
1834 -402 1217 -622 296 1056 -1087 435 -156 -1222 1447 -726 -212 1571 -1300 366 133 -1323
1850 -1323 1175 -754 -194 1500 -931 317 396 -933 548 -315 -523 1152 -428 -434 971 -900 -147
1867 -147 682 -961 1199 153 -1080 1675 -1023 -766 1174 -1461 844 465 -1141 1731 -554 -922
1883 -922 1207 -838 6 809 -874 798 205 -1341 869 -84 -1104 1228 -470 -99 1111 -1396
1899 -1396 799 395 -1467 1385 -359 -474 959 -1336 487 335 -1286 1192 141 -415 870 -458
1915 -458 -50 369 -1175 362 582 -994 862 329 -749 902 -997 17 1105 -1542 1113 610
1931 610 -1142 1242 -841 -404 966 -1633 644 809 -1190 1007 305 -555 869 -783 -461 934
1947 934 -1319 29 1073 -1090 846 453 -846 1265 -1198 -547 1306 -1496 680 906 -774 1245
1963 1245 -779 -691 756 -1425 -38 1008 -450 920 494 -527 745 -840 -1092 1021 -948 73
1979 73 1295 -671 1066 38 -1240 1262 -1238 -590 1306 -1055 888 459 -963 1307 -845 -880
1995 -880 1007 -983 -30 952 -622 840 496 -969 1060 -419 -1400 1011 -1011 -113 1252 -1028
2011 -1028 1449 394 -1397 1244 -1080 -904 948 -1018 957 889 -777 1247 -395 -1306 411 -796
2027 -796 -239 1093 -387 968 881 -1305 693 -476 -1574 980 -776 374 1595 -1137 1241 248
2043 248 -1582 982 -990 -519 1002 -960 851 868 -1036 819 -147 -1118 672 -650 -332 1196 -872
2060 -872 564 1155 -1358 814 -233 -1345 1167 -1145 -6 1507 -1107 1190 474 -1299 857 -957
2076 -957 -728 957 -922 571 1079 -799 612 151 -1168 676 -545 -562 1455 -813 279 1084 -1460
2093 -1460 763 -218 -1239 1455 -907 87 1461 -1223 654 228 -1224 958 -507 -517 1123 -710
2109 -710 11 881 -1008 316 332 -1182 969 -196 -711 1422 -979 33 1033 -1487 887 -28 -1166
2126 -1166 1448 -750 -165 1271 -1142 550 378 -1155 873 -277 -648 1075 -516 -114 1087 -1055
2142 -1055 303 484 -1424 983 -143 -781 1555 -850 72 1043 -1540 859 59 -1123 1348 -608
2158 -608 -228 1140 -1070 329 442 -1034 738 20 -777 1102 -412 -389 1130 -1084 238 728 -1327
2175 -1327 1086 -60 -1012 1463 -985 -52 1030 -1377 834 193 -1076 1153 -542 -499 1070 -774
2191 -774 150 694 -926 524 257 -994 944 -284 -645 1217 -991 130 845 -1360 1025 -22
2207 -22 -943 1319 -773 -27 950 -1122 615 127 -1085 798 -335 -485 985 -524 69 862 -976
2224 -976 404 270 -1249 912 -239 -616 1370 -859 340 928 -1446 787 -152 -1132 1209 -561
2240 -561 18 1155 -875 430 250 -1254 482 -213 -737 1045 -184 -9 1224 -922 99 386 -1439
2257 -1439 638 -149 -661 1503 -624 259 986 -1272 550 -154 -1058 892 -442 -75 1092 -544 274
2274 274 379 -1008 195 -64 -797 971 -113 -101 1215 -810 98 341 -1468 651 -287 -744 1490
2291 1490 -513 341 994 -1152 371 -117 -1087 900 -256 -225 1189 -422 3 591 -1096 142 262
2308 262 -874 1124 141 -391 1220 -927 -186 466 -1437 657 86 -579 1301 -333 -74 712 -1058
2325 -1058 95 0 -792 672 134 -254 926 -241 -293 469 -911 31 423 -826 1003 10 -386 1018
2343 1018 -903 -104 412 -1272 685 203 -432 1249 -279 -67 567 -956 -78 137 -805 595 265
2360 265 -376 923 -229 -446 695 -1090 21 594 -913 965 149 -618 1084 -859 -305 521 -1029
2377 -1029 540 337 -487 1001 -48 -292 524 -605 -265 361 -636 290 437 -510 739 -86 -577 725
2395 725 -718 -60 570 -818 765 141 -640 822 -652 -219 516 -704 544 246 -415 616 -156
2412 -156 -449 455 -436 -86 623 -616 329 551 -780 642 -105 -583 889 -691 128 665 -940 541
2430 541 -64 -835 664 -402 -43 717 -464 325 465 -632 151 15 -649 422 -99 -187 787 -471
2448 -471 115 566 -777 434 -57 -537 820 -426 62 613 -750 233 -69 -492 482 -300 -95 740
2466 740 -254 120 436 -611 68 -33 -629 476 -89 -176 997 -445 168 454 -940 408 -243 -544
2484 -544 956 -351 0 705 -734 100 -80 -682 427 -23 -136 746 -23 -238 362 -723 -125 233
2502 233 -704 645 320 -366 853 -479 -270 307 -847 353 137 -383 795 -102 -176 257 -587 -60
2520 -60 60 -357 428 307 -186 507 -101 -465 211 -764 -69 318 -559 752 337 -266 818 -489 -154
2539 -154 214 -888 411 126 -306 792 -128 -186 262 -565 -208 174 -451 417 644 -244 607 -142 -634
2558 -634 281 -865 -226 573 -473 750 384 -357 609 -686 -412 208 -633 295 418 -95 478 14 -333
2577 -333 79 -458 -381 421 -215 320 651 -308 343 -227 -654 275 -646 -100 724 -230 776 279 -352 364
2597 364 -700 -389 165 -478 281 486 8 492 35 -492 112 -532 -445 592 -156 358 726 -508 383
2616 383 -352 -885 425 -593 2 722 -262 739 224 -518 256 -526 -543 234 -195 203 538 -87 278
2635 278 217 -607 121 -170 -566 559 -185 158 611 -501 338 -95 -662 312 -487 -33 539 -171 578 258
2655 258 -367 132 -312 -510 109 -208 133 538 -59 243 217 -622 111 -240 -491 738 -174 315 610 -600
2675 -600 314 -241 -642 338 -403 54 584 -245 245 238 -429 93 -91 -365 346 -20 -70 599 -337 48 352
2696 352 -651 237 -77 -455 585 -300 55 516 -472 264 44 -420 313 -241 -70 351 -215 121 245
2715 245 -309 -5 -35 -372 283 3 -88 559 -362 69 288 -667 343 -49 -297 642 -351 34 355 -574
2735 -574 207 -30 -369 360 -110 -95 311 -277 -112 231 -419 66 261 -440 437 -1 -331 533 -387 -49
2755 -49 473 -566 344 32 -367 483 -313 -44 306 -397 160 98 -343 240 -44 -188 353 14 -106 309
2775 309 -360 -28 197 -530 360 35 -287 582 -367 28 304 -484 314 -55 -299 465 -266 -80 312 -283
2795 -283 132 119 -259 238 34 -390 312 -143 -185 497 -355 140 333 -594 296 -84 -485 537 -338 30
2815 30 480 -354 373 25 -378 266 -207 -195 304 -225 98 393 -193 140 123 -460 233 -56 -329 518 -282
2836 -282 136 343 -567 304 -134 -473 331 -355 99 348 -362 304 30 -317 179 -170 -128 242 -219 -21
2856 -21 273 -249 93 192 -485 418 -100 -340 514 -409 26 293 -556 314 58 -356 505 -299 -66 340 -289
2877 -289 167 63 -367 89 41 -215 327 -4 -132 426 -358 -7 262 -557 276 -50 -253 532 -298 19
2897 19 279 -456 216 -68 -275 413 -119 35 334 -205 -31 0 -422 44 48 -259 382 -12 -243 483 -381
2918 -381 43 217 -536 361 -111 -301 500 -332 22 215 -431 235 -23 -215 352 -70 -102 260 -139 -23
2938 -23 245 -368 -32 145 -335 354 26 -173 486 -283 66 260 -516 246 -104 -314 377 -244 15 197
2958 197 -249 100 20 -217 159 8 -197 216 -106 -192 216 -316 57 259 -368 401 25 -204 428 -418 17
2979 17 199 -467 297 -37 -235 316 -126 -9 255 -276 86 137 -253 177 45 -261 255 -88 -215 347 -427
3000 -427 -41 292 -453 414 -2 -208 484 -364 -56 201 -420 172 23 -254 311 5 -52 264 -138 -105 163
3021 163 -291 68 180 -293 336 -28 -213 381 -307 -1 202 -479 435 -1 -128 412 -209 -1 123 -389
3041 -389 74 3 -190 242 91 -94 334 -92 -203 155 -438 37 208 -317 500 12 -119 442 -412 -90
3061 -90 214 -399 337 80 -155 369 -116 -84 160 -309 -57 64 -147 119 188 -191 247 -113 -264 214 -336
3082 -336 -22 169 -248 328 11 -79 353 -311 6 130 -370 182 53 -111 308 -92 -72 73 -221 -54 141
3103 141 -160 159 195 -167 291 -103 -334 203 -505 -16 223 -324 398 103 -168 313 -256 -130 20 -275
3123 -275 238 206 -81 239 -14 -228 142 -223 -189 256 -160 231 315 -247 250 -92 -345 209 -240 70 414
3144 414 -231 385 12 -191 175 -234 -75 115 -136 73 169 -133 158 4 -189 137 -70 -142 271 -213 98
3165 98 209 -294 244 -112 -326 226 -270 111 179 -179 347 68 -117 116 -239 -221 1 -143 71 269 -55
3186 -55 164 77 -297 84 -180 -275 367 -131 137 357 -378 198 -143 -359 157 -241 65 285 -174 173 21
3207 21 -206 104 -109 -119 201 -9 -93 293 -107 -44 208 -325 197 -25 -221 263 -203 13 186 -244 227
3228 227 -72 -184 222 -190 -14 196 -80 118 103 -102 14 -45 -251 114 11 -75 344 -171 77 168 -364
3249 -364 168 22 -203 399 -103 112 183 -329 149 -107 -195 193 -33 20 214 -65 -62 74 -253 19 112 -207
3271 -207 216 -31 -78 282 -163 -29 191 -254 170 32 -169 263 -199 39 163 -183 152 -7 -148 77
3291 77 -79 -19 224 -60 9 135 -209 -43 102 -244 269 39 -158 273 -168 15 122 -373 179 1 -140
3312 -140 327 -40 8 95 -149 12 47 -146 131 36 -160 159 10 -175 259 -192 4 181 -292 164 12
3333 12 -204 269 -149 114 181 -200 86 -59 -100 150 -51 -7 246 5 91 93 -161 -42 50 -198 174 -46 -98
3356 -98 234 -158 37 125 -297 241 -45 -145 240 -222 45 162 -187 151 -9 -141 187 -66 -74 155 -38
3377 -38 -40 191 -209 104 115 -297 184 -53 -233 219 -147 -12 252 -252 206 6 -197 218 -133 69 161 -138
3399 -138 65 21 -96 29 58 -90 103 -90 -126 148 -178 26 120 -264 164 -17 -216 229 -170 63 144 -185
3421 -185 151 14 -208 204 -117 -33 148 -141 -48 114 -147 69 115 -153 203 17 -96 226 -205 17 178
3442 178 -262 198 -4 -120 268 -118 -5 166 -230 98 25 -114 77 -40 -31 173 -93 -34 93 -194 24
3463 24 100 -285 104 0 -122 222 -29 52 242 -207 122 -97 -132 165 -139 89 40 -129 130 81 -76 12
3485 12 -58 -159 93 2 -28 121 -142 34 45 -308 131 4 -198 267 -126 72 190 -220 173 -113 -162 97
3507 97 -100 7 153 -82 16 102 -134 6 65 -148 94 5 -88 159 -118 -29 120 -216 152 -26 -175 271
3529 271 -159 40 53 -207 121 -43 -133 120 -110 -78 52 -76 14 94 -131 36 60 -199 90 -4 -60 263 -183
3552 -183 72 163 -242 157 -45 -57 254 -107 15 123 -242 16 -54 -163 104 46 -34 144 -4 -50 76 -269
3574 -269 -65 119 -226 141 81 -157 173 -285 -48 60 -274 136 34 -29 168 -79 2 27 -143 -22 -15 -131
3596 -131 84 69 -10 172 25 -119 117 -243 -36 115 -223 205 -33 -2 182 -191 48 1 -192 25 -92
3617 -92 -56 164 -63 17 48 -160 -81 -34 -120 69 19 -55 126 4 -113 158 -189 -5 136 -116 182 39 -116
3640 -116 191 -209 -30 72 -151 88 7 -52 112 58 -96 79 -18 -68 83 -72 88 176 -95 195 -72 -179
3662 -179 120 -231 5 151 -93 261 22 -93 92 -161 -76 -7 -215 142 25 27 144 41 -136 2 -57 -133
3684 -133 199 -25 186 160 -102 171 -94 -184 110 -129 20 152 -87 235 28 -56 93 -153 -113 49 -86
3705 -86 82 63 -115 115 113 -95 113 -59 -162 177 -90 152 241 -142 230 -64 -197 93 -201 3 145 -6
3727 -6 172 45 -55 25 -38 -122 64 -52 56 100 -81 21 101 -144 58 -92 -136 181 -97 53 140 -94 167
3750 167 -89 -188 97 -140 -3 182 -90 112 47 -109 86 -56 -111 83 -51 -9 149 -108 -7 74 -269 86
3772 86 -18 -95 161 -158 89 131 -142 168 38 -184 108 -111 40 67 -58 60 34 -77 47 -15 -97 51
3794 51 -7 -42 145 -92 41 118 -179 115 -109 -152 171 -144 96 112 -129 124 39 -148 79 -146 -3 133
3816 133 -11 -77 136 -87 -62 105 -111 156 -20 -9 265 -50 70 133 -131 96 -74 -37 220 -103 -26 94
3838 94 -93 43 14 -94 69 -58 -128 19 -18 -71 103 -73 99 61 -206 147 -114 -142 167 -83 117 166 -226
3861 -226 131 -61 -121 9 -113 65 45 -28 18 51 -96 -39 -68 -129 124 17 -47 116 -97 10 71 -167 157
3884 157 -69 -131 154 -110 45 61 -113 49 -4 -65 34 -79 16 84 -14 -18 114 -66 -2 11 -146 42 -10 -101 115
3909 115 -90 -54 130 -96 26 -18 -19 156 -91 69 133 -27 -5 -98 -52 71 27 -77 73 -3 -56 59 -52 41
3933 41 84 -134 191 -94 -150 140 -133 43 49 -97 91 -80 -44 143 -161 13 105 -63 24 10 -169 31 -48
3956 -48 -102 22 14 -65 119 -155 -71 58 -223 66 38 -102 180 -90 7 58 -184 45 -91 30 46 -38 14 132
3980 132 -82 -71 -27 -124 -66 72 -97 104 -15 -78 120 -97 25 44 -156 128 6 -1 151 -41 50 95 -126
4003 -126 35 16 -68 54 -4 -39 42 27 -88 50 -109 -37 -20 -150 73 2 -53 105 -127 -26 5 -144 11 26
4027 26 -25 70 9 -42 73 -57 -46 3 -55 46 -23 -31 83 12 -53 57 -168 -26 100 -110 91 8 -51 125 -74
4052 -74 -17 75 -177 107 6 -90 71 -4 7 -17 -78 -79 57 -88 0 132 -60 118 -9 -94 105 -182 -2 60
4076 60 -104 147 0 -47 115 -128 -6 42 -102 65 79 7 -3 8 -36 91 -4 -67 29 -80 40 146 -67 119
4100 119 -53 -97 162 -63 -17 97 -81 32 -66 14 125 -15 52 33 -30 13 -6 -31 46 47 -28 48 69 3 49 -74
4126 -74 -21 85 -64 88 20 -28 91 -106 -22 22 -120 33 -15 13 128 8 -2 35 -93 -30 10 -58 35 46 -79
4151 -79 36 -28 -72 146 -43 14 79 -93 133 -47 -145 106 -39 40 87 9 54 -46 -95 14 -21 -42 -15 13 -95
4176 -95 59 -63 -23 43 -85 29 -25 -52 8 -87 14 66 -138 66 57 -11 83 -113 0 15 -55 65 62 -13 27 77
4202 77 -45 -17 -66 -107 92 -43 49 125 -68 -31 -8 -87 78 -51 55 128 -28 123 11 -57 44 -19 -71 34
4226 34 29 -54 25 41 10 79 1 23 74 -99 81 -86 -43 87 -82 113 -30 -85 114 -125 4 2 -43 85 9 -54
4252 -54 57 -23 -30 -4 54 -54 5 -13 -31 32 -50 12 -31 -78 108 -75 -4 132 -62 112 -36 25 51 -110 43 -27
4278 -27 7 65 62 -9 69 -21 -15 -33 -42 -26 93 -56 -8 82 -7 41 71 -106 60 -35 45 36 -24 129 43 -95 -38 -14 -21 48
4308 48 9 106 -2 -71 6 2 -129 23 -4 -87 46 -39 30 81 -100 2 -10 -43 39 -42 -1 -63 -33 -12 -39 -62 35 -28
4336 -28 -13 16 76 -2 99 -3 -37 27 -134 25 5 -58 91 -65 29 40 -143 1 -2 -89 44 -42 26 -18 -39 11
4362 11 -19 -85 -10 4 -19 85 0 -9 88 -91 -17 -57 -136 38 -34 -48 103 -51 19 -12 -110 21 -25 -2 49 -28 25 14
4390 14 26 -26 -63 39 33 -19 -60 51 -31 18 146 -47 13 45 -101 89 -26 -61 86 -19 58 16 -48 61 -39
4415 -39 -55 17 -20 -4 -14 -11 -8 15 -48 -68 40 -42 -35 51 -54 111 -40 19 98 -96 74 42 -23 76 -20 22 14 -26 31
4444 31 -104 -67 -4 23 34 -7 5 -39 61 -10 -29 17 -58 6 27 -74 125 12 38 50 -22 32 -48 -53 -8 -35 -6 30
4472 30 21 -14 -26 -53 -22 -25 -40 48 -28 -5 87 -9 -60 -19 -80 -13 2 -50 59 29 40 7 -25 3 16 39 54 11 -30 19 -7
4503 -7 -49 -4 12 -45 41 -79 3 42 -32 85 -51 21 18 -99 52 -18 -50 96 -101 49 31 -60 29 -53 -60 2 9 -20
4531 -20 121 7 -6 32 -29 -46 19 -55 -19 -8 -45 59 -46 -32 -9 -58 78 -2 -33 41 -65 36 66 -27 -95 25
4557 25 50 -17 0 -35 -38 6 21 57 -66 10 66 -74 97 -17 -35 83 -25 9 -81 -70 22 -24 -7 59 -48 52 68
4584 68 -22 16 -30 -38 8 -50 -126 13 15 -92 105 -37 73 13 -103 43 15 -23 98 -43 1 16 -85 -21 40 43 25
4611 25 -31 -49 112 -32 -18 50 6 -87 5 -51 18 64 -68 18 -64 58 72 -97 52 14 -3 -4 -9 22 36 -67 -39 0
4639 0 -38 20 45 -33 74 45 -32 -8 -33 8 65 -88 -9 12 -20 -29 -20 -10 8 12 28 0 0 81 8 -44 12 34 -34 -8 -39 14
4671 14 35 9 4 -19 -66 96 8 7 87 -75 30 45 7 45 -65 68 55 -71 34 32 -12 -19 56 3 31 -42 1 -1 -2 24
4701 24 35 -64 16 -8 -68 49 -7 -44 94 -60 72 44 -2 38 -66 34 51 -48 60 47 -33 47 -11 -26 46 -23 -51
4728 -51 18 -14 29 82 -61 -7 60 24 19 -87 -102 -6 -61 62 47 -48 98 -39 4 27 -8 -68 50 30 -4 40 3 65
4756 65 56 -73 9 -33 -31 -8 -57 -26 -11 -72 0 -59 0 55 -26 78 -7 37 15 1 14 20 40 -4 46 -12 17 -4 -49 -18 -56
4787 -56 -95 61 -56 45 63 -18 44 6 -82 14 -17 -20 -2 -23 12 0 -49 71 28 -59 29 76 -60 4 -69 42 34 -92
4815 -92 -2 31 -47 47 -31 -31 42 -79 70 44 -27 67 -116 -12 2 -30 25 -47 -35 68 29 -56 22 -15 -58 35 -1 -12
4843 -12 18 -6 50 -52 -21 46 -73 38 27 -20 90 -11 -13 52 15 -44 -43 -97 -7 19 16 -7 7 -80 -5 -31 -85 39 -18
4872 -18 58 84 -32 57 -10 -85 1 -29 -87 -26 14 37 -15 -65 -26 -31 -43 -26 51 60 56 -38 -24 -8 -13 18 -52 -1 28 -70 -30 -6
4904 -6 -41 79 -42 0 31 -11 27 25 -87 -1 -24 -9 -6 20 -33 -23 54 -16 61 -17 0 96 -21 52 16 -8 61 -19 22 45
4934 45 -46 21 21 12 -13 -54 19 94 -23 -10 47 -4 27 33 -43 23 25 -29 98 11 -8 84 -33 -42 -19 -40 14 3 40 43 -21 34
4966 34 67 -88 -26 -38 -19 19 18 -54 20 -32 -12 32 -34 14 2 -41 26 39 10 13 -8 -41 -6 -26 36 -53 93 -63 -16 30
4996 30 2 -7 -21 45 -2 31 32 -86 74 57 13 26 -117 75 5 17 43 5 44 5 -77 79 -43 -85 34 -77 -82 3
5024 3 -42 -16 45 -10 35 -35 -55 114 19 -21 19 -35 -2 20 6 50 -9 -36 72 -12 4 63 27 -1 5 3 42 3 0 48 -88
5055 -88 -29 28 -62 12 11 -72 30 -44 30 8 23 4 32 -77 12 10 16 18 -12 -3 -6 -35 -16 2 -52 -39 -84 -4 -31 14 13 24 -44
5088 -44 -34 -36 -122 15 35 -21 39 -44 5 17 -22 61 -28 -25 51 51 19 -34 -29 18 -4 28 7 -66 -25 -19 42 -17 17 -108 -25 43
5120 43 -56 46 -5 -3 118 7 -28 14 -19 17 15 -38 35 9 -19 7 34 -13 -8 -41 -59 47 -16 37 -31 77 80 -13 54 44
5150 44 -45 20 -28 -53 72 -25 20 60 -16 -43 47 28 39 -10 -40 8 -10 -63 42 -60 42 27 0 72 10 10 73 0 45
5179 45 61 -46 62 -31 -13 69 -25 -5 -24 -64 -55 38 -41 -32 49 -10 56 36 -2 -27 57 -45 73 -82 27 2 -4 53 -18
5208 -18 11 71 -32 63 40 -6 -11 -23 -9 44 -12 31 -8 10 39 -12 94 -7 19 -42 25 -41 -61 1 -39 37 -34 -38 80
5237 80 -33 11 -14 -21 10 18 19 -20 -58 11 22 -18 -81 -7 -17 -17 127 -36 15 90 -37 6 -40 -8 14 -40 -27 51 -10 81
5267 81 3 0 0 27 51 51 0 75 72 -48 -9 60 69 -2 -82 -6 34 -46 68 -9 -25 20 21 -14 -7 -49 20 26 -74 33 -7 21
5299 21 36 77 -71 24 -20 5 60 12 -4 -8 -78 -19 -2 -47 34 9 102 83 -50 4 2 -9 -11 -59 -41 18 28 6 -52 -32 12
5330 12 1 -22 7 -42 2 59 5 4 24 -27 36 -29 8 50 -78 -20 15 -69 76 -41 10 36 2 29 25 -75 24 -42 27
5359 27 61 7 -28 -4 -39 28 63 -43 72 9 -32 25 20 -25 -35 -77 -64 31 47 -8 -2 -12 30 -12 -18 3 3 23 -5 -18 -60
5390 -60 -67 -38 24 -27 64 62 -97 27 50 43 43 -28 19 -30 -6 78 -64 -13 6 46 -27 -15 31 2 -5 11 0 10 -55 -57 -33 -12
5422 -12 46 -36 -32 46 3 68 -1 -27 -6 3 38 19 -56 58 26 -26 2 6 -31 -48 -4 -58 17 -26 29 53 12 17 25 -46 71 -41
5454 -41 35 -12 -3 18 22 -63 28 -16 -32 -44 -47 54 -11 14 -7 16 -21 20 39 -60 18 13 12 -1 -53 81 8 -119 -3 -31 -25
5485 -25 -22 40 57 8 4 -5 57 -31 -11 -11 -52 88 16 -40 66 -68 39 -19 -20 0 13 33 -6 -68 -54 -49 -61 41 -13 8 -8
5516 -8 -18 -20 48 -26 38 9 -27 18 57 -27 -18 22 52 15 -66 -12 -47 -12 54 -26 49 10 -4 46 14 -117 10 23 -43 -40 41
5547 41 -1 29 32 -58 20 -8 7 -71 19 5 -24 -75 -35 -27 -2 -78 -41 -47 -25 -1 -42 -58 -2 -40 -22 17 12 -26 62 -15 -13 52 -59
5580 -59 50 52 -19 -7 -31 -38 50 -29 -49 14 -47 -38 -35 21 21 -16 15 -20 -75 -63 -36 -55 34 1 -7 -21 7 -33 -4 -48 -15 29 -53
5613 -53 52 10 -15 25 -23 -16 15 7 -52 20 -48 73 -21 -61 27 -31 39 -4 -25 8 41 -54 -31 21 43 8 -5 20 15 -34 75
5644 75 -71 -3 84 -33 -18 39 -25 77 -48 6 -75 -40 14 -9 -6 5 -25 27 -50 12 -16 69 15 -2 41 -21 -21 27 -46
5673 -46 -13 23 -5 2 21 7 -2 -27 -25 22 21 0 22 -10 -5 -59 6 -2 21 6 53 -14 47 44 20 11 -4 -46 -84 12 31 5 -70 42
5707 42 55 -7 3 -16 12 -76 25 27 -9 51 22 28 -13 10 -44 -7 -7 -44 11 39 -16 27 12 0 36 3 -8 -14 14 2 35 -4
5739 -4 17 -2 -23 45 -8 -40 13 44 4 53 -51 -39 -18 -42 25 -43 47 19 -22 -1 20 75 50 20 -57 71 71 -40 -12 3
5769 3 2 -4 -88 -15 -29 -60 51 -25 1 -38 -30 11 -1 20 54 -69 37 -39 -22 -2 37 -10 -13 -56 -53 3 32 -5 31 38 25 -30
5801 -30 8 37 0 12 5 -20 26 -3 -120 22 -8 1 42 27 32 -48 -48 27 -35 64 1 -38 -49 -18 -3 12 -20 -45 35 7 15 32
5833 32 12 -25 -13 -19 -3 -12 2 48 -57 -18 -39 -18 79 -4 -4 27 -13 -24 -7 21 -39 0 -6 -1 13 -11 35 19 -30 -15 -27 -7
5865 -7 -14 -26 3 -73 -89 12 -84 -7 3 53 -49 -8 9 -19 30 42 4 9 -42 -11 -56 16 1 44 -25 -41 17 18 -29 -6 40
5896 40 -7 5 -29 -23 21 -58 -57 48 -12 56 27 -1 28 31 24 30 -28 27 10 -28 6 38 -31 -66 -47 -33 -24 -44 -30 7 -9 118
5928 118 -2 -4 -48 44 -25 33 52 -7 -68 35 -28 2 -35 -3 15 -39 20 30 22 37 -22 12 15 -61 -23 -6 -32 60 71 -12
5958 -12 -11 -82 50 -22 -41 30 20 2 81 -5 -15 -6 -35 23 -5 9 44 -31 -2 -11 -7 3 0 -30 65 0 -22 9 7 -8 -42 8 -8
5991 -8 -5 -1 -30 -4 -15 6 24 -35 -30 -1 12 -47 -14 -6 3 -22 -1 69 32 -39 6 -58 -35 -9 11 18 53 -17 -23 -52 0 -40 -25 30
6025 30 -9 3 -28 -36 9 -58 9 -2 6 14 -78 2 27 -43 27 -15 -26 27 13 27 -36 -22 -10 -24 -21 -19 31 30 7 111 -21 4
6057 4 -72 -20 88 52 -22 -2 19 4 -53 34 46 -13 22 -70 -23 -25 -2 -2 15 8 -58 -20 -23 45 5 -27 19 87 6 -14 -54 -28
6089 -28 26 -35 23 -31 14 -22 -27 -2 -9 -18 -1 -6 50 -4 -31 -4 -37 52 -35 -12 6 7 -15 -55 64 3 -20 -24 -42 -5 -39 40 9
6122 9 -2 -76 32 -32 15 -17 28 -30 -4 -10 -26 30 -2 58 45 -28 56 -4 -37 -22 15 22 49 62 27 25 -37 34 -21 59 19 -24
6154 -24 -9 -70 14 -7 27 -10 85 -20 71 12 17 -18 -23 -7 -59 12 40 5 -9 -10 -17 -18 -14 -10 26 -27 -67 8 21 -23 -18 -17 -39 -18
6188 -18 46 -79 18 -59 28 -20 -75 -19 1 62 -39 -11 -20 48 8 17 -28 9 -24 22 -33 -3 11 -20 0 16 -35 22 -37 -22
6218 -22 6 -12 48 -7 -15 10 -25 -38 29 27 -23 -31 4 32 2 -28 -2 45 -77 0 8 6 12 -19 47 -49 -19 70 -52 1 -24 -47
6250 -47 44 -12 -23 -42 23 -41 -24 23 -49 -27 -1 40 -9 -40 -28 1 13 65 13 36 32 -28 -56 -33 -36 33 -87 7 43 -44 15
6281 15 -19 23 65 44 -13 -11 -67 -1 47 8 57 33 -45 10 -47 -11 18 -32 -18 -61 12 -20 -16 -17 -13 -25 6 -9 -26 41 29 -40
6313 -40 -24 6 24 -3 22 -38 9 1 -27 36 -92 25 -45 -9 33 -76 24 12 9 -1 18 -7 -7 -53 -64 -11 61 -2 -60 -29
6343 -29 10 31 -27 22 -4 -8 6 56 33 -62 -12 67 6 22 -32 -38 7 40 -39 -18 -22 -59 -34 17 -5 2 21 24 6 -6 7 12 -80
6376 -80 41 38 -10 -1 -61 49 46 10 -27 -22 -40 19 56 -4 13 13 29 -13 27 31 29 -52 -37 26 13 12 -12 38 -28 -19 -16 -32 30 -33
6410 -33 17 -25 -44 42 9 17 3 -1 -69 -27 42 3 -20 -80 -9 31 90 15 51 47 -9 29 -24 29 -51 74 -13 -24 -18 34 -3 43
6442 43 -43 -52 21 -2 -3 -29 -24 -17 -22 -17 4 -65 -19 -47 64 1 42 45 6 17 1 31 19 -43 19 -5 -18 2 -62 90 -29 15
6474 15 -3 -54 -41 -21 -1 19 -22 -18 2 -41 42 8 44 4 -22 89 -40 26 42 -22 22 -47 3 5 66 -17 -4 -2 -20 -31 -17
6505 -17 9 -53 31 21 -19 -42 -50 44 -27 1 28 -9 97 37 -46 -19 43 57 10 -28 -11 32 -14 4 7 -26 -15 -27 2 20 10
6536 10 28 16 -1 12 35 -23 15 45 -66 67 39 -46 5 7 15 47 40 8 -10 10 12 -52 -3 20 9 55 -33 41 42 37 16 -8
6568 -8 42 -63 -92 -30 -25 -33 3 31 57 -16 30 30 4 -9 16 -24 7 37 7 41 38 -91 -43 15 -39 3 -30 -3 -44 1 8 2 2
6601 2 8 10 -1 -27 15 -67 -15 60 -47 12 36 -33 -13 -27 -8 33 14 27 34 54 45 -16 -56 29 -10 68 33 -44 4 41 -30 22
6633 22 -12 -13 45 -35 -9 11 31 20 -4 -20 70 1 -19 -7 -62 35 41 -46 46 40 9 38 -8 6 21 -36 -31 4 72 39 -8 2
6665 2 -4 4 6 21 -2 -25 -15 9 -18 41 15 78 24 -37 -10 15 24 21 42 -4 41 66 -15 17 24 -31 6 37 -9 -29 18 -60 56
6698 56 1 23 44 -30 -15 -62 -33 57 -13 25 -11 1 31 23 3 -27 83 -2 29 -28 6 -15 10 -64 28 15 -2 -16 7 -10
6728 -10 -49 38 11 -1 1 -21 3 28 8 22 42 37 -13 -48 -2 11 24 40 -26 25 -65 10 13 6 31 -4 26 -9 19 -67 54 28
6760 28 41 50 -16 -93 -36 -62 -11 36 -34 -31 12 -22 -13 -10 25 52 -18 6 -19 22 -47 65 -2 -11 -37 4 18 -10 59 17 -71 21
6792 21 -70 14 29 -25 19 29 -20 -6 58 28 40 33 -16 -31 -2 25 -46 -53 19 -16 10 53 -2 -21 -44 -40 -34 -45 -22 -4 14 10 16
6825 16 -63 17 18 4 55 -12 -26 -2 8 40 34 28 -24 30 -36 -44 21 -3 48 35 40 1 20 3 -59 -61 -19 32 -35 2 -23 -14 21 -45
6859 -45 5 10 51 7 48 -36 7 0 -1 -59 12 -2 20 -23 64 -1 -4 -16 33 35 23 -3 -14 -22 -31 12 20 -9 27 47 -44 34 3 -54
6893 -54 28 -30 25 43 -89 14 -20 -4 30 -12 -15 0 -8 -35 18 3 41 -16 37 -16 5 -16 11 30 24 45 3 61 -5 41 -47
6924 -47 4 2 -11 70 -51 -48 -5 -45 -81 24 21 25 58 -25 66 4 -2 4 -14 -51 -4 44 -13 -4 31 63 -15 -52 -34 -19 -25 10 39
6957 39 0 15 28 -13 -38 -24 -50 -60 32 5 -19 46 17 2 -22 49 43 0 -31 7 -13 33 17 47 -31 28 -12 -40 -37 -13 53
6988 53 -28 -116 24 50 -44 40 16 -45 12 16 51 63 -13 6 12 24 -13 47 -52 -71 18 -1 7 40 -38 21 -17 -7 -40 100 44
7019 44 16 -54 0 -98 8 38 -33 24 20 3 -12 26 9 -16 -27 -7 -53 -26 2 40 42 -2 4 -19 -41 1 33 -68 -21 53 34
7050 34 46 50 2 -20 -62 5 0 -22 -17 -32 30 -6 19 -39 39 -50 -13 -25 0 59 48 -55 -85 6 -16 -40 10 1 -18 14 -3 -10
7082 -10 -1 -28 -2 11 -37 -7 -20 -33 -46 35 -17 40 47 42 23 6 63 -56 -8 68 4 -1 15 40 -14 38 -1 -3 -4 -34 -16 -25 -80
7115 -80 94 -54 41 -46 -38 -14 -5 -10 48 41 26 20 13 -19 -50 -49 24 4 -39 -38 33 31 -42 -26 -9 31 -53 -39 15 54 -46 19 -13
7148 -13 -15 -40 51 6 11 -14 14 23 -20 72 10 24 -27 -41 5 -5 0 -9 18 -26 -33 -12 38 -29 -2 -5 7 -10 53 -34 2 10 -11 25
7182 25 4 54 12 15 -23 47 16 -10 -36 18 -3 62 34 -43 -46 -1 37 22 -33 -8 -45 -6 -63 -21 -28 57 42 9 -12 -22 25 -30
7214 -30 -31 -78 -59 -19 -21 -20 -9 -15 27 50 -8 -24 4 -38 -67 33 -18 -6 -16 25 12 8 39 -12 -10 -63 -9 2 -38 -27 18 -25 -1
7247 -1 37 24 -14 27 -27 -69 -43 -54 71 2 43 -2 -20 -46 -26 85 60 -17 8 -11 38 -11 36 -13 -27 30 -63 -17 5 9
7277 9 0 -21 49 20 16 0 20 -15 -19 5 25 -31 30 78 -26 64 2 46 -2 -6 -4 15 -34 45 -18 -10 -59 3 5 10 -19 -92 16 -18
7311 -18 -6 -18 47 7 -24 -3 -3 41 12 1 34 40 53 20 -33 -27 -55 -100 -16 -26 -51 -46 -8 -11 25 14 -22 23 31 14 -12 33 -16
7344 -16 30 -77 52 13 55 37 -12 -47 -2 -49 38 6 -15 21 26 -8 -29 62 19 -12 -41 13 -31 33 68 -19 -10 -6 -23 2 5
7375 5 -2 21 12 -33 21 9 -35 10 29 9 -13 43 -15 -19 48 23 -37 -1 0 15 -14 79 -7 37 -47 27 -28 -46 3 -9 -8 -19 2
7408 2 82 23 -36 5 25 25 1 13 -45 -40 17 36 -6 23 6 -11 5 -24 -60 -98 43 -5 14 17 -21 -37 -44 3 -9 -24 26 10
7440 10 -27 -28 57 -29 48 17 -36 6 74 10 4 21 -29 33 -23 21 -16 -26 -16 -5 65 36 29 34 -20 52 -35 -10 -34 -9 5 4 15
7473 15 -11 64 -9 49 -41 0 46 -32 -19 -24 -7 -20 41 -22 -44 -56 -23 -2 26 -7 -11 13 -2 23 -46 37 50 -9 50 4 19
7504 19 14 -26 35 5 1 -31 12 45 -82 -8 14 18 -19 -9 35 14 -5 18 -56 -34 21 50 -45 -48 -28 12 -10 -88 71 -10 -16 18
7536 18 25 -83 44 -56 -35 41 32 7 -14 -25 19 10 -13 30 61 9 -6 24 -28 42 11 -38 31 15 -19 -4 17 -24 14 10 -9
7567 -9 -6 -21 -37 77 -65 -8 20 -9 -2 -39 32 59 60 -25 22 28 13 -10 20 30 25 -10 -22 -91 -7 46 3 -56 -17 7 -3 -2 37
7600 37 10 4 24 35 -33 37 12 -65 5 6 -47 -66 14 -20 -27 54 49 -14 27 53 -74 -74 -3 -86 -6 75 -31 4 -20 -101 -87 36
7632 36 13 65 54 -22 23 2 26 -4 9 -21 -3 52 57 27 -1 9 19 0 -13 -9 -9 -14 0 9 -20 -9 -68 -22 -12 -25 24 -3 -36
7665 -36 -15 51 29 38 8 -26 -5 -2 26 23 7 39 42 -45 18 -31 -45 46 -21 25 5 29 -3 -38 -21 -19 25 -34 17 -37 -59 -24 20
7698 20 -6 67 41 26 55 9 43 -19 -19 -61 55 14 7 22 -44 26 -29 31 -59 -40 4 57 54 51 25 -14 -8 -74 17 -20 -52 -30
7730 -30 -20 3 35 -32 -58 24 -20 28 -16 -9 9 8 1 -38 -15 0 -15 -19 -32 -37 7 0 -61 11 19 -4 70 -11 1 -23 -70 -10 32 30
7764 30 -61 -3 -25 0 38 -38 -68 -18 12 -30 -30 -25 -39 -22 -7 -50 27 -20 41 11 -15 14 43 -6 19 -35 -53 -45 9 -46 -22 -39
7796 -39 -15 -1 -17 -2 25 19 -50 -17 26 -29 5 -102 -36 31 -51 -15 -24 -4 34 11 32 57 24 -87 7 -16 31 -40 -100 -6
7826 -6 31 63 -23 6 -30 14 18 15 15 16 0 13 -28 21 45 7 51 48 -7 4 3 45 -1 21 6 26 6 10 -83 -25 50 28 -57 13
7860 13 -69 1 -42 -11 -17 -21 54 -13 31 -58 19 19 47 -28 53 10 16 -16 -11 3 24 11 24 -62 42 -14 -13 -21 -8 1 -5 32 -64 -27
7894 -27 -20 -20 -16 -13 -104 -4 -1 48 53 -37 11 -3 -1 15 -16 -13 -20 -62 -32 2 -64 34 15 -64 -7 -29 13 37 -55 31 40 25 4 0 -2 -13
7930 -13 -13 28 26 46 -33 9 -8 2 42 28 -20 -22 59 -23 14 72 42 -1 29 37 45 -32 67 22 10 17 25 -38 15 64 -3 27 -32 -7
7964 -7 -40 23 40 30 -32 -29 -18 -19 39 42 47 3 -35 -14 -43 -13 11 12 -8 11 27 -11 -32 27 5 14 1 -35 -19 7 -27 8 15 -23
7998 -23 41 24 26 -19 5 -23 -34 16 -50 -10 10 -23 43 53 -49 -16 -20 -82 34 33 38 -61 -3 -2 -30 28 -64 -20 10 2 -11 37
8030 37 -44 -2 -24 -68 -22 43 1 -17 0 45 -13 56 52 11 -15 -75 -41 -12 -16 -20 0 88 -17 -28 -30 50 5 -8 26 54 45 -30
8062 -30 50 -16 -5 0 -17 52 12 5 -9 -20 57 59 -66 18 23 37 -11 25 7 17 -33 27 7 -6 33 32 -14 -2 -6 17 44 0 -25
8095 -25 5 -11 11 -22 -84 9 -20 27 43 18 -42 0 30 -57 -13 -14 -5 -8 6 57 -51 -48 8 -35 27 -6 25 48 -38 -1 18 -6
8127 -6 -22 -57 56 48 77 86 18 5 -22 29 -35 17 2 -11 -29 37 -19 -46 -3 21 -35 -27 0 -45 40 -117 15 34 19 -9 -4
8158 -4 -53 30 22 81 19 25 -57 44 -39 57 -6 57 32 -27 -46 8 3 -7 86 -6 14 32 36 54 56 -78 21 51 -37 16 31 4
8190DL
8191G
##END NTUPLES=NMR FID
##END=
