##TITLE=1H_04-2025-Bay
 CDCl3
 8 sc, 
 13.1.2025
##JCAMPDX= 6.0         $$ Bruker NMR JCAMP-DX V2.0
##DATA TYPE= NMR FID
##DATA CLASS= NTUPLES
##ORIGIN= UXNMR, Bruker Analytische Messtechnik GmbH
##OWNER= root
$$ XWIN-NMR		Version 3.5
$$ Mon Jan 13 14:34:57 2025 Russian Standard Time (UT+4h)  she@DPX200
##.OBSERVE FREQUENCY= 200.1315
##.OBSERVE NUCLEUS= ^1H
##.DELAY= (6, 6)
##.ACQUISITION MODE= SIMULTANEOUS
##.ACQUISITION SCHEME= undefined
##.AVERAGES= 8
##.DIGITISER RES= 18
##SPECTROMETER/DATA SYSTEM= spect
##.PULSE SEQUENCE= zg30
##.SOLVENT NAME= CDCl3
##.SHIFT REFERENCE= (INTERNAL, CDCl3, 0, 15.7039)
##AUDIT TRAIL= $$ (NUMBER, WHEN, WHO, WHERE, WHAT)
$$ ##TITLE= Audit trail, XWIN-NMR		Version 3.5
$$ ##JCAMPDX= 5.01
$$ ##ORIGIN= Bruker BioSpin GmbH
$$ ##OWNER= she
$$ F:/spectra/data/she/nmr/H-F/1/audita.txt
$$ ##AUDIT TRAIL=  $$ (NUMBER, WHEN, WHO, WHERE, WHAT)
(   1,<2025-01-13 14:33:19.68 +0400>,<she>,<DPX200>,
      <created by zg, POWCHK disabled, PULCHK disabled
       configuration hash MD5:
       00 E9 B6 7A A2 85 ED C7 34 08 36 98 17 FE 4E 26
       data hash MD5: 16K
       7C 3C 39 0F 6A 10 46 80 78 9D 0C 22 7E 9D 8D 8A>)
$$ ##END=
$$ 
$$ hash MD5
$$ D7 10 7B A9 BB 1E 56 9D 98 26 28 66 3B DA F7 F1
##$RELAX= 
##$RELAX= 
##$RELAX= 
##$RELAX= 
##$RELAX= 
##$RELAX= 
$$ Bruker specific parameters
$$ --------------------------
##$DU= <F:/spectra>
##$EXPNO= 1
##$NAME= <H-F>
##$PROCNO= 1
##$TYPE= <nmr>
##$USER= <she>
##$AMP= (0..31)
100 100 100 100 100 100 100 100 100 100 100 100 100 100 100 100 100 100 
100 100 100 100 100 100 100 100 100 100 100 100 100 100 
##$AQSEQ= 0
##$AQ_mod= 1
##$AUNM= <au_zg>
##$AUTOPOS= <>
##$BF1= 200.13
##$BF2= 200.13
##$BF3= 200.13
##$BF4= 200.13
##$BF5= 200.13
##$BF6= 200.13
##$BF7= 200.13
##$BF8= 200.13
##$BYTORDA= 1
##$CFDGTYP= 0
##$CFRGTYP= 5
##$CHEMSTR= <none>
##$CNST= (0..31)
1 1 145 1 1 1 1 1 1 1 1 1 1 1 1 1 1 1 1 1 1 1 1 1 1 1 1 1 1 1 1 1 
##$CPDPRG= <>
##$CPDPRG1= <>
##$CPDPRG2= <>
##$CPDPRG3= <>
##$CPDPRG4= <mlev>
##$CPDPRG5= <mlev>
##$CPDPRG6= <mlev>
##$CPDPRG7= <mlev>
##$CPDPRG8= <mlev>
##$CPDPRGB= <>
##$CPDPRGT= <>
##$D= (0..31)
0 1.2 0 0 0 0 0 0 0 0.06 0 0.03 0 0 0 0 0.0002 0 0 0 0 0 0 0 0 0 0 0 0 
0 0 0 
##$DATE= 1736764399
##$DBL= (0..7)
120 120 120 120 120 120 120 120 
##$DBP= (0..7)
150 150 150 150 150 150 150 150 
##$DBP07= 0
##$DBPNAM0= <>
##$DBPNAM1= <>
##$DBPNAM2= <>
##$DBPNAM3= <>
##$DBPNAM4= <>
##$DBPNAM5= <>
##$DBPNAM6= <>
##$DBPNAM7= <>
##$DBPOAL= (0..7)
0.5 0.5 0.5 0.5 0.5 0.5 0.5 0.5 
##$DBPOFFS= (0..7)
0 0 0 0 0 0 0 0 
##$DE= 6
##$DECBNUC= <off>
##$DECIM= 24
##$DECNUC= <off>
##$DECSTAT= 4
##$DIGMOD= 1
##$DIGTYP= 9
##$DL= (0..7)
0 120 120 120 120 120 120 120 
##$DP= (0..7)
150 150 150 150 150 150 150 150 
##$DP07= 0
##$DPNAME0= <>
##$DPNAME1= <>
##$DPNAME2= <>
##$DPNAME3= <>
##$DPNAME4= <>
##$DPNAME5= <>
##$DPNAME6= <>
##$DPNAME7= <>
##$DPOAL= (0..7)
0.5 0.5 0.5 0.5 0.5 0.5 0.5 0.5 
##$DPOFFS= (0..7)
0 0 0 0 0 0 0 0 
##$DQDMODE= 0
##$DR= 18
##$DS= 0
##$DSLIST= <SSSSSSSSSSSSSSS>
$$ [...]
##$SUBNAM2= <"">
##$SUBNAM3= <"">
##$SUBNAM4= <"">
##$SUBNAM5= <"">
##$SUBNAM6= <"">
##$SUBNAM7= <"">
##$SUBNAM8= <"">
##$SUBNAM9= <"">
##$SW= 24.0689530833862
##$SWIBOX= (0..15)
0 0 2 0 0 0 0 0 0 0 0 0 0 0 0 0 
##$SW_h= 4816.95568400771
##$TD= 16384
##$TD0= 1
##$TE= 0
##$TE2= 300
##$TE3= 300
##$TEG= 300
##$TL= (0..7)
0 120 120 120 120 120 120 120 
##$TP= (0..7)
150 150 150 150 150 150 150 150 
##$TP07= 0
##$TPNAME0= <>
##$TPNAME1= <>
##$TPNAME2= <>
##$TPNAME3= <>
##$TPNAME4= <>
##$TPNAME5= <>
##$TPNAME6= <>
##$TPNAME7= <>
##$TPOAL= (0..7)
0.5 0.5 0.5 0.5 0.5 0.5 0.5 0.5 
##$TPOFFS= (0..7)
0 0 0 0 0 0 0 0 
##$TUNHIN= 0
##$TUNHOUT= 0
##$TUNXOUT= 0
##$USERA1= <user>
##$USERA2= <user>
##$USERA3= <user>
##$USERA4= <user>
##$USERA5= <user>
##$V9= 5
##$VALIST= <valist>
##$VCLIST= <CCCCCCCCCCCCCCC>
##$VD= 0
##$VDLIST= <DDDDDDDDDDDDDDD>
##$VPLIST= <PPPPPPPPPPPPPPP>
##$VTLIST= <TTTTTTTTTTTTTTT>
##$WBST= 1024
##$WBSW= 4
##$XGAIN= (0..3)
0 0 0 0 
##$XL= 0
##$YL= 0
##$YMAX_a= 173099
##$YMIN_a= -109005
##$ZGOPTNS= <>
##$ZL1= 120
##$ZL2= 120
##$ZL3= 120
##$ZL4= 120
##$ABSF1= 10
##$ABSF2= 0
##$ABSG= 5
##$ABSL= 3
##$ALPHA= 0
##$AQORDER= 0
##$ASSFAC= 0
##$ASSFACI= 0
##$ASSFACX= 0
##$ASSWID= 0
##$AUNMP= <proc_1d>
##$AZFE= 0.1
##$AZFW= 0.1
##$BCFW= 1
##$BC_mod= 2
##$BYTORDP= 1
##$COROFFS= 0
##$CY= 11.3945322036743
##$DATMOD= 1
##$DC= 2
##$DFILT= <>
##$DTYPP= 0
##$F1P= 15.6554695791079
##$F2P= 12.8336369535428
##$FCOR= 0.5
##$FTSIZE= 0
##$FT_mod= 4
##$GAMMA= 1
##$GB= 0.15
##$INTBC= 1
##$INTSCL= 1
##$ISEN= 128
##$LB= 0.24
##$LEV0= 0
##$LPBIN= 0
##$MAXI= 10000
##$MC2= 0
##$MEAN= 0
##$ME_mod= 0
##$MI= 1.114404
##$NCOEF= 0
##$NC_proc= 0
##$NLEV= 6
##$NOISF1= 3.799351
##$NOISF2= 2.8
##$NSP= 1
##$NTH_PI= 0
##$NZP= 0
##$OFFSET= 15.70392
##$PC= 1
##$PHC0= -26723.98
##$PHC1= 5.387441
##$PH_mod= 1
##$PKNL= yes
##$PPARMOD= 0
##$PSCAL= 0
##$PSIGN= 0
##$REVERSE= no
##$SF= 200.130013532006
##$SI= 16384
##$SIGF1= 3
##$SIGF2= 2
##$SINO= 400
##$SIOLD= 16384
##$SREGLST= <1H.CDCl3>
##$SSB= 0
##$STSI= 0
##$STSR= 0
##$SW_p= 3612.71676300578
##$SYMM= 0
##$S_DEV= 0
##$TDeff= 0
##$TDoff= 0
##$TI= <>
##$TILT= no
##$TM1= 0
##$TM2= 0
##$TOPLEV= 0
##$USERP1= <user>
##$USERP2= <user>
##$USERP3= <user>
##$USERP4= <user>
##$USERP5= <user>
##$WDW= 1
##$XDIM= 8192
##$YMAX_p= 0
##$YMIN_p= 0
$$ End of Bruker specific parameters
$$ ---------------------------------
##NTUPLES= NMR FID
##VAR_NAME=  TIME,          FID/REAL,        FID/IMAG
##SYMBOL=    X,             R,               I
##VAR_TYPE=  INDEPENDENT,   DEPENDENT,       DEPENDENT
##VAR_FORM=  AFFN,          ASDF,            ASDF
##VAR_DIM=   8192,          8192,            8192
##UNITS=     SECONDS,       ARBITRARY UNITS, ARBITRARY UNITS
##FACTOR=    0.0002076,     1,               1
##FIRST=     0,             0,               0
##LAST=      1.7004516,     0,               0
##MIN=       0,             -109005,         0
##MAX=       1.7004516,     173099,          0
$$ Real data points
##PAGE= N=1
##DATA TABLE= (X++(R..R)), XYDATA
0@%%%%%%%%%%%%%%qJ6j6J6j6K2l0L2l9M7n3O3p4Q7j00J14j30J46j66J90k15K41
36A27k70L02l35L74m16M59n08N64o23O86p60Q41r24J014j115J227j348J476j601
55h30J709j762J636r50j949K4165J31521k54324J11205J23581k43007J46550j219
68C6326j35154J63956n9106p3416J74803j14586m9981J56355j27834q907J15784
79G8240j12864N2037K0443q4831R3875n5568n1593J19180o7829m5614J11642n0359
91F759p1713J04875m1634o3496J14491p1506j7136J07466j32548M0365R4540j60624
103i0161Q3695R0256j56818Q4739O5187j46905Q2803J9444j06644J19587m7907
114b724m4973J41395j29353J5118J11893j57032P1452M9122j14387R8728k7359
$$ y = [0, 0, 0, 0, 0, 0, 0, 0, 0, 0, 0, 0, 0, 0, 0, -8, 8, -8, 8, -8, 14, -16, 16, -23, 24, -29, 34, -40, 47, -53, 61, -69, 77, -89, 101, -114, 127, -143, 159, -176, 198, -218, 241, -267, 297, -326, 360, -400, 441, -483, 531, -584, 643, -705, 771, -830, 879, -883, 753, -197, -2146, 22019, 153540, -100784, 10421, 134002, -109005, 37545, 36326, -98828, 65128, 6022, -67394, 107409, -7177, -57158, 99197, -28637, -37544, 78240, -34624, 17413, 37856, -46975, 46900, -8668, -60261, 58919, -8910, -54524, 57118, 6759, -64954, 39921, -1713, -65209, 49282, -22224, -39360, 68106, -64442, -24077, 70463, -90161, -6466, 83790, -73028, 11711, 76898, -70007, 12796, 32240, -74404, 45183, -2724, -47697, 93698, -35655, -20537, 91356, -65676, 5776, 54898, -59489, 39239, 11880]
125A1880n7874J03160q1795j6155J15932j06392K219J14080j24756J5248P9623
136E5170j13900N1625L0357p0265P6943k0655l8857O1249l5719k9728M3245m418
148E047l4017L6639J3522m2201K9299m717k0692K6073k6541K0948J8706m0820
160a8754L5365P679m6674K8764Q232m1825L5527P20l3195N7494l7905j3913P3024
173E4539q4407J9925O0735r8751M9907K5272o9987N9120r184k8993M9579l2432
185d677q542M0482m5211J646L9476m8188J9827K3346m1334L8767j5740j7481M4532
198B6903m7356J5398L0145m7487K7745P305k5948J5718o55o599M460M551o472
211b292Q158J962j5564J7844p157j4005J7601o825n645O352M728p632J127R944
$$ y = [11880, -45994, 57166, -24629, -40784, 75148, -31244, -29025, 85055, -39701, -24453, 55170, -58730, -7105, 23252, -47013, 29930, 9275, -29582, 31667, -4052, -33780, 9465, 5047, -28970, 7669, 21191, -21010, 8289, 3572, -17120, 8953, -17588, 3360, 22066, -18754, 16611, 24290, -22384, 6380, 14612, -27213, 8314, 9034, -24161, 33333, -4572, -18485, 54539, -29868, -9943, 50792, -47959, 1948, 27220, -42767, 16353, 7169, -21824, 27755, -4677, -13219, 27263, -17948, -16302, 23174, -25014, -5187, 18159, -23175, 15592, -148, -17629, 26903, -20453, -5055, 25090, -22397, 5348, 12653, -13295, 2423, 1768, -4831, -371, 4180, -2292, 5866, 7828, -7736, 10108, 2951, -11054, 6547, -278, -5923, 429, 5157, -2475, -1348, 8596]
225H596j5379J2418m102j0144K3444k7428J0711J4897l4640K9814o539j6774L0883
238A5757k1784M532J7152k6055J0677Q939k5273J2925J2149k5531K3167M942k5150
251a3553L1956j9616j0328K9350l5758J7378J2828k9359K9539r273j1514J9306
263A0956j6260K032Q457r325L504Q134r939R37R841j7931Q989N059j5819J8766
277G401p806k991J2993j4510P878j982m943M979n684O708o468N634K560r681J5017
292I105j1613M28R822j6732J1589j593p869J1689n131j683N433j670o524Q502
306C753l004q975J8590j4760J029J6276k5478J7258o21j8388K5683j5323o11J6774
320A2203j7959P017M079j1680M923M030q758O200P046j4471J3733j827j5283K0985
$$ y = [8596, -6783, 5635, 1533, -8611, 14833, -12595, -1884, 13013, -21627, 8187, 1648, -15126, 15757, -6027, -1495, 15657, -10398, 279, 9218, -16055, -3130, 9019, -16512, 6655, 11597, -13553, 18403, -1213, -11541, 17809, -17949, -571, 12257, -17102, 12437, 3164, -8350, 10956, -5304, -3272, 5185, -4140, -636, 7498, -2441, -1504, 8337, -9594, -605, 4454, -11365, 7401, -405, -3396, 9597, -4913, 2965, 983, -3960, 1019, -4665, 2043, -4425, 1209, 3769, -5912, 9105, -2508, -2080, 7742, -8990, 2599, 1006, -6863, 4826, -305, -1988, 3445, 1775, -4749, 3753, 749, -8226, 10364, -4396, -3367, 12909, -12569, 4689, 4068, -14320, 11363, -3960, -4571, 12203, -5756, 1261, 5340, -6340, -1417, 2613, -6145, 55, 7101, -7370, 6363, 4536, -10747, 10238]
334A0238j5549j306J6870j9410J2595J883j1224J1195o778j375L095m44j623K053
348B20M919r846Q930k041r871J3941j1266K267Q825j1325R226j406m700L494j419
363e2j951j429P655q216M422P421j5710J4710o068j0005J8087j6110M983J0128
377G865j4443J0614l08p610N481n30n683M449M183j0540J1953k467j1236J8360
391A0088j5338Q68J3726j9294J3714K94j0901J3233p459k046N540l570j552M109
405A412O07o464J0183n634m450J2307j4252O093M462j2508J2629m989k119P355
419D632n359K036q69Q55l964J742K819q138J1306n370l277J1849j4059O418L034
434C655j0525J0581l545j879N227k761k309Q39J512p181Q608p77o154J4996j2469
$$ y = [10238, -5311, -6617, 10253, -9157, 3438, 5321, -5903, 5292, -1486, -2861, 234, -210, -1833, 220, 5139, -4707, 4223, 2182, -7689, 6252, -5014, -2747, 6078, -5247, 3979, 2573, -2127, 1367, -52, -2003, -3432, 4223, -3993, 429, 7850, -7860, 6850, 782, -9223, 8864, -7246, -2263, 7865, -6578, 4036, 3728, -3882, 1599, 1069, -4614, -165, 4018, -6522, 5431, 2964, -8272, 10088, -5250, -4382, 9344, -9950, 3764, 4058, -6843, 6390, -1069, -3115, 2425, -1145, -2697, 1412, 2019, -4445, 5738, 104, -4346, 7961, -6291, -198, 4264, -8244, 4385, -604, -2723, 4632, -727, 1309, 440, 1295, -2669, -927, 1892, -6246, 5060, -310, -3587, 8262, -5797, 621, 3655, -6870, 3711, 166, -1713, 3514, 753, -1556, -717, 795, -6386, 2222, 1445, -4709, 10287, -2182]
449b182J630P945j7351J1463k247o877J3393o889K337L928n273o77Q24j273l502
464d751Q097m299n31Q943j2715O900J50r517J2509p122J731O492p366M212l369
479f36o77j025k9L310m569Q046m017j558P462j1280O842j16o735Q742n874M26
495a688K527k835J553M59K775l690N012k135o199R066j1052L533O627j1266J2931
510E618m052m286R153j0280L402K030m306M150k6p83k127K917m997N51N990p291
526d337R267j055n883Q675j1057J838K677o083Q135k496K765L55l090K096o388
541d581M892j724j88P585p251M941k329o501N045n124L073L564L93L078j808O70
557C735o225J399k198l577J0030p436O243M579j0711J0658p462k951Q646r570
$$ y = [-2182, -552, 7393, -9958, 1505, -742, -7619, 5774, -1115, 1222, 5150, -123, -800, 24, -1249, -4751, 3346, -953, -1484, 7459, -5256, 1644, 1794, -7723, 4786, -2336, -605, 5887, -1479, 2733, -636, -1313, -2338, -2367, 943, -3626, 4420, 403, -1155, 6307, -4973, 1869, 1753, -4982, 3760, -2114, -1688, 839, -1996, -443, 16, 2791, -899, 4113, 1978, -4221, 4845, -6207, -2674, 3953, -7313, 5618, 1566, -2720, 6433, -3847, -445, 1585, -2721, 1429, 1403, 620, -1507, 1410, -3587, -3036, 2954, -4337, 4930, 3875, -2008, 6667, -4390, -2552, 125, -5958, 2177, -319, 2446, 2801, -289, 1807, -4581, 311, -1413, -1601, 5984, -1267, 3674, 1345, -5156, -111, -5235, -2162, 1402, 1795, 4873, 3065, 3735, -2490, -1091, -3289, -6866, 3164, -4272, 1971, 6550, -4161, 6497, -965, -3916, 4730, -4840]
571d840N754Q72m884L952k057lO66K767j797R96K368p194N039l581k108P771p334
588c613O614n77n440O608q158L629J813l203P514m599K472j505n193L347n759
603f050M557J433n38O143l755R08j643k651l22j314L603l482N329n94m649P809
619D784q868L787M133q268J0860o176k109N511j0091N580p26k068P441l033K092
634B849O08k752k096M53q89k642P171m343J735N143r536P595l362m437R308q583
650c778N136J422n818O849o485K122J345m696N694l036J189J688j265J534j639
665B62J541k765O23q53k888M958m287M442K142l842P041p309K219N9q586R524
681B281o864J309Q505q643P745j130n043N203n025k38K310j763J16K617j021k356
$$ y = [-4840, 914, 1786, -3098, 854, -1203, -1206, -540, 2227, 430, 1426, 3794, -3400, 1639, -1942, -4050, 3721, -3613, 3001, 2424, -3016, 3592, -4566, -937, 876, -2327, 5187, 588, 3060, 1555, -3638, -291, -6050, -1493, -60, -598, 5545, 1790, 2698, 1055, -1596, -1918, -3232, 371, -3111, 2218, 1624, -3025, 4784, -4084, -297, 3836, -4432, 6428, 252, -1857, 3654, -6437, -857, -1583, -3651, 3790, 757, 2849, 3457, 705, -1391, -938, -1827, -4469, 2702, -1641, 94, 5237, -4299, 3296, -66, -4503, 4805, -3778, 1358, 2780, -3038, 3811, -2674, -552, 793, -3903, 1791, -1245, -56, 1632, 367, 1901, 262, 1803, -962, -339, -1192, -4080, 878, -3409, 1033, 3175, -667, 6374, -935, 1284, 1343, -7243, 2281, -4583, -3274, 5231, -3412, 4333, 3203, -1840, 3363, -1662, -1900, 410, -1353, -1237, 1380, 359, -1997]
697a997N358n785J995L526p884R256m834k601R518j1585O270J088q303R082n608
712b504J126M443m500M031j036j163m41n35l56j747L290k357K579N05k471M507
728C371n751L596N73m890P466o869K390K066p964Q547n278P01P263p256O409j897
744B477m699M117n415M38K595j028J420L362j889j522M197p500K627K789q031
759f062J0404m675k477R064j1240N728J253p281R315n002K68M600n925K940n98
774C12j564J011M89j132k2K242l970L981l61k341O208o280K350L59o624O961n651
791d032K844M753n655P677m456j847L196p394M705j023j149N299k714R70J95k014
807f45r02J374l71o70M922m859K531J506q722Q374m957j620R559q839O457N81
$$ y = [-1997, 3361, -2424, -429, 3097, -4787, 4469, -365, -2966, 6552, -5033, 1237, 2325, -5978, 3104, -2504, -1378, 3065, -1435, 2596, 1560, 397, -44, -579, -935, -2682, 608, -1749, 830, 1335, -1136, 3371, -2380, 1216, 1789, -3101, 4365, -2504, -114, 1952, -6012, 2535, -2743, -2042, 5221, -2035, 4374, 2477, -2222, 1895, -3520, -3082, -487, -1515, -95, 3267, 1378, -144, 4053, -3447, -820, 1969, -6062, 4342, -333, -2810, 6254, -4986, 742, 1995, -5286, 4029, -973, -705, 3895, -2030, 910, 312, -1252, -241, 248, -884, -906, 1336, -2634, 1347, 986, -1355, 4853, -1427, 923, 1282, -5342, 1619, -4032, -1188, 3565, -2090, 5587, 1131, -716, 2480, -4914, -209, -1232, -2381, 2918, 204, 1174, 1369, -645, -1547, -173, -544, -1214, 3708, -1151, 1380, 2886, -5836, 2538, -2419, -4039, 5520, -3319, 3138, 3719]
823C719p565P679o570N1M779m651L617O20k087P38P7j903J001K001l971N397k083
840H49l581O788p634K861K515o096P679m381O05L983o507N143k577j027L300m355
856b435L853j906j110K956k111J445oO52j515L20K64l164L719l321K305L020n852
873b886P103m518k175O039q396N922P3m720Q588o269N00L449n981K744N57r98
889i68J343J604j618J10J408n313M472j793l069P704o115L147K489o297O477n273
905a692j06M316o296N106p34j547K901k720J753j654k8R11j192J742j400K153
921A513j521k39J734l590L157k456O17L081n088O105k891k252N406p130M139l27
937B58l466O467m768J922K072l876K245j281m18L8J025n58K54K047l950L814j836
$$ y = [3719, -3846, 3833, -2737, -2686, 2093, -2558, 1059, 1679, -408, 330, 407, -1496, -495, 1506, -2465, 2932, 849, -2732, 4056, -3578, -717, 1798, -4298, 3381, -1000, -395, 3588, -2919, 2224, -353, -1380, 1920, -2435, 1418, -488, -1598, 1358, -753, 692, 686, 1338, -177, 143, 407, -2757, 962, -2359, -54, 2966, -2886, 4217, -301, -2476, 3563, -4833, 1089, 1162, -3558, 5030, -1239, -739, 2710, -3271, -527, 30, -968, 375, 1979, 361, 471, 1879, -3434, 1038, -755, -3824, 3880, -2235, 912, 3401, -2896, 3581, -1692, -1798, 2518, -3778, 1328, 594, -953, 1948, -772, 981, -673, -701, 210, -982, 760, -640, 1513, -8, -247, 1487, -2103, 1054, -1402, -785, 2296, -2792, 3313, 422, -1830, 3576, -3554, 585, 258, -3208, 3259, -1509, 413, 2485, -1391, 854, -427, -845, -807, 218, -340, -86, 1961, -1989, 1825, -11]
954a1l066O365o316L135K534n959O843m396k12L797n857M106q02j471K772k074
970f12J379q65N07o54n26J316k240L293k172J04K878m571L994k191j331L705n029
987c015M312j092j752M612m787L003r76k476L787l865K534O32j678K445j828Q15
1003F71j279K53j59o87K700k838L241q09k910M804n764K467J513m748O733l602
1019d14K43L296n493L400j826j327K786j563J746k61Q54r59n51O40l163L746k271
1036a117K45L616m702M230j904k298M148m971L243J07k068L963l681J983n55j585
1052a346K344k702K352o59l02J879k574K107j738N94L69j930L016l006J939L79
1068G22k514M498m122K164R54m447M888l969N81K749l541L943j539q00J572k209
$$ y = [-11, -3077, 3288, -3028, 107, 2641, -3318, 3525, -871, -1083, 2714, -3143, 963, 161, -1310, 1462, -612, 767, -98, 409, -245, -771, 545, -1695, 1598, -574, -470, 2408, -2163, 1831, -360, -1691, 2014, -3015, 1297, 205, -1547, 3065, -1722, 1281, 305, -2171, 1616, -2249, 285, 917, -761, 1684, -144, 671, -608, -355, -514, -1201, 1499, -1339, 1902, 1093, -1817, 2987, -2777, -310, 1203, -3545, 3188, -414, -171, 3125, -2368, 1032, -794, -2121, 665, -898, 848, 587, 1441, 482, -69, 571, -2592, 1154, -1117, -872, 2744, -1958, 2272, 368, -1930, 2218, -2753, 490, 597, -1471, 2492, -1189, 794, 239, -1346, 998, -1704, 648, -11, -313, 1566, -1008, 1099, -639, -45, 324, -1606, 1410, -1596, 343, 722, -1792, 2706, -1416, 748, 1702, -2745, 2143, -1826, -1245, 1504, -2037, 1906, 367, -433, 1139, -1070]
1084a070J142j053J164m62O55J381l079L233l193l69L094m610N000r36j905M602
1100C594n376K374n80k807L535k433K267M18n40J226k400J325j983N82J176j825
1116a447L453k359R63M31l066L366l126J717J288k577M064l466Q99R00l784M138
1132A394k952J041K086k833L322k105m8R43j961J495j141J016p48L34J292k851
1148a716L611k521JK830m955M385j705j809M495m585K803J57k798L350k696R90
1164a63L90o31J312j182J476j938P26M4k288L368k801J978J341k745L908l434
1180f39M30R84l535L751k609J382J821k705L622k978M37P70k792K796j693J080
1196A22R45j296J602k082J032j262o0J617k314L844k173R8K424n183L673j906
$$ y = [-1070, 72, -981, 183, -279, 376, 1757, -1322, 1911, -1282, -1651, 1443, -3167, 1833, 897, -1008, 3594, -1782, 592, 12, -2795, 740, -1693, 574, 992, 452, 1678, -722, 603, -1380, -798, 378, -1447, 2006, -353, 610, 1041, -2025, 1341, -1785, -68, 1220, -1357, 2707, -759, 140, 1040, -2744, 1394, -1558, -517, 1569, -1264, 2058, -47, -95, 848, -1113, 382, -759, 257, -491, -157, 1135, -1716, 1895, -626, -625, 2205, -2750, 1635, -70, -1879, 2616, -1969, 834, 991, -1807, 1543, -1153, -163, 227, -404, 908, -274, 1202, -736, -10, 34, -2254, 1114, -1687, 291, 1632, -1113, 2795, -639, -209, 775, -2760, 991, -1618, -236, 1585, -1120, 2502, -476, -39, 731, -2061, 735, -958, 122, 1067, -229, 1373, -709, 323, -939, -999, 618, -1696, 2148, -25, 73, 2497, -2686, 987, -919]
1212i19j549M588m076L351J40k644L038l082P92Po69J490q13J552j657J092n56
1229H5j785L200l135K199Q88k871L838l687Q51J280l379M000k290O94J909l022
1245a225K773k315M69R55j833K216j764R25jr64J592j722J927r37j73J326l216
1262a967K927k206K31K953m028M300j575k038L418m599K631p8j514L537k153J092
1278I31l02j432L85j273J548q26J976L50j223K300m102J681m41k665M937l053
1294a209K074J704l746L395l590J20J547k421L656j422M88P32k186J248j614R46
1310b78j7k0J704j793K096k148k51J491l006L719j921j02K736m293L539j714j382
1327a640L622l785K743j90k106K557k515J226L78n68J063q06J003j887J165p45
$$ y = [-919, -2468, 2120, -1956, 1395, 1535, -1109, 1929, -1153, -361, -354, -1023, 467, -346, 1206, -451, 641, 85, -1700, 1500, -1635, 564, 1452, -1419, 2419, -1268, -417, 863, -2516, 1484, -806, -112, 1797, -1225, 1548, -767, -298, 657, -1176, 1040, -724, 201, 200, -764, 828, -894, 1033, 96, -77, 1249, -1967, 960, -1246, -1015, 1938, -2090, 2210, 635, -1403, 2015, -2584, 47, -31, -1545, 1992, -161, 931, 629, -803, -418, -1691, -143, -969, 1007, 1357, 134, 2434, -1668, 13, -428, -3093, 1844, -1209, 865, 2569, -1177, 2218, -1372, -1252, 295, -2126, 1530, 108, 596, 1328, -858, 390, -1224, -278, -295, -315, 1389, -404, 1692, -456, -707, 784, -2222, 1497, -424, -526, 2210, -2083, 1456, -258, -1640, 1982, -1803, 940, 750, -1356, 1201, -1314, -88, 290, -278, 785, -21, 982, -905, 260, -485]
1343d85r24L026k815K545j30k826L614m171J632J505k903M478k728L78J364l497
1359a937K302j522K17J705p90J569j195L99j161n71Q12j548K632j262R77J468
1375B095l616L219k821n14K965l706M025j127j352L327m126J874j97j798K842
1390A090j854J256J79o62M31q78Q94j394J497o58q52K783l393K386k36k287M029
1407B331l964J653J130l528M057k545M54J992k907K727j663l39Q43j163J145o38
1423d15J019m19J35K87j955K248k305R34J688k940M019k391m52K517m530L335
1439G75j158j077L576l271K269k04j915J805j881P27Q0J28N89l36R75j831J566
1456H17j024j136K779l359K712j14k145L876l857J616J128l607L834k501M74J820
$$ y = [-485, -1409, 1617, -1198, 1347, 1217, -1609, 2005, -2166, -534, 971, -1932, 2546, -182, 196, 1560, -1937, 365, -1157, -940, 765, -25, 1544, 349, 748, -413, -984, -172, -1720, 912, -350, 627, 2095, -1521, 1698, -1123, -1637, 1328, -2378, 1647, 520, -832, 2495, -1631, 243, 46, -1752, 1090, -764, 492, 671, 9, 440, -438, 456, -938, 559, -99, -951, 1832, -1561, 825, 589, -1698, 2331, -1633, 20, 1150, -2378, 1679, -866, -412, 1580, -1327, 1400, -263, -602, 241, -922, 223, -415, 604, 185, 320, 607, -1348, 900, -1405, -471, 1217, -1723, 2296, -95, -547, 1970, -2560, 775, -383, -1460, 2116, -1155, 1114, 910, -1005, 800, -1081, -354, -274, -146, 443, 107, 1082, -749, 817, -207, -1343, 1436, -1923, 789, 675, -1470, 2406, -1451, 165, 1293, -2314, 1520, -981, -507, 1313]
1472A313k397K266j252k03N76j091Q32q35J293o76M25O61j925K357k360K64J643
1489H91l124L904j853k11K859m245K903j395j576L190l018K225K58j316J665j538
1505c81K94m06Q5Q9j78J454j631J896j042j151K599l681K431m2k105M084l341
1522a026J390J107l322L305k393J36J748k096K101j097K98M95r58N11j064J302
1538D37j148O59R26j984K650k099K56J712l469L330j787m40K832l376K882j150
1554B31j360K629k874J402J29r03J540j084R61n36J2k94o12J357j874K038n36
1571B26j000K851l434J871l5k536L565k882J521J237k539K845k007k23J074k030
1587a496J702n17M23M19k28M92j389J250j686N48Q30j807L039j754J48J630l178
$$ y = [1313, -1084, 1182, -70, -273, 303, -788, 44, -791, 502, -174, 251, 912, -1013, 1344, -1016, -752, 891, -2233, 1671, -182, -393, 2466, -1779, 1124, -271, -1847, 1343, -1675, 550, 808, -508, 1157, -381, -87, -493, -408, -319, -497, 957, -674, 1222, 180, -971, 1628, -2053, 378, 336, -1769, 2315, -1026, 364, 1471, -1851, 1454, -939, -803, 945, -1151, 950, -147, 151, 646, -312, 199, -865, 437, -711, -52, 874, -1110, 1540, -559, -303, 1409, -2060, 1270, -517, -957, 1875, -1501, 1381, 231, -1129, 1500, -1374, 28, 157, -746, 794, -290, 671, 135, 147, -147, -759, 598, -1276, 762, 226, -774, 2077, -1357, 514, 479, -2057, 1508, -1374, 147, 1384, -1155, 1690, -317, -540, 534, -1496, 206, -311, 112, 531, 303, 795, -594, 656, -1030, -482, 348, -1459, 1580, -174, -26, 1604, -1574]
1604a574K615j747n36K557k798K812r17j139K109k539J517m83o92J320q71R36
1620E70o27N49l78p25J388k206J980n13j216K912l007J994P0k381L362k950R65
1637b13J149k490K676j503L26Q52j408J161j012M84j86p6R08j181J577j441K44
1654a33Q84k377K467j443K39J927k726K834j637q66J830k768K092m21p48K309
1670A463j874J236p72n45O43j011J046o99J078j78n80J422k490J499m30j191K701
1687A318k437J867M39k370K741k676O62R97k054K426j231N08P27j123P84j102
1703e24P41p59J52P58j270J959j334K09J097k178K202j543N6J758k629K293j024
1720c6n82J820k390J714o90m83J371j338J228m07k19O79j222Q50j265J055l14
$$ y = [-1574, 1041, -706, -1242, 1315, -1483, 1329, 412, -727, 1382, -1157, 360, -123, -815, 505, -366, 570, -57, 492, 114, -611, 777, -1429, 551, 38, -1178, 1734, -1273, 721, 791, -1590, 1772, -1178, -213, 936, -1554, 1122, -381, -55, 797, -611, 550, -462, 22, -164, -240, 668, -513, 1064, -377, -133, 751, -1626, 841, -602, -363, 1564, -1162, 1672, 35, -831, 999, -1769, 323, -98, -846, 1463, -411, 825, 53, -492, 151, -860, 186, -513, 565, 387, -193, 1229, -1261, 238, -192, -1383, 1318, -1119, 748, 1187, -1183, 1558, -1118, -456, 541, -1513, 913, -318, 190, 917, -206, 578, -524, 217, -542, -390, 368, -902, 1057, -277, -68, 1029, -1149, 1053, -490, -434, 1324, -1305, 988, -36, -618, 1202, -1188, 526, -164, -647, 724, -614, 614, 207, -12, 667, -555, 295, -970, 85, -229]
1737b29n06J940k056J938l80j750K240k677J436M52j796K880j931O75N10j760
1753a014J467j213M80M60m63J188j104P88q59m4N16j556K060j100O45J179k272
1770h42K048j710k55J441k454K405p23l44J687j929J386p89n30J109j376J333
1786D57n33J62K18r10J209j485J153j78o99K091k286J539l46j635K351k404J192
1803a04O87j735K335j564O02O45j538J410j237L41L5l57Q56r44J311r16L32P21
1821H80j705J715j445L7J333j974K227j149k44J385k434J855q70l33J586j434
1837e70J608n93n15O49j709J042p38M73O33l25J211j267Q14o27j044J429j875
1854a404J563J42j053K343k071Q66K78j845K075j766R45L63q39J130j049L80n1
$$ y = [-229, -735, 1205, -851, 1087, 707, -1043, 1197, -1480, -44, 408, -1388, 1492, -439, 236, 746, -1014, 453, -760, -280, 180, -283, 905, -199, 589, -270, -314, 202, -1354, 706, -394, 251, 1430, -842, 1206, -504, -759, 682, -1772, 633, -90, -434, 1253, -676, 710, -79, -609, 500, -876, 457, -76, 86, 304, -606, 603, -882, 271, 93, -606, 1485, -801, 738, 392, -1243, 1108, -1296, -104, 583, -1152, 1183, -381, 221, 866, -672, 738, -499, -158, -123, -480, 376, -568, 743, -173, 159, 880, -825, 890, -555, -518, 815, -1159, 1068, -81, -325, 1060, -1374, 481, -389, -722, 864, -570, 1038, 445, -70, 579, -1130, -88, -826, -353, 280, -45, 1166, -101, 713, 86, -958, 471, -1404, 159, 301, -752, 1591, -480, 386, 664, -1181, 894, -872, 73, 436, -403, 727, -322, 58, 7]
1871Gl53O10q34J195p01J31Q57j741J621j264j54J305k083K207r99j54J657k244
1889i37J877q65o49J382j740J171l69k45P12q08J003r50O63o7o44J233j463J278
1907E82l43j047J627k119J532j0j197K444k034J115L53j674J630j653K74N31q14
1924h03J377n66O35k71k60J50r99J124j020N61O77j416J871j439J74R73k165K056
1942F59q88k06J697j819J338p52n44R11j502J062l23J85O74n76R88j036M84l74
1960b2p02R91j443J351k70m00J772j990J404k02j537J956j802P48N58j203J651
1977H60j188M13K93q15P98p25N81r2j09M27q86R92j250L37O11j202J903j189K14
1996b7J141k143J862j258l12J409j769J560l84n21J301j270Q04l62p1K36n06Q31
$$ y = [7, -346, 264, -570, 625, -76, 55, 912, -829, 792, -472, -626, 679, -1404, 803, -196, -350, 1307, -937, 940, 75, -574, 808, -932, 239, -130, -375, 337, -471, 532, -418, 245, 178, -466, 767, -696, 582, 239, -808, 819, -1300, 232, 222, -975, 1469, -565, 550, 903, -771, 859, -794, -520, 11, -803, 574, 8, 643, 372, 112, 262, -737, 387, -633, -72, 605, -811, 1060, -379, -205, 768, -1397, 659, -229, -435, 1262, -557, 781, 29, -515, 396, -1106, -44, -367, -182, 492, -84, 904, -132, 352, -22, -724, 267, -1176, 175, -95, -495, 1277, -713, 691, 489, -1048, 908, -894, -146, 412, -791, 860, -328, 85, 378, -437, 361, -364, 217, 125, 16, 443, -443, 549, -701, -364, 247, -955, 948, -241, -27, 1114, -1029, 833, -425, -737, 672, -1097, 463, 79, -442, 859, -411, 393, 31, -40, 196, -310, 521]
2014E21r07O70l89m74J124j642J512l30p07J870j890J229p8j448J661j790P34
2031c34P20j062J628j056M73J50q28L73o19M43k61J67N45o34J199j253L41M27
2049D19j424J779j349M32J068j693J697j165l82J150j741J603m46k90J254j154
2065b42O64m23k37R7l92P61o64J082m25k57J042j594J142n90q72J771j894J388
2083C57P1j225J883j715O53L16j080J366r39M00K96m87N57q42N10o12L53L92p82
2102e28J318q67M12L07j437J611j519J49J173j674J841p23k79J209j781J256n96
2119a28n50J013p89P24k26Q2O0l66M16q71R18m63k86J284j516J372n44q97J732
2138I65j941J197J41j153J678j274N46L45j125R82q62M11J81j73N60p24Q18p83
$$ y = [521, -386, 284, -105, -579, 545, -1097, 415, 85, -622, 1248, -642, 587, 509, -939, 722, -1068, -334, 386, -676, 952, -104, 369, 519, -309, 64, -555, -112, -373, -206, 339, -295, 904, -349, -8, 419, -1005, 774, -575, -143, 925, -768, 929, -236, -618, 532, -1209, 394, -52, -342, 912, -242, 422, -1, -238, -141, -533, 228, -436, 646, 221, -36, 1006, -588, 554, -36, -908, 863, -1031, 357, 428, -797, 1086, -629, 24, 340, -740, 626, -313, 87, 383, -104, 453, -389, 121, -491, -138, 254, -528, 790, -77, 335, 642, -795, 816, -703, -554, 619, -1055, 786, 63, -216, 993, -788, 468, -128, -678, 335, -454, 270, 44, 126, 186, -180, 236, -635, 283, -180, -466, 818, -698, 674, 130, -767, 965, -976, 221, 362, -791, 887, -387, 159, 504, -621, 361, -501, -90, 91, -82, 478, -246, 572, -211]
2156b11K38N5r35J479r21L92O79j553J557j264M9Q75j549J870q43q4J082j401
2174d85R19n84l49O42o25O32q7J77O1k71N36j104Q21q18%J082j191J301r9r47
2194c89J454k023R84O2j109J739j150O77M52q76Q46r42J15j02j46M45n56J062
2212E43n52M12Kr75J176j279N42N24j283J707r63R6Q49j758J478q14k20J152j104
2231d67R44k76k54L99p31N24m50K74lk16P57q88R07n17l31J110j472J036l61p26
2251g41J617j520Q88R5j052J391j143N58K95o86Q15q38M06k11l5K13m05Q81p80
2270b52N01R8r27J325j413L69N25j332J787r14J61R19j379J282q42k95Q13r81
2288e55Q57k08n3L30n42M21p04L03j88J2Q22r12J114m67n50R98j558R00l01m60
$$ y = [-211, 27, 82, -853, 626, -295, 97, 776, -777, 780, -484, -435, 440, -1109, 761, -82, -166, 916, -485, 434, -150, -499, 143, -482, 150, 63, 240, 301, 30, 566, -538, 283, -535, -535, 547, -644, 657, 558, -389, 1065, -958, 26, 88, -1021, 718, -432, 245, 697, -179, 667, -275, -160, -262, -408, 37, -519, 543, -9, 403, 405, -570, 606, -673, -131, 393, -890, 817, -146, -50, 799, -959, 519, -295, -515, 637, -467, 477, 201, -53, 346, -385, 139, -311, -37, -40, -256, 501, -387, 520, 3, -328, 782, -690, 346, -15, -741, 876, -644, 244, 339, -713, 678, -465, 93, 388, -298, 517, -321, 85, -126, -161, 52, -353, 528, -252, 249, 347, -580, 745, -668, -299, 226, -1106, 681, -233, -72, 847, -532, 750, -92, -387, 426, -555, 302, 94, 41, 371, -171, 250, -454, -151, -339, -327, 495, -417, 697, 230, -320, 678, -880, 20, -281, -741]
2308g41J550j307J034J95j016J109j409L95N3m88O94l47O55k44J20Q4o82P23q71
2327d93M79K79q99J353j144M54M33j419J590r61J39J018j367J216p64j84O96r68
2345e42N47l11J21L86k50M79n82O06m63m13Q47j203R99l93j78J099j346J110k91
2364B22r36J410j396Q72p0n08J084j039L99L1m24M09k07M51j07R3J83p02O10q74
2384d99L11J52p10J345r08O69L92j364J341j103P0P01j228J151l92k3N67p79N58
2403B51n29K38J93k56N39q25Q59o15k58Q75j222J039m43k38J359j397Q60r8p16
2422c84J082j411O29L2m48J030o81M04M5l07L23p19M81m71K60L86o61J046r30
2441b94K47K76r59J375j018L56O00j184J147p64j21O29j053R21m16K07N06l81
$$ y = [-741, 809, -498, 536, 731, -285, 824, -585, -190, -137, -625, 69, -278, 377, 133, 253, 337, -345, 378, -493, -14, 265, -634, 719, -425, 29, 462, -957, 633, -328, -189, 829, -538, 678, -86, -270, 426, -542, 5, -306, -185, 201, -49, 430, -152, 454, -9, -422, 425, -778, 221, -172, -350, 749, -597, 513, 222, -714, 696, -700, 172, 102, -406, 678, -361, 38, 69, -355, 54, -153, 298, 191, 284, 467, -235, 375, -499, -188, -36, -746, 599, -309, 360, 752, -612, 729, -374, -304, 397, -831, 320, -72, -95, 472, -307, 251, -278, -40, 153, -103, 436, -389, 470, -145, -403, 472, -750, 289, -154, -392, 967, -430, 430, 332, -384, 698, -713, -84, -52, -500, 530, -151, 253, 298, -9, 314, -405, 76, -395, -135, 251, -410, 636, -294, -47, 229, -730, 645, -373, -17, 583, -601, 546, -218, -339, 290, -763, 158, -258, -51, 455, 74]
2459G4N70n54lj32m89N70p10P48j33p2R76j225R59m28n78R73j340Q98m9m87J065
2480F33j032N18m4l92O92p58O70j90r8L29o21L76n80K56L97o05R75o48L81K86
2500E45j128J110r18J41N19j076J236p53K16M31q16P84m56K90K12n73N37o88L72
2519a5r3j88O31q07P93k86j77Q41j142Q48m79n15J009j210R07k18k62J043q58
2538a78O79k59l46M19p93N44k25j23O29n21P38p64L07j5o97J124r35M32M69r66
2558d81J060q49QL34r81J075m46M30N84p71O04q72J31J53m96N59l38M27j1j29
2578iO80r63P59m52m54R35j189R01j03m60J010j263R51k47n52R87r96Q40k10l86
2598b21N52o14M18m24J81J65l31P54n23M77j44p40R88j108M58L08q71J235q11
$$ y = [74, 644, 90, 87, -45, -534, 36, -674, 74, -59, -131, 845, -380, 579, 151, -427, 546, -794, 104, 55, -432, 633, -399, 119, 75, -317, 375, -383, 287, 97, -1, 328, -293, 83, -497, -241, 156, -449, 526, -122, 259, 545, -583, 527, -391, -250, 269, -807, 429, -324, -108, 323, -493, 291, -165, 125, 337, -236, 301, -387, -15, -108, -296, 335, -472, 321, 35, -142, 699, -443, 405, -74, -589, 420, -790, 117, -101, -363, 680, -178, 501, 242, -104, 315, -478, 66, -159, -282, 347, -174, 564, -200, 107, 92, -605, 519, -416, 16, 485, -481, 579, -270, -262, 72, -909, 166, -280, 150, 734, -37, 567, -305, -174, -21, -517, 42, -296, 131, 120, -9, 671, -292, 467, 15, -439, 496, -693, 208, 105, -355, 655, -608, 343, 96, -456, 531, -465, 375, 165, -221, 331, -283, 135, -289, -108, 57, -274, 480, -43, 434, 290, -450, 538, -570, -112, 196, -675, 560, -251]
2617b51M11M53j106R37o71J35K98o41P23k45Q3J1l77M36m95O15k30k11P68j045
2637d02Q34n60k77O92r74Q89p7k96R23j089P26j32n65O84p84M53m0j97N89o47
2657b50N13l21J26P7m83P80p94M35K17p95R40r31M88K36p27R67o95L06M56j084
2677e39P85n71J12J38n21Q35m40M76O0k98M13q68M26k66k01P47p56R18l25l16
2697a91Q30j338Q97l49l73R96q78Q83k35m29N66q57N47k22j20O24o25P25m38J25
2717A38nn00N12o56N82O7p45J309r07L15L52q66R03r66L97L48p94R59m97J82J68
2738B96o55N47l29K39r3k68M05l14M27k57r9N10r82R39n37k50R56q66P02k86n51
2759d66R19r94P32r4k64O37p53L78j39k07L63l21N48k94J76j8m81N23o91L57J71
$$ y = [-251, 160, 613, -493, 444, -227, -92, 206, -435, 288, 43, 126, 137, -240, 196, -299, 316, 86, -125, 643, -402, 432, -128, -405, 287, -687, 202, 125, -171, 752, -337, 389, 257, -308, 376, -408, 45, 5, -192, 397, -250, 263, -58, 68, 145, -338, 442, -352, 83, 300, -495, 445, -486, 2, 238, -489, 478, -217, 89, 545, -539, 246, -325, -213, -75, -596, 239, -201, 275, 335, 37, 450, -418, 8, -258, -459, 288, -468, 450, 125, -191, 639, -699, 198, -151, -524, 472, -406, 477, 242, -187, 379, -478, 69, -153, -273, 351, -274, 451, 13, 138, 133, -367, 145, -511, 71, 138, -607, 702, -205, 110, 462, -404, 499, -467, -70, 278, -516, 443, -54, 128, 296, -359, 188, -141, 98, 5, -263, 142, -172, 255, -2, -101, 409, -573, 366, -171, -421, 535, -331, 371, 85, -466, 453, -541, 191, 97, -167, 470, -283, 95, -44, -251, 112, -209, 339, 45, 221, 203, -278, 245, -446, -89, 82]
2780H2n43J025o53K63K47q82O92p19K39L84o67R73l66J10K59p36N01o09L04j56
2800b52L2O46n74O72n35j85N59j050P60k43j88P67q96R27r7n47P37j073O11k20
2820a49l18P95m96L92j75M2J50l78M14o10J98J39l69Q50o32L88P5q46R80j007
2840e57L90L44n34R25p05K04J57n92N71n87K12K42k20M63k67K1L0k00L01p56P41
2861A83k62j70O82r41Q47m17k09O97q99R35k57l61O16r03M71J6m80P16l97O41
2881E08m71J24j1n06M33n92M13L30n30P85o36L03J63q59R12q48L47K96p19J126
2901E68q03K09K37o21O74m23J85J5k70O46o44M22k55nK40p01P28m67K0P13p29
2922b61Q54m25m74P69j056O40l56j14P06m73O35k63r0K66o08J99j74j3L79l56
$$ y = [82, -461, 564, -89, 174, 421, -461, 231, -488, -249, 135, -532, 441, 75, 185, 444, -292, 209, -400, -96, -252, -220, 426, -148, 524, -11, -196, 363, -687, 73, -170, -358, 409, -487, 440, 343, -204, 533, -540, 71, -149, -467, 328, -168, 224, 49, 91, 241, -137, 277, -333, -135, 4, -365, 485, -147, 241, 316, -530, 450, -557, -167, 177, -357, 568, -137, 67, 224, -368, 203, -384, -172, 70, -150, 313, 46, 67, 97, -103, 198, -558, 183, -79, -249, 433, -508, 339, -78, -287, 410, -489, 446, 189, -172, 444, -459, 12, 28, -452, 264, -133, 508, 37, 161, 150, -356, 77, -515, -102, 228, -302, 483, -153, 150, 313, -546, 366, -482, -135, 161, -558, 568, -235, -26, 211, -410, 264, -159, 26, 41, -229, 417, -227, 195, -60, -65, 175, -526, 202, -265, -245, 468, -261, 593, 168, -306, 463, -593, 47, -309, -423, 283, -190, 445, 182, 92, 358, -250, -51, -225, -238, 141, -215]
2942b15O80o45K99J47n83P48p98M09K09o14Q82q32K28K03p10Q95m98L22M47q48
2962b74N77l85PJ08l04N10n64M91k41j30L90o00O47l80J47M62q41O49k68l78Q68
2983D91j035O56j77j63P11p35N27j23k45K87m67K87k73K36J11m54Q09n21L89M7
3003C58n37N71r33M61K03o63R27m83K83J86p41P05o67K09K79l78M84l92L90k03
3023E9j44K26n70O51k40p4N28o66P06n51k30M92r45Q13j98o4P94q58P97n31p9
3044h4J85m30N01j93j21M03m08L55m09K00L8l82P77o80L11Q6l72O66q23J44L11
3065G5m98P77m30K20J37n19N39m42J1m3j69N01l11K15Qm3L52o19N12l53j58N20
3087B82q13P53l54K3N15r16O87k62j69P32p69N72j46k53N65p76L98k46k5M45m15
$$ y = [-215, 465, -180, 119, 266, -317, 431, -367, 42, 251, -363, 519, -313, -85, 118, -592, 303, -195, 127, 574, -274, 303, -82, -75, 33, -271, 239, -325, 166, -75, -205, 185, -415, 232, -148, -1, 461, -380, 269, 1, -377, 491, -544, 112, -65, -228, 483, -252, 275, 152, -93, 194, -273, 14, -259, -23, 88, -366, 443, -78, 311, 358, -179, 392, -541, -80, 123, -540, 387, -96, 187, 373, -368, 337, -330, -121, 158, -220, 264, -128, 262, 59, -85, 141, -429, 222, -18, -92, 436, -230, 476, -75, -305, 187, -758, 55, -143, -207, 587, -271, 526, -5, -84, 101, -329, 172, -21, -142, 261, -147, 208, -201, -1, 37, -345, 432, -248, 63, 149, -223, 443, -380, -236, 75, -423, 354, -76, 144, 281, -238, 301, -141, -130, -173, -342, 159, -152, 63, 71, 28, 380, -239, 273, -80, -238, 282, -531, 222, -132, -109, 406, -510, 177, -85, -254, 478, -291, 281, 135, -118, 447, -329, 69, -177, -202, 243, -172]
3108a72N80l46J46j7m20L10m85K97J79l83P58n88K41J27n75Q14p98K31L05n85
3128c81O33l31J3O0k18K98l16M38j59k8K75m14K76m01J8L48m79N76k38J5M13o64
3150b66O59n25n7M36p71O37j75j29N47m02L60k90n9K14m63M88l29K96Nm47N69
3171B98o29M06k2m47P20n00L20J87n87O85p11K08l5l44P49l54L41j14l33L15m16
3192b63K18m0o5L20l88M61k77p7N28q48Q16m76J2N53q48O44l07l4M41q15N27j84
3214a02RK41l56L89k02M1l7l27M68m77L47N1k03N64n44L85m6m93M87n84L55Q9
3236E5k99O56o48L57j81k79N59n01L94r1j54L06l01L76l72k7K87m40N09j89J00
3257A17K79o48M67m57L4M27o09N94k00K3L34o14M36k28j66M02m16N66l69K08p7
$$ y = [-172, 408, 62, 208, 191, -229, 81, -404, -107, 72, -311, 447, -141, 100, 227, -348, 466, -332, -101, 204, -381, 252, -79, -66, -6, -224, 74, -242, 196, 37, 9, 284, -130, 146, -255, -237, 111, -368, 208, -30, -15, 398, -266, 393, -132, -189, 247, -524, 113, -62, -191, 356, -46, 314, 24, -35, 179, -284, 204, -125, 171, 176, -271, 298, -331, 75, 53, -394, 326, -174, 146, 333, -254, 431, -280, -72, -107, -451, 298, -56, 285, 171, -162, 153, -263, -45, -85, -150, 170, -218, 243, -34, -111, 417, -431, 385, -91, -79, 474, -374, 270, -37, -71, 370, -445, 82, -102, -93, 148, -208, 181, -21, 20, -17, -344, 124, -353, -6, 45, -158, 406, -138, 247, 201, -292, 195, -389, -34, 55, -244, 412, -236, 121, -60, -339, 220, -281, 113, 22, -132, 174, -127, 249, -123, -150, 137, -303, 206, 17, 117, 396, -252, 215, -242, -208, 219, -390, 204, 4, 27, 361, -253, 183, -45, -211, 191, -225, 341, -28, 180, 103]
3278A03k96L29l10J55mk02N77n42L17K4m15M83n91L18K02n08O17l47P1J60k86
3299a45M94p55L60p9q1K95k17M97k70j6K29p54N08k39O9L55n62O98m54q7N11p07
3321c50M88j89j24O25n35L85k37o3M1m25M00l46N30j56k22N64n67K51Q7m74M93
3342A76m89K76L27n94O88o27K50K40n68N45m28K09J41k04K64m03R5J12k27K21
3362Dj86M39j41l22M43l74K97l12Q8N02q24N92j11j89L32n09M88k15q7L22m69
3383b32L84k26L7K62m24L13l91L09J2k27M51n45L78j06k43O39o51K60J12l59O11
3404C64m85L04l1k85K51l95J52K3j45O38n35L03l6j32N4m42M16k17J42M12l86
3425c0M87m13k26M13p29O97l39N5M19n25M20o1k12J54m28L50k53L10P0k87L91
$$ y = [103, -193, 136, -174, -19, -23, -225, 352, -190, 127, 151, -264, 219, -372, -54, 148, -360, 257, -90, -19, 141, -145, 349, -406, -46, -125, -206, 89, -128, 369, 99, 83, 312, -442, 66, -173, -104, 251, -311, 387, -67, -154, 357, -350, 138, -51, -175, 450, -85, 300, 63, 0, 41, -384, 16, -330, 200, 44, -178, 386, -181, 70, 157, -317, 176, -313, -37, 290, -304, 384, -243, 7, 247, -321, 224, -204, 5, 146, -58, 206, -197, -102, 10, -217, 4, -182, 257, 116, -206, 237, -137, 160, -152, -64, 438, -386, 206, 95, -94, 238, -271, 217, 2, -85, 237, -232, 152, -74, -37, 225, -199, 114, -277, 32, 44, -183, 268, -277, 101, -5, -248, 391, -260, 0, 112, -247, 364, -121, 183, 152, -133, 118, -277, -125, -102, -247, 391, -144, 159, 123, -9, 45, -397, 19, -198, -56, 356, -30, 457, 44, -182, 231, -498, 199, -140, -85, 334, -191, 229, 168, -44, 110, -318, 32, -221, 89, 159, -128, 263]
3446B63l17J25m5j4L15m82L40j66l50O87o42M60k5l87M69m95L46p8o5M12m22N6
3468a5Q1k42L03l19K51k17L3K97m32M79l04K20L3m66O54m07P8K94p21N85k89n4
3490a58L00l35M34j73p4K20m87L38j91R0N3r2L26k49N9o5k14M22n48M68q3j78
3512a37N48n55K20m6j64L85m93P8K56j72M63l64J31j01k73L41m64L96q4M7J06
3533A18j60L07k90MJ05m51N42l95J46K97m49N21k19k23K72m47M02j1j37K19k43
3554i2J67j09j98J84j71L69k88L18j87j09L61m72J62Rp3K14l24K25K20m47M50
3575B09l67K71j56q0L63m50L21l2j10J10l30L43j63jJ75m20N15m11J00L85n98
3596c26N60m14NL46k32L33j89j78K79m25L33k88rL44j45L13k03L1j19k15K63m29
$$ y = [263, -54, 71, 26, 12, 327, -155, 185, 19, -331, 356, -286, 174, 149, -238, 231, -264, 82, 4, -61, 351, -71, -15, 66, -176, 127, -192, 59, -158, -125, 172, -260, 219, -85, 135, 168, -298, 356, -51, 27, 321, -400, 185, -104, -158, 142, -193, 241, 68, -6, 214, -273, 65, -126, -36, 17, -75, 251, 2, 61, -4, -218, 204, -344, 124, 41, -137, 411, -144, 76, 30, -134, 251, -242, -164, 92, -80, 383, 19, 150, 49, -224, 117, -347, 49, -35, 12, 118, -42, 265, -25, -21, 84, -367, 175, -220, -74, 223, -226, 295, 76, -147, 125, -322, 80, 69, -68, 151, -92, 75, -34, -232, -48, -219, 150, -138, 180, -7, -116, 245, -227, -65, -56, -129, 85, -239, -14, 206, -241, 209, -158, 113, -43, -123, 240, -210, 111, 79, -31, 79, -251, 92, -71, -72, 103, -317, 198, -213, -113, 272, -326, 234, -180, -175, 171, -61, 272, 83, -95, 184, -241, 92, -196, -205, 139, -6, 307, 104, 135, 16, -199, 64, -365]
3618c65M48j10l4N20n68K11m2l81N25m55K35J19j90L78m45J43j2k85M10k01J69
3639G0M1r1J90l62L19l72J86J92l33L32l77K50J82l35L68l84N4K19l13M55n03
3660b12J13J48j56M03l29L2O3j32K71l60J52J11k33N11m90J65j45j56L63k41L20
3681A98K4l73M01m27J14r4m3M45l27K48kj05K6j78J44p3RJ05j93K86k58K12Jl89
3705b49L13n7L2J03l20M06k29K6l9l03N01k64QL86m68L45k43J01Jk31L09k73K26
3728H1j8j41K08k48L09j39k59L36m32M29q0k22N18m13J88q7j37K37k53J04K3M2
3750D6J49l94K47j25lK25l33L06k39J51K70k88J79j86j54L24m82L63q8J16J91
3771B75l13K80l15l2J10q5J80j43N1R3k73L66k57M0j0l9K70m54L79o1j57K83m95
$$ y = [-365, 83, -27, -61, 459, -109, 102, 60, -321, 204, -251, -16, 103, -87, 291, -154, -11, -23, -308, 102, -99, 70, 111, 20, 210, -152, 167, -205, -19, 173, -160, 172, -205, 45, 227, -108, 260, -124, -70, 149, -164, 291, -212, -99, 49, -107, 296, -33, -1, 62, -70, 201, -159, -7, 104, -129, 382, -108, 57, -88, -244, 119, -122, 198, 222, -151, 250, -177, -63, -157, -200, 245, -82, 166, 164, 59, 85, -93, 51, -22, -13, 92, -101, 185, -73, 139, 140, -249, 64, 7, 39, 142, -178, 228, -1, 25, -14, -317, 184, -80, -72, 314, -154, 191, -52, 49, 50, -181, 128, -145, 81, 63, -78, 130, -118, 191, 52, -207, 129, -303, 126, 46, -176, 342, -71, 117, 30, -107, 130, -123, -19, 4, 46, 195, -199, 48, -77, -80, 145, -188, 118, -121, 30, 300, 12, 191, 5, -149, 175, -307, 56, -32, 84, 275, -38, 242, -73, -105, 5, -80, 100, -43, 8, 101, -172, 194, -63, -23, -33, -72, 198, -256, 123, 62, -95, 188, -307]
3794c07K69Rk34M24k65J77Q8k83L27k87K7P7l20M74k72K61j37j31K24k78L09l38
3816a86J87K33n20M34k63M0K07l64M67l06O4J26j19K56k26rJ04k41J90j24QJ86
3838A44k38L76l58J61j30m2K59l73L64r7k62L50m61L33ql76M15k06K63J63l31
3859e4J35j63M0J58k36m5J50J22j82J42N8k68L05l36L1L65m30M22l16J25O5l81
3881b93N17k81k3L03m77L24q6J37j05k32L24l04J72M4j10K48k46J42Kk03K92m31
3903b86L27j42m5M54m45M06k31k17M01l89J67kj89L40j83J45J9j16o1j97K72o4
3925c6JJ86k39M09l56K6O8l29M82l97K00J65k77L23k96P5O7j89J59q6k1K16k20
3948f9K03k18K00j63j16L20k48K27l8k58L79l79K28n2j41L31m43L19k8k12K87
$$ y = [-307, -38, -29, -263, 161, -104, 73, 161, -122, 205, -82, -55, 22, -298, 176, -96, 165, 28, -103, 121, -157, 152, -186, 1, 234, -286, 148, -115, -75, 132, -232, 235, -71, -7, 119, 0, 256, 30, 21, 125, -116, 74, -50, -42, 144, -94, 282, -76, 85, -45, -87, 172, -201, 163, 66, -196, 154, -307, 26, 18, -358, 57, -149, 114, 277, -54, 81, -82, -42, 116, -120, -165, -15, 107, -75, 67, 125, -143, 162, -174, -143, 222, -208, 214, -102, 23, 88, -293, 224, -57, -80, 223, -254, 70, -16, 121, 16, -216, 108, -196, -24, 20, -90, 158, -88, 54, 56, -147, 145, -286, 41, -101, -146, 308, -137, 269, 38, -179, 222, -167, 0, -2, -191, 149, -34, 111, 130, 14, -47, -244, 28, -36, -35, 151, -88, 321, -35, -9, 59, -270, 212, -185, 15, 180, -97, 226, -70, 5, 72, -117, 42, -44, -65, 151, -69, 134, -84, 116, -47, -163, 157, -91, 136, 98, -160, 219, -160, 68, 16, -125, 206, -237, 82, 54, -158, 129]
3969A29k65m7K72k46K85k11K32o1k20L47l88J63j80J27J38k08K02j29R0M8l14
3990b36L67l20j3K93j24J56j33P6Q8m02K82k09K43o6j03L70l06J42N0m42L29l23
4012b81L75q2j46K59j49J71j08j11K41k84O0q7kK67l15K89n8j49J91k64K31q4
4034c6M3J60l49M20l20J00J69m21L52j69J0K18m38M13j90Q9jk68K30m4J68m0j66
4057g0K25k31K1J22k82K68j19K20p3k84M65n08K59K3j14J39m22M78Nk33L77m12
4079a46J24q4j38M02l98K90j2k12L54k90Kk8o0K16j24K43j89l5N4k53K85j80Q0
4102i9K50k18K50k68K1J62k89K85j96J28Pj83J99q3M8J0n1j1%J15Lk52M56n62
4126b78L50j70j6K01l46L45j78n8L67l31J57n0q9K46l08J83j55P9Q5j29K17k24
$$ y = [129, -136, -183, 89, -157, 128, -83, 149, 88, -132, 215, -173, -10, -190, -63, 75, -133, 69, -60, 30, 78, -236, 131, -189, -202, 91, -33, 123, -10, 66, 154, -248, 34, -175, 68, 2, -101, 269, -37, 105, 155, -287, 42, -281, 94, 12, -134, 125, -24, 147, 39, -72, 169, -115, -55, -142, -144, 123, -192, 97, 39, -110, 81, -183, 48, -36, 7, 167, -182, 238, -82, 18, 187, -234, 118, -51, -41, 177, -261, 152, -38, 51, 50, -218, 12, -32, 136, 96, -70, 155, -76, -55, 67, -215, 53, -66, 154, 81, -203, 262, -246, 13, 36, -78, 61, -361, 117, 122, -111, 266, -146, -22, -106, -244, 158, -240, 50, 38, -174, 180, -110, -108, -136, -196, 20, -104, 139, -50, -85, -31, -284, 1, -179, -99, 151, -67, 183, -85, -64, 98, -191, 94, -102, 26, 33, -150, 49, -34, 14, 24, -27, -38, -38, 77, 80, -172, 284, -278, 72, -98, -114, 87, -259, 86, -92, -150, 217, -114, 43, -7, -96, 150, -158, 25, -130, -51, 34, -95, 122, -102]
4148a02R0P3m15M63j11k6K70l60L39k65L3K0k79M60k83J94rk72L24k74J11j04
4170a23q0M61l43J56k0q8N6k31J10n2n1M08l09L14k14j15L27m15K22n0q4K17q
4193H8N5j77k2J46l09K87p1o1K41l33L23j74n8J02j80K10j02N7J84k61J24j92
4215a23O0J16k46L61k67N3O6j32K39j09J19o6k10J88j84J51l0k7L07l53N9J9q7
4238i6J19k50L79k43Q7L16m08J59j23j45L60l05K59k0j58J96j93J59j72J07M5
4259G3k85M35l46J85pk53J89j93n9K69j42K44j29j4R8k40L34l47K07M0k24L05
4281A40r2M0l1j07R1k53K82oj66J75k02K56j73r3L11l49K22k8q6K02k74L07m9
4304A17j12J05k93K17n9j61L58k81K92q8j00L3k32L07l03K55J6j87L35l61K0L53
$$ y = [-102, -12, 61, -354, 109, -2, -28, 242, -118, 221, -44, -11, 9, -270, 190, -93, 101, 92, -180, 144, -130, -19, -123, -203, 258, -85, 71, 51, -37, 19, -212, -102, -154, -205, 203, -106, 208, -6, -121, 206, -209, 13, -37, -121, 96, 88, 143, -34, -56, 90, -219, 68, -3, -64, 177, -156, 167, -7, -65, 37, -143, 67, -35, 22, 206, -55, 69, -123, -63, 53, -193, 168, -99, -46, 20, -112, 127, 18, 137, 71, -139, 49, -135, 16, -14, -41, 266, -87, -28, -9, -96, 23, -227, 152, -91, -4, 312, -96, 63, -60, -205, 155, -150, 109, 89, -69, 127, -66, 93, -79, 28, 73, -212, 223, -123, 62, 55, -198, -9, -202, -261, 8, -134, 110, -19, -33, 65, -175, 159, -188, 19, 59, -165, 140, 48, 88, 57, -50, 41, -212, 70, 64, -102, 73, -129, 127, -46, -139, 172, -177, 45, 17, -69, 133, -141, 166, 117, 5, 110, -183, 34, -25, -186, 172, -109, 183, 95, -5, 28, -204, 103, -200, 55, 71, -116, 219, -142, -122, 231]
4326B31m38K43j53P7J85l04M46l53J4O8j26J74j22J08qq9K54l59J87P0k59K65
4348A11k73J93k2j80K70k63K12n0j05J49j94K01K6o7J22k52R3N6j84K22k41K90
4370A14j20j09K21j09J67l70K56L8k90K78j14N6j2p5K77l47J22J7r4K44o9p7O4
4393F8j60K63l54J91O1k03J95j77K46q3j18Q1l12L80j84Q5K51m66L27j52r0K47
4415I6l28J87j7n8K96k79J85q2n3J31j48N4Nj3P5k14K76q4L3o9j39K30j99J96
4439H1N8k12J63j49J58j4k37K84k63PN8o8K54j41j0J90j38J82l49K62K7j55J69
4462A57k24L8m8j57M27l91L51r7j01K38k54J34j96kK66k03K01j42m1J53l73K38
4484b6j23J63R1k49J98j18N7R9j04Q1k33J48J89k49J09m3q7K69k87J51j58M8J78
$$ y = [231, -207, 36, -117, -40, 145, -159, 287, -66, -52, 16, -110, 64, -58, 50, 42, -47, 207, -152, 35, 105, -154, 111, -162, 31, 9, -171, 99, -164, 48, -2, -107, 42, -152, 49, 75, 8, 130, -122, -29, 27, -157, 65, -176, 114, -6, -115, 106, -3, 164, -206, 50, 88, -202, 76, -38, 18, 6, -69, 208, -139, -17, 0, -94, 150, 81, 4, 68, -92, 171, -183, 8, 69, -134, 61, -116, 130, 47, -71, 10, -302, 78, -106, -21, 230, -236, 91, -61, -151, 96, -232, -45, -62, -120, 176, -103, 82, 0, -53, 78, -70, -16, -11, -24, 51, -163, 113, 29, 62, -7, -146, 84, -115, 81, 139, -73, 90, -59, 99, 85, -152, 132, -131, -124, -66, -134, 120, -21, -31, 159, 21, 203, -146, 116, 143, -12, 157, -67, -29, -77, -234, 193, -198, 153, 56, -45, 193, -61, 73, -123, -125, 141, -62, 139, -3, -44, 109, -264, -26, -149, 14, 105, -144, 54, -64, -7, 92, -12, 69, -164, -16, 173, -76, 33, -10, -97, 172, -115, 36, -122, -74, 104]
4507A04k34K46k03K00p1j64L32l53R8k1K4J36k83K73m8j1Q6k30L10j89j61L84
4529B25l22K63k17K7J88k76J26Kn0K36l42K35j38p1R9j92K52j49K36o3j16P9k19
4552a87L25j47j78L10l21J77J32k31L30m15J55O5j87L68k27N5j9n8L7k05K46q7
4574f2j1J99k30J90j3o6K14m18J29q3k4L39j83J30j85r9K93k83J10k0J90j00j99
4597a82L47k11O0N6j77K84k92K07O7k48K31l11J06J25j45P8r2jJ87k66L02j58
4619c3J28n3m8O7j75K24j32j36K73j44J81k62Q9J24l49L63j56J0J63j61J42j0
4641A05k48K88k67J69m2K8P6k11J30j24j2J26j15K01k17N9M3k96M18k82R3J75
4663I7k77L19j49J02j40N7M1k74K06K0J2J92k42J07K9j38J18j01q8P3l5J22n0
$$ y = [104, -130, 116, -87, 113, 42, -122, 210, -143, -45, -66, -42, 94, -189, 84, 36, 25, 111, -119, 191, 2, -159, 225, -97, 166, -51, -24, 164, -112, 14, 16, -34, 202, -140, 95, -43, -114, -15, -207, 45, -104, 132, 69, -47, 32, -187, 138, -9, -187, 123, -198, -21, 111, -120, 210, -205, -50, 15, -172, 196, -31, 24, 5, -53, -16, -221, 25, -62, -73, 126, -104, 86, 73, 7, 221, -197, -68, -151, -175, 164, -19, 111, -74, -173, 120, -163, -53, -73, 117, 17, -182, 165, -46, 14, 70, -107, 177, -115, 92, 159, -89, 142, -169, -63, 62, -83, -5, -97, -98, 89, -177, 125, -33, 95, 42, -6, 61, -114, 110, -22, -158, 115, -29, 152, -110, -21, 103, -246, 117, -39, -29, 134, -27, 115, 105, -143, 145, -122, 47, 5, 33, 109, -102, 28, -96, -108, 18, -97, 104, -113, -54, -11, -307, 111, -171, -78, 97, -180, 139, -10, 92, -48, 9, 50, -224, -18, 2, 14, 206, -36, 71, 100, -38, 80, -21, -109, -36, -71, 51, 1]
4686AN9k5r2J50k79K43j78J10Q7k28L07k46j20K63j64K11k27k8J79j26J74j26
4708e5n1Pm6J96k43J12J62j77L17j64J29l8l34K64j95R8Lp3K25k76L4J37j74K02
4732F0l7p7jJ86q2r9K27k19mJ09k03K32m4o0J50l25K82j86K9J69k73L97k81j10
4756a60L50k16J17j57J37lj67L35j92j12J06l2L2j82J72o1r3K67l52L88k44J0
4778e7J51l20K23R0j32J96l10J96n0k6M7j00Pm3J36K2j28K20j09j17K98l45J26
4801b5n0j0L8m7P2j06J6K40l30K75j80Q4P6k10K64j22J6Q6k42K52k42K09ll3O3
4826I1n9L0j36pO3L5J26o3j65K44j47P8j7k52L56k49J43o2N2Lk39J83J8j26Q3
4851a7oJ60j70Q8J01l06J31j11N0J73r0J63j30k2O4l01K67J01l48K47j17K45n8
$$ y = [1, 60, 35, -57, 93, -186, 57, -121, -11, 76, -152, 155, -91, -211, 52, -112, 99, -128, -156, 23, -103, 71, -55, -106, -99, -145, 51, -192, -80, 82, -95, 222, 58, 187, 149, -185, 79, -116, -18, -15, -88, 137, -139, -105, 32, -142, 60, 23, -54, -55, 131, 49, -50, 177, -42, -46, 63, -140, 92, 48, -12, 138, -187, 95, -91, -62, 107, -166, 231, -50, -160, 190, -26, 91, -66, 71, 68, -99, 236, 44, -68, 38, 6, 38, -144, 28, -33, -126, 141, -211, 177, -67, -57, 94, -226, -3, 87, -45, 151, -159, 37, -13, -39, 8, -92, -85, -128, 8, 30, -98, 122, 13, -104, 194, -151, -25, -75, -85, -47, -94, -22, -128, -112, 128, -202, 73, -107, -23, 53, -157, 107, -15, 1, 87, -155, 97, -145, 64, 61, 28, 91, 32, 62, -74, -81, -18, 17, 143, 80, -85, 159, 12, 90, 73, -179, 177, -72, 71, 9, 61, 64, -175, 8, 26, -100, -17, -23, 137, -33, 55, 156, -150, -19, -130, -80, 93, 3, 166, 36, 14, 78, -223, 44, 145, -203, 44, -73, 172, 114]
4874A14j63O9j77O2l2J89j20j8K43k70J16J16l22K85j96Q9M1k59L92j90N3L3j86
4897a31K03k77J52R7j14J15n0K2m2L1R3k14Q9j84J43K88k67J27j69Q4O0k91L46
4920A11j37j7J99l08K10Lj13J61j78LN9Q2L1j01R4k33J50R2k36J66r0J10n3j43
4944a38K99k17P6J1j84L41k74K1J5m3O5k14K17K0r9K08j13P9q5O8J40j44o5Q7
4968G1m9k7p0P6j8Q1k0j96K51j30j91L07k9J02k60K17N1l04K53r9o7P0o0L6Oj
4994@j5k82L29k11K28j21p2L36k19R8o8KJ16k12J66r9P8M5j30J32r0O7j26j14
5018a62K07j0q3J48k64J75m3j1J36j07J90k01K6J92k96K12j75J30r3j09K03j26
5040f1k9K05j78K3J3Nj23N9J51q3J97k33L3J85k15P9%q5J25j07R4n5j1N2j70J82
$$ y = [114, -49, 20, -157, -95, -127, 62, -58, -76, 167, -103, 13, 129, -193, 92, -104, -15, 26, -233, 159, -31, 22, 55, -131, 72, -205, -53, 44, -70, 45, -5, 17, -25, 6, 99, -115, -26, -210, -67, 221, -46, 81, -88, -4, 56, -235, 111, -26, -43, 156, -152, 58, 61, -52, 109, -69, -66, -7, 75, 106, 5, 99, -134, 16, 108, -128, 38, -52, 58, 5, -138, 161, -56, 20, 31, -153, 188, -86, -65, -50, -93, -28, -242, -25, -5, -104, 104, -9, 70, -15, 53, 193, 49, -16, 71, 22, -5, -75, 1, -17, 64, 44, -152, 99, -31, -222, 85, 56, 158, -102, 115, 166, -138, 115, 16, -51, 19, -41, -5, 1, 0, -15, -297, 32, -179, 49, -72, -144, 192, -27, 71, 3, 5, 121, -91, 75, -24, 54, 99, -31, 101, 11, 78, -48, -162, 45, 35, -48, 100, -164, 11, -32, -43, 93, -14, 176, -25, 1, 193, -103, 109, -66, 64, -29, -138, 65, -61, -90, 115, -63, -40, -27, -22, -145, -86, 65, -18, 179, -54, -21, 164, -51, 28, 28, -57, 68, -39, 55, 0, -11, 41, -129, 53]
5066E3j03o9K10j85O1Q9j0J63l01J09r9K05L1k05J56j22J2Q5k75J85m0P3P0l58
5090b65L29j76J8J74r1Nl8J18J6k65L46j54J5Q4k79K71k40n1K33j25K79l63K68
5113A09j0j53J78k71J35M2l2q9J19j87J45K3m5m3J06j18P3N6q5J63k34P3J14k12
5137a43J44N3n9J09j53N9N1j32J17k37L52j4m4R2l67K50j85N5L2j21J81m8k6N8
5161B4nJ38l24K70j8k66K70j04O9j6n1R8m1j09O9j16J97j62K65j85m2R4j35Q1
5185Aj98K06K3j37J13j02K9K62k77J10k03J62rn0J74r6j45K01k2j8l9O4R9j50
5209bJ2o0J95j71j00K78l69L72j24o6R1k3r0R1q8K5j3J40j13p5J68m5N8m4j76
5234a29J56k34J76K5M1O4j61P8n3RP3l8J14j84J15L6k86L90k44jR3p4J37k38K3
$$ y = [53, -50, -119, 91, -94, -33, 56, 46, 209, -92, 17, -82, 123, 154, -51, 105, -17, -5, 80, -195, -10, -50, 23, 93, -265, 64, -112, -94, 80, -11, -6, -44, 74, 90, -175, 171, 17, 32, 116, -163, 108, -132, -183, 50, -75, 204, -159, 109, 99, -54, 124, -147, -12, 30, -2, -91, 28, -159, -14, 9, -36, -79, 27, -91, -18, 38, -47, 116, -118, -45, 69, -143, 1, 54, -5, 104, -49, 10, 61, -71, 46, -191, 161, 147, 103, 195, -172, 78, -107, -52, -20, -141, 40, -8, -34, 24, 19, 157, -167, 103, 85, -181, 89, -15, 54, 38, -13, 85, 44, -65, 4, -112, 85, -77, 188, 3, -39, 55, -80, 1, -197, 9, 32, -105, 8, -94, -65, 197, -80, 30, -173, -11, -20, -70, 104, 8, -137, 64, 42, 24, -15, 49, 148, -2, 10, -50, 145, -26, -126, 152, -217, 155, 31, -35, 56, 33, -57, 34, -54, -29, -42, 98, -15, -90, 78, 33, 91, 47, -129, 27, -207, -31, -6, 35, 99, -62, 16, -37, -28, 45, 7, 121, -63, 52, 88, -198, 192, -52, -53, 40, -34, 103, -135, -112]
5259a12K52j31Qj22J28j31O2N7n5J03J4j23k7M7R1p5j56L16j85P8r6j63K80k13
5283a53J11J12j09R0j05P0n3j14J96k3j61J01P3M1j78J16j69J03L9k14L31j15
5305a1rQ5j39K28k06q3K79j11m3k2o2R3p6K13j18N5l3q0lm4J25n9q7K11j54m3
5331i4J41j29J57l6K5K2q0R4k08K73l04P5J79j57R0P3j65J23k50J24N4q1J00j23
5355i7K36k87k0L09k73J61m9NJ86k67J78k6j19J76l05K61r3k9J11j63K50j30l
5378A2%n7J43j52J04r7M9J00j74O2K5j36K13j83Q2P9j21J08j14J24%j68J67k40
5402a74J53P3j17K33k58R9j05P7m4qP1j28K16q9j17J98j87K05j19r9J45n0n2J45
5426F8j97R8m4R2N4k45J76k5M8N4j96K01j78K72j13j50J14N2j98m6Q7J85k26P2
$$ y = [-112, 140, 9, 17, -105, 23, -108, -46, 11, -44, 59, 73, -50, -77, -30, 61, -14, -170, 146, -39, 39, -57, -220, 60, -153, -42, 70, -39, 51, -54, 16, -37, -151, 45, 22, -139, -38, 35, 76, -102, 14, -155, -52, -13, -227, 104, -11, -20, 65, -74, 154, -52, -135, 144, 33, -10, -32, -94, -1, -77, 136, 18, 73, 40, -40, -43, -87, 38, -21, -108, 103, -51, -94, 47, -82, 75, 39, 64, 86, 6, 100, -108, 165, -139, -64, 115, -42, 48, 121, -44, 79, -171, -47, 7, -74, 26, -97, 139, -148, -168, 141, -132, 29, -20, -15, 171, -96, 82, 56, -63, 113, -192, 69, -24, -53, 58, -105, 145, 15, 12, 12, -45, 98, -54, 50, -47, 2, 102, -72, -10, 15, -121, 92, -91, -9, 70, -51, 57, -57, 67, 67, -101, 66, -174, -21, 52, -65, 168, -90, 9, -96, -19, -63, -71, 0, -128, 88, -1, -118, 80, -107, 98, -21, -120, 25, -25, -77, 68, -129, -31, -75, 17, 71, -174, 2, -23, 25, 79, -117, 84, -94, 178, 65, -85, 29, 81, -117, -163, -76, 109, -117, -45]
5450d5mkJ49j98K03o3o0L3j16Q4L5jp8k0J74j25K0M2n4J04l8j88J84j83J64K4
5476D1N1r5j45K27p3M3o8j8K65j85n1J09q4N7n5J11j21n6J00k2j55J46l1O3j90
5501a36J52J8j18J97l7j12K50l18J83k21L08r1j26J69o1qo1j8M9j76J45L1o2J40
5525I7j97K00j09L9Q8k47K27j14Lq0J13J29k03L5P2j35J17K7K7q4PR8m9j09o4
5550a12J43J90j57PN5j76K2O0O2o7m0llQ4j4j96J60j9J7J17m3l3j48R9O3k3m5
5577@n1J02j18p7J63q7L2M0K7K5r5Q6l0q5J35qN5k28J17M4j24J84k31L3P6o2J65
5604H8j45P6J4j31P8N8P4q1k1l2P8k3o3j22K17k48L03o1j10N6l6J38j17N5n5p8
5630h8K67k07o5J91l51L12j17j06K90l08K10Jo3R1j28L5N5j26J42p4J06l5K2q
$$ y = [-45, -49, -51, 98, -100, 103, 40, -20, 13, -103, -19, 16, 15, -63, -83, 91, -34, -14, 28, -26, 78, 40, -148, 36, -147, 17, 41, 92, -3, -148, 79, 6, 49, -19, -37, 228, 43, -8, 101, 17, 74, 19, 130, 9, -47, 53, 31, -124, 22, -9, 54, -136, 16, 34, -84, 113, 76, -36, 214, -104, 79, -142, 166, 75, -51, 118, 57, 49, -12, -30, 19, -157, -12, 19, -43, 97, -100, 100, -9, 30, 118, -129, 98, -16, -13, -93, 20, 149, -54, -19, 53, -82, 35, 62, 89, 5, 12, 110, 61, -48, -112, 31, 221, 64, 71, 126, -50, -28, 32, 94, 27, -13, -16, -19, 65, 51, -145, 15, -4, 13, 130, 87, 54, -94, 5, 68, 45, 0, -51, 51, -67, -144, 19, -68, -36, 4, 31, 56, -39, 47, 17, -68, 67, 59, 114, -114, 3, 47, -77, 107, -124, -91, -15, -77, 88, -57, 19, 33, -98, -20, 38, 112, 31, 10, -22, 56, 33, -30, -152, 65, -183, 120, 59, -51, 5, -31, 107, -10, 45, -10, -88, 179, -28, -93, 98, -253, 59, -58, -164, 126, -182, 28, 29, -34, 57, -71, -36, 19, -107, 35, -39, 67, 32, 54, 46]
5654D6j48R9k00J77J7q8K35j23k5J5%J8N5K5j61J3J51j74K78j70n3K31m07K42
5678E3j16J29J63l46J51k7P1n5j61J28j14m2K50n0M0p9r7K63k62M7k3J39J64l63
5702a37K38j25M8No2J24n4j87K47k52K64k03M4J4j4P2l3k3j9K9J20k29L5Ol2J38
5728A4o7L9J12k27J26j60K38L4j75K61k31J24j20O0K3j29J16jp0ko2J20m5J36
5752A14j03j40K3n5K49k8n8J57k45J10r0n6J97o0k2J6q5nJ73j41M6q6J35o0kN8
5778D2j19P1klr0jJ26r9J93K0j23jp0J19P2j22Q0j04J14j00nJ47k69J00O5j3o6
5805c8j58K98o5l4N7q7J6j4j05K98k21N9N6L7o8RJ19k41M9M9RP0m6j49J17m5J87
5832A59j63Q5o4n0P7j8O4j03L0R1j88j2j0r4K85j72O9J4m9J35j05j1N3M7k8o6
$$ y = [46, -102, -3, -203, -26, -9, -97, 138, 15, -10, 5, 5, 23, 78, 103, -58, -45, 106, -68, 210, 40, -13, 218, -189, 53, -63, 66, 229, -117, 34, 7, 78, 23, -138, -10, -124, -166, 84, 34, 74, -5, -102, 161, -101, -54, -77, 62, 226, -137, 101, -24, 24, 29, -33, 91, 37, -150, 97, -155, 109, -94, -50, -36, -50, 22, -11, -34, -53, -24, 96, -133, -98, -92, -124, 14, -53, -14, 98, -129, -3, -163, 75, 109, -66, 195, -36, 88, -32, 28, 51, -78, 38, 37, -33, -35, -97, 23, -22, 114, 11, -129, -106, -161, 88, 60, 2, 159, -86, 24, -66, -122, 75, 15, -7, 9, -76, -81, 92, -49, -3, -89, 46, -14, -16, 42, -77, -6, -8, -11, -101, -102, 24, -75, 118, 138, 15, 14, -56, 63, 135, 13, 93, -11, 103, 3, -2, 145, -124, -24, 41, 28, -38, -196, 102, 37, 3, 60, -27, -11, -25, -130, 168, -53, 6, 62, 99, 31, 40, 159, -82, -33, 16, 25, 95, 49, -100, 17, -28, 159, -4, 81, 17, -33, 44, 26, 90, -13, 17, 108, -80, -92, -102, -196, 89, -83, -14, 0, -49, 86, -19, -30, 23, 70, 42, -24]
5858b4J26k0p7l8J33j09M8j2P4k60L41k38R0j6j28R3j9j4J73j88J99j51k4J06
5882F5j39L0J13j15J2K1M9j37Q4P5k23L20k86Q8ko5K10j72O0P6l5N5j96Q3L1j38
5908a36L02k60K00o2l1J11j48M2l0O2jj29M9o0K6k3n7K29k73J92J90k46J38k05
5932a20J68Pr7K4k7n6J87K9j10PL7n4n8l4M7OJ6p2J86p7l0J4l7J07o2L6%j49K08
5961I6q0M6q6o9J83j15P8jJ8m2o1R0o5R2q0MJ00k14L2J27r6J03k38M5K53j90K27
5988A57k07K9L1N5K7j66M1l5k9K90l60K65j58l5Q2q0J60k5j09J16j49J30qJ7O3
6013A02p5l9L4n7J68j94M2lk7L9o0M9L9J01l2j19N4p8M2J12k27J66LN6Ok69K19
6040E2j92R4JM6R7j96J81j17J6N7j09k3J09k1J07o1J34j30j54K19j93J09l5k3
$$ y = [-24, 102, 82, 5, -33, 100, -9, 39, 27, 101, -159, 182, -56, 34, 18, -110, -17, -36, -50, 123, -65, 134, -17, -41, 65, -74, -44, 69, -46, -34, -13, 36, -101, -17, 58, -165, 155, -131, -43, -45, -110, 100, -72, -12, 64, 29, 84, -112, -29, 2, -136, 166, -94, 106, 44, 13, 124, -24, 18, -12, 50, 49, -80, -31, -91, -65, -88, -145, 84, -189, 3, 193, -53, 85, -120, 48, 55, -42, -18, -45, -101, 86, 115, 5, 12, 49, -5, -63, -97, -50, -44, -28, -100, 86, 9, -21, -7, -44, 63, 1, 37, 37, -112, 96, 16, 62, -24, -93, 90, -25, 53, 52, 70, 28, -33, 57, -8, 84, 4, 8, 108, -106, -74, 53, -43, 60, -178, -133, 120, -70, 157, -50, -21, 10, 65, 92, -74, -33, -68, -97, 193, -167, 98, -60, -95, -13, -93, 67, 42, -67, 49, -100, 30, 22, 39, 102, 27, -12, 22, -35, 133, -61, -19, -22, -49, -10, -70, -21, 18, 119, 87, -32, 22, -56, -14, 98, -129, 37, 40, 96, 102, -167, 52, -140, -46, -45, 1, 98, -98, 83, -34, -18, 39, -70, -93, 16, -5, 102, 41, 175, 45, -109, 110, -83, 26, -9, -32]
6064c2J72j42kq7L0J28p2j3M7o1Oq9J74j09J4K4m3J18k00J34N9j12J07j88J91
6089E4m7j58J83j6J18l7l9RL3j56J20k82P9J46m4J36o0P8m5m6o7m5J68j76J25
6114C1j46J07rJ1J08m8n4j6j8J26q1j16K05l9k9k8qj0j5J61r4j17J57o3j8k1O6
6141D2j61j38K88j20J2N2j92J02n4J33j1l8J19j15K04k26J03Oq5O2k5Q5J0n3J67
6166A67j64p7J06j48K13o5j49K54j98L1k8NJ76j27N6q2L4J63j58M0n5N2k9m5R1
6191F3j09Q2O0j33J4J72n2p1n4RM0qK1j4J05j07j2j02J34N0m8m5o7L0qj02J94
6218D2L1j00J6j48K95j92k2J04m0M3m9j13K82r3J50j27L7k7j45Q2n3Q9o2q5J60
6243G5j36J03L8j6op8N6k5M3J6k0k2l1J7l0j14J1J3K00K5o3m1N9o7pj81R7K5j2
$$ y = [-32, 140, -2, -4, -91, -61, 67, -5, -18, 29, -32, -26, -115, 59, -50, -36, -12, -55, 63, -137, -3, 56, -56, 51, -137, 54, 7, -151, 32, 16, 134, 97, 58, 67, 100, -56, 64, -218, -139, 7, -37, 99, 39, 117, 72, 26, -41, -86, 82, -94, 31, -115, -8, -17, -6, 102, 54, 0, -16, -34, 92, 11, -105, 100, 61, 32, 4, -4, -14, -29, 132, 38, -79, 78, 15, -3, -24, 42, -119, -257, 31, -89, -77, -25, -217, -115, -169, -36, -47, -85, 34, -81, 123, -103, 0, 6, -79, -17, -42, 43, 53, 0, 167, 3, -74, 32, -116, 97, 32, -117, 137, -61, -30, -58, -53, 123, -4, 52, -30, 4, 167, 9, 49, -6, 46, 17, -28, 63, -46, 36, 96, -37, -23, 149, 97, 26, -28, -19, 21, 13, 34, 20, 125, 18, 6, -96, 38, 88, 40, -5, -72, -42, -50, -152, 42, 73, -27, -11, -159, 136, -56, -78, 26, -14, 29, -20, -133, 149, 56, 206, 79, 116, 89, -56, 26, -27, 62, 0, -85, 75, -61, 42, 80, 64, 58, -20, 36, 11, 54, 70, 50, 28, -3, 14, -16, -130, -119, -106, 94, 119, 56, 15, 74, 7, 0, -181, -84, -59, -71]
6272g1J99j70L3J61k57M2J05r2J9L0P0l8R6j59K5J0j41J51j46Q8K67j86N4k06
6296a16M0R9j03J99j18J5N8j94J71j58J38P3k61J41L2o6M6n7J15o0L2J3k15J17
6320e9J5J34r4j08J30J4pr6j71L96j96R1l8j14J45J2q9L7J6N1j45J12J8q1m3j27
6346a97K79lk18K19J9j97J29k5Q0j85L7L9L4j9M3j7J2N1p0j33L05k05L5k7p9J3
6372h0P2J18j25l1K3Q4j82J17L4J39r7j55J02l6Ql8K5k3j70K93n1J2j4n0J05q9
6398iJ54k41R2M5j41J45j69J61o3j4J27r4pP6r5J40k9m4l2n0J45j03%k8q5J78
6424E9j07P2p5m7K12r5O1q9j67K65j29p4J07l9J10j34lQ3NQLj37K23p7l0j12J9
6451h8J16q9J9O3O2j66R8J1m7p5J78r0R1p2N4J4j89J89j08O7l0O4j90N4N6P0l9
$$ y = [-71, 128, -42, -9, 152, -105, -63, 42, -50, -31, -1, 69, 31, 127, -32, -7, 3, -138, 13, -133, -45, 222, 36, 90, -116, -76, 23, -80, 119, 1, 16, 74, -120, 51, -107, 31, 104, -157, -16, 16, -50, -4, -61, 54, -6, 26, 39, -176, -59, -44, 90, -4, -112, 18, 32, 25, -71, -242, 154, -42, 49, 11, -103, 42, 54, -35, 2, 18, 69, -76, 36, 54, -27, -70, -197, 82, 79, -139, 80, 99, -98, 31, 6, 86, -99, -62, -23, 11, -8, 35, 18, 30, 81, 11, -122, 183, -22, 13, -14, -93, -80, -8, 110, -15, -46, -23, 61, -121, -4, 30, 169, 72, -83, 19, -17, -9, -47, -22, -45, -215, 78, 27, 39, 25, -25, 80, -9, 145, -96, -4, 41, -100, 45, -124, 37, -26, -40, 87, -7, -14, 62, -33, 107, 78, 34, 2, -48, 97, -6, -6, -34, -119, 59, -48, 24, -51, -98, 114, 19, 80, -9, -176, 89, -40, -114, -7, -46, 64, -70, -73, 10, 15, 23, 26, -111, 112, 35, 5, -107, -88, 28, -61, -42, 21, 83, -83, 15, 26, -21, -96, 82, -8, 83, 11, 65, 79, -110, 79, -29, 38, 8, 72, -118, -64, -8, 62, 23]
6478B3j34J06N2l8KO4j77K22j89QL9QP0j43J86j49j4J03n4r0L4J12J53j36k5k1
6504A2k2J13nn3m6j66K23n4R8j40o0J68r1M1q7J75n7n3kp4J10n8O3J15k43J75
6530H2K6k54L14q8j77nM5K3n5J11J72k37J28j16m9P7j84L00j16o5j6R1J5Q1L7
6555A40j14p7J03q5P5O2k17J49m7n0j5M8J1j37J93mQ5O1r0j0l8N6j44k7M9j68
6581a91J57O5m3j93K91j09O1l4J06j66O3k5m2M5j4K0j4l0J21j54N9J63j27L8j60
6606a13J80p0q4J89j1j1j54J39j0j49J05q9P6j08J64n8N0r4n4J40O9m0k35K34
6630F6n4R0j98J7J52j95P9nO3N9j92K34r5k8M3j15J43j79K05nk8n2j74J75m4n7
6656i5J50l5n3MQ2r5J31l0p6j7J19j06K39j68q9J22j40mO8J57j31p0R0j28J19
$$ y = [23, -111, -5, 47, 9, 11, 75, -102, 120, -69, -61, -22, -14, 56, -87, 99, -50, -64, 39, -15, -105, -71, 41, 194, 58, 33, 12, -10, 103, 98, 45, -1, -167, 56, 2, 100, -40, -100, 68, -23, 18, -69, 106, 49, -4, -6, -80, 30, -28, 35, 150, -93, 82, 108, -146, 168, 80, -97, -102, -57, -34, -89, 22, 194, -43, 85, -31, -80, -3, -187, 113, -3, -68, -84, 7, 22, 103, 140, 26, -51, 52, -33, 42, 104, -113, 36, -11, -61, -76, -28, -17, -154, 39, 35, 120, 181, 91, 81, 43, 99, -45, -72, -23, -191, -34, 31, -12, -205, 86, -23, 38, 4, 110, -56, 7, -18, -60, -15, -29, -9, -23, -53, 68, -86, -27, 136, 9, 47, -113, 67, -3, -87, 102, 91, 80, -74, 65, 55, -94, 11, -78, -2, -110, 54, -4, 46, -48, -102, 38, 107, 67, -168, 66, 12, 102, -96, -79, 73, -122, -43, -48, 15, 74, -118, 116, 21, -7, 36, -79, 64, -115, 90, 85, 57, 5, -169, 6, -38, -95, 55, 20, -33, -29, 53, -42, 89, 59, -17, -34, 85, -21, 218, 50, -39, 83, -57, -61, 7, 164, 33, -37, 53, -75, 44]
6681D4m7O9l2L6j03J25K2j60K6l5K4kR3j05Q3k7q1J62q4L8m3k7M4o5Q6n5J1O6
6709F3k43J49L0q5J86j54J39m7nN6m8%j41J7Q3j2N1jn0J3m7l3j1J41k3o9J14r9
6737b6O9m9q7J60j20L1J84k25L7k7R0m8j9L4l4O5J05j23m8n7K08n5j29J70k23
6762a17J26M1j46J75j08J26nj36n9l0J77j07J50o6q6J72k10R1Q3r9J7Jn2J18j61
6787a05O7K2q4J06q5J38j01O4L5o8Q5j71L3J16j35K05m7kJj41J54j23p1J53k20
6812a74J61q7P6J09j75N0R0L5j54P4J5j5R7K6j30Q6j14J7k4N0l8K5J42j56K7r3
6838h0P7O8p9q4P9N9p7k0J81mk07J55j3q4N8p0J55n1p5J15k45K16pj70N9Q1%m0
6866cq8J45m2J70k24N1M7j62J66k03K60j64M5J1rL8o4L8M7l8P2j04N0k6r4O3j4
$$ y = [44, -3, 66, 34, 70, -33, 92, 114, -46, -20, -55, -31, -33, 60, -45, 38, 11, -70, 92, 8, 46, 3, -24, 20, -45, 41, -14, -3, 63, -180, -31, -1, -86, 100, -54, 85, 38, 33, 89, 41, 41, -100, -83, 0, -12, 39, 38, -12, 1, -46, -79, -90, 51, 28, -41, 73, -26, 43, -6, -93, 67, -53, -22, 162, -63, -26, -53, 37, -11, -30, 4, -30, 35, 140, 17, -31, -88, 120, 65, -64, 106, -117, 9, 50, -96, 79, -29, 97, 92, -44, -103, -133, 44, -63, 87, 21, -65, 107, -103, -12, 71, -28, -11, -10, -62, 56, -105, -38, -16, -100, 6, -79, 59, -42, 22, 57, -11, 74, -97, -64, 52, -83, 122, 75, 73, 74, -67, 87, -36, -107, 46, -174, -13, -100, -24, 85, -90, -40, 50, 85, -69, 5, 20, 5, 102, 128, -2, 84, -30, -13, -37, 13, -25, 0, 142, -14, 13, -80, -3, 65, -14, -98, -19, 40, -37, -57, 124, 120, -87, 68, 55, -29, 29, -41, 114, 63, -12, 103, -142, 74, 67, -103, -44, 37, 37, -3, -91, 54, 12, 182, -42, 9, 56, -106, 60, -143, 117, -47, -2, 9, 0, 38, -26, 12, 59, 21, 93, -11, 39, 13, -81, -18, -32]
6893c2l7P1n1Q5j14L6N1o3J32o5q0J47j09J42j32K5N7j06Q2kl5Oj9q4J88l7j24
6920f8J93l4j27%J11q4L9oJ4L6o5M8r2Q1m2Q3k0j15J17m8j55K85j65M2p9L4J28
6947A11q6pLM4Rj37J16j05J27qj36L5k5J25j8K7j6Mr9L0L7k8k2J65j79l1K1N5
6975A2j71K22m0j11J59j4p9J8JQ1j01n4J2J53j62P9J8OJ43j34P2j07q3R3J9l7
7001em1Q8Q4k51J04M2m7J83j55m2K5m6R2j70J72j17K03k2k45K19r9pP8o3J00p4
7027Fn%jJ38k94K66L9j33N6j21J00j10J73j7j12J83k53J92j61qJ1j7K4OJ10m6
7053B6o8N4o1jR1j56J74n0k6%L1q5J18r4P3K6j68O2M5J67j12l6m2K5K6p4l1m1
7081a27K00L9j21J45N6k18m9j5M5M5J7j19J87j23o6J06n2J3M4K7K8m8K6p4n7M9
$$ y = [-32, -69, 2, -49, 36, -78, -42, 9, -54, 78, 13, -67, 80, -29, 113, -19, 6, 63, -43, 39, 37, 2, 8, -11, -95, 93, 56, -68, 125, 91, -36, -36, 75, -9, 30, 24, 38, 74, 9, 57, -35, 46, 4, 87, 67, -48, 69, 21, -134, 151, -14, 28, -51, -17, 111, 25, 18, 21, 65, 74, -63, 53, -52, 75, 67, -69, -34, -59, 66, 48, 75, 59, 63, -36, -6, 31, 3, -19, 146, -33, -64, -43, 12, -159, 63, 23, -88, 71, 57, -22, -4, -3, 78, -23, -77, -65, 88, -74, 5, 23, 29, 172, 38, 110, 3, -80, 13, 32, -5, -46, 42, 126, -125, -21, 21, -26, 157, 2, -40, -15, -61, 31, -139, 33, -84, 119, 97, -148, 71, -28, -35, 43, -20, 80, 6, 1, 1, 0, 138, -156, 110, 149, 16, 72, -49, 51, -59, 114, 97, -15, 168, -85, 107, -54, -62, -51, -68, -44, -38, 72, 26, -42, 12, -49, -50, 41, -115, 59, 9, -17, -17, 14, -71, 47, -47, 26, 52, -116, -54, -9, 158, 46, 10, -32, -7, 19, -55, -86, -127, 73, 112, -9, 136, 192, -26, -75, -90, -45, 0, 17, -102, 85, -38, -104, 2, -50, -37, 7, 34, 62, 14, 40, -34, -91, -42]
7107d2O8j30K04lp4j19o0J99J5m3%r2J25k4p2K4n6J11J8j20L9l9J54l2Jk7m1J51
7135A35k31J14q3o6L6K5o2K09n2Mn2N5J1n6Q9j30J3m5J22j5l7Q6Lk64K98j35J78
7162A50o7j80PO5L9o9Q1O3j19M2K2l4J60j93PN0M9l5r0J07p8p5K7Q9l2j25K13
7189G4m7r8ln3J88J7n9o4J48k03K39j20l3j00P1M8o0J18j26M2J57j51P8j27J35
7214G1K3p8J5L6m4P0j7j4j32OJ9M8J9k6KO3n4LORp8J8j7J10L6o6J00j10p2J46
7244I2j40MM7j7N0l5q3k2M8M7j27J73m5j24J63l1L4m6o7J98j72Q6Q1j26M4m9r7
7271a14J0J7J98j7j20m6J15L0j14J82q7k1M1m6M6p7J8P8m0M2j07j02J13Q7n8j49
7297a21J79j99N5Q1J22o8M2l7l5M2q8M5r4J87j63N6Mkj6N0p9j6M5O6mN0k08J32
$$ y = [-42, 26, -104, 100, 97, 23, -96, -156, 43, 58, 15, 15, -77, 48, 24, -48, -24, -80, 31, 49, -71, -32, -71, 83, 51, 52, 25, -16, 135, -96, 18, -65, -131, -95, -70, -132, 77, 25, 29, -23, 32, 43, -13, 76, -54, -41, -86, 36, 21, -16, 70, 73, -191, 107, -28, 150, 83, -97, -90, -25, 14, -55, 26, 89, -30, 12, 34, 0, 160, -33, -26, 24, 73, 38, -52, 55, -23, -98, -71, 18, -14, -139, 74, 27, -71, -74, -127, 61, 78, 19, -45, 103, -100, 139, 19, -14, -114, -43, 5, -55, 63, -63, -21, 136, -15, 63, -64, 71, 94, 16, 31, 67, 23, 93, 76, 62, -70, -64, -45, 3, 22, -4, -2, 61, 7, 10, 16, 25, -53, -35, -52, 58, 94, 28, 128, 18, -54, 92, -48, -44, 3, -14, 36, 1, -82, -104, -56, -9, -136, 37, -8, -132, 31, 0, 34, -12, -79, 119, -53, 33, 114, -12, 32, -17, -114, -104, -87, 111, 94, -26, -72, 43, 73, -41, 141, 54, 33, 74, 28, 74, -3, 15, 93, 53, 95, -12, -114, -1, 86, 28, -121, 58, -141, -86, -5, 117, 49, 91, 54, 19, 61, -27, 18, -76, 111, -52, 4, 8, 6, -10, 40, -39, -55, -10, 56, 52, 102, -106, 26]
7325B6j54J52J44j03r2J5j1N7N2j59N0l1J79j39o0J32k22M4J18k6P9j05J2Q2K9
7350F9m9p1j8R9k3J12O6k06L6j40J5J64r4K4lO9j06M7j8Q7q9MJ50k33J42L5q0
7377a1J3M5j38J54l3jp1O8l4q8J39j72J49kj23Q2j0O2j0QJ0k06K72r8O3M3r3J18
7405A36j19k1L0l4R3k06lM1J91q5n0J85r3j33J47o8j44L8P9N7q4nP6K5r1M6n4
7432d6R1P7o8j45J84j66J12l9o8J4J00J10j47m4J5J94k38J08o9l0n4J24R6j85
7456g4J85j17J93j06j04Q7kpk3j77J93p5pM3m2O3L4p6K5j04QP4r1J59o2M4o0P7
7484E8j38P4l1J49m9j10R2l6j7J6Q7k09J77m4j79J45QN9l5l6J35j31P0r1P1j06
7510g1J27O4k72J70L5k7J3o9l0P6j37P0R4j27LR5p3kN5K7n6l4O6j4r4J52j27J01
$$ y = [26, -128, 24, 168, 65, -27, -12, -23, 34, 86, -73, -23, -54, 125, -14, -74, 58, -164, -120, -2, -28, 51, -54, -42, 40, 69, 20, -51, -69, 30, 7, 119, 185, -21, 15, -125, -110, 54, -40, -16, -19, 50, -56, -9, -27, 60, -29, -25, 125, -108, 34, 69, -11, 2, 47, -91, 63, 30, 29, -42, 26, -8, -96, 43, -129, 20, 18, -105, -23, -33, 29, 19, 27, 37, -169, 103, 5, 68, 111, 18, 136, 17, -4, 26, -8, 85, -121, -124, -83, 108, 23, -27, 158, 65, -68, 79, 11, -133, -95, -16, 41, -43, -48, 28, 53, -38, 8, -46, 45, 122, 54, -91, 93, -73, 39, 0, -68, -54, 46, 156, 9, -35, -20, 174, -64, 44, -25, -55, -109, 15, 111, -74, 111, -6, 187, 81, -23, 64, 62, 55, 32, -145, 48, -27, -34, 9, -33, 30, 64, -12, 13, -91, -83, -9, -100, 59, -3, 41, -19, 58, -80, -6, -37, 112, 63, -47, 45, 9, -8, 8, 95, -114, 63, 19, -160, -15, -7, 52, 17, -19, 116, -15, 55, -36, 35, -71, 56, 120, -152, 18, 53, 26, 39, -30, -60, 16, -121, -51, 43, -84, -81, 14, -59, -61, -6, 21, -35, -69, -3, -17, -111, 41, -86, 15]
7538A5m1j8mP7P0j40q6J27k1M6K4m2J7L1j31J61j26J33j36N2j00J04j8j11J04
7563a3n2MQ4Llj22J46m2o8k6J39J6nj42Q7J69j53m3K6Q2q8Q2n9JQO4j71J38M7
7592A09j39J8n3J8%K3l2R8J13j79r8J35n2N0LJ75j77Q8l1n5n6J41k35O3M2K06
7618A75j51j6O6j33J46j66J84n9j05K3J1J48n5k35K74k01N9J63j60j17J82j75
7640a42J67J35j75m7lj1j0K83k70O6q9R2R4k72J75J6M6J4j79M0q3K00J25j58P4
7665H8j82J69l1j14J06k1k3K1k6k9ol8N7p7qK53j94J38lq6L0jo4p1K24j46J4J47
7693A27j49L4K9m9l1n6K1J60n1N2k5Rr2M7K3j68J20m1J04k9j60K08k1J11k32J32
7719G3j4q4OP2j33J13j11LK29k23O3m1K5J17Lj99J79q9k4m2O1q8J03Jn8J45k00
$$ y = [15, -26, -44, -48, 29, 99, -41, -127, 0, -21, 25, 49, 7, 24, 55, -76, 85, -41, 92, -44, 8, -92, 12, -6, -117, -13, -65, -61, 23, 26, 23, -99, 47, 5, -63, -89, 50, 66, 61, -81, 6, 175, 22, -21, 5, 87, -1, 81, 22, 23, 31, 95, -76, 62, 109, -30, -12, -65, -47, -47, -24, -56, 42, 155, -24, -122, 13, -39, 11, 14, 189, 12, 100, 69, 14, -42, 99, -136, -73, -31, 175, 24, 8, 74, -59, 87, -79, 105, 46, -59, -36, -25, 123, 68, -167, 107, -94, -35, 128, -32, -149, 33, -142, 25, 160, -15, -62, -65, -76, -86, 197, -73, -7, -96, -4, 90, -182, -7, 9, 55, 69, -110, -70, -153, 47, 172, 14, 88, -94, 75, 44, -70, 36, 15, -8, 13, -13, -42, -48, -86, -29, -106, -114, 139, -55, 83, 80, -6, 24, 23, -41, -112, 112, -34, -20, 127, -22, 12, 41, -8, -39, -95, -74, 86, 35, 87, 62, 71, -21, 26, 49, -119, 1, -40, 64, 35, -125, 83, 62, 173, -59, 73, 59, -25, -19, 53, -80, 33, -78, -75, 154, -69, -6, -47, -22, 95, 98, -101, 78, -11, -35, -77, -16, -104, -1, 0, -58, 87, -113]
7746a13P9j79L30Jj11J91j50o2J31j62K9j5P4R7j32P9j53L3P8N4P0k35L3K2N0
7771C9Nn2O2J09k21R5Lj29J09m9J03j70J42P3j12j4qj4Pn8J36j01Q0n0J98j28
7797E5L3j06p9J09L3M1j58O1N0q1m5J68o7p7R6q5M8J4p2O0Q5j23m1P6j17J56l1
7824CnN3Qp7n9J42m7M2k12O4J06J29j63K2j09J58j74N4J3j2J6j2q0J73j7l4J47
7851A29n4m0J0p2oO4O6j24oQ3m5m7k4k2O7r1J07P9j22j1KL3n7q3K60j32N4Jp3
7880e4J52p0k1j40J12P4q0J01j6o0jn0P6j16L9R9m4o2J49r2k6j4j69K64k00M0
7906a09M9JJ04O4lj51j13J67q5Q1Mj03J50r4M7o7J14k6J2l3q1J68p6q0ON3p5J09
7934C3l9J0J1o1J7K5K0j18J48j13J28k07K07J8n1n6j7J64q1j04pL1J27j50R5j2
$$ y = [-113, -34, -213, 117, 118, 7, 198, 48, -14, 117, -45, -16, -31, 43, 140, 8, 87, -66, -33, 45, 99, 169, -66, -33, -11, 39, 44, -8, 54, 163, -58, 37, 40, -89, 20, -29, 74, -96, 46, 119, 7, -7, -15, -29, -22, -80, 56, -45, 35, -15, 183, 55, 88, -18, -97, 12, 45, 86, -72, -11, 39, -42, -87, 81, 14, -63, 33, -52, -4, 10, -62, -2, 83, -40, -81, -5, -122, 34, 3, -2, 51, 59, -18, -77, 65, 18, 60, -152, -88, 18, 147, -16, 6, -103, 55, -119, -65, -52, -64, -48, -60, -140, 33, 16, -18, 129, 75, 35, 45, -27, -33, 31, 97, -27, -33, 50, 5, -42, -66, -88, -21, -112, -5, 74, -48, -59, -57, -24, -81, -164, 96, -36, 18, 19, -54, 98, 28, 7, -133, -21, 53, -27, 74, 58, -2, -3, -53, 23, -93, -54, 45, 1, -61, 88, -4, -30, -44, -213, 51, -149, -109, -60, -59, 45, 109, 106, -45, -158, 9, -76, 5, 9, -94, 56, -38, 9, -58, 56, 30, 42, 9, -72, 96, 20, -60, -54, -1, -76, 33, -6, 4, 15, -46, -29, -4, 16, -102, 46, -67, 61, -146, 61, 79, 28, -28, -45, 119, 38, -66, -73, -42, 85, -65, 30, 18]
7960A8m2l1J41j06J35j04j05nO2J70j02M4j16K6r0J87K0j2r7L6n8m5J60k55J83
7985A4J5L7j2j9k9J0n7j1q7J84j08q9K76o0j18P2l5k9K6Ko0K5J07p4Nq2J13k3
8013gP7Q9j50L3J3j9r6K1n2J34m0P3k29Q5M3J12J8j19o7J23o2j2RO6j36O1O9j22
8041h5L7O6np2K5m7J09j8nj20J54j01kR0k8J0rR0K3r8r9K1J52j5l7l6K2N9q7%
8071fM4R3Qj27l9J87k28O2q2R9kq4J17j37J05po5R4J9j85K43p6K5L6o7J7q5M5
8099Dj45J11K0j18K10j26J60j04OJ27k20Q9kj07K19j69O1K1nO7j09P5j46J63j35
8124e3O1j30J25k6KN0m1R0n5jq1J39j04J54Kj71RP2j4M7j36K2M1K03j95m1N5J3
8152C7j2J0j12P3R2j31MK0K5J37k72O7J24j31R2o7K5O1j32P8J28j72M1N3k9o5
$$ y = [18, -24, -55, 86, -20, 115, 11, -94, -99, -37, 133, 31, 75, -41, -15, -105, 82, 102, 90, -7, 29, -29, -74, 86, -169, 14, 29, 66, 54, 35, 6, 16, -41, -52, -139, 45, -63, -152, 124, 64, -54, 18, -17, -46, -20, -18, -78, -53, 54, -20, -15, -97, 16, -7, 70, 159, 9, 42, 55, 36, -60, -39, -91, 43, 3, 76, -153, -68, -25, 87, 105, -14, -81, 42, -20, -32, -23, 43, -93, -32, 37, -85, -48, 18, 13, -59, -34, -81, 28, 10, 5, -115, 39, -62, -64, 26, -2, 8, -1, 89, 112, 14, -85, -64, 88, 73, 36, 0, 22, 81, -6, -6, 38, 131, 139, 12, -27, 160, -68, -6, -88, 11, 9, -75, 42, -95, 10, 3, -62, 32, 51, -134, 109, 33, 58, 94, 27, 44, -41, 4, -141, -30, -10, -128, 82, -44, 116, 12, 18, 145, -75, 14, 12, -95, 124, -45, 16, 37, 32, 99, -10, 65, -81, 82, -53, 8, -122, 3, -23, -21, 29, -12, 78, 23, 22, -59, 80, -24, 130, 132, -39, -30, 42, 28, 75, -61, -39, 2, 205, 10, -31, 24, 37, 25, 35, -77, -4, 88, -43, -39, -19, 6, 143, -129, -62, 62, -69, 23, -44, -19, 42, -90, -12, 116, -56, -15, 38, 9, -56]
8178e6N1P7L3j66J34m0j07J59j8j52N1L4J1
$$ y = [-56, -5, 72, 105, -61, 73, 33, -74, 85, 67, -85, -34, 0, 11]
8191A1
$$ Imaginary data points
##PAGE= N=2
##DATA TABLE= (X++(I..I)), XYDATA
0@%%%%%qJ6j6J6j6K4l4M2n6P0p8R4j18J36j60J92k24K56k96L44l93M48n12N79
29C06o52P37q32R33j043J165j296J443j605J782j976K187k421K680k966L285l643
46a916M044m495N014n614O314p149Q159r411J1013j3144J6131k0644K8318m4681
60b8061J34327r4437r6569K57839k56610M3418J26359j70349J02843N2148j54482
71h3574J49359l1989j33054J58370m7021j01637J56821p7711l0534Q6012r6241
82e1199M9421K3528r4310J10165j2322r1343J00535m283j02627Q5789K0021r9565
94f6190R3845n76q7092J15889o8945m6698J43534j18814o210J50136j42627j764
106c5512J27624j40326J2681J01596j20095O6930M2674j11952J23007n0462q7373
$$ y = [0, 0, 0, 0, 0, 0, -8, 8, -8, 8, -8, 16, -18, 24, -32, 38, -40, 54, -64, 72, -88, 104, -120, 136, -160, 184, -209, 239, -273, 306, -346, 391, -441, 492, -551, 614, -682, 761, -844, 938, -1038, 1149, -1272, 1408, -1558, 1727, -1916, 2128, -2367, 2647, -2967, 3347, -3802, 4357, -5054, 5959, -7185, 8946, -11698, 16620, -28061, 106266, 11829, -84740, 173099, -83511, -40093, 86266, -84083, 18760, 70908, -83574, 65785, 33796, -99258, 59112, 12091, -89546, 67275, -10436, -40970, 45042, -51199, -1778, 21750, -72560, 37605, 25283, -66060, 34475, 30192, -72435, 13354, 33375, -66190, 27655, 27079, -60013, 55876, -13069, -59767, 83767, -35047, -41257, 108879, -33748, -35512, 92112, -48214, -35533, 66063, -54032, 12898, 55572, -56380, 66627, 16165, -71208]
117g1208J53832j13037k2538J28953j24693M0674N1993j03417Q6600j4238p4908
128f1987J19776n1749p0542J30260p7292o0240J25372q3430j0447R2178q1654
139b9755L7371K8431p4236N3957m852m9215M6238J1734l7470K0786K8368m6328
151a4971R387K2737l4647K5584m539o367L2770l9381Q544K7439m9358J2043L0705
164A9946m0041J5833K8795m3531L3835K681n1915O9660m1085l9008R2834p6157
176b8153l915P7374p7874K9005L4297n6475M0830n620l6310M4218k2035k3776
188b8434N1796k9368j1858M7163m1481J1937J8575m1446M2298j9170k0569N1236
200C0679m2606K213L1590l5009J0586J0582j1605M627M898m767k35O838j5605
$$ y = [-71208, 82624, -30413, -52951, 76002, -48691, -8017, 43976, -59441, 27159, 12921, -61987, 57789, 6040, -64502, 65758, -11534, -71774, 53598, -29832, -40279, 51899, -29755, 7616, 36047, -38189, 15768, 10916, -38299, 7939, 19673, -17797, 2989, 31357, -14971, -5584, 17153, -17494, 8090, 3551, -2816, 29954, -9427, -883, 26556, -22802, -10759, 19946, -20095, -4262, 24533, -18998, 14837, 17518, -34397, 35263, -5822, -44830, 48004, -28153, -32068, 45306, -32568, -3563, 30734, -25741, 15089, 9469, -26841, 17377, -4658, -28434, 23362, -6006, -17864, 29299, -12182, -245, 18330, -23116, 19182, 12, -20557, 30679, -11927, -9714, 21876, -13133, -2547, 8035, -3570, 1057, 5955, 1188, 953, 7791, -7814]
213g814P606O195k0358J6609K253j1977Q877L443m945m610J1524j0073o16J0307
227F421j8277J9337r490j1868L0989l0738J0320J9319l1796K7342n540j6977K5726
240A4768k1463l192K0097k0526K719K2699k1266N318K0819l1899J6442M697l0356
253b1143L4074j7644q251L3737l2419J3524J1458k7563K0900o400q928J5442q092
266a305j246Q791o957n483J1831j0599k048J6225j6914J0277N547j5673J5761
279H207j0181k422Q252j0449P686k949K571R29l177Q905j1990Q312m94j1567J5703
294G336j2795J902J0251j3393J0264J30p081O072j030n656L955M448j1969J2832
308E266j462j3997K1793j7938L3J8217k5265J8923J557j7646K2365j3757m351
$$ y = [-7814, -208, 5987, -14371, 2238, 4491, -7486, 1391, 4834, -111, -4721, 6803, -3270, -3886, 6421, -11856, 7481, -2009, -13877, 17112, -13626, -3306, 16013, -15783, 11559, 6019, -10958, 14768, -6695, -9887, 10210, -10316, -7597, 15102, -6164, -846, 19973, -11926, 4516, 9213, -21143, 12931, -4713, -12964, 20773, -11646, 1878, 13336, -14227, 6673, 273, -8655, 6787, -1305, -2551, 6240, -717, -6200, 5631, -4968, -7016, 9209, -7705, 2572, 8119, -7554, 8207, -1974, -4396, 3856, -6593, 1093, -1856, 715, 1644, -1533, 7372, -4618, 3694, 3200, -8367, 7336, -5459, -3557, 6694, -6699, 3565, 3695, -3386, 2686, 1656, -4000, -45, 4403, -7566, 5266, 3804, -10193, 11600, -6338, -6305, 11912, -13353, 5570, 7127, -10519, 11846, -1911, -6262]
321f262J2637j2472K468P964o425L51J0250j1955K076R893k0207J4736P39j5480
335a1687K2864j3234j742J3749j7188Q452O68p246P110j141m39k77M819p060N96
350a756O608j3262J0893p39q091J4479j0208J560N754r944M801m03j141p35N257
365C073j837m469J1504j3391L461P929j7813J6953m311q586J8101j3969K077P413
379F135j1626M717K540m847J776O549q327L202P121j6335J3440k042j2784K0806
393A0325j4466R46J2987j7747J0369M25q882Q824k702k206L114K252o237M554
407A556K371j1091J2172o265m841J3404j3279O922M200r935R446m405j735K094
421F14j782L5j628O220o802M809L632j1180J2256p579m124J2044j2231O612L312
$$ y = [-6262, 6375, -6097, -3629, 4335, -2090, -1739, 8511, -3444, -1368, 8525, -11682, 3054, 3793, -11687, 11177, -2057, -3799, 9950, -7238, 1214, 1882, -5364, 1746, 605, 166, -111, 4708, -2352, -1756, 4852, -8410, 2483, 1744, -6347, 8132, -2076, -516, 5238, -4706, 95, -308, -1449, -2184, 3073, 1236, -3233, 8271, -5120, -1659, 6270, -11543, 5410, 1099, -7487, 10614, -3355, -1278, 6135, -5491, -774, 1766, -3081, -1305, 5244, -3083, 119, 7240, -9095, 4345, 2303, -10481, 10325, -4141, -3195, 9792, -7955, 2414, 2839, -6043, 2781, 79, -2127, 987, 3239, -2998, 1556, 3927, -7164, 5008, -1257, -6098, 7306, -5973, 949, 5149, -4786, 4660, 255, -1480, 614, -1168, -1133, -2761, 3459, -3343, 1466, 5098, -6082, 6174, -1405, -5529, 6515, -5716, 896, 4208]
436D208p707O100k264k895Q12K858l978L183O147j0771J0263l710j0444J4549
450F351j3655L183J0299j2753J2282j454o432O991o534j442J973N67k261N075
464B190J220o981R324p980k080R527j2080R373J269p398R992q016M0J832m028
479c796L299j329M631l211K497J786q105Q633o963q29P922r977P022q1n094O023
495B428l327J414P87J179k189l30K429q735P466k419m662J3346j0476M731N036
510F678j2568R948n471l016Q068n877K925J224k411j341J374%k734Q099m876J282
526A304N124j1739P209m230m565J0085o504N554J845m104L202n811K340k508R98
541a800M717m800P392n524k027L744q776O299M71m61O502l042J004l083j722k920
$$ y = [4208, -3499, 2601, 337, -2558, -1746, 1112, -2866, 317, 6464, -4307, 5956, 2246, -8198, 6351, -7304, -4121, 6178, -6575, 5707, 4253, -2179, 4812, -1722, -3164, -1191, -624, -2885, 2190, 3410, -3571, 5753, -2227, -4307, 5220, -6860, 2513, 3782, -3616, 6376, -1640, -1600, 232, -3796, -497, -1826, 2805, -406, 2091, 3877, -4228, 4405, -2558, -3387, 4535, -5442, 1580, 1499, -3595, 2428, -899, 515, 1302, 2481, 292, -38, 2391, -6344, 1122, -1297, -5959, 7387, -3089, 1642, 6678, -5890, 4058, -1413, -4429, 3639, -2238, 687, 1911, -500, -1841, -467, -467, -3201, 4898, 22, 1304, 6428, -5311, 1898, -2332, -6897, 3188, -3316, 2238, 4083, -21, 3181, -2630, -290, -2798, -1800, 2917, -1883, 5509, -15, -2042, 1702, -7074, -775, -304, -765, 5737, 2695, 3699, 616, -1106, -4026]
557d026q55M195m104Q920j148l587R116j2407M168K048j0163J1725n547r19O927
572D343p890L856O34j900K019R26m14k631L404n563J137L309n835Q745l703j212
588g75N614r643O016k274k149P702n891N142j981l951K888o530M709o81R08N876
604D980m088M073l089l806J445l788K207J0L454q81K32L349p755O134k465l733
620c721R834r286M803J548r785R046o500J080O769n608O674j708l120J930m206
635b250p05N62J941j935M914K69m734P170p821R67M933r257R744l327l091P633
651E013q810M802j125l376O441n724L964P11k932L741k874J062j476l4m52j715
667b784K793l070M635l64q62N379o612L662k878m717O278q274O775K211o049J1505
$$ y = [-4026, -4881, -686, -4790, 4130, 2982, -605, 8511, -3896, 272, 2320, -7843, 3882, -1665, -2584, 4343, -3547, 309, 943, -957, 1062, 1988, 1574, -1057, 2347, -3216, -2079, 1230, -4605, 4140, 437, -775, 4839, -4804, 1212, -1062, -3211, 4491, -1400, 3742, 1761, -2190, 698, -5832, -1123, -1804, -896, 4980, 892, 4965, 1876, -1930, -485, -4273, -2066, -2056, 1398, 517, 749, 4098, -3657, 2477, 12, -3721, 6113, -3173, 1630, 3178, -6607, 2439, -4061, -2981, 3788, -1820, 4854, 3146, 26, 1956, -2250, -2955, -2393, -452, -2387, 2527, 2796, -1938, 5232, -2589, -1622, 3311, -5946, 3798, 471, -2620, 5013, -3797, 1005, -120, -3496, 2945, -2779, 1185, 1896, -1036, 2705, -169, 893, -583, -617, -1069, -2784, 9, -3061, 1574, 1210, 348, 5727, -885, 2777, -101, -4818, 1460, -6814, -39, 2172, -3877, 7628]
683G628p452q8M661r314N182j328k848M600j305j59J600L36l520L865j359l563
699c064P259p183L487L139r174J0329o303k477R075j0595O818J035n341P611m892
714b76O25J510l705J227j147J102r80K543j02q61K938m327L319k258j685N296
730C219p018N516j166m520P466p959N053K215n880R384o447o1L240q240M767j531
746a962j531N562j107L53J841j419l983L474l207k075P876p507M830L209r693
761e339J0165o391k311R109r798O681P33o173O986n154m1K790l114J817L98l86
777b8q19K393k072M71L298n386M813k785l422N423o995N228J191l435Q368o853
793f10K314P82p448O014m732J501M483m032N266j866k300J502k367p7J151J343
$$ y = [7628, 176, 88, 4749, -4565, 617, -711, -3559, 1041, -264, -423, 1177, 1513, -2007, 1858, 499, -3064, 4195, -2988, 499, 3638, -5536, 4793, -1510, -3987, 5088, -5507, 1311, 2346, -2995, 4616, -276, 349, 1859, -1846, -619, -1766, -664, -1644, 899, 797, -64, 2874, -1453, 1866, -392, -2077, 3219, -3799, 1717, 551, -3969, 3497, -4462, 591, 2806, -3074, 6310, -137, -198, 3042, -5198, -431, -1962, -3493, 2069, 962, 1315, 3156, 1737, -2246, 1228, -1979, -4054, 3822, -3685, 1145, 4354, -5339, 4826, -1565, -3876, 5233, -4565, 2116, 2849, -3324, 3662, -1492, -1533, 1257, -1857, -40, 358, -28, -847, 1546, -526, -55, 3243, -2143, 2670, -115, -3537, 1886, -5109, 119, 1310, -2125, 6243, -610, 1704, 2486, -4962, 1052, -3680, -2179, 2304, -1728, 3538, 1672, -628, 874, -1493, -1570, -419, 924]
809I24j511L404k251k850N028p726M391L348p561J0776n319k135O739j0465N621
824D13j00n152Q312l962L94K827l697O52M33r19l0K701k839J507K018o658N961
841A861k453l032P699o819M302J041n582O859o078J322K493m687M992l253R13
856d22K051l643L740j323l68J286j076m77j278J871k491K423N28j971N327n992
872a815K432J672p304P813m623j32O567p967O168j408n405O775n035O56L551k108
888a63R38R83j356j582K096l447J280L197n400O892k041l537O616p583L062R39
904H94n115P333m816J277L511m987L585k072l62J126j835K275j379J216m38l9
920A74O97k592K804k608J187J289k706M725m222J715K110o620O341l690r29N356
$$ y = [924, -587, 2817, 566, -2284, 2744, -4982, -591, 2757, -4804, 5972, 653, -1482, 5257, -5208, 413, 313, -4839, 3473, -489, -95, 2732, -965, -313, 120, -799, -829, 1872, -967, 540, 2558, -4100, 1861, -592, -3624, 4075, -2744, 1558, 2599, -2983, 3876, -2202, -880, 1613, -3074, 1918, -1335, -422, 1629, -2014, 1726, 403, 35, 1321, 245, -232, -1510, 361, -2130, 293, 821, -1150, 4177, -1815, 617, 2289, -5015, 2798, -1825, -1957, 4610, -3357, 2811, 1403, -4002, 2773, -2262, -1606, 1945, -163, 775, 1758, 402, -1180, 916, -2531, -1251, 1946, -3454, 3438, 1397, -2140, 4476, -3107, -45, 894, -4221, 3112, -1704, -427, 3084, -1903, 1682, -390, -752, 374, -1461, 814, -565, 651, 213, 174, 871, -1721, 1083, -1525, -338, 951, -1755, 2970, -1252, 463, 2573, -4047, 2294, -1396, -2325, 3031]
936C031n905N279j190k908M628m628R96Q53j375J280K94N66j109J797k426K55
952e62K214n327N849j977k664O793o894L491Q24n430O348m531R83L172m238L525
968A576j441k21N13j130Q99j244J670j396J092J065k935L768l481P34J914m272
984b889M925l023O11L156m999M519k709j124L196m469M024j333q61L415l380K001
1000A060q75j152Q98j078J511j104K239j191l47K182m944M004j845k150O035n499
1016b256L757Q71m700N098m741N56K224l337L896q54K11O79j236%j575J801k321
1033a927J847J291k784M641l813L39K327n081M615k200m59L790m318L562j744
1048H6j566K737l393K942j118j5J803k443K427k054N74L14j661K473k544K245
$$ y = [3031, -2874, 2405, 1215, -1693, 2935, -1693, -697, 156, -1219, 61, 355, 921, -188, 1609, -817, -562, 1652, -3675, 2174, 197, -2467, 4326, -2568, 923, 1747, -3683, 2665, -1866, -883, 2289, -1949, 1576, 135, -86, 427, -703, 196, -1048, 622, -774, 318, 1383, -1552, 2216, -1265, -531, 1383, -2889, 2036, -987, -376, 2780, -2219, 2300, -409, -1533, 1663, -2806, 1218, -115, -976, 2439, -941, 1060, 185, -967, -69, -1147, 364, -740, 1499, 308, -39, 2143, -2801, 1203, -642, -2792, 3243, -2256, 1501, 2372, -2328, 2770, -1971, -1415, 809, -2528, 1368, 514, 725, 1404, 168, 168, -1407, 394, -1927, -80, 1211, -1573, 3068, -745, -406, 1921, -3160, 1455, -745, -1204, 2586, -1732, 1830, 86, -1480, 1257, -2136, 806, -312, -327, 1476, -967, 1460, -594, -20, 294, -1367, 1106, -1438, 807]
1064H07o03j174L246l902L066q94k324M168n131L036N93l348N247l711J314J377
1080A767l410K585j808K81N57l0Q70j067K104l086J105L25l024M880l136J285
1096A98K863n140M297l016j543L532l972L604j90o15K371k883J264j778P4N70
1112c64j121K969k108J826l02k192K694l547K404J34j630L741l558K266p00k575
1128b063L585l959K714O91k398M195l547J219M67k641K711k197J050K07k54R35
1144G15j465K114k246J321N34l251M438l605Q12K519m649M902k474q84L512m410
1160b117L017p58j168K197j655J392r72K53l61j069J871k372K564k98j288L535
1176B771l865K006m96k790L477l284K438P11j831L590l417J500l84k427L075k808
$$ y = [807, 204, -970, 2276, -1626, 1440, 546, -1778, 2390, -2741, 295, 888, -2460, 2787, -924, 390, 1767, -1643, 942, -866, -585, -28, -58, 812, -255, 1849, -1237, -132, 193, -2831, 2049, -1087, 198, 3061, -2079, 2218, -798, -2341, 1191, -2781, 823, 633, 18, 2389, -494, 770, -1008, -934, -364, -1485, 1484, -624, 1202, 900, -1292, 1402, -2145, 259, 393, -1237, 2504, -1054, 1212, 512, -2063, 1522, -2437, 277, 968, -1430, 2765, -782, 437, 904, -1737, 974, -1223, -173, 34, -220, 715, -750, 1364, -882, 439, 973, -2278, 2160, -1445, -633, 1886, -2763, 2139, -335, -1219, 2293, -2117, 900, 142, -1026, 1171, -484, 908, -64, 189, -172, -1241, 630, -1742, 822, 524, -764, 2771, -1094, 912, 416, -2374, 1103, -2181, 257, 968, -863, 2727, -690, 810, 426, -2001, 1074, -1734]
1192a734J902O44j333K357k429J039j026k40J004j484K744j800J168O56l394L641
1208A715l678P25K448l880N201k196o23L130m773K397r31j289K577j538J468n95
1224A58L87l59q63J436k532K803r50q89L189m088K506n45k405L903l566K467O51
1241A303k512L369l213R23N59j934K610k101J373M6j288J879j911J697q73M6Q00
1258G73j922K215k522J093J021k461M238k975N27J948m663M002k332m26L488l379
1274a375L147j012j499J385k322J215m08J142M87nJ283k934J682k015r07L093
1290I57l212L975j21k188L730m763J446J4k465M032k142J624P47k273J863k620
1306a396Q99L17p40J915j066J508j663K22N6j917K834k285J689J121l012L700
$$ y = [-1734, 168, 812, -521, 1836, -593, 446, -580, -820, 184, -1300, 1444, -356, 812, 1468, -1926, 1715, -1963, -1238, 1210, -2670, 2531, 335, -288, 2842, -1931, 466, -465, -1754, 823, -715, 753, 158, 545, 186, -677, 759, -1773, 1030, 80, -809, 2380, -1708, 798, 253, -2152, 1751, -1815, 652, 1303, -1209, 2160, -1053, -130, 429, -1505, 1105, -996, 377, 423, -865, 1014, -897, 800, -73, -27, 773, -1149, 1066, -1456, -363, 658, -1803, 2435, -540, -13, 1935, -2728, 1274, -1058, -1484, 2004, -1375, 1772, 760, -739, 646, -1676, -461, -869, 273, 760, 755, 2038, -896, 786, -1229, -2136, 957, -2255, 1720, 1599, -589, 3141, -1622, -176, -162, -2627, 1405, -737, 887, 1634, -639, 1224, -1396, -497, -180, -920, 995, -71, 1437, -226, -4, 52, -1865, 969, -1316, 373, 1494, -1518, 2182]
1322B182l294L10K235l950M435k084n29K534l741K551p53q25K208j671J137q52
1338a07L8n03k35J463j904K875j372n96K364m360K850r62j484M462l775K633J09
1355A496l292L166l345J210J171j595K996j388M67m76j267N28j345J990j104J573
1371G85N39j774K381l423J066Q24k995M508k636R98K193m401L510k154j012K931
1387A340k981K561l88p72J265j673Q71q90O45m11J48J308k110K462j435o67K688
1404A961l844L005j024j872L831m077K554N91k635L525k941Q32O17k026K218j313
1420e98Q74J51j66M68j339J213j901J246L14j548L278k837J622O07l820L901k824
1437a359N06K569l431L726j861q56K213l209J950o33l02J326p78R12o92N08j032
$$ y = [2182, -1112, -802, 1433, -2517, 1918, -166, -695, 1839, -1902, 649, -104, -929, 1279, -392, 745, -107, -69, -572, -807, 656, -1248, 1627, 255, -341, 2023, -2337, 513, -449, -1933, 2529, -1246, 1387, 1496, -1796, 1370, -1975, -765, 406, -1189, 1807, 419, 886, 410, -857, -329, -1674, 316, -788, 785, 1324, -450, 1931, -1492, -426, 398, -2597, 1911, -725, 273, 2466, -1935, 1575, -579, -1591, 1340, -1641, 920, 532, -240, 1025, -648, 223, -667, -22, -433, -285, 1023, -1087, 1375, -60, -727, 1961, -1883, 1122, 98, -1774, 2057, -2020, 534, 1125, -1510, 2015, -926, -94, 523, -1503, 715, -598, 276, 427, 261, 729, -610, 603, -1298, -52, 262, -1286, 1992, -845, 777, 1384, -2436, 1465, -1359, -853, 1716, -1715, 2011, 150, -706, 1507, -1702, 248, -385, -687, 639, -139, 773, 81, 589, -443]
1454d43q4J081k315K888j318n13K798l841K912r77k011L767l976K396M53k327
1470a510L403k535Q45N17k021J870j334P64j23K62N01j100J589k099J091jj827
1487a708L211k674J684J135l455L780l055K77J990l451L426j356l41K346k752
1502i43J638p81p94R49o71J027n64J112j016L3Q95k581K683j605m09K969l624
1519a682L251r44k037L376l823J882N57k272L304k079P84N43j664J363j202N55
1535h8l36K85M90q83J728k006J319j1j973K887k893J459J203k903L703k612M09
1552b22J670l432K851j324l16J965k013J684o18l19K92q59P26r55J351o38K94
1569A37J287k574K535j780r11K810l672K999j72j680L350l283J374J51k307K550
$$ y = [-443, -527, 554, -1761, 1127, -191, -704, 2094, -1747, 1165, 188, -1823, 1944, -2032, 364, 817, -1510, 1893, -642, 203, 720, -1301, 569, -765, -1, -124, 138, 639, -461, 1128, -971, 120, 119, -1708, 1503, -1171, 513, 1648, -1807, 1973, -1082, -805, 1185, -2266, 1160, -196, -537, 1809, -943, 695, -86, -880, 69, -602, 425, -139, 973, -43, -10, 885, -1696, 987, -618, -1027, 1942, -1682, 1569, 625, -1412, 1964, -1859, 23, 580, -1692, 1612, -467, 317, 860, -804, 559, -643, -88, -424, -139, 351, -532, 1196, -810, 509, 498, -1475, 1412, -1481, -22, 1181, -1722, 1981, -631, -222, 1448, -1984, 867, -457, -773, 1192, -821, 863, 245, -74, 218, -641, 85, -870, 481, -157, 137, 1424, -1150, 1385, -395, -1306, 1504, -2168, 831, 659, -1021, 2329, -954, 420, 571, -1736, 814]
1585H14j680R96N61q62J167j159N18j021M54O7r01K309j994J522J70k287K793
1602A467k808R47J244k605L479k103K56J558l020K582j472l85J791j811J520n53
1618H7R7K52p84O46j309J612j163J33J580k448K679j507p82K493l154K185n08
1635A09j527L037k866J569M58j816K025j695O73R9o25R63q08J201j041L68K16
1652C40j400J894k008J229Q06j799K781k410N80R26k849K781j692J28J958k138
1668h73K186j313m98R08j518J071m00O43J61l14Q87j572J265j276k41J718k126
1685a292K525p69q68K079l090J872n77j538K749j968J531K43j286J281j420M66
1701f2k76j84P79q30J304j186P70K8j278K002j943R07P07k114K739k003M00J266
$$ y = [814, -866, 130, 691, -171, 996, -163, 355, -666, -212, -145, -1046, 1263, -731, 791, 961, -1326, 1467, -1341, -394, 850, -1755, 1724, -379, -123, 1435, -1585, 997, -475, -860, 931, -880, 640, 87, 184, 436, -348, 298, -1011, 601, -562, -429, 1151, -1297, 1382, -125, -907, 1586, -1568, 617, 109, -1418, 1619, -1247, 322, 780, -1036, 989, -706, -33, 66, -559, 404, -404, 797, -244, 124, 340, -1060, 834, -1174, 55, 861, -938, 1843, -567, 13, 939, -1910, 871, -821, -693, 1265, -873, 1313, 0, -498, 410, -1108, -37, -437, 206, 367, 53, 940, -632, 633, -643, -884, 834, -1292, 1233, 464, -404, 1675, -1415, 457, -120, -1658, 1091, -877, 654, 897, -389, 892, -528, -62, -338, -522, 257, -573, 731, -455, 315, 343, -935, 1067, -876, 31, 738, -1376, 1363, -640, -240, 1026]
1719A026k395K445j569o2J429j843J894j076K55O02j275R37r08L45j8l36J443
1736H94j283J473q88n40J516k771K243j059p31K612k468J979l08j514J927k153
1752a071J148J49r17J511j044R17p85j62L81j200J626j192J062M67j378K015k267
1769g40N55M53j971K570j526P12J318k244K068j485k46R28j560J720r33L58O10
1786E87j021P99r80P31j43l52J233j634J868j004o89J608k506K039p89o13K379
1803A513k443J739j78j347J865k032R14j13o74J178r31R21m11J42N14j238J324
1820G43j501N68M05j236K148j773R10N71k036K144j768M03J262j765K216j258
1836C3m0P92j725J009q86N29N23l96J231r02P53p47p89P95j735J896p51j55K046
$$ y = [1026, -1369, 1076, -493, -555, 874, -969, 925, -151, 104, 706, -569, 368, -540, -195, -213, -549, 894, -389, 1084, 196, -344, 1172, -1599, 644, -415, -1146, 1466, -1002, 977, 669, -845, 1082, -1071, 77, 226, -691, 820, -224, 693, -92, -254, 127, -1073, 553, -639, 423, 890, -488, 1527, -740, -185, 268, -1703, 867, -659, 53, 1371, -873, 1195, -290, -536, 392, -1168, 552, -381, -23, 587, -434, 365, -615, 116, -27, -379, 854, -780, 1088, 84, -605, 1003, -1503, 536, -253, -866, 1513, -930, 809, 631, -716, 1149, -883, 31, -82, -756, 422, -509, 412, 1, 143, 657, -581, 743, -758, -190, 215, -1021, 1127, -646, 264, 835, -1201, 943, -825, -422, 840, -925, 1291, 33, -7, 785, -940, 69, -817, -288, 235, -161, 1070, 168, 921, 174, -615, 180, -1555, 341, -410, -565, 1481]
1855A481k299J943q80j049J835k351J603kj012J685j575Q55k22p12R92p45Q85
1872D32n95M40J76j125J539j742Q01M09j545K164j634Q68O66j721K210j701OR38
1890E86j990K073j119J18R30j067J207q76L72Qo18J003j269J253p11k24R67j717
1908a074J695r45k74J768k060J975p37r45J572k183J157j9r56J970j203R75l5
1925F81p07M58j000O58o87L48L86o10J509j388P35P9j608J905j590Q10Q60j816
1943i77K226j525Q3N93j602J522p08K62Q37q66R92p92L45l61o05P96j318J443
1961C45n38R6J175j634J461q38o78J481k186J629k92p26J708j801J276M2j144
1978f24J242j125N88Pj45M02o18N16p70N17n9n67J497j479J104J73j320J641j909
$$ y = [1481, -818, 1125, 245, -804, 1031, -1320, 283, 281, -731, 954, -621, 234, 12, -700, 292, -453, 432, -163, 277, 453, -672, 867, -875, -74, 335, -1210, 954, -680, 188, 854, -867, 1343, -358, -352, 586, -1404, 669, -450, -332, 598, -469, 738, -138, 234, 242, -376, 627, -642, 611, -100, -324, 643, -1074, 621, -324, -598, 1170, -890, 1085, 348, -597, 975, -1208, -51, -70, -1026, 944, -259, 716, 681, -26, 432, -568, 90, -597, -249, 137, -473, 1036, -352, 383, 462, -1146, 759, -831, -21, 839, -977, 1249, -276, -193, 400, -1202, 320, -388, -126, 711, -155, 837, 45, 390, 29, -576, 220, -1098, 345, -193, -97, 1078, -556, 905, 67, -611, 870, -1316, 313, 21, -705, 1003, -798, 478, 520, -624, 618, -507, 81, 88, -57, 345, -273, 243, -527, -10, -69, -636, 861, -618, 486, 659, -661, 980, -929]
1997i29P13O63j807K157j201L44Q47j556J458r87K8N02p29J008p75N58l48m8L98
2016B96j229J537r38J24J134j651J642r35o05J366j989J413r3q28J745j470J230
2033G49k14r89R83j248N51k27N5M71l92J030p79L39j80q87J368j346R37L76j372
2052g75J932j884O81N34j646J846j115L27R08j226J165q11r0K52p59N61l44O96
2070B52j27K3N80j275J325j171k41J249j795J828p09l71J672k082J391m65q96
2087h12J426j325J060J5o77Q87q63M88n45P1L10m63J088q45P14J4r40J156j614
2106h55Q02J05j039J846j448Q60N73j535J599j362k2Q54j148J240m73P8L86o28
2124a67M53q24O71k83l7O42q91J238r27j00R04j770J715q33k80J559j794J290
$$ y = [-929, -216, 447, -1360, 797, -404, -60, 787, -769, 689, -298, -270, 232, -497, 511, -264, 294, -54, -102, 296, -933, 604, -334, -210, 924, -727, 915, -20, -625, 741, -1248, 165, 72, -756, 989, -481, 749, 535, -454, 529, -719, -168, -395, -340, 131, -261, 769, -10, 329, 149, -738, 630, -716, 221, 597, -775, 1157, -727, -46, 488, -1158, 688, -427, -100, 808, -418, 747, -64, -154, 98, -661, -100, -444, 252, 125, 148, 728, -547, 778, -393, -634, 615, -1180, 648, -61, -432, 1240, -842, 549, 84, -812, 614, -711, 349, 364, -313, 574, -289, 199, -346, -275, 35, -428, 660, -185, 529, 543, -397, 759, -855, -53, 52, -987, 859, -589, 271, 844, -691, 908, -454, -476, 378, -770, 470, -3, 75, 461, -167, 286, -538, 133, -150, -187, 455, -436, 802, -125, -225, 679, -1091, 624, -209, -489, 1070, -724, 566]
2142E66q3j128J286j376O69K05m70Q71p16N52m06L6R4n54Q51p69O63O3q10J201
2162G45j557Q94J28j201J765j209N52N69j362J527j300LP60j142J141m56Q7M43
2180C87l04M72r31N54o52K22M35q49J591j042J54Q65j857J406o41o06J483j568
2198h81J374J28q64J256j398L54j27l60O06n26Q39l04K85q6n69O80j220Q12jp23
2218g25J586j370R02K45j449J672j463L58M96j099J462p34R1N07r40P49n36O6
2236a82K73k90N39o38R18p00OM67j144J106p60R0J165j646J524p67m70J342j636
2255h03J204l57m22R98j065N16K8n03M50n04P96m74M99j80l67Q18j260O93j57
2274i0p45J555j366R01L36j178J399j252L25L92j316J421o21J96O21r24Q78q30
$$ y = [566, 483, -645, 641, -735, -66, 139, -331, 540, -176, 376, -30, 6, 100, -454, 397, -372, 291, 354, -456, 745, -812, 82, 210, -991, 774, -435, 117, 686, -676, 851, -449, -446, 314, -828, 313, -143, -56, 387, 83, 555, -376, 178, -474, -252, 183, -666, 925, -117, 37, 902, -955, 451, -190, -796, 687, -881, 493, 621, -243, 1013, -385, -31, -158, -518, 88, -438, 401, 97, 382, 296, -273, 407, -813, -1, -2, -725, 861, -509, 393, 638, -811, 861, -602, -244, 252, -847, 615, -119, -28, 479, -461, 288, -248, -182, 91, -199, 340, -298, 620, -80, -74, 393, -751, 355, -405, -315, 850, -796, 728, -39, -509, 833, -803, 401, 44, -378, 620, -445, 71, 99, -404, 46, -458, 338, -136, 363, 183, -184, 634, -626, 67, -90, -835, 720, -646, 255, 591, -587, 812, -440, -115, 277, -1039, 382, -239, -43, 578, -346, 532, -298]
2292b98K92j43k14M68n01R12n12J30M56j415J096r66J45J140j320J600n69m21
2310a20Q93j404P20l49m01R17o64O97r3r8L63n87L78o73M41j84l04J051j183Q95
2330B95kr41J369j343P70L66j156J563j266K95M44j137J018n37J58K24k23N81
2348D78m10K72m31K7N3o50Q73n92L61N95j166J243q00k03J025j506J214m96l36
2367d49J056j129O92j67l09N75o85P25k10J07K62n80L74p22L61j60m45J260j103
2386e47R50J34r05J248j357M13K62j036J528j012L09M67r34R28o46K10N4j64M26
2405C28n52M51m25Q7K56q85R18m60L25O77j070J204q98k01Q55j395R83n90j61
2424e53J181q68P89l05l97N64p94N46m53J57K01n11Q92p82M10J7o02J028j170
$$ y = [-298, -6, -149, -363, 105, -396, 516, 4, 134, 590, -825, 271, -695, -550, 590, -730, 870, 301, -120, 773, -631, 89, -260, -661, 256, -408, 289, 196, 98, 461, -126, 252, -421, 20, -164, -468, 583, -600, 295, 293, -648, 721, -622, 148, 514, -642, 921, -345, -50, 394, -743, 275, -262, -104, 120, -103, 478, 68, 340, -91, -64, -11, -661, 212, -380, -19, 576, -590, 653, -147, -350, 675, -831, 383, -113, -449, 607, -522, 170, 3, -306, 269, -416, 309, 99, 206, 468, -112, 262, -460, -99, -259, -704, 556, -547, 403, 537, -368, 880, -477, -64, 198, -838, 690, -322, -13, 454, -480, 448, -198, 12, 66, -98, 328, -224, 227, -198, -111, 145, -740, 178, -282, 43, 720, -350, 854, -44, -245, 610, -785, 198, -392, -553, 628, -240, 549, 244, -153, 411, -383, 163, -290, -133, 68, -443, 449, -333, 77, 94, -508, 520, -650]
2443f50Q76K63j101J463j379P26p2q74J219j099O63L88m93P20o73J91n2o84N27
2462d1n64O43k84K44O04p61R38q50j70N61j227J138m76n1R96j237J049m94l85
2481c67Q39r42P33k71k2L37o98N22m96K15J64l67Q73o24N74p1p60J079j427O54
2501e5pn36J111j099P65J28p24R53q76L69K17o71O34l73K88k47j80N53o52Q01
2521C99l74J26L81q72R85q75q6N70j120J218n14j84R78r20R79m87m01O07r18L77
2541a31k43j6O24l81N75m42K30kp27Q26p96O91l4n05J033j256N17J34q45J066
2561C18q85Q31K77p70J006j052Q1K24p96Q43n02M83J65j61M63o45N94p05L4M62
2581B65q54Q91n13N3P21r66J034o94j47P65j075R70n02j64O63q46N35l13j22L45
$$ y = [-650, 226, 489, -612, 851, -528, 198, 126, -748, 471, -628, 35, 423, -70, 650, -23, 168, 116, -568, -41, -605, 38, -246, -2, 602, -159, 779, -71, -241, 320, -907, 231, -245, -296, 700, -537, 512, 18, -367, 472, -470, 263, -8, -30, 307, -391, 131, -365, -150, 14, -353, 520, -104, 470, 399, -361, 718, -709, -55, -62, -598, 513, -586, 179, 307, -417, 536, -340, 29, 246, -425, 209, -164, 124, -123, -303, 250, -402, 399, 25, 151, 532, -340, 645, -230, -316, 254, -866, 352, -162, -346, 632, -288, 691, 204, -197, 410, -508, -131, -374, -390, 234, -147, 428, -14, 216, 214, -513, 313, -483, 208, 174, -331, 702, -554, -37, 97, -748, 318, -567, 264, 541, -229, 777, -275, -194, 30, -766, 77, -425, 58, 223, 62, 525, -120, 474, -231, -197, 265, -589, 302, -211, -158, 563, -403, 631, -63, -210, 555, -520, 450, -52, -216, 447, -399, 136, -177, -299, 46]
2601D6k68O08m69M13j18m92N71p53N48j96n65J315j021P28K17r71R17j052M30
2620a12J35o89J035n55K39K25n89O90p28N69k60l1M40n79O41p09R1M65j053J190
2640D15n91J24P31j028Q38m84k64N74r48P54l24N0N86p26O68l76O5K3m30N83n40
2661c00L34Lm34P27q28P15p2n91J096j210P29N7n98R23j142N85P2n98O60l99M52
2682A81J12k42M34p62K56j71k10M41n32Q95m03J03N01j152Q16n37o3Q07j108J182
2702E48m58j70O06j080P12n26N2N67m99O65n04K59j0n50N84o31M46k7j49P26p89
2723b28O05r8q05R16j145Q22O2q16J133p79O92K3o24O01p22M51q2k69M88m27N18
2744C16k87RK30o36P37o51J83M38r27J067m87q2N77j004P90l96j66P59q17M59
$$ y = [46, -222, 386, -83, 330, 212, -280, 291, -462, 86, -110, -675, 640, -381, 347, 564, -407, 510, -542, -112, 23, -666, 369, -186, 53, 278, -311, 379, -349, 220, -40, -71, 369, -210, 431, -278, -187, 278, -775, 415, -176, -52, 679, -349, 489, 5, -259, 315, -633, 121, -203, -153, 433, -293, 375, -1, 64, 87, -343, 240, -300, 34, 37, -397, 330, -498, 217, 145, -446, 650, -560, 169, 226, -372, 551, -591, -6, 66, -532, 128, -271, 181, 293, 51, 485, -277, -21, -192, -402, 39, -493, 402, -1, 102, 603, -549, 267, -270, -333, 474, -634, 548, 90, -80, 526, -554, 158, -368, -316, 251, -248, 417, -87, 172, 162, -388, 196, -435, 11, -16, -165, 561, -228, 377, 279, -526, 390, -755, 67, 129, -687, 446, -333, 359, 382, -242, 359, -363, 88, 6, -263, 225, -202, 316, 29, 38, 268, -368, 369, -282, -99, 339, -588, 479, -8, -90, 487, -517, 273, -123, -289, 470, -347, 112]
2764A12j39k68M26l82L78j91J35K86n14M60p23L66L9k32N88p33R27m05m99Q35
2784D66j039M65J12n21J241q64M00O0p45P84p82L77j08k17O79m03M72k68j25K23
2804B07p40Q14o39J55O06q81J195p72J20M08r09P20m95k38P89o83N99q6o7K32
2824C35p20N39m87K62j3k10N91n42O23j61l38M59q70O06n5m94J130r99O00J34
2844C90p56Q19r05M14R7m97P61l48M01k67k34J99n24N14k98J60L65o33R83r48
2864c07J52N06q95J109o48n0M09q11P71m28j63N60l57N29l65J55O0n52K67l95
2884d53J69K63l6N10n56N32k20m94O06q13O14j03m24R71p70N04j23o06P85o01
2904b45L56j83k41O37o16M98p0k77L44o24M97m44L38J93m92R64o62K05J15j022
$$ y = [112, -27, -295, 131, -251, 127, -64, 71, 357, -157, 303, -420, -54, -15, -247, 341, -392, 535, 130, -369, 466, -573, -108, 4, -517, 724, -140, 260, 320, -425, 359, -423, -46, -154, -371, 308, -95, 377, 109, -16, 207, -533, 281, -358, -203, 403, -478, 717, -55, 65, 473, -436, 284, -211, -449, 340, -343, 256, 170, 103, 335, -385, 154, -333, -71, -84, -294, 297, -245, 378, 217, -121, 338, -532, 74, 19, -475, 655, -344, 256, 390, -366, 453, -452, -38, 59, -438, 323, -25, 376, 109, -125, 74, -450, 64, -234, -74, 291, -342, 641, -307, -155, 351, -544, 565, -83, -133, 276, -535, 236, -192, -355, 205, -152, 377, 12, 167, 227, -325, -58, -453, -284, -21, -57, 453, -103, 429, 209, -285, 321, -492, 122, 19, -405, 566, -204, 300, 177, -429, 356, -245, 111, -72, -313, 324, -292, 206, 136, -141, 203, -421, 76, -368, -30, 163, -329, 635, -27, 178, 293, -729]
2924g29Q88m47j5N65q18J053j84j50J73o46L31l94M1N30m81N76k69K35j09l81
2944b31M39o53P46j80l66Q07r53N60k25m54Q71o44M45N2n26P75o34K15r9k72N39
2965B12m52M88k86j0K91m62N61l85m6M79q15Q78o00J07L54q54P82m02r6N54n23
2986b25N81l55q0L27n26M13m17K12J34l43O21n00M98j06l85M97q13M68j57k44
3006d00P93o98O18O9o39N77o29L03n1k96O99m48K87l6l27L44m89M49l22L06J14
3027B24l49M86n89K13J72p59P57n08K54O32p91Q00n40p3L83o53L26j76J1M86n50
3048b44N37l41J58J1l45M08n35M80j08k44N66q47O72l02k85Q15p67N32J4m99P88
3069D64p14K54o2m71P19l50L34l6j65M01l88K89m11O3J88n25M34k06J13M54o80
$$ y = [-729, 159, -288, -303, 262, -556, 497, 313, 163, 336, -310, 21, -373, -332, 198, -283, 293, 24, 259, 150, -231, 208, -445, 301, 121, -245, 562, -391, 169, -56, -510, 361, -283, 162, 214, -312, 463, -171, 44, -55, -327, 212, -240, 248, -38, -48, 243, -219, 342, -43, -89, 390, -425, 453, -147, -40, 314, -540, 242, -160, -256, 298, -225, 356, 1, -79, 248, -278, 135, -282, -70, 64, -279, 342, -158, 340, 234, -151, 346, -467, 1, -156, -400, 393, -305, 313, 382, -257, 320, -309, -6, -57, -353, 346, -102, 185, 149, -178, 166, -323, 126, -196, 110, 224, -125, 361, -228, -15, 157, -602, 155, -353, -99, 533, -258, 542, 2, -71, 312, -341, -15, -191, -180, 306, -244, 293, -48, 110, 121, -224, 184, -351, 129, 21, -223, 343, -504, 168, -134, -419, 396, -371, 161, 175, -324, 464, -250, 4, -58, -529, 190, -160, 174, 138, -27, 374, -14, 275, -136, -73, 115, -410, 24, -182, -69, 385, -295]
3090b95P65o83J19M85q30R07n93k6M99o74O08m58O0L03m40O96m71K19p6l96M97
3111B16o80M09j01j10N70n43O45j88l59M03o17M39j9m25P60o42M30j64k77M27
3131A74m30L99j56qK40m35M08l55J42Ol42O94n11J70M19o05O21n30K06N5q25Q48
$$ y = [-295, 470, -213, -94, 391, -439, 468, -125, -151, 348, -326, 282, -176, -116, 187, -253, 443, -28, 191, 115, -281, 216, -464, -55, -156, -266, 304, -239, 406, 218, -141, 262, -355, 84, 65, -360, 400, -242, 188, 24, -253, 174, -256, 143, -13, -21, 219, -216, 192, -163, -21, -15, -357, 337, -174, -4, 415, -190, 431, -99, 107, 162, -663, 185]
$$ [...]
8191d6
##END NTUPLES=NMR FID
##END=
