##TITLE=1H_01-2023
 DMSO-d6
 8 sc, 
 26.1.2023
##JCAMPDX= 6.0         $$ Bruker NMR JCAMP-DX V2.0
##DATA TYPE= NMR FID
##DATA CLASS= NTUPLES
##ORIGIN= UXNMR, Bruker Analytische Messtechnik GmbH
##OWNER= root
$$ XWIN-NMR		Version 3.5
$$ Thu Jan 26 14:37:19 2023 Russian Standard Time (UT+4h)  she@DPX200
##.OBSERVE FREQUENCY= 200.13135
##.OBSERVE NUCLEUS= ^1H
##.DELAY= (6, 6)
##.ACQUISITION MODE= SIMULTANEOUS
##.ACQUISITION SCHEME= undefined
##.AVERAGES= 8
##.DIGITISER RES= 18
##SPECTROMETER/DATA SYSTEM= spect
##.PULSE SEQUENCE= zg30
##.SOLVENT NAME= DMSO
##.SHIFT REFERENCE= (INTERNAL, DMSO, 0, 15.7039)
##AUDIT TRAIL= $$ (NUMBER, WHEN, WHO, WHERE, WHAT)
$$ ##TITLE= Audit trail, XWIN-NMR		Version 3.5
$$ ##JCAMPDX= 5.01
$$ ##ORIGIN= Bruker BioSpin GmbH
$$ ##OWNER= she
$$ F:/spectra/data/she/nmr/H-F/1/audita.txt
$$ ##AUDIT TRAIL=  $$ (NUMBER, WHEN, WHO, WHERE, WHAT)
(   1,<2023-01-26 14:36:04.75 +0400>,<she>,<DPX200>,
      <created by zg, POWCHK disabled, PULCHK disabled
       configuration hash MD5:
       00 E9 B6 7A A2 85 ED C7 34 08 36 98 17 FE 4E 26
       data hash MD5: 16K
       5B 63 30 E4 04 4C 43 6C 98 C1 39 72 D8 BE 4C 33>)
$$ ##END=
$$ 
$$ hash MD5
$$ A6 8A CF D1 7A 51 B7 E4 69 69 63 9B E4 AF 1A 9F
##$RELAX= 
##$RELAX= 
##$RELAX= 
##$RELAX= 
##$RELAX= 
##$RELAX= 
$$ Bruker specific parameters
$$ --------------------------
##$DU= <F:/spectra>
##$EXPNO= 1
##$NAME= <H-F>
##$PROCNO= 1
##$TYPE= <nmr>
##$USER= <she>
##$AMP= (0..31)
100 100 100 100 100 100 100 100 100 100 100 100 100 100 100 100 100 100 
100 100 100 100 100 100 100 100 100 100 100 100 100 100 
##$AQSEQ= 0
##$AQ_mod= 1
##$AUNM= <au_zg>
##$AUTOPOS= <>
##$BF1= 200.13
##$BF2= 200.13
##$BF3= 200.13
##$BF4= 200.13
##$BF5= 200.13
##$BF6= 200.13
##$BF7= 200.13
##$BF8= 200.13
##$BYTORDA= 1
##$CFDGTYP= 0
##$CFRGTYP= 5
##$CHEMSTR= <none>
##$CNST= (0..31)
1 1 145 1 1 1 1 1 1 1 1 1 1 1 1 1 1 1 1 1 1 1 1 1 1 1 1 1 1 1 1 1 
##$CPDPRG= <>
##$CPDPRG1= <>
##$CPDPRG2= <>
##$CPDPRG3= <>
##$CPDPRG4= <mlev>
##$CPDPRG5= <mlev>
##$CPDPRG6= <mlev>
##$CPDPRG7= <mlev>
##$CPDPRG8= <mlev>
##$CPDPRGB= <>
##$CPDPRGT= <>
##$D= (0..31)
0 1.2 0 0 0 0 0 0 0 0.06 0 0.03 0 0 0 0 0.0002 0 0 0 0 0 0 0 0 0 0 0 0 
0 0 0 
##$DATE= 1674729364
##$DBL= (0..7)
120 120 120 120 120 120 120 120 
##$DBP= (0..7)
150 150 150 150 150 150 150 150 
##$DBP07= 0
##$DBPNAM0= <>
##$DBPNAM1= <>
##$DBPNAM2= <>
##$DBPNAM3= <>
##$DBPNAM4= <>
##$DBPNAM5= <>
##$DBPNAM6= <>
##$DBPNAM7= <>
##$DBPOAL= (0..7)
0.5 0.5 0.5 0.5 0.5 0.5 0.5 0.5 
##$DBPOFFS= (0..7)
0 0 0 0 0 0 0 0 
##$DE= 6
##$DECBNUC= <off>
##$DECIM= 32
##$DECNUC= <off>
##$DECSTAT= 4
##$DIGMOD= 1
##$DIGTYP= 9
##$DL= (0..7)
0 120 120 120 120 120 120 120 
##$DP= (0..7)
150 150 150 150 150 150 150 150 
##$DP07= 0
##$DPNAME0= <>
##$DPNAME1= <>
##$DPNAME2= <>
##$DPNAME3= <>
##$DPNAME4= <>
##$DPNAME5= <>
##$DPNAME6= <>
##$DPNAME7= <>
##$DPOAL= (0..7)
0.5 0.5 0.5 0.5 0.5 0.5 0.5 0.5 
##$DPOFFS= (0..7)
0 0 0 0 0 0 0 0 
##$DQDMODE= 0
##$DR= 18
##$DS= 0
##$DSLIST= <SSSSSSSSSSSSSSS>
$$ [...]
##$SUBNAM2= <"">
##$SUBNAM3= <"">
##$SUBNAM4= <"">
##$SUBNAM5= <"">
##$SUBNAM6= <"">
##$SUBNAM7= <"">
##$SUBNAM8= <"">
##$SUBNAM9= <"">
##$SW= 18.05172834244
##$SWIBOX= (0..15)
0 0 2 0 0 0 0 0 0 0 0 0 0 0 0 0 
##$SW_h= 3612.71676300578
##$TD= 16384
##$TD0= 1
##$TE= 0
##$TE2= 300
##$TE3= 300
##$TEG= 300
##$TL= (0..7)
0 120 120 120 120 120 120 120 
##$TP= (0..7)
150 150 150 150 150 150 150 150 
##$TP07= 0
##$TPNAME0= <>
##$TPNAME1= <>
##$TPNAME2= <>
##$TPNAME3= <>
##$TPNAME4= <>
##$TPNAME5= <>
##$TPNAME6= <>
##$TPNAME7= <>
##$TPOAL= (0..7)
0.5 0.5 0.5 0.5 0.5 0.5 0.5 0.5 
##$TPOFFS= (0..7)
0 0 0 0 0 0 0 0 
##$TUNHIN= 0
##$TUNHOUT= 0
##$TUNXOUT= 0
##$USERA1= <user>
##$USERA2= <user>
##$USERA3= <user>
##$USERA4= <user>
##$USERA5= <user>
##$V9= 5
##$VALIST= <valist>
##$VCLIST= <CCCCCCCCCCCCCCC>
##$VD= 0
##$VDLIST= <DDDDDDDDDDDDDDD>
##$VPLIST= <PPPPPPPPPPPPPPP>
##$VTLIST= <TTTTTTTTTTTTTTT>
##$WBST= 1024
##$WBSW= 4
##$XGAIN= (0..3)
0 0 0 0 
##$XL= 0
##$YL= 0
##$YMAX_a= 382434
##$YMIN_a= -222390
##$ZGOPTNS= <>
##$ZL1= 120
##$ZL2= 120
##$ZL3= 120
##$ZL4= 120
##$ABSF1= 10
##$ABSF2= 0
##$ABSG= 5
##$ABSL= 3
##$ALPHA= 0
##$AQORDER= 0
##$ASSFAC= 0
##$ASSFACI= 0
##$ASSFACX= 0
##$ASSWID= 0
##$AUNMP= <proc_1d>
##$AZFE= 0.1
##$AZFW= 0.1
##$BCFW= 1
##$BC_mod= 2
##$BYTORDP= 1
##$COROFFS= 0
##$CY= 11.3945322036743
##$DATMOD= 1
##$DC= 2
##$DFILT= <>
##$DTYPP= 0
##$F1P= 2.36226072786647
##$F2P= -0.459571619588291
##$FCOR= 0.5
##$FTSIZE= 0
##$FT_mod= 4
##$GAMMA= 1
##$GB= 0.15
##$INTBC= 1
##$INTSCL= 1
##$ISEN= 128
##$LB= 0.24
##$LEV0= 0
##$LPBIN= 0
##$MAXI= 10000
##$MC2= 0
##$MEAN= 0
##$ME_mod= 0
##$MI= 1.114404
##$NCOEF= 0
##$NC_proc= 0
##$NLEV= 6
##$NOISF1= 3.799351
##$NOISF2= 2.8
##$NSP= 1
##$NTH_PI= 0
##$NZP= 0
##$OFFSET= 15.70392
##$PC= 1
##$PHC0= -19113.6
##$PHC1= 12.40079
##$PH_mod= 1
##$PKNL= yes
##$PPARMOD= 0
##$PSCAL= 0
##$PSIGN= 0
##$REVERSE= no
##$SF= 200.130013532006
##$SI= 16384
##$SIGF1= 3
##$SIGF2= 2
##$SINO= 400
##$SIOLD= 16384
##$SREGLST= <1H.CDCl3>
##$SSB= 0
##$STSI= 0
##$STSR= 0
##$SW_p= 3612.71676300578
##$SYMM= 0
##$S_DEV= 0
##$TDeff= 0
##$TDoff= 0
##$TI= <>
##$TILT= no
##$TM1= 0
##$TM2= 0
##$TOPLEV= 0
##$USERP1= <user>
##$USERP2= <user>
##$USERP3= <user>
##$USERP4= <user>
##$USERP5= <user>
##$WDW= 1
##$XDIM= 8192
##$YMAX_p= 0
##$YMIN_p= 0
$$ End of Bruker specific parameters
$$ ---------------------------------
##NTUPLES= NMR FID
##VAR_NAME=  TIME,          FID/REAL,        FID/IMAG
##SYMBOL=    X,             R,               I
##VAR_TYPE=  INDEPENDENT,   DEPENDENT,       DEPENDENT
##VAR_FORM=  AFFN,          ASDF,            ASDF
##VAR_DIM=   8192,          8192,            8192
##UNITS=     SECONDS,       ARBITRARY UNITS, ARBITRARY UNITS
##FACTOR=    0.0002768,     1,               1
##FIRST=     0,             0,               0
##LAST=      2.2672688,     0,               0
##MIN=       0,             -222390,         0
##MAX=       2.2672688,     382434,          0
$$ Real data points
##PAGE= N=1
##DATA TABLE= (X++(R..R)), XYDATA
0 0 0 0 0 0 0 0 0 0 0 0 -8 8 -8 16 -16 17 -24 32 -40 46 -56 65 -77 89 -105 122 -144 167 -191 219 -250 285
32 285 -321 367 -411 466 -521 585 -652 729 -811 900 -997 1106 -1221 1350 -1489 1642 -1810
49 -1810 1994 -2196 2420 -2667 2944 -3255 3604 -4004 4461 -4995 5625 -6385 7319 -8502
63 -8502 10053 -12184 15311 -20350 29821 -53837 249431 382434 -9212 238925 232508 -146398
75 -146398 -196707 93943 -20153 -104732 178089 283696 70817 129864 215259 -15957 -164394
86 -164394 -20387 -56056 -207750 -84251 81908 -31905 -71566 52205 6907 -131795 -92237
97 -92237 -53169 -131475 -125242 -29886 -61891 -110700 -33407 -16549 -99904 -71503 11538 -8114
109 -8114 -36438 23059 49667 -2636 -13602 11709 -9907 -7849 39478 54108 60203 98825 108883
122 108883 64274 35922 45966 26500 -6065 19004 60472 69973 72685 73298 58160 26287 -11104
135 -11104 -39715 -52407 -34916 -6375 6551 25897 46754 31458 -12889 -57818 -83301 -97525
147 -97525 -108059 -86844 -37494 7995 34509 34926 22212 -1444 -45911 -86413 -101263 -86088
159 -86088 -48448 -12222 25292 66282 81962 63547 27494 -2844 -19750 -38455 -41794 -13947
171 -13947 23106 52328 64980 65551 62693 44244 14311 -7794 -13797 -3177 3363 5703 20479
184 20479 30850 22885 5378 -6977 -6686 -9125 -15051 -9906 -918 2771 -4684 -21402 -27012 -27207
198 -27207 -32221 -31016 -18455 2418 13971 7678 2785 -2679 -16832 -32363 -39710 -28280 -7393
211 -7393 6422 19538 31595 35300 25067 323 -16325 -19017 -20255 -14810 395 23458 41728
224 41728 39851 28170 17310 1173 -16337 -29509 -26203 -6251 9714 19842 28122 30209 21486
237 21486 -880 -22216 -27619 -27516 -22942 -11536 5282 22980 24690 13005 2397 -8187 -18988
250 -18988 -27020 -26021 -9239 6920 13885 17447 16877 12228 -1526 -17901 -19973 -13632 -6232 2762
264 2762 11495 21677 21809 7854 -5214 -13108 -17578 -18658 -15263 -1464 14917 19149 16319 9340
278 9340 1087 -10353 -24577 -27082 -17257 -5266 5846 13785 19832 21150 8610 -6767 -14976 -17322
292 -17322 -14671 -10237 1113 17662 24276 21768 15635 7859 948 -8871 -13825 -6311 3346 11360
306 11360 15017 16721 17765 9878 -1758 -8655 -10294 -7408 -5553 -2935 4653 7450 2634 -4398 -10567
321 -10567 -11911 -13940 -15918 -10250 -2845 370 -1538 -7065 -9407 -12658 -18518 -17400 -10896 -798 6642
336 6642 8422 11004 9444 997 -8380 -14328 -12029 -4553 2526 13641 25554 30737 27867 17304
350 17304 6889 -1215 -9849 -11804 -5204 6578 19616 25334 27152 25378 15125 900 -12553
363 -12553 -19417 -17995 -14969 -8067 2466 9999 11558 4777 -4522 -10994 -19213 -25479 -25028 -19593 -10189
378 -10189 -5060 -2795 -65 -1569 -6073 -11821 -14733 -11708 -8022 -4615 1394 6467 9296 7725 3707
393 3707 2485 3076 2312 4489 8242 13773 16440 14699 13758 12369 9300 6489 4671 6643 9053 8527
409 8527 7868 6815 4432 1805 -2547 -3632 -1666 -1282 -672 -1380 -2295 -4899 -11215 -16033 -17530 -17058 -14241
426 -14241 -9549 -3768 2354 3023 -330 -5574 -11465 -16203 -20356 -18997 -10690 -1085 7994 15242 18432
441 18432 18037 11198 1933 -4786 -8889 -8327 -3906 3576 14677 22103 24529 23282 17465 10501 1873
456 1873 -5725 -7317 -5660 -2068 3166 6749 10356 10102 5166 654 -4259 -8208 -11033 -12694 -11073
471 -11073 -8515 -7838 -6918 -6855 -6142 -6025 -7552 -6960 -5604 -5469 -5535 -5867 -5897 -4972 -5710 -4730 -1608 1426 5030
490 5030 6742 8025 9007 7449 5065 3545 2590 4353 5486 7563 10830 11877 12246 10123 7321 5321
506 5321 2529 642 1204 2074 4019 3689 2329 1403 -1493 -4951 -7664 -9122 -8107 -6681 -5239 -3019
522 -3019 -2148 -2896 -5728 -9270 -11430 -12895 -12948 -10456 -6771 -2410 1309 2547 3188 1732 -1363 -3876
538 -3876 -5494 -4531 -1681 1551 5961 9502 11288 11710 9577 7321 5387 3208 2435 3021 4812 6815
554 6815 7518 7977 7708 6222 4238 2420 640 159 -725 -1240 -1269 -2120 -2382 -3359 -4377 -3946 -4647 -4644 -4401
573 -4401 -4693 -4732 -5166 -6447 -6564 -7223 -6499 -5493 -4645 -2618 -1367 -536 -492 -931 -1150 -1301 -1644 -496 335
592 335 1827 3593 4534 5413 5214 3739 3332 2815 2495 3098 3355 4647 5366 4937 4696 3685 2420 1102
610 1102 -87 -276 310 105 1092 1091 912 421 -1223 -2127 -3033 -3752 -3454 -3318 -2467 -1541 -1465 -1186 -1844 -2063
630 -2063 -2203 -3028 -2744 -1953 -1835 -1103 -594 -417 3 -26 -114 -68 -107 335 475 715 1461 1393 899 798 328 326
652 326 213 287 937 1159 1255 1274 1026 595 363 -698 -572 -873 -600 28 68 747 954 749 948 219 -80
673 -80 -202 -864 -567 -258 173 761 768 1238 1509 811 1213 439 127 201 264 99 237 40 117 19 -133 -133 -791
696 -791 -701 -839 -1101 -902 -808 -1577 -1454 -1797 -1965 -1827 -1934 -1379 -1595 -1284 -523 -571 -650 -440 -1143 -866 -762 -930
718 -930 -151 219 869 1773 1825 2218 2218 1931 1726 1295 1372 1530 1754 2385 2721 2803 2655 2068 1649 1378 443 693
740 693 -102 74 -34 125 92 -666 -736 -1236 -1928 -2375 -2533 -2715 -2408 -2379 -2509 -2188 -2568 -2388 -2484 -2559 -2221 -2153
762 -2153 -2041 -1311 -1233 -775 -482 -744 150 555 861 1629 1800 2089 2335 2047 2154 2112 2034 2198 2600 3072 3933
783 3933 3446 3596 2900 2025 1160 340 -95 -3 304 786 873 1050 870 -378 -1639 -2615 -3780 -4259 -4082 -3739
803 -3739 -2602 -1999 -1169 -973 -1816 -2290 -3406 -3937 -4046 -3406 -2235 -894 -126 988 1175 909 534 -84
821 -84 -186 338 376 1479 2805 3408 3774 3746 3287 3111 2394 1877 2284 1973 2623 2701 2920 3010 2005 1565 978
842 978 115 -435 -884 -757 -742 -860 -1104 -1670 -1759 -2239 -2565 -2558 -2636 -2799 -2345 -2607 -2813 -2909 -2906 -2600 -2218 -1658 -970
865 -970 -376 -112 -19 -345 -718 -854 -957 -31 845 1688 3035 3481 3869 3290 2103 1467 810 56 688 1324
885 1324 2638 3676 3969 4158 2966 1925 387 -1269 -1637 -1407 -1078 162 828 1290 1124 243 -850
902 -850 -1998 -3036 -3651 -3835 -3042 -1877 -1251 -392 -329 -668 -1089 -1602 -2306 -2246 -2103 -1287 -978 243 747 867
922 867 683 416 77 243 736 651 1400 1419 1257 1614 1255 1186 1254 1151 1313 1530 1361 1752 1033 763 266 -243
944 -243 -371 -91 141 371 705 680 62 -665 -1017 -1669 -1804 -1581 -1152 -343 267 576 624 7 -738 -1362 -2002
965 -2002 -2157 -1439 -538 370 795 1685 1231 799 101 -1014 -1393 -862 -545 -18 1070 1585 2268 1944 1128
984 1128 260 -1043 -985 -1183 -510 95 978 1551 1435 1067 392 -265 -1325 -1061 -1237 -549 -35 489 493 587 90
1005 90 -212 -430 -681 -817 -414 -80 584 598 459 173 -168 -428 -527 -223 190 235 991 955 700 337 -297 -605
1027 -605 -624 -620 87 465 872 870 722 -5 -374 -883 -1170 -961 -533 -63 325 732 643 213 -51 -613 -1210 -1276
1049 -1276 -728 -250 19 452 1034 859 290 -269 -429 -573 -477 -279 439 795 1169 1071 592 307 -317 -481
1069 -481 -629 -241 416 778 1218 892 678 -82 -700 -665 -1002 -658 -51 420 715 475 91 -542 -813 -1330
1089 -1330 -1387 -1077 -599 38 696 702 736 258 -560 -921 -1166 -956 -106 255 932 1250 1343 1031 273 -327 -658
1110 -658 -969 -143 143 442 1388 1673 1245 785 305 -362 -719 -889 -483 -193 265 423 578 758 248 -501
1130 -501 -944 -945 -836 -862 -655 -179 35 -375 -426 -606 -534 -593 -589 -511 10 283 -154 -161 -305 -68 -78 -94 398 708
1154 708 1079 1002 1181 785 496 114 -94 -117 615 1058 1241 1501 1400 1147 312 -353 -665 -1063 -895 -316 128
1175 128 823 1127 689 178 -377 -1174 -1829 -1461 -1475 -654 -296 294 465 498 7 -790 -1282 -1448 -1473 -924 -142
1196 -142 227 875 1140 944 485 255 -238 -597 -438 -176 409 832 1270 1265 1176 1138 653 392 25 6 220 250
1218 250 464 724 496 429 40 61 -230 -43 -209 -318 -449 -132 -643 -440 -782 -416 -601 -492 -180 -221 -434
1239 -434 -562 -679 -1092 -1064 -972 -462 198 256 761 741 587 78 -8 -515 -629 -564 59 594 1234 1485 1825 1103
1261 1103 708 175 -559 -656 -525 52 534 960 1435 1061 829 69 -217 -732 -1001 -919 -778 -252 187 715
1281 715 447 215 -296 -710 -1286 -1429 -1290 -725 -238 -67 134 389 197 -1 -502 -175 -413 -661 -188 119
1301 119 223 310 583 275 356 229 243 733 389 393 409 690 464 309 78 395 280 460 551 705 229 23
1323 23 98 -557 -544 -350 -200 -4 144 2 -54 -94 -373 -669 -799 -1064 -917 -396 -253 177 99 128 55 -390 -641
1346 -641 -719 -650 -442 -19 496 598 640 973 414 105 -201 -407 -295 -139 395 844 912 938 738 381 319 85
1368 85 -265 -142 9 22 606 422 642 316 -140 -323 -430 -637 -434 -12 123 -104 112 -334 -237 -273 -513
1389 -513 -450 -369 -159 -294 -62 -197 41 -179 -256 -398 41 -59 301 435 156 211 360 -261 -147 -115 -344 111
1411 111 305 658 561 570 584 62 -23 -168 -475 -66 37 183 418 405 355 117 89 -173 -141 -149 -76 -55 202 -12
1435 -12 176 102 -128 -224 -103 -55 -18 -31 -100 237 331 26 68 -181 -462 -238 -176 72 80 273 -60 165 56 -323
1459 -323 -617 -331 -231 -295 -277 341 492 406 138 137 -130 -265 -333 -417 27 75 630 511 -7 346 -202 -179 -250
1482 -250 -101 -80 -27 332 507 303 131 154 91 -70 -73 -98 40 306 195 335 314 -60 -228 17 -313 -318 -142
1505 -142 119 160 155 40 -134 -147 -383 -269 110 -462 -157 -85 31 -9 -92 53 -298 85 -383 26 150 151 76
1528 76 -203 -17 -199 -115 216 62 14 237 300 238 125 -9 -139 169 -129 -42 -34 473 434 636 263 178 337
1551 337 -241 -297 -333 -125 -250 54 182 -13 -69 4 -280 -264 -670 -539 -410 -548 -35 -119 -242 51 91 -141
1573 -141 -189 -668 -320 3 -166 63 231 151 182 231 63 91 40 129 66 130 383 446 445 369 193 74 143 478 120
1598 120 203 298 39 142 65 113 145 -79 -250 169 97 121 -177 -99 -289 -589 -163 -157 -120 -63 -262 -54 -84 -187
1622 -187 -269 -100 -374 -375 -337 -108 318 -94 375 -31 166 -180 -1 -91 -72 -102 356 399 529 473 394 39 113 -203
1646 -203 43 131 -17 311 286 381 271 -7 233 1 -5 -188 -68 -399 95 -14 -48 -196 -186 101 -442 -428 -371
1669 -371 -194 79 -322 -78 -218 -25 96 -25 -318 -122 -78 -82 -16 29 93 -258 -47 125 -20 246 139 149
1691 149 -60 90 30 32 0 -34 -126 280 542 200 569 400 141 14 43 17 -157 -134 -237 149 103 206 -112
1714 -112 -24 61 -184 -209 -359 -138 -34 -88 43 -139 25 -344 -319 -140 -250 -70 20 6 -186 -25 369 36
1736 36 -101 -135 -101 -232 37 60 33 240 255 264 313 134 70 -169 -54 174 -16 -205 120 33 140 -91 -88 215
1760 215 -14 -39 14 -166 -166 -161 43 -134 -245 -21 175 -347 52 44 163 -56 280 48 -276 -136 -326 -100 -84
1783 -84 13 99 290 19 40 -59 205 2 -45 108 184 322 177 85 -51 -113 -9 -217 -157 13 -105 216 30
1806 30 -160 209 178 265 15 -73 195 209 -141 32 48 78 -112 47 170 -88 111 185 -39 -9 123 28 -176
1829 -176 -1 -3 -193 202 -138 -77 38 2 149 208 -128 -359 76 -24 -9 306 127 25 -29 -110 216 -203 47
1852 47 -26 42 -118 16 273 -65 -76 131 -50 117 300 77 -179 -166 35 -98 87 -37 -103 349 -46 153
1874 153 -210 -93 114 326 -55 -153 135 -67 -18 -16 -41 45 77 130 13 175 93 0 191 -229 -118 -275 31
1897 31 108 115 -18 -39 -12 140 291 -45 -25 92 -48 93 -58 -147 -10 -32 110 -40 31 140 336 -29 -94 -16
1921 -16 -19 -43 315 -92 258 42 -91 75 52 0 -174 22 -129 -151 70 -94 -145 -16 -128 -171 327 168 -78
1944 -78 -189 -206 66 -327 -41 -27 -187 -67 25 -9 9 66 41 182 -139 55 20 30 -17 -47 33 -183 49 249
1968 249 209 129 8 -31 127 22 -48 -32 120 225 187 123 -168 116 167 93 263 -11 -44 -191 75 -184 -92 -61
1992 -61 45 -56 -53 20 174 -96 -68 -4 6 -40 -99 281 8 5 -53 -138 93 35 122 -159 100 85 84 -124 134 146
2018 146 72 129 -19 26 -47 222 -42 -61 116 72 48 -304 232 -2 -150 161 -382 -64 -34 72 -340 -12 17
2041 17 -68 40 -362 78 -41 -264 32 -231 -85 146 0 -106 191 116 -115 78 -128 -104 32 5 -54 251
2063 251 54 173 216 54 355 181 -20 303 37 219 168 -53 128 7 135 162 252 65 82 -477 -7 -108
2085 -108 78 26 169 172 112 -21 70 -73 11 76 -67 70 -36 185 -14 -187 136 -38 301 -142 -177 68 -55
2108 -55 164 -21 -24 105 57 -502 133 -328 58 174 -117 95 82 -96 -232 127 172 -139 287 140 165 111 -179
2131 -179 57 -153 -69 17 -68 9 -135 -21 -34 -2 -18 68 -62 133 -92 -289 64 95 16 194 38 39 0 -410
2155 -410 229 17 -59 17 -150 -252 92 -49 -122 -96 52 -123 -88 110 -23 161 -57 -199 -268 -128 185 95
2177 95 -128 -163 163 -67 -290 -67 147 -53 132 85 21 -49 -204 -48 -169 295 291 -31 -156 -14 -148 76
2199 76 -11 152 143 -44 13 283 71 -194 -20 -93 -125 215 205 40 -104 -205 -93 -97 -282 -140 -88 166 162 114 -81
2224 -81 -179 -18 283 -142 145 167 26 47 36 12 -49 101 150 -187 -110 -254 46 -81 -146 181 -157 231 37
2247 37 -168 45 -164 104 -243 -83 -56 148 47 -164 -91 -33 93 -139 -4 -31 106 166 -95 -31 83 28 46
2270 46 -123 -58 24 -153 -27 -122 253 -445 24 3 -19 -67 -263 129 48 -30 6 -30 -65 -166 53 -6 -123 -2
2294 -2 69 77 147 -19 -109 199 -302 -121 -3 -28 -179 -203 -14 -51 104 96 8 -119 -19 -99 144 -165 53 76 96
2319 96 -243 116 -192 -74 20 -241 72 272 -103 37 84 -60 -45 11 -65 -194 131 99 97 38 -132 -340 120
2342 120 -45 224 0 -64 -63 197 228 -59 -41 -60 45 230 -74 -36 -10 -2 -70 -52 -13 -66 193 -24 100 73 81 -41
2368 -41 -32 74 -88 169 6 35 93 -7 299 105 110 -2 -138 -202 69 -123 -4 202 42 -156 361 -115 -85
2391 -85 -23 48 59 111 -176 312 184 289 102 -248 66 85 121 -146 -60 -202 38 47 -4 136 231 -55 -111 -130 135
2416 135 -192 -114 -403 -38 -47 -51 -56 -80 -217 22 -365 89 47 -256 -116 -158 116 2 -59 109 26 73 47 -45 -2
2441 -2 -36 52 88 -46 25 136 14 87 199 69 -39 -125 -140 -169 50 -144 -139 83 126 24 99 -138 -312 82 3
2466 3 -189 57 16 -37 -140 176 -53 202 86 -94 37 12 179 -170 120 -10 -132 111 -76 -169 -142 -50 175
2489 175 150 -48 -1 -145 329 40 -59 74 50 90 216 -200 80 105 -18 -126 -7 202 40 -75 -250 -44
2511 -44 121 -26 -103 42 184 110 147 56 -77 77 -352 5 5 -180 -35 17 140 182 178 47 -57 9 -175 89
2535 89 61 93 -134 -167 107 197 134 67 28 323 -95 -166 -43 -110 -13 -159 62 177 -130 -7 172 41 191 -288
2559 -288 -41 -223 273 170 21 -34 -52 -62 41 50 -84 -164 15 208 -15 153 54 34 56 -78 -249 25 169
2582 169 -111 50 30 -72 -94 -91 -83 -153 133 34 -74 -30 -6 222 77 146 -13 -41 -167 -208 -73 34 -43 60 -294
2607 -294 43 132 -116 -187 -31 -40 -149 84 -45 7 -78 -1 89 -214 -204 72 25 208 -139 21 -40 110 66 -322
2631 -322 -102 131 119 135 143 -133 -173 152 -152 -336 -100 -133 -50 128 169 182 -84 -2 -46 -185 -3 277 -175 -222
2655 -222 47 414 307 -314 29 -51 -176 -15 123 -15 99 -85 183 -234 -43 81 -179 39 -238 226
2675 226 -176 143 -1 -223 215 -270 253 -210 98 26 1 -327 126 111 -166 172 76 -68 20 -122 -49 161
2697 161 -114 -236 -67 -62 -253 -323 121 16 -93 77 -106 -162 -285 -38 -198 197 5 -206 5 59 175 156
2719 156 -130 -164 22 -37 126 5 -367 153 254 106 -281 132 -10 -225 0 -283 208 -399 88 5 49
2740 49 108 -67 58 -249 -7 126 -14 90 111 -95 -17 144 -78 259 -327 16 150 -282 247 -152 -148 323
2762 323 -66 -2 -138 135 4 286 -78 132 -46 -378 -135 -170 -180 12 314 -61 13 162 -31 245 63
2783 63 -41 -136 8 -56 -79 28 -6 -74 -36 -27 61 -210 -218 -3 -157 198 -71 -106 57 71 140 -62 83 88 -184 -229
2809 -229 299 154 108 140 -37 38 -110 55 98 186 -397 209 48 97 69 -214 36 225 109 160 23 1 177
2832 177 -80 -208 40 -14 32 -330 110 -75 117 418 160 12 -5 160 176 243 -273 71 29 4 -67 42 -12
2855 -12 -95 136 -150 -72 -114 -206 14 -186 76 -139 52 29 65 80 29 -9 132 -176 -88 334 94 116 -48 -249
2879 -249 26 307 33 -36 -71 150 146 31 230 -119 -101 123 51 -40 -232 201 -305 -96 189 113 -27 53 134
2902 134 59 477 -264 -83 50 47 -236 181 -63 66 73 248 -380 -42 399 -43 89 16 -40 -260 -145 213
2924 213 -8 121 -71 217 58 -20 78 147 238 -134 -75 62 43 -176 -140 211 162 -73 -75 -213 -48 -150 54
2947 54 71 354 -197 -173 -146 -69 -118 53 140 85 -125 -38 88 -44 151 -195 -43 -131 -87 -206 -88 117 -139 86
2971 86 -100 -50 -22 -107 -188 -75 179 146 -25 130 30 -110 103 129 -84 -26 299 174 -97 -109 -127 0 -53 11
2995 11 400 112 54 126 91 -91 85 29 -56 242 -90 -161 68 78 88 142 138 310 -72 -62 80 -105 186 -237
3019 -237 120 111 -12 107 100 -136 -2 198 128 -63 -84 62 87 -88 -1 -63 -127 -68 -116 50 -80 95 -234 -87
3043 -87 223 -114 59 22 -34 28 -103 91 149 -32 152 132 143 171 92 47 -120 164 162 -200 -135 248 -31 96
3067 96 -7 -25 181 -56 -175 -166 143 -80 0 -71 11 -62 -125 -241 -136 37 -243 -63 158 258 -259 242 -14
3090 -14 145 83 -103 357 20 43 -234 -28 -7 76 -31 -71 -39 -70 -166 134 284 31 -3 110 -21 -41 128 217
3114 217 -48 -196 56 106 -267 230 47 -154 -159 107 -168 87 248 110 31 -317 -62 -30 120 -156 144 -183
3136 -183 226 108 -9 -127 228 136 220 -187 131 81 24 -67 -18 -66 -33 -384 -70 7 -349 -141 -46 8 -124 -114
3160 -114 -118 116 149 -46 -277 121 -11 22 91 -156 -123 290 -155 215 23 -189 -66 34 -75 4 97 -51 93
3183 93 54 232 106 146 -242 117 82 -180 -53 224 -220 29 54 -83 52 139 -122 15 154 -14 -10 18 -70
3206 -70 1 39 93 181 -75 -244 304 -176 -248 -23 -46 53 -181 67 -1 225 -156 25 -10 -191 -54 8 67 20
3230 20 60 -39 -110 -232 -155 -143 23 -284 11 308 -76 -13 81 -14 -27 89 307 20 64 72 -113 208 64 -3 -164
3255 -164 -158 352 -34 -125 -159 -21 -121 -238 35 -157 -18 26 89 -87 17 141 260 -31 -32 229 -194 -12 49
3278 49 -81 43 -35 -214 83 -4 -63 172 -37 -13 42 47 -241 0 -54 -120 -128 -87 130 150 -340 -50 205 246 113
3303 113 73 27 -306 170 -165 -9 145 -179 -137 13 -52 142 40 -161 30 25 -12 238 107 -82 -146 14 -137
3326 -137 -35 134 -172 -8 -121 -238 -87 75 48 33 -65 189 140 89 83 37 111 -247 -56 147 -87 73 -19
3349 -19 -253 140 7 -276 -68 275 136 114 262 136 -30 -69 -13 214 0 -102 45 -65 273 5 -79 -21
3371 -21 -199 -242 171 162 -17 25 180 -80 109 -24 32 241 -7 23 -46 -355 -82 197 -98 -245 192 55 -81
3394 -81 -13 -106 58 188 128 -118 251 4 -287 19 -370 -32 98 170 306 -3 -69 -165 -62 84 -20 17 -73
3417 -73 -43 18 72 -132 20 153 -62 -247 -91 16 91 -74 348 -229 -21 99 9 115 58 18 28 -41 -89 -77
3441 -77 -56 -15 7 -30 73 -206 -215 86 95 100 26 -47 224 -95 84 98 317 -36 117 231 264 95 -68 2 -184
3466 -184 75 -2 84 -32 103 -330 -137 178 346 56 -173 72 -165 -4 -43 79 -131 232 -92 -78 0 310
3488 310 130 249 391 -134 -274 -44 109 -195 -60 142 -77 -317 29 -322 64 28 -12 166 -14 168 3
3509 3 -250 -241 148 247 40 -182 94 -43 282 190 237 143 -116 111 -64 91 -46 -152 84 87 -133 -151 -181 -30
3533 -30 138 104 76 -110 -187 -106 137 62 -139 -56 -233 -142 132 -23 58 19 -139 -167 66 66 90 92 93 -284 271 101
3559 101 155 39 -132 78 129 36 156 -108 112 -47 28 -103 148 -56 266 -55 162 109 -148 -24 -136 6
3581 6 291 -108 -41 -82 -59 -154 -15 -70 156 95 -111 24 37 235 -204 14 143 90 -18 -8 -83 -306 12 56
3605 56 -127 -88 -136 -43 -109 184 69 13 2 -106 -339 287 47 -102 -185 -256 -22 14 -163 53 144 100 79 82 103
3630 103 -133 133 241 -15 -91 76 -9 -159 -289 -131 273 -124 46 59 -172 -57 -65 -70 -44 65 48 198 279
3653 279 277 17 -174 126 -197 -11 -44 -82 2 -291 38 -289 -214 181 -36 -61 83 193 1 102 -150 129
3675 129 37 -154 -238 1 -30 -8 79 -2 136 -102 33 -248 107 307 127 0 -249 -220 -183 132 -100 26 67
3698 67 -180 -200 213 -155 20 -166 -41 -5 71 -86 -95 -109 54 -43 91 -146 41 81 -71 -58 180 159 -96 -54
3722 -54 -116 272 -254 20 93 21 131 -273 -37 -72 -60 68 23 55 121 -210 279 -14 -238 -67 100 -123 -43
3745 -43 -91 -57 368 244 338 -118 -23 -113 39 -82 222 -38 106 224 -118 66 236 140 110 -125 58 82 74 -57
3769 -57 -310 90 -281 -78 -91 -58 396 -217 1 -192 -25 67 -296 71 202 -111 -45 -287 -56 -329 71 -50
3791 -50 326 -291 -79 269 -162 -88 -22 -78 -267 -14 -183 -30 50 89 -270 -6 3 100 35 -91 242 131 -158
3814 -158 31 107 127 -240 225 -55 101 376 -102 -294 53 179 219 -40 -10 -89 282 -25 104 137 78 43 -70
3837 -70 -81 239 240 29 14 -144 -266 21 -98 121 189 86 372 17 -4 80 -133 101 153 -29 11 -103 -82 -159
3861 -159 -92 418 224 268 -26 -65 -6 -178 -97 147 182 -216 -151 248 8 86 -76 39 41 -272 -162 -102 -124 206
3885 206 -76 2 -13 148 143 -311 113 93 -120 23 96 -84 -284 -194 137 -290 -106 -70 -55 137 -211 35 32 146
3909 146 55 25 142 -8 -258 -208 -47 -101 13 -221 50 -135 90 46 147 30 -444 -5 57 -35 187 108 -81
3932 -81 -9 -80 -184 -135 189 165 -98 -202 -338 -30 -101 426 74 -86 -87 236 178 111 -104 127 78 -232 41 99
3956 99 3 29 -111 -80 0 -21 -41 181 259 49 178 104 -186 -129 -181 -365 -47 -15 121 -265 211 -32 -208 151
3980 151 41 -6 -101 -9 57 172 136 -107 247 -175 -14 236 37 -174 -43 40 -70 151 4 -110 94 -126
4002 -126 30 -283 -60 -137 80 95 -61 236 -237 -218 -181 -74 182 87 -475 6 -79 4 112 -158 20 161
4024 161 121 -17 -114 19 112 94 137 -159 -49 -11 -184 -20 -99 14 -142 -283 -44 82 -178 -149 171 -90 169
4047 169 -180 9 221 -61 10 -180 -48 -115 -112 -21 29 70 -219 -128 147 -272 -258 -152 242 0 -207 -33 -186
4070 -186 204 221 100 66 -58 -62 56 32 22 158 0 -11 46 7 -53 -167 -149 89 90 -111 -36 -7 -79 177 -200
4095 -200 26 -190 200 301 54 380 112 -9 -190 -37 255 -52 92 -54 -131 208 -27 -13 183 96 2
4116 2 18 93 -42 -136 88 -105 -68 -74 50 7 -85 113 82 5 -11 -92 229 -43 -25 48 -158 -78 -205 57 119 -18
4142 -18 -49 -29 263 -118 105 314 18 -44 -128 -30 50 3 100 -267 177 318 131 85 18 400 -172 121 38 81
4166 81 -108 -72 68 7 26 82 3 -68 143 -54 -292 123 -80 152 -87 -121 48 -44 -327 56 284 -209 -88
4189 -88 -70 -8 -113 103 71 -233 -272 28 -8 4 78 38 12 36 -168 -137 -116 -89 -130 -11 118 71 -29 -367 -102
4214 -102 -8 -159 -89 -45 -121 163 109 -82 -220 114 110 -58 -32 -54 27 -126 -41 194 6 -252 -148 -9 107 -71
4238 -71 67 92 -315 14 -88 -90 63 -254 108 -162 -82 62 -123 -141 -101 -209 -1 -398 -320 61 -185 61 -47
4261 -47 140 148 -264 198 -7 -4 85 33 -157 -117 -256 42 128 -215 -121 -38 -61 -8 163 -82 19 -164 -251 -65 -130
4286 -130 201 251 301 282 99 -38 -332 -54 -65 55 33 -64 -223 -202 87 -22 -128 61 -68 195 -86 14
4308 14 -57 117 113 -32 -136 144 100 -93 232 57 258 -207 -133 -33 90 120 253 -114 52 -42 -139 103 -60
4331 -60 -142 140 124 37 365 -56 -86 86 98 -95 7 15 -100 -93 214 3 -14 -232 74 -95 138 -140 -324 85
4355 85 49 -120 12 183 54 187 74 -2 -8 -30 -202 -161 -207 24 275 -247 119 64 54 -193 143 -202 -7
4378 -7 31 -38 -3 101 40 73 -135 199 110 -27 39 187 132 -37 -140 -49 239 272 144 37 47 -93 162 -90
4402 -90 35 -136 66 -112 -225 227 -79 -180 -28 42 -19 -7 92 229 135 -181 277 -123 -51 -93 -276 260 -143
4425 -143 -204 -85 -18 -181 -142 144 -11 -58 -181 19 -38 -272 82 210 -136 -87 97 -134 240 109 103 -114 256
4448 256 -3 197 136 123 -255 69 420 119 -53 -49 -37 133 -65 -97 -91 34 -116 -256 -142 -24 102 -39 117
4471 117 90 -279 -98 30 -44 70 31 40 76 171 60 56 22 256 90 138 -106 96 -155 169 164 -321 -87 118
4495 118 74 -187 -104 176 90 100 -46 38 112 100 -118 48 155 -64 -26 85 154 62 185 -306 -51 -22 -134 -39
4519 -39 164 86 -35 192 18 -59 211 -319 -65 -177 -88 147 -24 82 194 167 -7 -190 -126 -87 125 188 0
4542 0 199 -314 -5 -75 -49 155 -113 -16 65 36 2 44 -73 -243 8 -98 22 155 246 27 -56 155 -12 34
4566 34 -4 62 142 -49 -75 257 -10 118 62 0 38 73 -4 128 -93 161 -61 242 -85 182 -424 -180 103
4589 103 -109 -81 -47 83 41 57 -175 -66 -82 -200 -256 -248 71 196 -144 -145 -194 -284 136 90 21 -15 -41 -172 58
4614 58 -217 -97 173 -166 13 59 186 19 -253 -31 -73 -5 -113 -236 72 -173 -309 111 59 -91 -123 367
4636 367 7 -185 14 -338 -34 118 25 120 177 -133 -27 16 49 118 -143 273 110 -34 136 123 -132 5
4658 5 -29 162 206 -92 20 3 39 164 104 66 -87 141 12 96 186 59 -203 231 18 255 74 22 -200 -97
4682 -97 -52 -273 -6 -9 -33 -367 94 207 163 34 -135 160 37 122 -101 8 -78 163 241 -55 -329 -206 72
4705 72 48 -261 -116 262 163 -91 -76 -141 34 -49 204 -209 154 138 262 78 -106 -264 -96 -145 211 16 -71
4728 -71 -113 231 141 -246 -201 -67 84 262 189 -127 -138 -120 21 146 -13 196 -339 -12 30 -311 -127 -104 -188
4751 -188 58 113 -225 -17 46 45 197 -219 -289 53 -21 145 -174 101 34 -204 -166 62 83 66 -56 47 12 -6
4775 -6 -8 185 -101 159 77 -110 1 -27 -66 -119 -149 113 -191 111 186 -159 221 244 -177 -150 -55 24 224 31 112
4800 112 314 262 192 149 164 71 243 47 -94 -7 -115 126 -256 109 -10 20 -28 50 -54 -224 153 195 -69
4823 -69 82 31 284 -28 -123 -3 -11 138 -133 33 171 22 -30 -66 -295 3 133 -183 19 70 126 129 9 214
4847 214 -89 165 119 196 53 -234 -83 -171 -120 109 12 -16 -48 -95 266 3 -175 15 244 -194 -120 -54 -254
4870 -254 -77 -17 70 135 99 -15 238 -8 -172 234 29 -346 26 -87 114 178 240 -158 -120 274 65 118 -70
4893 -70 -181 -100 -141 -346 302 103 -276 -188 -153 -214 85 177 -12 217 38 21 -142 137 -10 28 92 93 221 83
4917 83 256 116 -198 214 -37 176 38 124 61 101 -88 107 -86 64 185 46 69 221 296 370 162 178 238
4940 238 -122 9 -267 190 -34 -86 171 -28 -219 48 -34 21 -72 119 30 -119 10 -52 34 186 -140 -32
4962 -32 87 -129 122 204 96 68 333 -199 120 62 228 5 117 87 302 -22 241 -44 -24 3 -176 120
4984 120 -68 42 -62 285 -77 1 245 28 -12 228 48 -124 62 65 -5 151 256 -87 -59 63 -37 20
5006 20 -103 40 164 42 -27 50 126 -155 60 165 282 -80 191 123 53 98 -19 -325 -109 -288 225 162 -211
5029 -211 -4 -129 -42 -22 -315 -116 -115 34 150 -216 -142 105 22 -95 -191 -176 189 53 98 13 153 -121 94
5052 94 -55 228 -296 143 129 19 -3 172 -111 -51 101 143 -123 -17 -115 119 -85 214 -144 48 -77 132
5074 132 54 21 -155 8 -82 67 291 94 -96 -59 120 45 224 46 197 -170 -183 172 8 -254 -151 -221
5096 -221 -2 4 -74 -49 -28 -75 -189 -387 24 -122 -205 -16 -65 -53 276 -60 28 48 -86 169 -69 -64 -82 -194 24
5121 24 27 -72 -43 8 68 239 -3 151 31 -232 289 53 -15 -9 -199 204 292 48 -177 186 -174 -163 -273 260
5145 260 -163 -2 47 -37 97 -117 97 298 -32 -177 -129 -206 194 -97 75 1 -54 -221 75 103 66 242 -6
5168 -6 68 -47 51 -171 67 -6 -78 -229 21 13 -104 -256 -140 -12 -105 140 103 217 107 -51 53 113 -365 -172
5192 -172 51 -88 189 -198 -109 273 -9 -5 227 -96 -115 228 -55 -185 -33 -69 162 184 195 2 55 113 -78
5215 -78 -29 121 -9 -93 -37 43 -37 15 -24 -199 124 61 156 -62 -7 -63 137 -168 -90 -60 252 -132 114 132 -15
5240 -15 117 -9 291 -161 -31 -10 -32 -60 76 139 -82 -85 391 -86 26 71 126 36 69 -212 59 160 -109 -56
5264 -56 -16 -7 0 -37 -10 -11 51 205 85 -100 46 -276 -27 -128 127 189 -117 11 -70 -160 -86 -36 36 -45 299 -52
5290 -52 -106 -163 -65 -328 -128 -209 -70 -257 -197 -81 -147 -293 -77 -27 161 -137 50 84 3 175 -95 -118 -28 -22 309
5315 309 3 -125 147 23 -61 115 -123 -214 77 136 141 31 -255 -27 -94 -1 -29 200 193 0 23 103 269 300
5339 300 -96 98 208 -120 0 231 -32 -145 43 -195 -108 -188 148 -236 -101 103 36 241 154 27 -132
5360 -132 -243 -44 155 232 132 83 -84 -307 51 138 -149 172 56 -26 -258 -210 -98 -86 33 -132 -40 8 342
5383 342 155 -310 -289 -255 -17 112 63 21 -28 34 85 26 35 -339 100 214 -330 156 107 -46 -157 159 -119 -77
5407 -77 398 -78 53 -54 -43 82 48 61 -136 149 -203 -60 94 106 157 -51 -176 -26 -112 120 50 -205 28
5430 28 101 -186 100 -216 40 -135 -168 -283 -31 136 52 -235 26 -45 186 124 256 76 -102 178 -125 -94
5452 -94 408 -236 -384 165 206 205 -191 12 0 -41 186 -203 172 254 -112 126 167 -112 -205 107 89 -157 142
5475 142 71 -40 -261 49 -45 10 47 79 302 46 36 -394 -89 107 124 198 -192 -51 -25 -103 89 98 -36 -183
5499 -183 -36 -44 92 -272 251 38 -33 268 -50 -155 -43 -142 -281 -122 -102 -233 -33 163 109 140 67 4 -114
5522 -114 110 -33 -70 13 144 240 5 235 -153 -87 45 -155 -102 47 103 -178 111 -54 -64 -64 208 79 163
5545 163 -205 172 37 -191 -70 -149 8 -217 75 48 -2 -146 16 -175 155 -131 227 -25 -218 -130 160
5566 160 -187 125 122 72 -3 -243 -26 -353 -203 100 -107 177 -115 -97 193 20 7 64 -47 79 107 96 -151
5589 -151 46 -37 126 54 -92 -14 -46 196 -68 63 -13 -142 -17 -253 43 139 146 253 181 -181 21 -161 199
5612 199 210 -126 148 62 156 -136 -2 23 265 172 34 -179 300 -61 91 237 11 -158 30 -272 235 -4
5634 -4 -134 313 131 158 -5 225 194 -80 114 -138 -142 30 75 141 187 -251 -53 240 -67 170 185 75 -87
5657 -87 -132 -61 23 95 -135 21 183 -175 16 -16 -84 253 -29 64 115 44 61 113 -212 260 53 -99 13 226
5681 226 -34 118 119 -318 -32 -53 57 -66 140 -207 -95 -247 10 -22 214 -48 51 96 79 -190 -23 39 -44
5704 -44 156 73 -274 -323 16 92 87 144 75 -125 207 -126 120 -1 -151 -31 -201 31 -111 -8 -125 134 -52
5727 -52 162 90 -31 128 -122 25 164 149 -114 11 -315 -197 318 92 -47 274 -96 -247 188 47 74
5748 74 7 -91 -17 -27 257 46 68 34 -31 -146 -264 56 138 -159 -37 -105 125 -29 -27 -33 13 62 -54 71 84 -121
5774 -121 -53 45 178 -51 -163 -23 180 79 332 -71 125 -42 -359 23 191 47 77 -181 518 38 -14
5795 -14 -59 208 16 231 133 165 138 123 90 82 -91 64 -216 -56 -57 -11 68 -118 -17 52 -226 -218 -59 -63 32 19 154
5822 154 -7 -81 -150 -56 -43 -166 155 242 122 -160 -309 123 14 203 51 86 38 100 182 -125 -22 4 98 -8
5846 -8 138 183 161 -99 -18 -74 -142 157 101 94 -128 -269 190 -106 -31 0 -4 15 -73 -68 67 -315 159 -5 -130 159
5872 159 -115 -214 -44 86 5 201 101 239 160 280 141 -94 -99 -217 22 119 79 -35 140 -51 33 1 19
5895 19 -151 7 -169 -70 137 7 84 21 91 -58 -110 -61 -288 232 -89 -320 -70 -5 74 -126 13 347 -248
5918 -248 37 154 87 -159 -115 -104 241 -92 -74 105 -377 111 -164 112 -147 136 20 96 -76 -179 -35 -62
5940 -62 -248 -75 -3 -84 -219 -10 -31 102 276 232 141 -96 -345 -354 29 241 -57 -174 17 -66 40 -104 174
5963 174 -242 -90 -18 -98 100 -36 102 68 92 83 11 -14 -8 43 58 -50 -10 -67 -323 -116 -140 -42 111 -211 32
5988 32 -2 -53 -15 126 6 -220 227 -142 184 -30 -217 136 -286 120 42 -117 72 -244 40 -301 46 160
6010 160 19 11 -72 -272 192 -305 -13 48 -224 -164 -133 -46 229 -56 -178 -199 232 -20 189 -14 -249 138 -45
6033 -45 43 96 330 -193 -64 -141 -170 109 -300 -72 66 154 187 251 102 -191 -154 156 132 59 -65 214 -7 22
6057 22 10 -201 -50 21 -81 -156 -32 208 117 142 255 -134 299 -17 49 64 45 -65 33 18 -107 -62 -19 77 358
6082 358 -154 9 15 -87 183 0 -34 282 -99 -83 -238 -364 -64 -164 -66 214 -61 -23 -127 48 163 -70
6104 -70 57 160 60 200 193 -58 -22 -141 -34 110 12 50 307 134 145 -35 40 44 -219 166 26 51 68 -127
6128 -127 -249 14 -40 -16 -158 -181 148 -7 49 8 67 14 -266 89 124 308 143 96 71 59 -14 -200 -118 -104 -188
6153 -188 -98 170 130 -74 29 53 -124 -169 0 23 -165 -176 17 68 -10 5 -74 -200 90 441 53 2 43 -227
6177 -227 -268 -95 13 -58 61 -312 -36 120 70 -106 -203 -128 -184 33 103 -209 33 -86 -132 202 -37 -179 -56
6200 -56 113 72 -13 -88 76 -238 117 128 -118 128 56 -66 -186 -102 -21 -134 -220 111 -148 -78 80 -107 55
6223 55 -46 -246 8 -85 -156 -253 -13 -112 121 -123 80 36 -109 62 -37 -199 203 -178 -159 57 72 -15 -121
6246 -121 20 -153 -120 135 -105 252 209 94 81 131 -99 104 -160 -18 44 55 14 101 -217 -127 -191 -36 203
6269 203 24 -35 -206 -30 -84 265 42 23 -208 7 -58 -65 54 31 93 -28 228 72 -133 -254 79 -135 -237
6292 -237 202 -69 136 -34 100 155 120 -123 -71 -63 119 -3 41 -93 -174 -157 -227 155 -27 216 224 0 -110 -230
6316 -230 -120 225 46 161 -53 -217 226 61 56 27 63 76 190 100 -39 -69 -349 331 63 133 61 -63 104
6339 104 -208 -76 -287 88 -131 85 -173 4 178 -126 307 205 169 -220 58 -254 75 37 24 47 91 47
6361 47 62 12 -196 -72 -140 -110 63 -67 -123 34 65 62 -41 16 -9 -36 -39 54 198 -47 -167 278 198 -89 161
6386 161 -4 -7 -103 234 53 -177 -75 45 -9 -6 -88 -301 -92 -147 62 -128 149 177 -10 -74 -195 -48 289
6409 289 170 54 11 29 178 125 -44 126 -168 115 205 -111 -148 -51 -113 -116 -69 -231 -17 42 -17 111 425 -78
6433 -78 -58 102 446 -79 36 -59 121 156 -120 -178 -135 192 39 -2 80 38 -8 -74 102 149 -215 -51 -215 65
6457 65 -185 -193 -133 -45 97 40 -60 -92 321 -79 31 336 -18 -66 42 197 156 59 -9 -33 12 -115 -96 32 269
6482 269 -29 105 129 34 93 50 189 241 48 123 375 103 -76 55 58 165 114 37 -141 95 129 -197 49 -22
6506 -22 -103 181 71 -85 -45 168 78 4 115 84 68 67 -204 -63 -82 -125 12 -35 -157 156 -89 32 -199 53
6530 53 -61 18 -219 -14 155 -117 62 -184 404 116 364 -126 -305 119 56 -178 54 -132 166 -154 213
6551 213 104 -136 -161 33 -191 107 95 -140 -67 93 92 -102 -312 46 99 203 48 227 -196 73 -165 71
6573 71 90 63 203 -63 183 -29 -25 110 113 -237 -27 -52 55 44 -107 -102 99 70 -227 -169 96 177 295 -23 19
6598 19 -90 -167 -177 -166 -20 113 70 -140 -269 -81 239 95 -189 -17 -197 32 -88 153 117 82 174 -58 -55
6621 -55 11 -105 60 -119 169 -42 -87 27 89 -255 -64 166 -28 173 123 -216 -46 291 91 -33 85 119
6643 119 -149 30 19 178 65 22 277 176 -26 -207 -230 -172 176 -2 17 70 -72 -431 -54 198 170 147 66
6666 66 -56 -210 -202 479 132 68 -206 -272 -34 -61 102 40 46 221 147 -45 52 -76 92 65 -91 -103 -68 59 -101
6691 -101 168 18 -22 44 -108 65 185 -256 62 139 -21 -245 163 -240 -170 107 -211 -139 -12 38 -150 -255
6713 -255 334 -89 132 36 21 -336 -37 -69 105 112 -40 -54 -228 -213 272 156 86 -66 1 -156 -78 -78 -132 96
6737 96 -1 2 -26 -61 -87 -149 -1 -10 41 -14 -85 60 -176 -100 99 177 56 213 -99 -14 -274 -6 227 56 136 107
6763 107 107 47 -91 71 -37 -193 140 -49 194 138 49 -127 295 61 -87 -145 123 198 -61 -221 101 -123
6785 -123 230 -56 -6 42 352 -145 -446 103 -114 143 11 194 -124 105 334 -20 10 -161 77 233 17
6806 17 -113 74 242 -19 7 26 -65 -120 -19 -79 57 28 -24 83 -262 147 41 43 -88 1 17 95 -87 -37 -72
6831 -72 203 -199 143 -389 -45 -133 -115 96 -30 82 -265 -27 -14 -29 -220 59 284 -79 -245 113 131 83
6853 83 255 124 118 -74 94 -25 -183 -146 133 90 8 64 41 63 180 -256 18 192 -32 35 77 28 -134 121
6877 121 -30 93 242 25 -226 -121 -76 -160 -54 142 49 -90 62 -20 67 81 -42 256 -11 -35 -325 -137
6899 -137 -259 -30 -211 212 -158 191 137 109 -74 -196 82 -58 20 66 149 1 23 67 -135 -65 248 116 70
6922 70 -163 -31 -10 291 27 -129 -147 -279 77 -98 -97 64 40 147 137 -74 -7 -38 23 -25 224 64 -4 55
6946 55 144 19 59 -21 86 -56 -16 -10 -76 -88 150 154 40 -111 -69 138 432 -142 -112 -291 -143 137 96 20 91
6971 91 47 -82 140 -187 53 -50 -106 66 15 27 -121 -73 42 51 -7 -92 -140 225 -203 -247 -147 -453 -29 -109
6995 -109 178 149 -66 205 28 -9 -112 -322 -118 85 -3 89 -84 103 -212 90 -120 -84 136 33 -71 164
7017 164 25 -40 -64 -50 -104 91 146 154 -42 151 140 -157 111 30 14 134 39 -155 39 -49 -105 -153 -30 37 -115
7042 -115 -39 -194 289 265 199 -98 -78 -252 -116 44 176 -168 -56 160 -63 143 -43 -42 112 -121 200 108
7064 108 39 190 -61 -82 54 -113 -15 -257 195 12 -10 126 26 168 -164 -68 186 -96 68 -106 -272 2
7086 2 -360 -163 -38 169 366 -121 -84 191 154 -56 51 -160 -23 56 -224 -116 -55 236 76 -167 174 -151
7108 -151 -88 -258 -27 -38 220 23 -226 368 -98 79 -7 -27 44 177 5 -399 -167 -210 -246 52 79 -363 272
7131 272 -24 127 -159 229 -74 -154 -76 -192 -207 110 252 106 -34 16 10 -20 127 -32 144 -14 1 -157 157
7154 157 -18 -41 44 -11 93 42 101 -4 -86 57 -326 -25 170 -242 -130 -174 1 91 189 -250 171 162 11 109
7178 109 94 -333 -247 -141 49 35 -71 45 295 -85 49 120 -5 1 81 -35 137 -83 140 -88 -73 201 22
7201 22 -176 -138 -57 111 -38 88 -91 -51 -163 -155 -80 -206 218 16 -100 -77 -81 200 238 -290 126 -110 -127 -50
7225 -50 -14 132 207 6 225 6 -414 115 150 -12 -4 59 -100 -232 3 -161 6 83 13 -103 38 -31 186
7248 186 -34 -336 -46 193 78 -60 -117 -97 166 -83 -6 -143 147 -10 -298 -231 -52 -29 -125 183 -68 -144
7270 -144 -12 159 34 -48 227 -35 39 -137 -57 127 25 -159 152 -104 45 -203 169 -113 -53 201 166 -51
7292 -51 113 44 -18 -159 -20 6 132 -352 23 -94 -112 -39 2 -63 -250 190 88 17 -146 81 35 -112 -164 4
7316 4 -237 -103 -206 -87 -102 12 80 353 -30 46 -281 55 238 -143 67 -163 -164 -89 -36 127 -10 57 -285
7339 -285 209 74 19 175 113 1 54 11 173 -208 -281 -13 84 175 11 -65 -164 -5 -275 141 86 18 -235 42
7363 42 82 7 89 17 -38 -65 37 -95 56 32 245 -39 -86 84 142 177 293 -42 -180 -60 -29 -244 -158 -97 -101
7388 -101 131 -59 -76 26 -373 -202 181 -47 -312 17 -65 -196 131 -249 11 -61 81 -344 -107 154 -89
7409 -89 -129 39 218 9 -61 71 51 -220 60 -64 89 -21 -277 -77 83 114 -209 134 89 107 -143 -172 -162
7432 -162 -58 118 183 -191 47 154 230 41 -386 16 53 -45 43 50 -121 -32 -56 102 -131 -63 -150 29 -54 92
7456 92 -91 41 -117 -51 4 25 214 70 -79 -5 -23 -18 188 123 -21 44 192 59 -369 -62 -11 -182 -229 -46
7480 -46 -56 43 -13 -81 -126 -35 274 -209 -140 -361 15 92 -58 108 -118 -27 68 -20 -67 204 -281 34 -66 86
7504 86 86 -93 317 -56 -118 -47 333 326 215 -93 -106 39 157 11 -88 13 308 -53 177 169 -24 41 15 -127
7528 -127 -197 297 88 -211 1 16 -29 -83 -276 106 155 108 62 163 84 66 77 53 182 -52 -61 -71 158 -117 175
7553 175 203 -14 51 102 -15 72 109 -106 -282 43 -26 79 44 -201 2 30 -29 20 -218 -275 -112 -144 -77 -100 -148
7578 -148 -51 -33 118 -53 -69 85 -43 -253 138 276 57 160 -137 87 249 57 64 161 -241 192 -192 18
7600 18 -56 -143 20 73 190 286 75 -134 16 6 47 -71 -29 158 11 -36 38 -208 -48 36 -170 -90 -266 -169
7624 -169 -107 -108 -103 89 141 114 -12 83 196 131 113 44 -251 214 61 8 99 408 -99 -122 -93 -101 -51 -36 -134 -99 99
7651 99 191 134 131 119 -186 -111 90 32 -143 -255 -6 42 -225 -202 -29 -228 -55 5 170 125 44 -20 53 -288 125
7676 125 6 -4 -246 -73 -138 79 413 65 356 98 44 269 276 -16 -71 -88 -95 -101 82 -49 49 -83 408 193
7700 193 -112 -24 -157 -19 -98 -10 132 54 -113 221 152 -46 231 78 101 -185 67 59 32 268 80 -170 215
7723 215 -65 149 198 107 -137 37 -231 -43 117 -304 -213 -148 259 -208 73 252 70 216 -122 53 63 -216
7745 -216 204 -53 168 43 -26 67 -63 122 57 153 -50 186 198 19 176 50 58 -116 -198 86 -168 -198 -67
7768 -67 -122 -143 1 403 -40 215 -89 -55 33 327 30 -100 11 -51 -97 -13 69 119 100 8 40 109 120 -47 -15
7793 -15 -13 -5 218 -121 95 112 11 115 -324 -262 -25 -36 58 -203 -328 60 25 169 -36 9 -78 -302 -52 -60 104
7818 104 29 4 -7 -329 61 135 -90 -10 -56 -58 31 -132 -298 -88 -110 78 -118 150 -44 -5 69 -141 16 -221
7842 -221 138 95 139 -146 -36 -148 -91 -158 23 213 -8 93 187 -108 -90 -92 -194 -173 -125 70 35 81 34 -108
7866 -108 -186 147 -103 33 144 122 -73 10 -74 -132 -80 61 -73 295 21 -127 -280 -77 -46 64 -26 107 -237
7889 -237 -115 72 -157 65 56 17 3 -81 252 -166 -78 13 -196 -178 -55 -222 -68 199 169 64 -45 -4 -36 106
7913 106 4 113 -16 -90 -37 -100 22 29 -74 -277 36 49 187 125 -216 53 169 -28 -22 -109 22 -27 -66 146
7937 146 61 278 -135 -258 -14 -255 -130 -48 221 45 11 195 -39 -236 206 179 25 -164 -43 -263 -175 -106
7959 -106 105 -197 220 19 -244 208 -60 -6 67 92 128 -146 155 155 -342 25 162 116 -22 -59 118 91 236
7982 236 2 70 95 -78 -45 51 -113 -14 -123 -88 97 -152 105 84 131 74 1 3 -164 289 145 101 66 213 80
8007 80 -178 -21 2 -6 -17 -315 118 98 -140 35 -146 93 -135 173 -83 -78 307 -247 157 191 -163 9 -21
8030 -21 -33 61 51 -3 -8 -119 -18 67 20 -380 42 -18 -137 -33 -63 -130 107 275 50 -74 56 -132 -111 -64 -313
8055 -313 0 -226 -33 -72 227 -28 191 37 -233 -109 -56 57 -17 -91 75 47 -70 191 134 190 104 -17 167
8078 167 140 231 -42 161 134 -119 134 140 15 -18 159 -12 -55 -26 -147 91 -85 27 94 0 -72 90 62 6
8102 6 136 -103 125 -172 -61 109 181 366 178 -99 -181 -13 -48 246 -62 108 1 30 35 -4 55 151 260 92
8126 92 -67 68 64 144 -73 41 44 -101 329 55 40 147 227 -61 161 47 -208 87 -106 4 -123 -16 163
8149 163 -250 -31 18 -44 -99 -37 224 88 221 13 -64 -49 173 138 295 42 88 -119 -90 65 -122 -230 161
8172 161 232 8 -47 215 -250 41 -165 85 -26 -200 -218 0 -48 195 -7 88 43 74 124
8191A24
$$ Imaginary data points
##PAGE= N=2
##DATA TABLE= (X++(I..I)), XYDATA
0 0 0 0 0 0 0 0 0 0 0 0 0 0 8 -8 8 -8 8 -16 16 -21 24 -31 32 -40 48 -56 64 -75 86 -101 114 -132 149 -168
34 -168 189 -215 243 -271 303 -339 379 -419 466 -517 573 -632 699 -770 849 -935 1032 -1134
52 -1134 1252 -1379 1522 -1683 1866 -2074 2312 -2593 2925 -3325 3820 -4452 5288 -6452 8199
67 8199 -11132 17335 -59734 155091 118577 -31286 295480 268864 -82082 -50035 104786
78 104786 -151022 -222390 85405 156644 4152 173700 338253 147590 40066 152678
88 152678 56708 -94019 3884 81384 -15959 23785 156830 84804 -23324 58924 64287 -70588
100 -70588 -67260 18858 -26542 -80826 -30991 -24249 -92359 -85092 -50401 -88858 -83115 -16005 -25988
113 -25988 -65724 -38536 -24482 -81736 -108386 -63222 -43568 -50968 -9652 32532 33337 30982 21670
126 21670 -4917 -19430 -9665 -342 7030 48044 94788 90901 72415 66995 44933 6674 -19526
139 -19526 -11324 18007 43333 69263 88954 91860 74806 27582 -25303 -54522 -66133 -64471 -45969
152 -45969 -5986 42848 60062 45441 22450 -11024 -54033 -97318 -114682 -92606 -59309 -26613
164 -26613 8220 34208 44081 25104 -12769 -40945 -55196 -60596 -56815 -36669 3973 34267 38202
177 38202 38635 35984 23797 4309 -12185 -7035 7062 15612 22319 27716 34089 31841 13670 4093
191 4093 9449 14897 15901 15366 22796 25457 9049 -9027 -17867 -20739 -18417 -16861 -5211 14513
205 14513 21729 14585 -368 -12710 -23285 -40364 -47434 -32679 -12018 4861 14114 19739 22295
218 22295 7502 -16206 -31320 -34382 -25864 -16821 -2248 21971 36956 34449 20471 4745 -6165
231 -6165 -19429 -28976 -19258 459 19560 29318 30590 31012 20465 -1935 -19796 -25567 -19139 -10032
245 -10032 -1557 14360 26880 25159 12718 -3480 -12304 -18193 -24863 -19514 -3769 10723 18085
258 18085 14589 10877 5453 -8484 -20225 -21848 -12138 900 7639 14931 22476 18204 5933 -10018
272 -10018 -17652 -16133 -15268 -8870 5418 18518 24102 16644 5542 -2920 -14806 -24803 -25942 -16091
286 -16091 -502 8510 12614 16572 12757 1080 -13834 -23823 -21582 -16873 -11256 111 12094 19423
300 19423 15513 5721 -75 -5810 -12139 -12640 -6250 6639 15187 16024 17360 16259 10199 1780 -4967
315 -4967 -2340 3389 5567 9333 13293 14832 10409 356 -4052 -4174 -4489 -3465 -429 5241 7952
330 7952 1064 -6681 -12040 -16700 -19525 -20021 -13044 -1474 3776 4586 2181 -3321 -10896 -22659 -28036
345 -28036 -23829 -15373 -4829 5738 15511 21770 16990 6085 -3681 -11625 -15325 -14589 -6517 9347
359 9347 21929 28635 30524 26721 19304 6625 -5510 -8364 -5826 292 7728 15297 22615 22698 14133
374 14133 5494 -2516 -8704 -13074 -14203 -8607 -1965 489 749 -1686 -4792 -9934 -17176 -19028 -16368
389 -16368 -13301 -9593 -7608 -3940 -2874 -6668 -10007 -11208 -10565 -8058 -6587 -1736 4147 5876 5833 4749
405 4749 4306 5171 3748 4715 8672 11608 13081 11666 10418 10420 7532 6106 6996 9667 12996 12799 11786
422 11786 9917 4752 -2265 -8124 -11048 -8682 -5542 -1924 4057 7505 6824 851 -7925 -14881 -21709
437 -21709 -25584 -23828 -17381 -7134 1713 6334 9153 6749 -488 -9283 -16706 -18786 -16788 -11912 -2460
452 -2460 7589 15886 19151 17112 13515 8164 1379 -2742 -3786 -370 4824 8894 13518 16482 15801
467 15801 13074 8659 5081 2962 -22 -977 -463 -458 150 -1258 -2434 -2030 -3255 -3983 -4450 -4581 -4413 -6734
485 -6734 -8994 -9916 -11516 -11960 -11690 -9934 -6057 -3545 -2355 -846 -794 -2111 -4081 -6288 -4998 -3190
501 -3190 -152 3000 5800 8856 9215 7336 6383 4993 4494 4763 5586 8870 10871 10959 10450 8490 5821
518 5821 3159 -150 -342 1117 2463 4440 5221 5213 3056 -1675 -5723 -9364 -11335 -11000 -10474 -7060 -3282
535 -3282 -1685 -853 -2406 -5182 -8026 -11452 -12901 -11410 -9384 -5924 -2052 676 3314 2715 1755 676
551 676 -939 -1098 -1220 620 3138 4969 6538 7884 7818 7906 7203 5893 5813 5435 5568 5416 4958 4717 4036
570 4036 2596 2660 2040 1884 2181 1171 1274 -76 -1365 -3241 -4616 -5120 -5325 -5615 -4509 -3594 -3263 -2774
588 -2774 -3939 -4431 -5412 -6489 -6262 -5569 -4532 -2443 -1769 -280 308 -477 -794 -1440 -1257 -287 181 1514
606 1514 2676 3580 4618 4144 3305 3192 1712 1612 2031 2389 3496 3992 4246 4324 3231 2268 1091 -193
624 -193 -384 -504 -564 325 353 504 342 -655 -800 -1570 -2355 -1927 -2177 -1662 -1470 -1355 -1000 -1505 -1315 -1127 -1872
645 -1872 -1425 -746 -491 -20 -108 343 175 -541 -663 -382 -661 89 316 667 1388 941 1188 562 -121 -413
665 -413 -938 -1206 -371 -468 156 532 639 998 268 10 13 -891 -539 -681 -678 -47 369 573 1196 616 937 1061
687 1061 423 1009 900 681 987 1130 1406 1273 1020 1133 973 591 799 712 1000 453 441 237 -434 -616 -720
708 -720 -1499 -1405 -1251 -1129 -854 -1122 -814 -1299 -1932 -1948 -2129 -2485 -2722 -2584 -2106 -1168 -1086 -282 -310 -18 -482 -624
730 -624 -374 -340 38 791 1188 1700 2585 2238 2375 2220 1703 1749 1955 1744 2213 2309 2693 2913 2116 2159 1217 713
752 713 741 -148 187 -188 -309 -317 -577 -1112 -1583 -2399 -2405 -2473 -2542 -2698 -2532 -2786 -2804 -2918 -2678 -2631 -2391 -1793 -1587
775 -1587 -1173 -660 -871 -677 -833 -942 -567 176 987 2183 2598 3177 3403 3100 2165 1567 1428 1754 1548 2584
795 2584 3870 4058 4279 3561 3092 1949 302 -664 -983 -1219 -383 359 781 771 174 -1076 -1800 -3263 -3988
814 -3988 -4526 -4099 -3435 -2700 -1817 -1393 -1573 -2157 -2685 -3286 -3061 -3467 -2436 -1510 -561 368 760 868 767 577
834 577 644 649 1061 1802 2295 2955 3429 3324 3195 2981 2576 2397 2346 2187 2434 2529 2078 1682 1357 1174 565 328
856 328 297 -14 -341 -1046 -1239 -1631 -2298 -2351 -2533 -2654 -1892 -1637 -1447 -1208 -2302 -2590 -3374 -3908 -3676 -2940 -2050
877 -2050 -853 159 1103 1142 475 -7 -971 -1487 -1083 -1039 642 2177 3313 4220 4087 3682 2649 994
895 994 280 -317 28 1212 2110 2857 3564 3330 2434 1143 -113 -805 -1400 -1575 -883 -355 483 725 277
914 277 -263 -879 -1938 -2262 -2895 -2051 -1718 -1372 -924 -861 -843 -1139 -1640 -1480 -1321 -964 -774 -272 -239 31 -90
935 -90 -203 25 50 657 687 1329 1452 1260 1310 718 521 209 135 900 1068 1724 1831 1715 1173 588 -84 -785
957 -785 -940 -499 -42 369 507 1431 839 480 -736 -1757 -2029 -1960 -1608 -560 166 1013 1089 695 -172 -1070
977 -1070 -1638 -2105 -1658 -1201 -215 950 1605 1642 1311 431 -220 -1059 -1175 -901 -211 768 1054 1177 1251 1182 158
998 158 -551 -729 -743 -857 94 364 662 768 400 78 -529 -790 -695 -497 -18 75 437 517 248 -68 -585 -961
1020 -961 -732 -353 163 594 595 898 807 39 -328 -650 -593 -349 286 793 1376 1172 794 385 -498 -686 -1010
1041 -1010 -620 -247 269 795 959 402 404 -434 -799 -985 -1160 -560 -91 364 740 472 498 -76 -656 -833 -1026
1062 -1026 -761 116 310 1014 1207 520 543 -251 -585 -529 -145 170 649 1088 1080 1065 569 14 -385 -548 -215
1083 -215 -8 475 978 1129 1025 683 -40 -643 -1285 -1122 -467 -338 572 738 560 307 -266 -860 -1483 -1677
1103 -1677 -962 -693 -3 844 887 1115 364 -30 -581 -1121 -1259 -622 151 978 1400 1358 1180 696 346 -147
1123 -147 -416 -759 -9 386 629 1109 1102 817 622 124 -197 -459 -217 -96 17 319 -86 84 -39 -570 -775
1144 -775 -814 -793 -401 -35 -232 -171 -580 -890 -898 -686 -447 -279 203 416 261 162 -180 -460 -623 -611 -413 32
1166 32 765 1371 1648 1619 1172 308 -247 -237 -284 -201 463 1206 1507 1525 1105 889 -58 -782 -1176 -1003 -371 -91
1188 -91 349 914 980 585 -168 -790 -1469 -1605 -1824 -1262 -804 62 102 377 -2 -155 -892 -1370 -1131 -851 -662
1209 -662 -175 515 872 799 394 363 57 140 53 248 293 768 824 1106 823 928 700 897 422 642 422 682
1231 682 629 152 -282 -83 142 -96 101 206 364 282 -80 -247 -685 -1387 -1112 -1191 -668 -168 103 344 41
1252 41 -163 -640 -1057 -1183 -1448 -1035 -644 126 903 1002 1218 848 249 -508 -841 -767 -273 36 815 1402 1297
1273 1297 1479 1069 710 -115 -503 -642 -327 262 473 757 872 694 385 88 -477 -510 -800 -980 -236 -197
1293 -197 338 113 218 -157 -421 -788 -792 -652 -446 -700 -286 -297 -158 -409 -394 -555 -219 -232 70 371 184 56
1315 56 -12 130 57 47 214 625 543 743 567 624 374 149 -251 -281 10 429 481 1065 734 600 15 -9 -609
1338 -609 -597 -647 -445 -133 177 375 303 15 -177 -612 -819 -1301 -1062 -708 -347 82 244 367 336 -127 -575
1359 -575 -645 -858 -660 -302 239 581 694 753 387 -104 49 -276 -346 -441 263 506 575 396 434 610 128 -178
1381 -178 -193 -223 -14 133 311 335 401 41 53 41 16 -226 116 -33 214 -44 -209 -241 -425 -252 -249 -518 -195
1404 -195 41 27 -6 -176 -63 -308 -461 -469 -337 -154 28 398 17 5 325 -171 -173 -274 -156 -106 17 264 436
1427 436 508 211 65 199 -143 -369 -30 24 273 326 393 430 362 -31 -262 -142 87 -134 216 240 333 286 350
1450 350 -263 -235 -217 -428 -83 -120 -30 373 194 313 174 -439 -572 -283 -353 -170 -41 -25 139 208 88 -115
1472 -115 -135 -562 -748 -279 -127 -47 125 242 -8 -227 -314 -497 -69 -292 -161 16 164 90 212 284 0 -120
1494 -120 -263 -313 99 331 385 414 335 185 52 -60 32 -353 70 63 121 576 389 467 162 -298 -138 -176 -282
1517 -282 -108 -199 33 -135 -53 -199 -82 -395 -444 -318 -4 -81 -166 -228 -462 -330 -308 -172 -131 117 31 287 354
1540 354 237 175 -97 -81 -238 -472 -377 65 269 325 768 579 206 185 -180 -62 -62 -96 -90 417 466 440 308 471
1564 471 -47 -281 -698 -334 -459 -210 140 180 173 -103 -112 -587 -110 -563 -315 -20 -154 -36 -105 43 97 -162
1586 -162 -207 -192 141 -260 80 130 264 176 139 27 258 67 237 242 201 127 207 252 233 176 30 196 124 249 -75
1611 -75 40 170 238 103 -116 -121 -203 -177 -52 127 495 269 13 -176 -233 -555 -385 -191 -383 49 54 390 77
1634 77 -168 -8 -322 -283 -418 -164 -257 50 30 602 258 522 -227 56 -91 -93 -130 136 252 458 718 274
1656 274 246 488 -48 -154 125 -201 -72 -183 449 38 -2 102 -140 -98 -212 -148 -247 -232 -193 -68 88 -230
1678 -230 175 -182 -211 -449 -203 -21 -274 -336 -57 68 -78 90 -62 -72 176 29 33 -133 184 -108 12 31
1700 31 103 217 334 394 276 49 333 160 -53 72 -100 129 55 165 213 30 -165 188 -251 -178 12 -56
1722 -56 -43 -179 -15 312 104 143 -150 -96 -356 -332 -344 -265 26 -66 -231 -90 52 -328 88 -321 -146 -10 0
1745 0 -163 74 143 73 319 -257 -1 -242 -239 -24 218 89 69 93 263 166 193 -211 296 130 -135 -129 175 148
1769 148 143 -3 -1 141 -71 73 -111 175 245 -416 44 -42 -280 -37 -139 58 -296 87 146 -199 116 -17
1791 -17 -226 -158 8 254 -177 -43 21 231 59 88 128 16 -126 130 -97 -53 129 -48 75 -14 87 -440
1813 -440 -80 85 -361 116 -114 -126 -96 -125 -99 165 42 15 -163 29 -4 161 135 134 -108 -18 400 -83 -43 106
1837 106 68 262 -23 181 -122 -199 135 22 -252 -237 -126 100 172 136 179 -24 98 -40 -27 -209 -424 -124
1859 -124 -13 164 0 116 164 -122 59 -216 -121 -210 -127 -89 278 -103 -128 -5 -93 -90 -151 124 248 69 188
1882 188 261 190 50 236 -54 -17 37 102 156 -310 300 193 153 88 4 -38 -111 41 -23 -123 107 -277 90 -281
1906 -281 -71 10 -150 113 58 -141 -128 84 17 30 -75 37 -115 152 -84 50 -45 -61 57 -55 -45 127 -95
1929 -95 227 -85 87 371 -128 -99 -88 102 -90 104 -34 204 -258 -29 -147 -110 134 -148 75 51 -106 -49
1951 -49 -75 -281 -92 -184 80 52 -50 203 -203 99 -190 -309 -9 -17 -119 -77 -102 -316 50 -38 41 -93 -81 -29
1975 -29 -14 52 14 -66 131 -69 104 108 180 212 545 105 16 79 73 329 -21 -9 -26 35 70 197 -53 33 170 413
2001 413 -128 -149 -336 -94 -79 -122 8 -61 -24 -13 72 -134 -169 236 -178 -164 -197 -172 54 -85 -98 216 18 81
2025 81 37 92 -19 179 145 401 -97 -115 54 192 42 16 -55 56 241 242 -157 10 -86 -53 28 -221 -77 121
2049 121 -143 -19 -116 -271 102 -124 43 -49 165 -108 34 -95 -59 -142 -168 49 -35 175 51 45 18 111 -66
2072 -66 293 -322 -237 -53 -26 113 222 201 24 -8 -322 -24 105 258 160 108 181 73 39 235 26 -139 -45
2095 -45 -38 -121 5 -12 -40 0 -194 -153 230 -102 -270 -33 -62 -447 -129 -214 -28 -40 106 -35 -1 -60 -23 280 77
2120 77 -145 370 260 -9 -100 -98 210 -145 87 59 12 284 30 -255 104 -132 -213 -134 129 34 -49 -66 -41 -418
2144 -418 222 250 14 -91 -234 -103 -111 4 65 -143 -96 -319 44 -271 -28 53 62 293 14 -169 176 -128 -54
2167 -54 201 -4 160 21 38 210 117 214 120 -10 -46 -31 75 12 113 -15 63 231 106 -10 101 58 -88
2190 -88 -64 344 -192 -148 142 -5 -253 -179 -18 -238 -152 180 163 -14 274 -23 70 64 -83 147 -118 -71 -37 -106
2214 -106 51 -126 -79 24 13 -223 -190 -258 -173 40 -174 206 -61 1 -127 376 309 -65 -110 156 -80 12 199
2237 199 -102 239 34 -297 68 88 -71 -66 -101 165 189 101 107 -153 39 0 -49 61 110 -52 117 -90 -93 -92 247
2262 247 170 15 -219 -155 -5 132 3 49 -10 216 95 -38 -193 -157 -108 4 183 41 33 -414 -55 221 167
2285 167 182 113 -10 -314 48 183 -315 -130 -57 261 -93 -115 -105 -97 43 -113 -178 -238 -53 -90 -293 22 -90
2308 -90 -132 141 -100 142 -73 278 -210 107 162 119 24 -168 -29 -40 -148 66 23 -92 -276 -25 311 -121
2330 -121 26 198 5 -279 -383 40 -285 38 65 -38 81 1 181 75 -68 -383 -79 94 -25 -30 25 -155
2352 -155 -35 -89 -13 269 46 382 140 230 121 -244 102 -99 -70 134 5 0 208 76 159 16 102 24 -65
2375 -65 174 69 93 -12 -62 -68 -179 35 120 -95 -39 -172 -80 -191 125 58 143 116 -123 -144 -347 56 -114 87
2399 87 -25 -120 -75 -17 -3 112 -120 -154 40 -290 -157 220 146 -333 197 134 2 -67 480 129 22 210 -53
2422 -53 -61 -68 44 -263 -128 0 -19 4 -191 -98 48 -68 116 -10 -286 104 193 -174 224 -140 57 110 54 -257
2446 -257 212 -162 84 -36 318 157 -99 175 -186 60 130 -207 19 41 -220 -10 123 -100 8 -30 -251
2467 -251 -346 302 147 -163 239 41 91 78 -50 -73 -63 -29 18 -13 18 -65 -29 136 206 270 148 -156 125 30 117
2492 117 81 46 9 59 16 25 -124 -40 55 280 90 -163 -45 127 295 -132 -127 -150 70 -118 89 361 -190 9
2516 9 -25 137 -110 -174 103 -271 -90 261 -132 -119 240 -84 -72 -281 126 216 169 -3 -17 103 323 -65 57
2539 57 -145 -99 -338 313 -66 -187 -69 -98 15 -123 -23 -99 -92 159 -67 -7 188 70 -122 135 -109 -25 233
2562 233 37 197 -160 4 -60 50 293 34 -153 -218 163 -16 -20 -57 189 101 37 -204 -287 -222 161 -23 216
2585 216 -13 -270 18 -21 -62 85 -123 64 -100 110 325 -98 -184 14 -34 -374 38 -244 -114 42 227
2606 227 109 -1 301 -25 184 -15 156 65 -100 -229 108 51 -155 10 17 -85 -78 -202 89 -21 -106 -301
2628 -301 159 0 0 14 61 48 67 47 -133 26 67 31 -247 -142 74 96 -65 -196 2 251 130 -144 -109 65
2652 65 57 128 -282 -69 -85 257 -136 -57 155 -321 76 31 -136 -195 -100 18 230 211 -30 43 14 -156 106 74
2676 74 25 120 99 251 179 -50 -11 -211 -139 46 -58 100 62 22 118 124 105 -264 -25 -159 45 -162 30 -56 32
2701 32 149 -17 115 36 207 -61 -106 291 322 -354 -145 -40 -59 102 108 238 -32 190 185 155 113 -182 -153 -13
2725 -13 142 -174 210 51 -82 247 -55 -359 -172 48 55 98 72 44 -63 -122 69 50 10 255 59 -195 -294
2748 -294 -3 37 167 41 -35 -145 -167 25 129 52 3 78 251 230 -51 119 217 -29 -321 -90 -85 -17 -83 31
2772 31 -86 42 -237 87 21 -284 -26 92 -59 182 2 43 -292 -54 85 -567 117 -171 -7 156 -31
2793 -31 -170 170 -53 -227 110 269 -3 -14 -205 -306 -173 -36 -53 68 27 59 -244 174 -65 -44 -72 -201
2815 -201 -189 -212 54 -119 -215 -239 227 187 72 9 193 -66 -136 -139 -112 74 153 267 -179 236 -58 -135 25 -37
2839 -37 -7 -139 -40 237 98 173 -74 81 235 -85 -294 -190 103 125 86 -184 -66 104 -98 -129 155 -46
2861 -46 22 -122 3 103 107 141 -124 -72 253 -168 -80 65 -192 -255 -113 -91 -169 239 -42 217 67 3 -64 160
2885 160 187 40 394 178 -21 61 96 -185 26 -62 227 171 -16 180 116 45 26 -48 -9 -156 -41 33 -69 142
2909 142 62 -231 -9 -84 -212 141 46 44 54 -104 -197 -285 -103 -107 -116 -96 -160 7 -135 -116 76 12 42 -9 129 -86
2935 -86 -168 137 33 -145 64 73 -220 96 171 0 -316 97 101 -194 298 -194 33 18 31 -100 -131 277 83
2958 83 69 65 -10 116 -218 -119 -134 -309 431 80 -160 -107 65 -24 101 -56 -34 -33 -103 294 56 87 188 -137 -169
2983 -169 161 -186 -105 104 161 40 256 -156 -64 -157 58 428 192 -63 1 104 35 85 -99 -131 127 53 -81
3006 -81 57 -233 -107 -146 -10 169 76 -5 -6 -131 -190 -219 -12 184 96 -194 -13 -106 122 -8 -231 -78 287
3029 287 -304 59 -95 -40 -19 277 -122 201 82 -106 128 15 -29 61 22 45 -128 -58 -29 -205 -19 -118 182
3052 182 -79 133 125 13 110 -92 23 245 -229 -123 41 -29 171 406 242 -15 -12 116 -69 -135 163 -246
3074 -246 -240 -174 -215 -196 168 51 68 62 -188 -66 -63 101 254 70 -113 -86 -266 -189 -153 203 -125 -111 89 -25 -73
3099 -73 77 176 15 -153 -380 51 -203 40 -62 -63 218 28 200 -150 -180 -57 -27 -337 -192 15 157 -105
3121 -105 -174 17 -254 -102 169 -74 169 243 88 305 -114 -70 162 92 186 -70 -2 190 -212 -102 -128 9
3143 9 -90 -23 -14 76 54 -93 -238 -167 -7 -353 -110 199 144 -13 -108 -408 67 -42 26 95 -45 -237 172 112 -103
3168 -103 -59 73 -168 91 35 130 -132 37 -105 142 -13 -215 222 222 28 -96 38 53 -91 71 -102 164
3190 164 168 -16 -43 -43 9 -319 -44 280 -223 59 148 219 20 -247 -101 -162 -166 -354 -44 27 308 21 -33 -109 22
3215 22 -75 59 -218 -119 159 78 28 120 29 -232 57 128 237 126 -5 234 30 -260 36 18 -53 63 18 49
3239 49 -127 -89 -117 -30 -319 27 40 -26 -148 -162 29 -79 -15 -47 -108 -190 -100 -138 323 -180 147 -201 -13 158
3263 158 -102 37 119 32 293 -451 -41 142 255 46 121 36 46 -27 114 116 34 0 -120 -136 -236 -227 -351 110
3287 110 -200 31 -47 86 -53 -100 127 55 -245 -154 -88 -341 -31 -10 40 -100 114 329 -155 -106 -52 66 85
3310 85 -92 -333 -134 -54 70 -173 -14 -12 -88 -91 -144 -81 -355 244 160 57 -36 107 -49 -362 66 75 -231 99
3334 99 151 172 -38 -71 42 -2 -94 46 -20 -189 130 25 239 124 -18 -59 -112 52 -219 -189 -4 93 -189 67
3358 67 113 34 -315 46 46 -77 11 -58 -126 -169 -21 45 298 -96 -107 20 -8 -131 -73 221 -156 -248 14 92 22
3383 22 132 -35 -12 -61 -235 -84 -78 -258 11 49 13 -163 -26 -258 222 7 149 183 161 84 106 25 -241 198
3407 198 -2 315 185 102 -201 -105 100 -148 -210 25 -48 -218 -336 -77 98 15 -39 281 6 -95 -94 -62 71
3430 71 -91 -223 81 33 47 91 92 -34 31 -42 -47 65 23 -78 112 166 -269 -120 129 135 31 155 -84 67 126
3455 126 144 123 -45 -147 -25 173 114 -200 41 -51 -14 275 -13 -160 -66 -6 -49 18 114 -342 -349 178 -190 -76
3479 -76 -7 215 -104 8 274 38 -293 -316 -82 212 4 200 12 -51 149 -52 -69 -54 154 54 102 5 171
3502 171 293 -156 144 -42 -12 -112 -272 -41 -262 -104 8 -437 89 -12 -267 6 -16 -155 -178 -10 155
3523 155 94 204 -197 -268 95 279 173 -245 -93 51 75 5 -73 317 -47 -104 136 136 -135 -60 96 -72 27
3546 27 70 -71 164 58 6 -50 -33 177 -48 96 137 -113 127 2 -44 -5 -147 -82 -289 62 -51 88 -94
3569 -94 116 -4 -79 152 -12 93 -15 187 -172 -22 32 -255 -39 -141 -211 -50 -84 133 -58 -156 149 5
3591 5 352 -99 -338 186 122 22 65 -181 -210 83 -159 137 -40 184 -6 -75 209 78 0 82 -99 -126 21
3614 21 101 48 8 78 273 -36 82 -62 124 -102 266 -127 103 -37 -104 -41 156 -301 -59 175 -319 10
3636 10 141 67 163 53 -112 -62 -120 3 -25 -49 -107 -79 -252 -82 136 228 21 -173 63 -22 117 15 -38 152
3660 152 -50 -126 -97 160 28 -49 -98 -70 17 284 31 -92 -240 79 16 -163 -100 17 -78 -38 174 203 -53 -98
3684 -98 61 144 118 119 185 -59 -81 -98 31 1 -13 41 -196 63 -350 116 282 -14 -13 87 -3 -148 -28 -285 58
3709 58 345 -84 -33 43 -130 154 207 -110 10 -60 -65 -48 27 -121 147 268 -189 -416 -10 126 -29 -15 -66 -174
3733 -174 -183 54 -103 92 39 100 -283 89 -66 -27 -68 -269 -55 -61 145 -226 245 137 24 267 -99 26 -311
3756 -311 -13 -201 -89 -50 187 63 80 -187 95 30 -68 -290 -8 38 133 67 93 51 -235 149 53 127 -125 130
3780 130 -21 91 5 56 -1 -100 57 8 -84 -300 -1 58 7 88 123 17 -8 -201 35 35 -49 -144 -42 -67 153
3805 153 193 -170 94 119 -41 16 46 -67 60 174 -10 -91 -16 -169 -18 -237 -8 -83 -77 -117 57 -7 -113 45
3829 45 179 265 6 257 87 -10 351 38 -56 -147 88 240 226 -166 -82 -42 -309 -63 129 136 -35 242 65
3852 65 141 24 172 36 -107 -382 25 -47 -165 57 -17 118 183 250 354 -18 82 -97 -95 -146 18 -227 31
3875 31 -74 -92 8 91 102 54 99 -116 165 335 -208 303 21 138 33 69 -47 -190 184 83 3 45 -37
3898 -37 -153 -171 36 129 -54 -266 -69 110 -24 307 75 11 -189 26 -197 -90 -7 -64 -20 58 91 -147 24
3921 24 92 55 58 186 72 -25 -216 147 -53 39 0 3 24 -124 -208 -173 38 24 -178 88 119 103 23 79 -209 23
3947 23 -142 117 -226 -202 -122 -284 -67 205 96 -92 -110 -160 -14 -95 -88 362 132 -180 9 11 -184 -221 57 -31
3971 -31 -84 2 -196 -117 104 -171 -207 -34 -224 -27 471 163 6 -270 -30 63 -74 -48 -14 -167 -89 -14 118
3994 118 144 46 4 -45 26 -88 94 -22 50 132 -38 249 400 -69 133 195 -174 -4 -64 75 -85 48 -167
4017 -167 -13 40 285 125 120 -86 170 -104 -117 -204 91 36 310 -51 56 158 -35 39 48 106 -95 79 63 31
4041 31 -26 24 -151 136 36 -329 138 243 -106 -5 97 -153 -151 83 108 178 99 -82 4 166 -6 29 71 -230
4065 -230 154 -27 -80 -224 -260 71 106 317 130 -213 301 135 -52 -28 280 76 30 -61 7 -38 -184 266 -56
4088 -56 -74 222 202 -14 -14 -114 8 133 -98 119 93 40 -56 -76 67 -201 162 217 44 -215 46 295 -149
4111 -149 193 -56 39 -25 -256 -156 104 -50 179 -13 89 -16 206 -29 141 94 300 3 117 -90 -32
4132 -32 116 210 67 132 -190 28 -21 198 163 124 35 146 -141 29 -164 -153 -97 -206 235 -58 51 -149 15
4155 15 23 -13 275 36 166 72 -60 -8 10 136 -79 21 149 -45 190 -133 -19 26 236 2 -94 8 70
4178 70 -4 53 -97 -17 179 103 49 -118 182 196 -283 -278 2 204 -169 -310 132 -204 -189 -115 -118 -38 -22 208 20
4203 20 -287 44 97 -123 59 -337 -65 -45 36 59 6 150 -30 -68 118 134 -78 -77 248 362 219 -185 -196 -68
4227 -68 -117 33 -144 -134 -53 -133 -249 208 163 144 -246 -347 -24 -190 -50 72 -247 -197 -238 -66 -12 40 -20 113
4251 113 -49 43 133 -19 12 -21 -98 -135 226 -304 19 -80 -22 -159 -84 98 -167 180 140 87 -42 71 -155 58
4275 58 175 89 -196 -44 204 -176 -4 82 31 -34 -161 -52 304 -26 46 -130 127 -101 238 -179 -29 -140
4297 -140 209 -193 -141 191 -19 5 14 155 -41 -44 -164 79 25 -113 -39 22 -105 200 -171 92 -264 198 75
4320 75 182 30 78 28 -6 -2 -256 -211 13 -98 -173 131 -177 32 209 50 78 187 65 24 56 221 -190 128
4344 128 -33 333 357 225 -111 -105 23 -24 -162 49 299 -95 118 49 55 -82 74 -106 -144 227 -70 68 -149
4367 -149 162 -191 199 79 81 -128 -18 -141 73 81 -78 125 78 -2 -41 -349 27 34 25 30 64 235 118 -59 -77
4392 -77 40 92 -40 -71 -71 76 -175 121 -23 67 231 -120 145 23 -150 16 28 46 188 79 -121 150 -33
4415 -33 -94 -23 148 59 139 -202 158 277 199 121 -22 74 143 -389 8 -104 19 -111 416 42 235 34 -331
4438 -331 -141 -298 -65 69 -231 -119 126 100 109 81 197 -26 -56 165 -14 51 -7 -90 202 149 -80 -89 214 -52
4462 -52 167 -25 78 78 -243 58 37 -110 61 -100 13 -252 -63 -192 -115 -44 285 28 162 215 -20 109
4484 109 -19 100 210 195 -72 63 76 173 -6 -105 200 -88 -65 -61 105 88 78 57 -312 -110 26 36 -152 105
4508 105 136 107 -186 102 -51 0 -273 72 -26 -26 156 -271 -236 36 -2 -387 -62 27 -82 -14 -47 -9 -77 207
4532 207 -16 104 -119 157 -117 -104 -1 -102 123 -47 -119 -88 -212 176 218 -81 24 147 -10 -187 98
4553 98 -22 275 -60 172 121 69 -256 -108 166 82 -124 -45 -65 166 -12 104 -3 176 0 98 -176 68
4575 68 -15 146 -112 95 -163 -114 -70 -202 -224 -23 -66 -451 128 -181 23 -218 -11 88 71 326 317 80 -67
4598 -67 -62 19 -4 -66 -110 -5 68 -66 78 182 -105 22 -166 120 167 -100 324 59 -46 -231 -147 100 -82
4621 -82 35 55 -155 -185 164 421 19 -67 33 -29 -185 120 94 173 278 -28 -131 -358 94 294 66 201
4643 201 140 -9 -155 -21 410 123 132 54 -148 185 198 82 105 -247 153 139 168 132 -52 -43 -232 -56 212 227
4667 227 17 20 116 -135 38 50 213 -182 175 108 -17 -229 -186 147 -145 -5 -154 146 278 98 -208 -57
4689 -57 378 -18 -118 -64 -130 -96 214 131 88 215 119 -149 -40 -245 281 192 153 68 -132 -72 77 98 227 -114
4713 -114 -60 229 -29 105 -37 -59 -78 43 -22 66 -220 -95 -172 41 42 -26 -188 159 -5 40 112 97 143 -28
4737 -28 100 -63 -222 346 15 -63 -213 127 86 -77 121 121 -115 -31 -119 -211 70 108 -224 -151 -139 -199 119 91
4761 91 174 92 66 -192 5 85 -197 -162 -88 77 28 31 47 3 -5 -70 -20 117 244 100 -395 223 -141 23 43 -211
4787 -211 229 -55 -57 101 71 -65 66 71 40 -306 9 100 -132 33 -116 -48 158 -203 46 -3 -239 56 -37
4810 -37 -5 344 103 -38 149 -1 -145 -424 -133 -257 88 4 -183 -108 255 350 15 -82 103 -99 -63 256
4832 256 129 -54 -297 33 136 75 -164 -132 258 -154 -141 -23 -228 69 -70 -31 382 -45 276 -251 79
4853 79 33 -284 123 52 10 -52 -83 36 138 -191 57 -19 77 192 129 174 97 18 145 64 123 -17 38 172 62
4878 62 28 -123 157 41 227 -171 30 -142 145 44 94 308 -178 -41 80 -226 129 -92 115 -249 -160
4899 -160 2 31 75 63 94 214 -38 -101 -93 -252 100 -1 12 73 118 -213 143 76 52 32 -50 189 -26 61 121
4924 121 -53 -55 43 -162 51 29 -12 -185 -90 -253 61 217 146 15 101 -66 161 23 64 -37 15 -38 159 -21
4948 -21 -204 95 -5 111 116 -31 207 208 -126 169 -122 26 74 32 127 32 -251 143 -157 229 -124 40 -22
4971 -22 -165 -243 -184 177 -196 93 155 -66 -172 45 -12 112 -165 -114 -407 -45 53 204 -216 -156 -98 -249 -86
4994 -86 1 -15 -68 -162 326 -137 -119 -139 -34 -60 -77 48 71 -237 -138 -394 172 31 -150 -245 121 0 -96 -394
5018 -394 26 -40 238 -444 -133 19 70 -23 11 241 -170 42 -64 -90 185 -56 26 80 299 -3 -212 -31
5040 -31 -79 -181 84 264 66 -121 -140 -78 143 144 323 -75 200 -49 4 -52 -65 0 -199 201 87 204 -18
5063 -18 -39 -33 -103 111 -47 121 216 -72 -231 11 -156 90 17 161 -35 46 -126 21 119 137 81 55 -28 -26 -267
5088 -267 234 105 44 87 -104 206 -172 140 -82 -91 -28 -2 -78 -95 64 -105 -104 -408 79 -135 274 51 -207
5111 -207 -108 -295 -242 -94 -88 103 383 335 -284 -59 -163 124 147 -93 163 47 32 -222 165 -80 173 -213
5133 -213 178 -52 -53 45 76 -286 216 15 -48 -89 -82 -119 128 151 -47 -26 -179 -145 146 -230 -119 -162 252 -66
5157 -66 70 -140 -65 -153 178 -16 117 -16 139 -13 77 213 -289 -2 166 204 77 54 -10 257 -105 -6 -347
5180 -347 280 109 126 -45 111 17 -110 -65 423 -102 36 103 -70 -158 26 -47 -76 -91 -72 -174 -10 -119 104
5203 104 -148 -14 -71 27 121 -31 19 176 25 498 -124 -52 24 123 -61 159 247 -284 -159 80 19 -55 -9 124
5227 124 118 154 -73 -36 -212 -136 -298 -336 114 -136 66 -42 215 45 -191 8 -86 19 -58 277 -57 -102 -98 181
5251 181 58 41 113 298 -19 -86 -160 183 -184 -156 7 97 33 172 -91 -27 -21 26 -140 -42 -212 -59 -60 244 -142
5276 -142 348 252 -216 -84 -200 39 -87 -144 -62 165 344 22 -7 18 -120 2 -39 20 5 139 -275 -207 40
5299 40 188 -45 -104 15 18 154 252 -25 -124 -8 -119 -391 103 278 64 35 -70 93 60 -87 153 -60 -263
5322 -263 173 189 43 -74 82 232 166 147 -19 90 47 -95 -110 -121 144 75 -18 -321 -104 -244 -223 56 39
5345 39 13 177 192 -20 -146 -64 -71 60 -4 -106 -394 -229 56 60 204 134 -42 23 -116 -68 -169 -33 -361 -59
5369 -59 -153 120 -114 -8 -66 0 -45 -295 140 -93 76 -163 45 53 93 -22 -375 -148 -94 118 99 -127 -99 -108
5393 -108 -10 -256 220 -171 195 -165 105 209 48 72 22 138 -35 -34 49 77 27 -121 163 -222 1 -40 -98
5416 -98 119 198 -45 -103 -78 -328 130 -383 10 -100 -16 51 -27 20 207 -237 -13 199 -390 -92 198 83 -123
5439 -123 85 10 -48 -71 114 -61 -23 308 -67 109 -230 23 -236 -33 255 126 28 -68 -75 66 2 30 -58 -65
5463 -65 -253 -219 -115 205 -170 -48 -23 225 0 117 72 -210 34 29 73 -174 -141 81 53 319 139 135 -51 268
5487 268 57 -48 76 -230 -89 -72 108 -32 -117 258 53 -44 43 -144 7 -103 -16 64 118 -84 119 83 172
5510 172 -53 73 150 84 -43 88 -96 -227 103 -179 -95 -227 -7 -219 -102 -97 -248 -46 230 -105 -49 312
5532 312 -38 -220 -138 -163 -16 18 -73 -71 -135 -22 -108 58 52 16 33 -6 12 -242 108 -10 83 -148 61 19 -238
5557 -238 -138 -75 -52 25 51 65 208 141 -35 -107 -79 -60 -284 -57 13 54 182 12 335 54 -113 393 90 -149
5581 -149 -45 -57 -91 139 -282 -142 -88 -19 63 185 -367 -70 108 -129 -57 -102 -325 -56 25 273 40 -82 97
5604 97 100 -60 35 -13 -8 77 173 52 -72 -211 -252 -125 231 -328 116 -32 -6 130 -45 75 -33 63 -43 296
5628 296 -21 -18 121 4 163 -159 89 5 -6 64 -139 -430 -164 118 -43 204 -129 -11 -28 22 39 -60 -108
5651 -108 53 -117 4 277 114 -4 30 13 83 -187 -73 179 25 3 70 177 -199 85 77 -171 -131 10 61
5674 61 37 -167 105 204 -98 -73 -20 109 -103 290 100 118 -18 249 14 162 249 -318 -186 1 78 -43 -170
5697 -170 71 134 207 15 28 -68 -148 -71 43 60 140 5 56 -158 -160 82 130 -120 172 -162 -4 -149 98 225
5721 225 133 -16 -178 -255 79 33 -106 -116 -309 -160 -70 -101 -20 1 -222 -5 128 82 -231 145 166 78 -82 -179
5745 -179 -169 -52 19 -62 -345 -132 -25 32 214 -107 -222 8 236 156 142 224 -35 70 257 34 -143 -100 -130
5768 -130 -275 257 -73 -69 -166 -229 81 -160 97 26 -137 -76 29 -72 94 -117 -18 13 58 -100 -103 -123 134 -119
5792 -119 -83 83 -43 150 -339 -176 75 -44 -141 -28 103 263 54 -74 417 93 -142 162 216 -191 -77
5813 -77 -258 -58 102 95 -63 210 -51 -11 -13 -244 -89 113 -61 -245 111 -140 107 136 48 228 146 247 105
5836 105 128 -180 51 162 -67 126 350 -267 -76 242 56 211 -190 -356 -152 104 -27 74 -133 101
5856 101 105 17 -10 9 -23 91 -120 30 224 78 390 -97 92 164 -72 -201 -69 49 171 -206 -63 -15 23
5879 23 -31 18 -263 131 220 45 231 -8 -232 -77 55 20 22 95 100 -137 40 -113 142 120 -67 24 23 294 87
5904 87 91 -139 -11 20 -91 29 -13 243 -56 -12 -28 180 -172 -220 -86 -11 299 11 -108 52 25 36 167 -145
5928 -145 213 -12 28 -340 191 109 -7 -12 -105 -36 70 122 -254 -201 -72 -28 -236 -61 -105 -99 -238 -63 -69 5 -177
5953 -177 -131 -154 -49 -81 23 17 32 55 -75 -51 245 150 48 -256 -146 31 221 190 39 67 91 -17 191 -174
5977 -174 41 89 36 -356 162 118 2 -180 90 -23 -213 -59 165 -94 -235 197 -137 -139 109 151 -43 -19
5999 -19 -55 -112 36 101 -106 183 104 -235 -11 -151 -130 341 -7 130 162 311 36 -51 -100 -53 -40 -153 -306 164
6023 164 -74 -76 -132 -86 135 -63 -119 -205 -163 -364 -180 -120 -38 144 38 -28 -136 52 -101 49 64 -298 84 87
6047 87 -92 -234 -27 -168 20 -80 142 -180 -3 -337 -160 -54 -26 18 -69 -54 41 105 -38 -182 -57 -303
6069 -303 -169 265 64 -77 -234 -171 38 30 96 -67 56 -164 -225 -274 -31 -213 68 -111 56 119 -198 -48
6091 -48 -80 -297 150 22 -413 -93 65 64 -94 34 -99 -301 -106 -186 -284 12 22 -159 3 22 3 -24 -114 -50
6115 -50 -241 58 -103 122 -219 -226 -20 37 56 -74 -91 -103 -8 -48 47 133 79 -125 53 135 29 -259 223 239 -16
6140 -16 99 -55 32 -144 32 -110 167 -133 -56 31 -331 -165 -255 -29 -203 -26 362 19 -43 310 248 -45
6162 -45 -227 152 38 59 -55 223 155 -52 196 16 -23 19 231 -13 144 -117 -178 -32 -123 -70 13 174 -67
6185 -67 177 -145 -50 -17 -259 -97 0 128 -93 -109 189 -39 -88 -10 -52 -126 -110 -195 34 196 21 -146 58 313
6209 313 13 160 -120 5 -132 -171 42 -310 -191 -114 57 -7 -122 33 121 85 64 1 123 45 -91 -262 -73
6232 -73 112 -189 -138 229 9 338 216 35 228 -81 31 -219 -244 63 182 36 11 72 8 -211 -13 -157
6254 -157 -110 162 -67 85 157 12 141 6 10 -19 -345 115 259 33 294 -156 34 86 110 -401 -95 -116 291
6277 291 148 282 236 -48 119 -71 320 54 202 -142 -480 -22 59 -79 154 158 -101 -87 53 29 10 179
6299 179 210 116 63 80 -89 -79 -148 232 -136 135 172 -9 -63 -93 -132 -41 -414 261 -132 -38 -54 158 274 290 -40
6324 -40 -167 -118 114 43 -281 -173 45 132 -72 0 344 128 -157 45 180 187 -76 179 256 107 -167 -114 35
6347 35 34 -190 -185 -29 -107 164 77 90 147 80 74 181 145 -139 31 -143 141 -59 154 94 -69 53 89 100 -249
6372 -249 58 51 134 170 57 18 -95 55 -225 -107 54 87 18 34 180 -55 19 -23 -135 -167 94 -98 -58 -122
6396 -122 205 -89 -165 -320 -83 283 67 -125 -45 110 -99 38 -75 -98 1 -77 76 157 -66 111 -171 -63
6418 -63 -125 -52 -243 44 -100 24 34 -35 248 143 -189 30 -283 65 2 -10 36 169 -50 -60 177 257 193 -9
6442 -9 -232 -280 -109 74 257 33 -102 145 13 -12 -83 -43 -90 -144 54 -97 -274 -200 -15 103 -36 -5 39 124
6466 124 47 189 111 32 105 31 -135 -77 11 79 -32 -87 43 -231 39 101 8 69 82 -163 39 -58 -184 105 273
6491 273 -12 -236 -154 -132 47 -81 -48 169 -252 316 40 132 10 196 56 -107 -192 -143 -257 -65 54 -83
6513 -83 231 -3 -6 -234 110 95 -31 205 81 -15 101 -13 -194 326 -35 -3 -180 40 85 -36 238 -298
6535 -298 144 23 41 138 9 -131 215 22 -46 75 -6 -313 -49 94 83 -140 -125 172 168 246 -32 118 -166
6558 -166 -235 -4 -111 12 -13 -84 -18 121 66 -38 274 -144 227 -120 65 43 -110 91 -115 22 -172 35
6580 35 -130 -198 -24 -8 -31 -270 -129 -162 95 47 -106 28 3 47 0 51 -59 -32 -96 104 128 -102 332 -207
6604 -207 101 -35 18 -142 -181 -88 -178 34 -141 85 115 223 -197 12 -60 230 57 -235 -227 -86 39 46 148
6627 148 -181 198 -161 284 176 -275 359 140 -52 171 -151 65 126 85 170 34 -150 -250 82 66 178
6648 178 123 -160 181 -51 2 118 23 -296 17 -199 97 -155 -63 -77 -201 -152 187 62 -79 77 120 102 98
6671 98 -93 -45 132 -89 164 88 -223 -54 -55 -264 -126 138 33 -164 -241 47 111 -361 180 79 54 -7 407
6694 407 -202 -196 137 146 -113 -53 52 -58 -212 45 62 -103 47 -31 207 -128 332 42 23 -6 -97 -53 272 -26
6718 -26 108 -186 -180 -102 366 -105 163 -249 9 156 -157 -202 -134 -174 -141 121 31 40 253 354 166 -156 -121 -252
6742 -252 143 317 241 64 -89 -171 -143 290 -226 -65 63 79 3 -167 301 96 350 343 97 16 -97 -84 77
6765 77 -210 -105 71 -321 -175 -206 -87 273 120 30 -14 202 14 -163 -410 151 157 -102 28 178 22 -88
6787 -88 -149 -108 -210 111 218 -13 -160 182 -3 309 -112 -17 178 35 -195 -49 -207 -71 35 118 68 175
6809 175 -133 -24 144 -125 -72 117 71 -69 -186 47 20 119 -123 64 -129 -256 -334 -46 282 218 -305 -172
6831 -172 292 173 -52 31 -211 -5 -117 52 198 -135 196 55 122 145 -133 75 -22 -2 -145 -112 134 6
6853 6 -43 51 -70 127 176 242 212 -117 -28 -101 -5 -247 -167 -37 -121 38 -34 195 32 136 -168 -55 181 -226
6877 -226 -212 73 315 227 -1 39 170 -148 64 42 126 79 1 4 39 -138 -139 -207 67 -6 -164 85 33 8 -78 -194
6903 -194 127 -296 -313 47 -65 173 3 57 -226 23 -31 61 26 -261 -52 279 -26 75 -53 18 -169 -108
6925 -108 154 15 29 -159 78 -183 61 -29 -109 -140 71 -59 -18 -43 124 105 -22 166 -13 8 59 -78 73
6948 73 -13 0 -18 -144 62 55 -72 164 -4 24 -22 57 -150 -53 204 -38 116 169 58 122 -21 128 -123 8
6972 8 29 -151 -68 -176 -148 -61 120 21 270 -204 -78 -111 13 128 163 62 -92 98 180 -16 29 165 240 -96
6996 -96 -29 103 148 -77 -3 67 1 -5 138 -266 -106 -50 -15 -100 -107 38 -49 11 75 228 93 81 205 -212 25 80
7022 80 -33 -219 42 -253 114 -84 16 247 260 130 -350 46 76 186 -136 397 199 -103 -163 129 -116
7043 -116 -153 178 16 10 26 -40 -16 -66 -131 -69 91 47 -361 -41 68 -352 -136 -16 252 0 -164 -19 -44 -39
7067 -39 -144 -110 -55 -72 -172 -21 -44 -138 43 10 79 148 -66 -33 218 -60 156 57 -70 -41 368 -2 37 116 -93
7092 -93 337 -93 -42 144 -342 194 -208 -194 70 87 -107 -161 -236 -21 100 249 -79 75 -133 42 84 -5 21
7115 21 -33 69 -133 -16 -63 10 -27 238 -62 95 -20 126 161 -202 213 -250 122 -150 102 -89 -19 -209
7137 -209 -257 37 2 -117 -80 -75 267 -57 199 52 10 -84 -176 52 140 -80 -81 210 17 -77 -106 0 72 162 -46
7162 -46 -135 -183 -32 -24 1 156 -62 46 315 204 -105 271 3 -79 247 128 80 218 -188 16 -235 -123 -85
7185 -85 76 -81 129 -146 -15 -270 -155 -8 125 -56 -95 95 241 111 129 -161 109 11 87 91 108 270 213
7208 213 186 -83 -130 -6 58 -196 -179 203 55 -97 -40 -84 140 95 63 148 93 -86 53 -61 144 -79 53
7231 53 -86 231 -24 -68 198 -238 4 -72 -232 140 40 148 -344 85 331 -234 -19 -63 83 -302 344
7252 344 -191 62 126 -107 139 -25 27 -21 369 342 -139 51 156 114 -164 86 -3 127 -42 75 228 -141
7274 -141 24 -52 72 161 177 -150 -9 -64 114 150 -43 -154 -204 40 46 95 -36 -85 111 15 40 -87 -17 159
7298 159 235 -90 -54 152 62 16 269 -29 157 70 78 112 481 3 -214 116 48 -207 -23 -162 -133 -50 180 91
7322 91 -114 165 -197 -5 -85 167 -221 86 51 155 151 93 -103 -171 -168 254 126 -78 187 56 323 67 120
7345 120 -53 -58 25 115 -156 -541 -40 111 158 -53 204 98 -45 108 -55 123 -2 20 16 38 90 -248 -104
7368 -104 32 276 17 -70 -63 213 26 129 -118 47 -70 88 -4 -28 -239 -359 33 47 38 -244 -127 -58 -328
7391 -328 44 160 178 157 -207 -55 -159 44 -36 210 -38 -273 44 22 36 -43 53 54 -48 40 4 203 196 105 -125
7416 -125 -57 40 296 -179 -63 -71 -229 206 5 183 380 -202 17 -37 47 130 73 187 50 178 -87 -147 130
7439 130 -34 115 38 -13 -37 -262 -92 133 -22 -35 83 162 51 -47 76 32 -53 -136 42 -288 120 -45 39
7462 39 61 -237 95 -105 -23 156 160 217 146 73 -34 152 -4 34 188 181 26 89 -197 -108 -132 99 204 -99 -72
7487 -72 -149 -92 55 70 5 59 -90 22 -307 150 -167 -108 -110 74 -201 -89 162 -38 -80 88 -89 15 -323
7510 -323 -46 77 -55 -125 -40 -17 34 -10 -9 210 90 108 23 -8 183 -121 -173 -329 136 -78 -55 -126 154 -74
7534 -74 20 -246 -170 -34 162 40 24 7 82 -97 -106 155 -131 -260 -122 -98 -36 186 -59 344 198 50 -21 -82
7558 -82 193 30 262 -163 -73 31 19 67 211 -38 -113 175 -39 -114 26 141 -46 35 78 68 89 -94 81
7581 81 -20 -263 12 -12 -198 105 13 -246 -59 -61 -69 -61 -222 81 -268 -66 49 48 -130 361 38 -114 -86 -241
7605 -241 -119 58 229 -145 91 -33 -468 -87 -160 -88 270 -25 67 -452 -266 -135 132 176 -48 -4 116 -13
7627 -13 300 157 100 173 -59 -136 69 76 6 -80 -107 -179 20 224 12 151 -39 70 227 -201 122 13 135
7650 135 -46 -56 93 20 -2 -23 62 -32 -205 -157 -179 128 -88 -51 -314 140 -69 95 -131 89 8 -78 -213 -110
7674 -110 257 152 55 159 -218 -26 -137 -66 -23 65 123 97 -192 -3 -86 -154 -83 -92 -64 -113 -3 -88 -129 -176 58
7699 58 -95 68 -8 -117 -145 -46 -189 -45 68 38 -139 -181 -321 -129 309 241 -55 158 -101 127 -357 -369 97
7722 97 123 17 -38 13 -18 105 326 -51 51 244 24 -305 128 156 -13 115 86 174 161 -10 -109 254 -102
7745 -102 92 -23 -115 -54 62 -9 -56 -103 -151 149 142 -41 118 163 3 -75 195 -82 -99 47 -25 26 222 -83
7769 -83 -40 -114 33 83 -369 140 -23 -22 246 -185 12 -24 109 216 98 22 157 -177 110 141 269 70 123
7792 123 22 -99 75 141 -112 132 97 -267 -110 -23 -56 -75 134 -36 210 -41 -65 -14 -78 -328 66 3 -34
7815 -34 -69 -19 -184 239 2 244 -190 87 -292 128 134 79 148 -24 -166 196 333 15 -131 218 -218 -91
7837 -91 -175 -117 77 18 -24 6 -59 -107 52 -8 -193 -246 225 -36 -58 275 20 -72 -112 72 46 -111 271 -4 -202
7862 -202 -136 -23 156 45 -234 29 -294 -33 95 59 -93 70 -160 -137 197 -97 33 -137 -46 -282 -152
7883 -152 -63 -41 270 -145 -307 -234 -216 29 156 327 199 294 -81 -99 128 -3 134 18 -143 203 -29 -12
7905 -12 6 153 -72 -16 215 57 7 -174 -119 237 -177 14 64 -283 174 -79 -211 -132 -187 -198 29 -53 -103 -194
7929 -194 -272 -163 15 -26 126 -45 -28 -10 -13 -60 220 -162 -89 157 -162 31 -368 118 79 -28 -101 -4 -90 -171
7953 -171 154 117 -14 -73 -114 -4 -103 110 -116 -74 -144 -27 -141 -169 -42 -96 4 27 66 112 17 224 -196 64
7977 64 313 11 36 -213 -133 187 11 192 80 -90 258 162 -95 1 -210 -26 -58 2 -77 -72 202 -27 -170
8000 -170 114 162 47 228 40 80 -60 -71 -219 123 -21 -224 -85 -131 -56 -48 -171 -352 -161 -22 193 54
8022 54 128 181 -10 75 71 -43 -34 43 -29 -31 -175 5 22 120 170 -167 -70 -24 -26 35 -173 0 82 -261 79 191 184 -83
8050 -83 40 -15 -82 -56 182 134 10 -135 52 151 -45 77 -299 -88 -46 43 95 -14 116 -196 -81 -96 179
8073 179 115 194 62 -406 194 -155 -59 -43 23 -55 -115 186 -5 -3 64 -56 157 82 63 -68 -36 13 -203 120 -59
8098 -59 274 184 -67 27 159 51 147 -58 73 49 -323 -33 91 -100 -250 -61 -29 29 -90 -48 -139 73 -272
8121 -272 -2 17 13 -94 174 -8 -156 -24 136 163 -26 -43 -11 41 108 70 135 81 -107 -14 114 -26 287 -184
8145 -184 -131 -8 -114 -100 315 -38 81 -97 -294 -2 -200 91 157 -147 -60 3 99 108 6 -304 16 72 -26
8168 -26 129 266 -25 -198 138 -127 127 -15 55 -68 301 93 145 257 7 -5 -185 -27 278 148 -55
8189 -55 -221 -162
8191a62
##END NTUPLES=NMR FID
##END=
