##TITLE=1H_-33-2023
 CDCl3
 8 sc, 
 19.5.2023
##JCAMPDX= 6.0         $$ Bruker NMR JCAMP-DX V2.0
##DATA TYPE= NMR FID
##DATA CLASS= NTUPLES
##ORIGIN= UXNMR, Bruker Analytische Messtechnik GmbH
##OWNER= root
$$ XWIN-NMR		Version 3.5
$$ Fri May 19 14:05:31 2023 Russian Standard Time (UT+4h)  she@DPX200
##.OBSERVE FREQUENCY= 200.13135
##.OBSERVE NUCLEUS= ^1H
##.DELAY= (6, 6)
##.ACQUISITION MODE= SIMULTANEOUS
##.ACQUISITION SCHEME= undefined
##.AVERAGES= 8
##.DIGITISER RES= 18
##SPECTROMETER/DATA SYSTEM= spect
##.PULSE SEQUENCE= zg30
##.SOLVENT NAME= CDCl3
##.SHIFT REFERENCE= (INTERNAL, CDCl3, 0, 15.7039)
##AUDIT TRAIL= $$ (NUMBER, WHEN, WHO, WHERE, WHAT)
$$ ##TITLE= Audit trail, XWIN-NMR		Version 3.5
$$ ##JCAMPDX= 5.01
$$ ##ORIGIN= Bruker BioSpin GmbH
$$ ##OWNER= she
$$ F:/spectra/data/she/nmr/H-F/1/audita.txt
$$ ##AUDIT TRAIL=  $$ (NUMBER, WHEN, WHO, WHERE, WHAT)
(   1,<2023-05-19 14:03:45.12 +0400>,<she>,<DPX200>,
      <created by zg, POWCHK disabled, PULCHK disabled
       configuration hash MD5:
       00 E9 B6 7A A2 85 ED C7 34 08 36 98 17 FE 4E 26
       data hash MD5: 16K
       D1 12 4B FA 16 A6 7E 34 49 FD 80 43 EC 27 42 7C>)
$$ ##END=
$$ 
$$ hash MD5
$$ C5 24 2A E0 24 9D F2 70 9B 6D EE B1 6C 16 DA AC
##$RELAX= 
##$RELAX= 
##$RELAX= 
##$RELAX= 
##$RELAX= 
##$RELAX= 
$$ Bruker specific parameters
$$ --------------------------
##$DU= <F:/spectra>
##$EXPNO= 1
##$NAME= <H-F>
##$PROCNO= 1
##$TYPE= <nmr>
##$USER= <she>
##$AMP= (0..31)
100 100 100 100 100 100 100 100 100 100 100 100 100 100 100 100 100 100 
100 100 100 100 100 100 100 100 100 100 100 100 100 100 
##$AQSEQ= 0
##$AQ_mod= 1
##$AUNM= <au_zg>
##$AUTOPOS= <>
##$BF1= 200.13
##$BF2= 200.13
##$BF3= 200.13
##$BF4= 200.13
##$BF5= 200.13
##$BF6= 200.13
##$BF7= 200.13
##$BF8= 200.13
##$BYTORDA= 1
##$CFDGTYP= 0
##$CFRGTYP= 5
##$CHEMSTR= <none>
##$CNST= (0..31)
1 1 145 1 1 1 1 1 1 1 1 1 1 1 1 1 1 1 1 1 1 1 1 1 1 1 1 1 1 1 1 1 
##$CPDPRG= <>
##$CPDPRG1= <>
##$CPDPRG2= <>
##$CPDPRG3= <>
##$CPDPRG4= <mlev>
##$CPDPRG5= <mlev>
##$CPDPRG6= <mlev>
##$CPDPRG7= <mlev>
##$CPDPRG8= <mlev>
##$CPDPRGB= <>
##$CPDPRGT= <>
##$D= (0..31)
0 1.2 0 0 0 0 0 0 0 0.06 0 0.03 0 0 0 0 0.0002 0 0 0 0 0 0 0 0 0 0 0 0 
0 0 0 
##$DATE= 1684490624
##$DBL= (0..7)
120 120 120 120 120 120 120 120 
##$DBP= (0..7)
150 150 150 150 150 150 150 150 
##$DBP07= 0
##$DBPNAM0= <>
##$DBPNAM1= <>
##$DBPNAM2= <>
##$DBPNAM3= <>
##$DBPNAM4= <>
##$DBPNAM5= <>
##$DBPNAM6= <>
##$DBPNAM7= <>
##$DBPOAL= (0..7)
0.5 0.5 0.5 0.5 0.5 0.5 0.5 0.5 
##$DBPOFFS= (0..7)
0 0 0 0 0 0 0 0 
##$DE= 6
##$DECBNUC= <off>
##$DECIM= 32
##$DECNUC= <off>
##$DECSTAT= 4
##$DIGMOD= 1
##$DIGTYP= 9
##$DL= (0..7)
0 120 120 120 120 120 120 120 
##$DP= (0..7)
150 150 150 150 150 150 150 150 
##$DP07= 0
##$DPNAME0= <>
##$DPNAME1= <>
##$DPNAME2= <>
##$DPNAME3= <>
##$DPNAME4= <>
##$DPNAME5= <>
##$DPNAME6= <>
##$DPNAME7= <>
##$DPOAL= (0..7)
0.5 0.5 0.5 0.5 0.5 0.5 0.5 0.5 
##$DPOFFS= (0..7)
0 0 0 0 0 0 0 0 
##$DQDMODE= 0
##$DR= 18
##$DS= 0
##$DSLIST= <SSSSSSSSSSSSSSS>
$$ [...]
##$SUBNAM2= <"">
##$SUBNAM3= <"">
##$SUBNAM4= <"">
##$SUBNAM5= <"">
##$SUBNAM6= <"">
##$SUBNAM7= <"">
##$SUBNAM8= <"">
##$SUBNAM9= <"">
##$SW= 18.05172834244
##$SWIBOX= (0..15)
0 0 2 0 0 0 0 0 0 0 0 0 0 0 0 0 
##$SW_h= 3612.71676300578
##$TD= 16384
##$TD0= 1
##$TE= 0
##$TE2= 300
##$TE3= 300
##$TEG= 300
##$TL= (0..7)
0 120 120 120 120 120 120 120 
##$TP= (0..7)
150 150 150 150 150 150 150 150 
##$TP07= 0
##$TPNAME0= <>
##$TPNAME1= <>
##$TPNAME2= <>
##$TPNAME3= <>
##$TPNAME4= <>
##$TPNAME5= <>
##$TPNAME6= <>
##$TPNAME7= <>
##$TPOAL= (0..7)
0.5 0.5 0.5 0.5 0.5 0.5 0.5 0.5 
##$TPOFFS= (0..7)
0 0 0 0 0 0 0 0 
##$TUNHIN= 0
##$TUNHOUT= 0
##$TUNXOUT= 0
##$USERA1= <user>
##$USERA2= <user>
##$USERA3= <user>
##$USERA4= <user>
##$USERA5= <user>
##$V9= 5
##$VALIST= <valist>
##$VCLIST= <CCCCCCCCCCCCCCC>
##$VD= 0
##$VDLIST= <DDDDDDDDDDDDDDD>
##$VPLIST= <PPPPPPPPPPPPPPP>
##$VTLIST= <TTTTTTTTTTTTTTT>
##$WBST= 1024
##$WBSW= 4
##$XGAIN= (0..3)
0 0 0 0 
##$XL= 0
##$YL= 0
##$YMAX_a= 363057
##$YMIN_a= -400085
##$ZGOPTNS= <>
##$ZL1= 120
##$ZL2= 120
##$ZL3= 120
##$ZL4= 120
##$ABSF1= 10
##$ABSF2= 0
##$ABSG= 5
##$ABSL= 3
##$ALPHA= 0
##$AQORDER= 0
##$ASSFAC= 0
##$ASSFACI= 0
##$ASSFACX= 0
##$ASSWID= 0
##$AUNMP= <proc_1d>
##$AZFE= 0.1
##$AZFW= 0.1
##$BCFW= 1
##$BC_mod= 2
##$BYTORDP= 1
##$COROFFS= 0
##$CY= 11.3945322036743
##$DATMOD= 1
##$DC= 2
##$DFILT= <>
##$DTYPP= 0
##$F1P= 15.7292609196834
##$F2P= 12.9074282941183
##$FCOR= 0.5
##$FTSIZE= 0
##$FT_mod= 4
##$GAMMA= 1
##$GB= 0.15
##$INTBC= 1
##$INTSCL= 1
##$ISEN= 128
##$LB= 0.24
##$LEV0= 0
##$LPBIN= 0
##$MAXI= 10000
##$MC2= 0
##$MEAN= 0
##$ME_mod= 0
##$MI= 1.114404
##$NCOEF= 0
##$NC_proc= 0
##$NLEV= 6
##$NOISF1= 3.799351
##$NOISF2= 2.8
##$NSP= 1
##$NTH_PI= 0
##$NZP= 0
##$OFFSET= 15.70392
##$PC= 1
##$PHC0= -20058.95
##$PHC1= 11.25272
##$PH_mod= 1
##$PKNL= yes
##$PPARMOD= 0
##$PSCAL= 0
##$PSIGN= 0
##$REVERSE= no
##$SF= 200.130013532006
##$SI= 16384
##$SIGF1= 3
##$SIGF2= 2
##$SINO= 400
##$SIOLD= 16384
##$SREGLST= <1H.CDCl3>
##$SSB= 0
##$STSI= 0
##$STSR= 0
##$SW_p= 3612.71676300578
##$SYMM= 0
##$S_DEV= 0
##$TDeff= 0
##$TDoff= 0
##$TI= <>
##$TILT= no
##$TM1= 0
##$TM2= 0
##$TOPLEV= 0
##$USERP1= <user>
##$USERP2= <user>
##$USERP3= <user>
##$USERP4= <user>
##$USERP5= <user>
##$WDW= 1
##$XDIM= 8192
##$YMAX_p= 0
##$YMIN_p= 0
$$ End of Bruker specific parameters
$$ ---------------------------------
##NTUPLES= NMR FID
##VAR_NAME=  TIME,          FID/REAL,        FID/IMAG
##SYMBOL=    X,             R,               I
##VAR_TYPE=  INDEPENDENT,   DEPENDENT,       DEPENDENT
##VAR_FORM=  AFFN,          ASDF,            ASDF
##VAR_DIM=   8192,          8192,            8192
##UNITS=     SECONDS,       ARBITRARY UNITS, ARBITRARY UNITS
##FACTOR=    0.0002768,     1,               1
##FIRST=     0,             0,               0
##LAST=      2.2672688,     0,               0
##MIN=       0,             -400085,         0
##MAX=       2.2672688,     363057,          0
$$ Real data points
##PAGE= N=1
##DATA TABLE= (X++(R..R)), XYDATA
0 0 0 0 0 0 0 0 0 0 0 0 0 0 2 -8 8 -8 8 -9 16 -16 24 -24 32 -40 46 -52 60 -71 84 -95 109 -124 141 -163 185
35 185 -208 235 -262 295 -329 368 -409 455 -505 560 -620 682 -753 831 -916 1008 -1110 1225
53 1225 -1349 1487 -1642 1816 -2015 2242 -2504 2812 -3177 3622 -4176 4881 -5817 7101 -8959
68 -8959 11667 -23602 317854 19411 -279226 142036 -51163 -400085 -29502 134661 -196872
79 -196872 15730 160161 -359427 -333402 240687 59708 -211066 120907 74598 -296070
89 -296070 -76208 159383 -31760 45947 209355 -148417 -249851 179351 140233 -138759
99 -138759 106285 172513 -183162 -138309 106829 -4178 -15987 137359 -77638 -246338 39077
110 39077 65595 -178829 -3295 137330 -148991 -198154 10546 -22955 -61678 55259 -25701
121 -25701 -155806 -11278 42320 -110436 -15823 136378 -22648 -122601 6902 45663 -6499
132 -6499 22198 41203 -18210 -12470 35172 -23068 -26530 85050 45207 -79757 -31216 57200
144 57200 253 -49851 20374 27272 -45276 -13763 6292 -47564 10108 51559 -52074 -54903
156 -54903 55086 21606 -68301 6100 68090 -24503 -25322 50857 -5785 -15560 63385 4679
168 4679 -46165 55664 59992 -55817 -12750 85666 -6374 -52052 57033 20812 -52786 35106
180 35106 25245 -62727 19307 63159 -56133 -43095 72465 -1813 -73327 44815 41095 -61341
192 -61341 15954 47734 -48957 4898 72679 -25158 -34579 70552 23459 -54082 40436 63069
204 63069 -37980 7470 61083 -23943 -7476 63474 -4181 -33134 46358 25379 -47516 10893
216 10893 49422 -32733 -20861 41143 -19872 -33289 32121 -4843 -42343 14701 14205 -43599
228 -43599 -12940 29700 -24197 -32510 24435 -8079 -35374 16300 4040 -30669 5814 15073
240 15073 -22034 -10368 22355 -3519 -20165 18304 10005 -18420 12288 15689 -10584 7292
252 7292 17607 -1746 -719 16287 9661 -6406 9864 15401 -7269 3179 13135 -5444 -1245
265 -1245 6478 -3345 -5936 -1251 -288 -9548 -8496 893 -11176 -12387 -1054 -10853 -11863 -4578 -9042
280 -9042 -8949 -7645 -5194 -4938 -8397 -388 -907 -5558 4144 2554 309 7481 5590 7213 8977 8227
296 8227 12470 8714 10105 14011 7428 10703 11522 5830 9395 6289 4191 5866 478 2471 925
311 925 -3929 121 -4363 -6162 -3045 -8215 -6471 -6467 -9598 -5800 -9153 -8213 -4821 -9636 -5128 -3983
327 -3983 -7382 -1452 -2842 -3042 1461 -765 1763 2525 2284 5844 2007 5073 8001 1360 6578 7489
343 7489 1176 6553 5730 1494 3973 4163 2893 -737 2587 5185 -4540 505 5466 -6154 -478
358 -478 4673 -6048 -2634 3455 -2739 -6476 1083 3753 -8280 -3198 6901 -7809 -4572 8209
372 8209 -6097 -5712 7528 -2296 -8990 3897 7103 -7873 -3975 10594 -4675 -7188 11912 -697
386 -697 -6852 11576 2224 -9560 7637 13357 -4219 -2142 15798 2258 -7636 14204 8067 -5274
400 -5274 12669 6844 -10374 6416 14362 -4859 -5582 11890 1391 -14987 2743 5869 -10455
413 -10455 495 75 -16909 -4879 4098 -10852 -12586 1898 -1604 -18426 -9589 3876 -6636
426 -6636 -6620 -1498 -9152 -4529 1549 -4496 -5269 2200 5908 -6270 -10786 7679 7786 -7230 -2804
441 -2804 4344 93 -4249 -1358 -520 -4952 2528 -326 -18015 -1707 12310 -15992 -19278 7421
455 7421 504 -18731 -5463 2651 -15751 -7645 6215 -18295 -9380 21238 -13362 -31585 14341
468 14341 13299 -23268 -1700 18579 -15614 -14860 16312 -9112 -13111 30426 -3467 -42684 12621
481 12621 22953 -29815 -5317 30376 -17080 -30204 14758 -4985 -21763 30685 7246 -50438
493 -50438 4027 29580 -32779 -8880 45800 -7111 -36957 16137 6799 -20779 34575 28496
505 28496 -40981 1312 39393 -27327 -11474 60190 10029 -39289 12981 13977 -24731 24418
517 24418 38325 -32382 -10797 33574 -30075 -28183 53924 18218 -44235 1007 13921 -30262
529 -30262 6089 39778 -16570 -14856 29342 -20663 -32488 48502 34796 -29660 3244 25388
541 25388 -17916 -51 43567 9436 -5074 28778 -4344 -27789 36967 42219 -15803 290
553 290 25799 -12098 -14848 26343 16278 -6756 10869 -4341 -31302 9173 28365 -13540 -11266
566 -11266 15431 -9888 -27631 4493 17513 -3109 -1840 20 -19424 -4774 19772 191
578 191 -7473 14758 5240 -20331 -4356 23388 10797 -4448 6219 99 -9019 9050 11041
591 11041 -3021 7467 11436 -14241 -16843 15272 14452 -12948 -1935 7793 -15907 -10421 9605
604 9605 -3389 -5919 8844 -9133 -26223 3930 16166 -15545 -8590 15562 -12150 -21182 10726
617 10726 4115 -10430 10059 3152 -23630 -1058 20608 -10133 -10455 22551 -2059 -25158 9833
630 9833 11834 -12471 7598 12253 -19253 -7492 19221 -6472 -14414 20765 4719 -27426 3280
643 3280 14383 -14401 678 15761 -14110 -12949 14371 -2914 -16022 15455 10204 -23578 -2165
656 -2165 15617 -11660 -4298 17192 -5947 -13282 10686 1855 -13711 10140 14018 -15576 -5112
669 -5112 15402 -6753 -7885 15376 1064 -11846 6669 4633 -11132 3868 13349 -8789 -7405
682 -7405 12143 -2565 -10537 10279 4760 -9981 2768 5584 -7922 -874 10176 -2938 -7098
695 -7098 8280 1806 -9287 5373 7142 -6102 486 6246 -3424 -2525 6472 1288 -5018 4045
709 4045 4137 -6414 380 6144 -3497 -2355 4157 -1353 -4170 1539 1556 -4188 -903 3254 -4169 -3680
725 -3680 3436 -1813 -4046 1871 116 -3570 -664 1680 -1700 -1970 2973 -351 -3353 2638 1406
740 1406 -2576 1763 2372 -1240 -361 2133 730 -1355 1867 1819 -2551 666 2097 -2135 -172 1541
756 1541 -1343 -1591 154 53 -2097 -936 931 -2478 -1840 1030 -1866 -1650 759 -1105 -1515 -231
772 -231 225 -665 -752 1235 -238 -1060 1787 395 -476 1821 704 95 1080 1032 994 416 1231 1219 -314
791 -314 1306 1149 -475 1192 637 -303 609 84 93 -29 -201 383 -754 -249 384 -1089 -15 194 -945
810 -945 142 -123 -508 247 -221 153 -15 -79 847 -206 337 1132 -223 706 1064 -40 971 868 411
829 411 678 558 998 216 183 1230 -297 123 1057 -648 62 759 -729 -338 183 -107 -677 -605 502
848 502 -782 -853 735 -979 -725 957 -797 -738 785 90 -410 76 895 144 -272 1386 129 -171
866 -171 1838 57 -423 1743 658 -324 708 987 184 -160 863 140 -469 1148 -344 -1171 1278
883 1278 47 -1294 492 195 -661 -233 116 -204 -140 804 -412 -897 1586 269 -1189 1449 813 -555
901 -555 946 597 -128 1058 1295 -435 -208 2122 208 -1380 1874 922 -1359 1045 411 -1283 1097
918 1097 1039 -1574 -427 1909 -711 -2125 1781 771 -2331 985 750 -2093 1055 1501 -2144 -269
934 -269 2412 -866 -2179 2211 1336 -2441 892 1513 -2284 734 2174 -2347 -543 2706 -1048 -2614
950 -2614 1969 1355 -2772 173 1732 -2524 -243 2227 -2274 -1156 2697 -1102 -2898 1754 1547 -2559
966 -2559 -132 2105 -1916 -756 2409 -1442 -1309 2783 -493 -2784 1611 1710 -2086 -501 2006 -1256
982 -1256 -1329 1750 -820 -1552 2000 -278 -2717 852 1294 -1738 -911 1263 -561 -1542 761 -193 -1252
999 -1252 1159 79 -1966 474 1158 -911 -570 902 293 -728 200 553 -104 678 364 -794 625
1016 625 1007 -19 107 395 563 141 -249 648 899 226 -213 -225 386 318 169 377 -488 -200 321 -979
1036 -979 -302 1321 -239 -1466 -321 56 -696 -83 910 -793 -1028 568 -888 -893 2011 659 -1655
1053 -1655 -54 736 -745 202 2089 213 -1026 1136 -125 -1258 2309 2063 -1425 -67 1206 -1109
1069 -1109 -555 2314 681 -1488 411 -88 -2391 792 2122 -1703 -1121 837 -1756 -2062 1379 843
1085 843 -1784 -203 157 -2717 -416 2365 -739 -1251 1361 -760 -2252 1144 1776 -787 164 1297
1101 1297 -1536 -989 2476 492 -956 1753 438 -2150 395 1978 -348 -255 1480 -754 -1833 1312
1117 1312 743 -1347 935 1023 -2137 -876 1270 -375 -874 1102 -8 -1965 220 812 -1293 183
1133 183 1469 -1167 -1227 1026 112 -988 796 933 -1130 -368 1127 -624 -428 1657 87 -1060 780
1150 780 641 -872 255 1447 -311 -678 972 102 -924 1088 826 -991 152 841 -750 -564 1042
1167 1042 263 -1016 349 451 -1263 -98 979 -780 -602 734 -416 -1179 472 604 -1017 -229
1183 -229 830 -937 -862 1016 -169 -1007 718 192 -1280 73 964 -695 -616 1053 -337 -1275 816
1200 816 436 -1112 358 693 -1091 -446 968 -308 -934 797 247 -1343 240 880 -1050 -90 961
1217 961 -606 -701 807 81 -913 393 626 -1024 -262 982 -635 -623 839 -275 -983 409 280 -898
1235 -898 -133 624 -776 -725 771 -262 -867 582 65 -962 179 581 -505 -218 752 -81 -544 775
1253 775 434 -554 579 694 -434 284 885 27 -15 790 364 -291 526 737 -314 309 808 -219 37
1272 37 642 49 -131 404 319 -274 108 541 -206 -130 534 -166 -258 464 41 -171 268 193 -150 6 360 50
1294 50 -103 478 84 -108 443 195 66 332 263 186 236 250 256 179 301 236 100 377 110 49 300 31 89 253
1318 253 -72 15 161 -138 -151 -29 -73 -337 -236 -15 -466 -374 -23 -583 -394 66 -497 -488 -1 -252 -465 -96
1340 -96 106 -283 -32 349 -179 -38 731 -86 -123 726 176 -108 470 498 26 254 569 -143 37 703 -313
1361 -313 -444 714 -155 -715 283 -4 -712 -90 -22 -730 -229 391 -735 -710 673 -337 -966 555 164
1380 164 -735 411 377 -567 308 918 -447 -197 1374 -11 -841 1167 574 -803 691 582 -837 390
1398 390 915 -828 -430 1249 -386 -1425 883 425 -1442 326 513 -1375 78 939 -1087 -472 1408
1415 1408 -410 -1546 1061 759 -1311 575 1059 -1210 122 1260 -894 -251 1736 -293 -1537 939
1431 939 918 -1319 300 1170 -1243 -474 861 -1069 -501 1453 -424 -1704 419 625 -1308 -59 1226
1448 1226 -753 -707 586 -807 -370 1378 -75 -1142 333 429 -822 -111 1143 31 -535 15 -524
1465 -524 -239 783 -8 -552 25 -224 -722 -452 266 416 -380 -788 -463 -72 -156 -357 266 52 -721 -155
1485 -155 -284 -601 961 646 -1201 -112 917 -749 -788 1375 601 -1073 577 373 -1554 774 1625
1502 1625 -1532 -128 2067 -1183 -1841 1855 899 -1728 1045 1259 -2445 -13 2320 -1782 -642 3151
1518 3151 -994 -2933 1891 1228 -2421 1132 2457 -2703 -929 2672 -1772 -1396 3995 -108 -3635
1533 -3635 1731 1600 -3057 890 3630 -2178 -1755 2886 -1393 -2390 4184 1220 -3787 1412 2122 -3510
1549 -3510 80 4312 -1214 -2297 2764 -840 -3403 3246 2247 -3618 632 2379 -3618 -1297 3994
1564 3994 -379 -2730 2167 -64 -3950 1627 2741 -2949 -97 2687 -2872 -2289 3306 549 -2497
1579 -2497 1716 1032 -3403 343 3006 -1758 -627 2947 -1371 -2640 2326 1280 -2127 943 1855
1594 1855 -2350 -1019 2401 -783 -1429 2303 -113 -2744 938 1463 -1692 -163 2002 -1062 -1800 1561
1610 1561 325 -1740 1339 1273 -1993 -77 1789 -782 -895 1852 559 -1668 764 1477 -1382 154
1626 154 2186 -672 -869 1825 293 -1358 1200 1688 -1274 -161 2141 -744 -1027 2207 415 -1512
1642 -1512 1407 1155 -1669 285 2190 -745 -993 2243 108 -1911 1674 1342 -1755 814 1974 -1396
1658 -1396 -687 2257 -88 -1509 1978 1111 -2225 817 2047 -1586 -16 2427 -820 -1444 1930 623
1674 623 -1734 1262 1798 -1964 -215 2246 -1183 -953 2296 -35 -1878 1191 1010 -1772 331 2063
1690 2063 -1356 -1115 1941 -517 -1614 1853 655 -1951 376 1100 -1413 -395 1972 -548 -1621
1705 -1621 1313 83 -1853 1043 1151 -1704 -270 1003 -1162 -1017 1395 70 -1765 439 383 -1952
1721 -1952 65 1263 -1299 -944 741 -811 -1400 719 471 -1466 -253 636 -1435 -570 1223 -553
1737 -553 -980 583 -275 -1195 300 709 -835 -511 647 -820 -937 872 -69 -965 260 -127 -1006 -231
1755 -231 407 -518 -774 236 -392 -1053 319 135 -859 17 59 -681 -184 283 -33 -402 97 190 -526 136
1775 136 536 -222 112 319 -96 101 261 363 59 -16 516 30 -88 498 202 -116 238 171 43 -57 297
1796 297 150 -308 266 327 -379 248 487 -170 61 328 59 -82 346 382 -346 198 661 -351 84 843
1816 843 -262 -193 598 141 -209 352 469 -356 151 828 -402 -82 962 -287 -342 816 30 -350 500
1835 500 398 -386 220 713 -495 -147 1082 -330 -480 942 -49 -609 648 155 -596 266 500 -686
1853 -686 -239 857 -503 -688 916 -178 -891 734 120 -790 454 456 -767 -4 879 -501 -690 1101
1871 1101 -86 -946 1008 208 -974 682 516 -968 257 921 -685 -509 1116 -152 -1048 954
1887 954 32 -1202 732 343 -1245 275 722 -1017 -457 956 -357 -944 918 41 -1179 749 404
1904 404 -1196 557 823 -1103 -119 1020 -398 -529 949 35 -972 736 332 -1089 757 686 -1249
1921 -1249 76 794 -781 -321 954 -226 -695 592 -7 -1054 891 583 -1278 441 783 -1150
1937 -1150 48 1068 -515 -277 918 -414 -896 1178 392 -1246 862 792 -1575 301 1114 -1078
1953 -1078 -67 1175 -1011 -907 1329 -49 -1426 1173 786 -1975 407 1307 -1515 10 1670 -1230
1969 -1230 -977 1717 -199 -1490 1503 993 -2037 424 1652 -1705 -104 2208 -1268 -1087 1993 -439
1985 -439 -1819 1697 1075 -2104 365 1783 -1904 -460 2369 -1144 -1246 2161 -403 -2035 1618 1174
2001 1174 -2036 303 1842 -1734 -815 2331 -702 -1474 2053 -110 -2125 1358 1284 -1762 172 1734
2017 1734 -1353 -1089 2008 -239 -1459 1685 339 -1952 937 1260 -1298 69 1556 -785 -1064 1436
2033 1436 288 -1149 1206 680 -1572 379 1099 -842 -29 1159 -425 -1012 533 399 -773 475
2049 475 680 -1065 -292 595 -469 -95 668 -81 -713 -258 281 -103 -22 533 -191 -563 17 3 117 193
2069 193 298 -54 -743 -30 530 -263 209 556 -694 -657 222 185 -222 316 369 -1172 -542 706 -444 -314
2089 -314 1023 -544 -1302 243 228 -597 291 787 -1078 -996 889 -270 -647 1313 23 -1618 178
2106 178 547 -836 303 1157 -929 -1309 848 -53 -1051 1284 384 -1861 -121 697 -863 49 1326
2123 1326 -617 -1563 607 332 -1069 1020 941 -1748 -423 1000 -606 -79 1384 -257 -1498 282
2139 282 613 -825 665 1286 -1363 -895 877 -331 -187 1350 52 -1449 -203 669 -464 376 1423
2156 1423 -798 -1303 690 49 -205 1315 538 -1220 -496 570 -27 303 1473 -181 -1379 328 378
2173 378 -198 1230 873 -889 -756 322 122 184 1213 393 -1324 -323 356 -176 826 1038 -433 -849
2191 -849 -90 159 192 928 827 -856 -646 305 -187 491 1181 0 -726 -255 36 87 573 834 -356 -836
2211 -836 96 -104 121 919 257 -573 -388 -128 52 251 680 81 -770 -105 15 -106 576 399 -334 -327 -117
2232 -117 33 93 380 338 -520 -315 160 -231 198 443 -220 -345 -186 -24 -54 19 317 -273 -471 151 -163
2253 -163 -189 333 -113 -370 -93 29 0 -85 221 -114 -542 225 81 -308 295 92 -369 -19 66 -43 -55 158
2275 158 25 -494 110 208 -382 171 184 -524 -50 144 -168 -119 148 53 -452 44 255 -388 147 338 -453
2296 -453 -38 250 -207 -9 173 -7 -214 66 271 -311 40 368 -431 -93 361 -331 -73 330 -118 -191
2316 -191 116 80 -239 25 352 -342 -48 423 -351 -65 400 -200 -126 236 -15 -153 68 213 -308 14 437
2337 437 -343 -144 505 -266 -184 371 -104 -235 201 11 -231 4 306 -308 -161 472 -237 -260 503 -140 -252
2358 -252 349 29 -231 183 198 -256 -9 408 -157 -210 510 -126 -305 447 -60 -344 308 118 -330 18 309
2379 309 -199 -240 443 -128 -402 456 -142 -437 380 80 -338 136 243 -210 -103 359 -81 -306 505 -4
2399 -4 -425 475 71 -407 291 124 -263 42 243 -160 -210 339 -77 -435 392 70 -465 330 167 -394 147
2420 147 270 -187 -61 340 -59 -320 443 76 -421 367 175 -432 231 183 -349 76 269 -183 -212 282 11
2441 11 -452 301 154 -501 181 192 -451 97 278 -325 -81 234 -93 -350 277 160 -368 216 255 -482 170
2462 170 353 -252 -1 322 -137 -199 247 63 -340 185 247 -470 34 358 -331 -11 304 -205 -155 166 -24
2483 -24 -281 114 181 -360 -26 335 -299 -2 292 -242 -157 214 -102 -152 62 112 -204 -26 236 -305 -133 279
2505 279 -216 -96 254 -191 -208 116 11 -88 -7 151 -237 -184 189 -108 -77 242 -133 -217 76 -24 14 101 62
2528 62 -45 -206 56 5 19 216 -113 -178 -51 -136 65 163 -43 -36 -181 -212 -55 38 166 -23 -76 -126 -269 59
2552 59 279 54 112 -96 -395 -42 188 82 142 42 -151 -304 32 265 29 119 31 -518 -130 191 -1 182
2574 182 222 -241 -385 -15 281 38 154 216 -485 -202 322 34 208 452 -88 -405 59 286 103 254 334
2595 334 -346 -314 380 87 91 485 -144 -454 32 219 6 243 295 -242 -414 290 162 16 443 53 -516
2616 -516 10 319 63 230 401 -101 -372 305 241 14 449 228 -471 -28 254 87 198 315 -29 -395
2636 -395 127 328 -17 260 231 -361 -209 233 107 80 237 -17 -369 -87 295 93 163 321 -275 -326 186
2657 186 187 109 208 76 -298 -187 252 152 19 223 -95 -392 -25 181 59 107 49 -255 -396 44 153 -49
2679 -49 109 -60 -416 -167 43 -14 43 49 -132 -380 -76 186 -75 57 100 -329 -303 71 6 4 75 -36 -287 -234
2703 -234 105 -57 -42 175 -180 -382 -43 21 -121 25 35 -269 -315 105 31 -204 222 -30 -353 -59 119 -137
2725 -137 3 221 -114 -312 33 88 -191 157 204 -357 -121 175 -120 65 254 -43 -251 68 60 -194 112
2746 112 240 -227 -106 166 -88 -58 265 -44 -198 130 65 -192 171 260 -210 -106 229 -164 -58 319 -33
2767 -33 -95 127 44 -161 179 273 -160 -18 244 -131 -41 311 -44 -171 175 -35 -123 182 160 -126 73 197
2789 197 -235 14 355 -113 -94 216 -103 -167 243 45 -184 125 154 -277 -41 299 -190 -52 335 -182 -185 295
2811 295 -22 -174 194 154 -328 131 298 -268 7 353 -252 -202 402 -143 -269 284 48 -411 156 247 -395
2832 -395 -11 352 -320 -208 472 -170 -378 425 -7 -489 277 215 -471 55 354 -316 -127 564 -229 -352
2852 -352 523 -12 -472 432 251 -546 155 427 -449 -97 591 -319 -364 603 -151 -534 446 116 -649 262
2872 262 366 -543 9 644 -431 -324 637 -147 -577 563 169 -676 352 373 -590 87 622 -437 -215
2891 -215 713 -166 -533 651 67 -661 518 370 -681 178 577 -584 -141 760 -302 -429 704 16
2909 16 -733 574 332 -782 313 499 -651 -55 713 -375 -388 723 -100 -690 612 239 -717 362
2927 362 525 -721 30 665 -450 -192 760 -169 -518 632 117 -707 502 556 -737 147 649 -594
2945 -594 -182 786 -214 -444 597 53 -745 475 457 -764 173 609 -708 -146 776 -310 -416 683
2963 683 -68 -685 516 350 -653 320 660 -706 7 716 -395 -192 817 -149 -551 512 170 -631
2981 -631 376 538 -680 -63 657 -536 -223 813 -227 -475 498 -35 -658 428 420 -619 16 498
2999 498 -676 -201 813 -225 -351 635 -80 -619 420 447 -465 164 530 -613 -247 701 -228 -355 590
3018 590 -177 -683 358 240 -512 248 320 -654 -355 472 -337 -305 598 -241 -675 270 38 -487 359 316 -472
3039 -472 -172 358 -266 -129 649 -111 -505 329 -5 -376 393 263 -428 -85 124 -412 -141 440 -185 -438
3059 -438 213 -202 -550 334 151 -424 -38 87 -442 -85 420 -131 -319 264 -115 -412 381 110 -416 156
3079 156 146 -394 41 432 -130 -183 400 -86 -454 365 206 -423 204 196 -503 15 320 -208 -138 230 -87 -392
3101 -392 272 267 -391 186 297 -461 -1 424 -150 -48 373 22 -303 166 343 -285 177 381 -378 -79 438
3122 438 -84 -90 323 48 -270 141 305 -182 2 352 -326 -244 465 -26 -127 325 -17 -305 15 308 -10
3143 -10 23 317 -143 -333 337 218 -42 303 4 -268 -44 264 184 62 257 -102 -426 107 225 20 292
3164 292 21 -382 -229 51 274 271 198 -19 -594 -198 210 150 352 168 -384 -407 -197 208 432 269 110 -407
3186 -407 -558 58 252 375 342 -155 -412 -474 -31 472 321 271 -97 -749 -378 250 343 452 139 -365 -761
3207 -761 -267 482 262 332 301 -736 -773 181 150 309 546 -86 -782 -490 232 175 291 647 -430 -948 80
3228 80 32 14 778 314 -721 -410 148 -59 159 879 -63 -887 49 -16 -439 724 616 -579 -361 110
3248 110 -328 -116 876 153 -745 84 45 -717 510 739 -480 -202 164 -443 -218 675 307 -552 194 111
3268 111 -721 278 706 -470 -17 379 -477 -243 564 167 -352 302 170 -667 84 586 -476 50 536
3287 536 -548 -220 527 -57 -230 373 102 -541 70 366 -459 23 554 -493 -139 504 -300 -201 475 -40
3307 -40 -391 188 248 -461 140 518 -461 -73 590 -567 -183 618 -300 -321 393 54 -456 222 371 -568 30
3328 30 534 -592 -214 726 -376 -387 582 -187 -515 369 249 -590 89 564 -616 -250 780 -423 -464
3347 -464 757 -205 -610 553 173 -620 203 492 -606 -207 781 -483 -488 844 -247 -668 691 89
3365 89 -707 374 377 -669 -63 722 -474 -490 895 -211 -776 768 34 -743 531 329 -728 113 660
3384 660 -422 -335 794 -193 -733 747 168 -864 594 377 -811 243 603 -550 -201 723 -182 -686
3402 -686 764 161 -865 565 354 -899 288 549 -673 -71 655 -253 -523 636 97 -791 588
3419 588 448 -845 304 639 -754 69 733 -352 -310 609 98 -573 472 431 -786 267 623 -750
3437 -750 35 661 -418 -221 611 -88 -452 393 323 -621 194 565 -665 -5 676 -500 -220 626 -226
3456 -226 -328 398 187 -416 153 457 -507 -7 572 -373 -150 620 -265 -198 436 -9 -195 186 169 -348 12
3477 12 456 -420 -162 496 -380 -176 466 -214 -231 321 -41 -221 202 242 -320 -53 426 -310 -41 602 -356
3498 -356 -185 471 -243 -208 427 88 -297 90 223 -457 -88 661 -356 -279 608 -427 -482 531 13 -420
3518 -420 215 157 -556 -100 694 -287 -363 673 -394 -686 756 202 -468 356 224 -681 -132 701 -79 -339
3538 -339 746 -235 -986 616 391 -512 437 310 -811 -315 610 -6 -383 689 -5 -1121 246 502
3556 502 -586 415 582 -775 -523 427 97 -277 638 267 -1097 -123 653 -463 220 841 -529 -713
3574 -713 343 141 -255 481 542 -777 -463 615 -268 -101 884 -190 -832 194 164 -272 217 630 -400
3593 -400 -650 552 13 -470 678 180 -712 33 350 -162 -95 466 -68 -607 313 373 -542 210 325 -604
3613 -604 -90 530 -2 -220 113 35 -565 117 719 -274 -238 367 -484 -332 578 366 -163 -80 13 -558 -167
3634 -167 951 197 -412 200 -390 -593 476 755 53 -221 -51 -490 -572 841 738 -419 28 -131 -993
3653 -993 85 1000 334 -205 -104 -426 -946 442 1133 -118 -87 131 -1082 -530 945 597 -75 86 -231
3672 -231 -1114 -158 1204 222 -197 459 -826 -1113 691 723 -36 323 91 -1084 -683 979 423 -186 748
3691 748 -363 -1343 284 759 -66 309 451 -768 -879 527 473 -268 698 246 -1327 -121 694 -220
3709 -220 274 717 -451 -890 211 392 -319 537 553 -987 -371 580 -333 44 849 -147 -698 -10 174
3728 174 -341 242 669 -459 -486 428 -325 -212 692 44 -400 6 85 -240 19 574 -81 -350 302 -189
3748 -189 -343 385 48 -163 72 -27 -159 -31 239 146 -171 100 -4 -209 188 66 -74 155 -127 -7 59
3769 59 -135 196 48 -105 67 -46 -55 -40 60 130 -233 -26 194 -379 61 310 -259 10 250 -189 -190 226
3791 226 187 -293 73 325 -381 -62 467 -286 -160 385 -254 -349 298 168 -339 16 418 -410 -187 643 -310
3812 -310 -372 597 -142 -399 399 110 -405 68 384 -364 -239 610 -184 -421 681 -104 -550 437 161 -503
3832 -503 208 324 -347 -185 488 -170 -440 598 13 -565 459 165 -546 224 290 -355 -96 440 -137 -418
3852 -418 541 77 -604 410 214 -594 242 347 -458 8 310 -213 -302 399 32 -561 342 227 -565 245
3872 245 321 -453 38 378 -293 -183 327 5 -321 289 151 -538 236 386 -545 52 387 -356 -68 367
3892 367 -162 -229 246 78 -398 182 302 -459 41 312 -400 -14 312 -314 -125 255 36 -293 148 236 -332
3913 -332 37 370 -403 8 388 -333 -88 337 -90 -193 239 135 -267 36 311 -328 -41 429 -356 -148
3933 -148 397 -146 -207 302 0 -245 69 179 -305 -67 354 -315 -160 392 -223 -223 404 -121 -223 256 61
3954 61 -203 47 226 -275 -160 413 -217 -221 490 -156 -276 328 7 -235 146 189 -286 -114 334 -177 -274 466
3976 466 -135 -404 408 -59 -388 221 187 -238 -128 254 -157 -300 421 6 -467 406 56 -406 287 260 -230
3997 -230 -36 160 -157 -228 390 188 -440 213 202 -479 142 370 -178 -26 226 -151 -294 213 308 -343 102
4018 102 199 -510 -30 405 -134 -24 177 -158 -273 54 307 -168 -29 219 -346 -268 432 18 -76 259 -36
4039 -36 -248 -9 284 28 -133 277 -144 -387 304 158 -131 185 33 -199 -142 134 240 -184 136 109 -374
4060 -374 53 267 -190 34 117 -76 -188 -34 231 -173 -78 257 -267 -194 360 -81 -155 159 27 -207 -45
4081 -45 295 -71 -198 308 -64 -315 364 124 -338 69 182 -115 -4 300 23 -381 159 151 -380 218 388
4102 388 -425 -116 171 -172 -163 271 171 -445 -7 340 -375 -10 530 -257 -318 259 -41 -268 290 362 -404
4123 -404 -208 398 -266 -246 682 -11 -531 280 104 -415 192 463 -231 -371 351 -72 -436 535 228 -601
4143 -601 112 185 -430 21 455 -139 -382 268 26 -510 312 378 -541 17 343 -331 -146 465 17 -416 114
4164 114 150 -444 116 534 -396 -185 392 -270 -183 435 67 -324 39 246 -326 -198 550 -161 -303 382 -119
4185 -119 -358 273 276 -225 -79 179 -148 -227 432 90 -363 269 86 -372 137 266 -83 -80 151 -47 -250 215
4207 215 312 -222 105 242 -268 -29 282 -1 -112 31 100 -248 -31 364 -136 -156 252 -152 -290 236 125
4228 125 -143 -88 118 -118 -248 302 102 -325 197 52 -302 53 249 -79 -136 225 8 -319 224 256 -358
4249 -358 66 339 -341 -111 340 -71 -172 187 174 -337 -1 382 -369 -152 357 -250 -254 369 -54 -324 181
4270 181 196 -286 -59 383 -275 -262 445 -66 -278 411 41 -339 134 214 -195 -33 370 -118 -320 359 35
4291 35 -339 318 99 -436 55 224 -183 -39 237 -44 -356 179 129 -355 232 175 -304 2 173 -155 47
4312 47 197 -12 -248 70 153 -231 92 166 -282 7 164 -135 34 154 -15 -118 14 95 -130 72 228
4333 228 -194 17 177 -150 26 178 -95 34 76 -1 -26 28 137 -50 -26 78 -177 48 160 -142 1 88
4355 88 -138 13 75 -30 -30 9 30 -92 17 94 -134 35 125 -190 -15 118 -45 10 88 4 -35 52 131 -161 2
4380 2 230 -180 58 213 -101 -9 159 -68 -39 71 90 -136 7 168 -198 -115 204 -209 -62 179 -110 -62
4402 -62 119 -21 -80 -25 92 -128 -49 223 -162 -79 216 -102 -121 195 -4 -87 103 14 -55 -66 120 -64 -147 190
4426 190 -65 -165 177 -26 -169 44 34 -112 -7 71 -27 -136 147 -59 -214 92 55 -191 143 93 -123 41
4448 41 89 -22 -90 88 -18 -150 163 93 -192 58 135 -135 21 107 -35 -12 -32 45 -195 -19 116 -239 -10
4471 -10 91 -150 -15 96 -77 -103 21 28 -71 -44 134 -69 -46 172 -46 -40 147 29 11 20 108 30 -73 166 15
4496 15 -88 162 53 -91 42 81 -5 -23 40 20 -118 31 116 -168 26 46 -160 -3 115 -13 -119 -52 19
4519 19 -84 -110 207 -75 -92 149 -29 -134 107 114 -48 3 168 -70 -168 294 75 -184 214 80 -191 84
4541 84 158 -25 -61 177 7 -257 181 137 -215 52 181 -353 -136 192 -94 -177 164 44 -349 0 292 -227
4563 -227 -68 359 -198 -263 294 34 -208 198 213 -300 -125 394 -143 -188 463 29 -376 231 160 -284 151
4584 151 410 -229 -261 347 -41 -306 404 156 -480 5 235 -318 -40 354 -120 -397 232 64 -458 237
4604 237 371 -467 -38 330 -315 -177 482 48 -342 188 177 -421 88 568 -246 -171 399 -249 -424 454 316
4625 316 -276 70 279 -432 -213 518 -73 -293 367 -31 -582 133 337 -289 2 330 -281 -445 401 118
4645 118 -392 284 197 -542 -75 436 -109 -86 409 -29 -507 187 357 -239 190 537 -381 -334 293 21 -169
4666 -169 369 177 -529 -164 331 -212 -69 535 -86 -497 143 2 -352 179 388 -311 -409 290 -53 -252
4686 -252 561 272 -545 -13 301 -249 64 564 -52 -478 212 170 -384 360 558 -371 -147 317 -306 -210 505
4707 505 106 -545 83 219 -556 -13 616 -296 -379 385 -172 -517 370 293 -466 4 430 -375 -195 646 1
4728 1 -443 482 143 -492 310 475 -392 -104 488 -177 -372 579 170 -510 278 273 -488 69 484 -288 -273 401
4750 401 -10 -447 342 203 -561 48 409 -391 -140 388 -211 -360 319 109 -397 153 273 -420 -68 417
4770 417 -184 -112 379 -60 -344 221 130 -188 55 270 -230 -200 356 -6 -182 270 63 -265 31 143 -127
4791 -127 -26 185 -131 -236 94 32 -170 125 49 -191 -82 70 -31 -88 24 102 -184 -32 119 -134 -43 115
4813 115 -40 -105 -10 115 -102 -51 103 -34 -152 81 81 -130 83 152 -91 -30 173 91 -148 172 133 -190 45
4836 45 174 -188 -67 204 -117 -163 112 32 -238 80 170 -287 -9 215 -228 -98 223 -44 -234 133 70 -205
4858 -205 19 238 -182 -42 323 -130 -123 225 33 -209 210 120 -198 19 248 -154 -148 211 -47 -223 203 24
4880 24 -251 86 98 -210 -19 196 -149 -146 197 -67 -258 227 82 -240 150 92 -234 66 192 -49 -54 103
4902 103 3 -174 136 111 -181 136 166 -143 -19 75 -102 -71 68 3 -151 106 56 -203 72 101 -205 1
4924 1 87 -160 -21 94 4 -18 31 7 -54 62 147 -112 44 111 -76 7 113 32 32 60 8 -8 -4 79 -35 7 93
4951 93 -59 6 69 -54 15 -50 -31 0 -30 -60 -24 -84 -4 -31 -75 35 -76 41 41 -88 8 22 -73 31 58 -57 36
4978 36 51 52 9 92 20 -75 130 119 -113 136 144 -101 26 119 -65 -42 96 64 -219 35 107 -193 -69 212 -155
5003 -155 -152 133 -80 -155 93 100 -279 -32 237 -251 -107 372 -100 -205 225 38 -275 171 278 -229 -41 293
5025 293 -169 -194 406 108 -250 238 145 -378 37 400 -238 -143 317 -150 -394 331 194 -374 175 204 -442
5046 -442 -111 360 -139 -243 291 -24 -498 137 264 -358 98 374 -460 -310 368 28 -269 362 198 -469
5066 -469 -4 431 -223 -30 594 -198 -371 318 128 -287 297 373 -381 -224 367 -160 -263 482 97 -529
5086 -529 74 222 -383 4 499 -156 -372 259 -81 -502 279 401 -441 -84 317 -317 -137 534 162 -411
5106 -411 127 165 -507 124 638 -190 -250 339 -192 -491 375 429 -309 -60 339 -474 -335 570 30 -365 299
5127 299 32 -655 53 536 -212 -151 482 -240 -677 451 409 -454 242 348 -699 -226 622 -55 -325 524
5147 524 46 -791 246 543 -425 52 634 -510 -599 548 154 -456 399 361 -848 -128 672 -397 -235
5166 -235 782 -225 -745 390 256 -551 271 648 -651 -410 698 -182 -459 757 157 -855 203
5183 203 456 -523 -17 785 -339 -539 616 79 -699 517 414 -770 19 543 -423 -273 659 -93 -645
5202 -645 331 225 -665 266 563 -577 -256 560 -235 -387 513 163 -603 218 446 -499 31 643 -264 -394
5222 -394 499 -1 -420 314 337 -381 5 468 -264 -218 441 42 -442 269 166 -433 82 429 -202 -253 339
5243 339 -56 -373 331 280 -412 -2 285 -248 -183 387 53 -383 114 255 -343 53 430 -267 -157 306 -30
5264 -30 -289 269 170 -337 -63 349 -226 -230 412 -28 -388 282 121 -337 114 400 -254 -257 394 -37 -393 353
5286 353 215 -456 76 296 -368 -42 433 -157 -378 291 99 -489 255 353 -431 -4 387 -329 -223 439
5306 439 -33 -417 179 191 -404 39 429 -389 -118 407 -218 -321 382 108 -393 82 273 -331 -80 457
5326 457 -214 -317 312 -42 -374 289 121 -323 3 195 -278 -144 336 -68 -311 244 39 -316 200 166
5346 166 -328 18 202 -160 -112 296 44 -280 215 117 -253 111 206 -182 -10 129 -85 -83 88 63 -176 90
5368 90 111 -190 52 174 -154 14 98 -101 3 91 22 -53 -25 107 -55 -24 101 -37 36 92 -111 6 -11 -44
5392 -44 28 -38 1 25 43 -21 4 6 24 -96 39 77 -80 50 43 -61 46 3 -13 42 2 -7 -15 41 77 -101 18 102
5420 102 -148 -16 68 -56 -34 41 -43 -59 36 -6 -111 53 86 -171 36 121 -174 19 105 -73 -52 0 2 -70 47
5445 47 68 -98 -10 124 -119 -42 92 -90 -39 46 13 -87 63 148 -108 -72 190 -121 -2 206 -92 -126 129
5468 129 -52 -101 124 131 -92 -42 177 -123 -94 187 -46 -164 169 45 -120 87 45 -88 15 85 -39 -157
5490 -157 136 49 -204 166 96 -223 50 109 -101 -61 142 15 -210 89 96 -179 105 100 -220 -18 120 -61 -100
5513 -100 136 75 -201 29 170 -173 -45 183 -139 -77 164 -59 -167 121 163 -156 -56 142 -92 -176 201
5534 201 -3 -155 148 57 -88 15 149 -38 -136 181 -18 -188 178 111 -186 86 61 -159 -52 185 41
5555 41 -169 139 131 -217 -29 174 -212 -58 158 -69 -169 33 87 -165 -2 226 -155 -143 239 -38 -169 243
5577 243 28 -294 31 195 -80 -94 297 -58 -297 240 54 -325 157 189 -273 -65 275 -65 -186 270 132
5598 132 -374 172 230 -368 -2 312 -231 -186 270 -26 -293 203 264 -394 -15 358 -283 -134 459 -124 -285
5619 -285 224 42 -335 151 387 -308 -157 419 -210 -294 494 35 -398 200 143 -328 53 460 -122 -246 394
5640 394 -62 -478 356 239 -384 108 213 -343 -152 377 7 -259 354 56 -506 207 313 -399 -4 375
5660 375 -314 -281 307 154 -219 192 156 -511 2 383 -203 -26 334 -171 -318 126 171 -154 163 279 -349
5681 -349 -310 281 8 -88 322 -14 -391 -28 134 1 80 267 -127 -383 84 139 -137 388 154 -299 -177
5702 -177 98 37 -30 231 77 -499 -106 209 -121 118 333 -192 -327 -4 116 -33 162 245 -298 -294 186 -62
5724 -62 3 333 10 -385 -48 178 -40 141 382 -190 -381 148 122 -105 355 164 -363 -100 141 -44 30
5745 30 379 32 -418 47 180 -249 224 279 -337 -214 262 -84 -107 313 151 -411 -24 259 -210 61 370
5766 370 -267 -281 214 -48 -142 247 194 -354 -111 242 -166 -54 417 -153 -278 166 -19 -164 192 172 -245
5787 -245 -169 181 -54 -86 351 -13 -335 216 78 -107 177 118 -175 -159 110 -10 -101 252 72 -298 74 48
5809 48 -184 111 175 -116 -68 64 22 -49 161 156 -220 -3 137 -139 63 133 -77 -79 41 14 -39 14 123 -125
5833 -125 -43 39 -139 37 91 -113 -23 -39 -63 -7 -32 61 2 -101 3 -33 9 36 -53 1 1 -39 45 -6 -41 91 -49
5860 -49 13 26 -8 42 27 46 -33 -65 78 38 -44 86 -23 -64 86 -28 -40 -19 31 -34 -65 31 47 -67 102 47 -73
5887 -73 60 85 -40 60 34 9 -53 4 8 -96 21 74 -128 35 99 -76 37 81 -10 -40 32 69 -92 -25 76
5912 76 -82 -13 116 -65 29 70 -48 -29 -10 53 14 -15 71 -8 -6 113 -55 -20 70 -14 -8 43 1 10 -33 38 20 -21 94
5941 94 -21 -95 140 -35 -40 109 -47 -47 19 -30 6 12 26 61 -80 71 26 -105 55 -44 -107 23 20 8 -16 -8 10 -76
5969 -76 13 35 -30 69 12 -84 61 13 0 26 30 18 8 58 73 -58 4 32 -65 22 72 -45 8 -15 -24 -39 0 38 -13 -32
5999 -32 -39 -91 -29 47 -53 -48 6 -51 -25 -45 -6 7 -7 41 -55 -57 45 -34 19 45 -29 80 -3 -12 50 6 85 73 -8 44 53
6030 53 -15 4 -8 15 -4 -19 49 -61 -73 93 -101 -59 33 -25 30 -70 33 -35 -58 12 -54 -59 64 5 -111 17 -7
6057 -7 5 88 36 -27 -75 73 70 -69 89 138 -64 89 30 -63 55 80 -16 -55 21 49 -130 -12 129 -161 -66 90
6083 90 -167 -56 105 -73 -140 -24 15 -90 14 102 -134 -39 219 -65 -63 124 -39 -65 57 82 -59 -17 141
6106 141 -54 -104 186 -25 -136 97 39 -114 8 128 16 -49 101 -6 -190 134 57 -166 69 10 -236 -8
6128 -8 119 -4 -98 109 -33 -201 60 221 -91 79 86 -236 -116 112 60 -42 85 57 -204 -44 150 -25
6150 -25 60 164 -177 -183 54 7 6 36 92 -164 -189 156 -21 -79 208 -73 -236 -4 75 -45 53 134 -96 -209 86
6175 86 63 -84 140 87 -313 -75 102 0 103 171 45 -229 -16 138 -80 115 218 -205 -212 82 9 5 142
6198 142 62 -208 -91 128 -136 -61 246 -126 -232 145 43 -112 99 163 -173 -91 174 -38 -90 224 35 -218
6220 -218 35 94 -122 159 134 -124 -172 131 23 -137 203 99 -295 26 166 -153 -51 213 -79 -196 66
6241 66 79 -229 118 157 -209 -148 171 -121 -94 214 -37 -246 46 95 -124 26 174 -114 -125 166 -2 -107
6263 -107 206 97 -116 17 166 -94 -63 195 9 -142 153 84 -175 110 69 -101 -82 84 18 -129 71 46
6285 46 -184 74 129 -168 5 89 -82 -58 84 6 -133 24 174 -91 -30 88 -73 -70 184 -40 -73 90 1
6308 1 -86 -12 110 2 -110 152 44 -83 97 28 -49 84 51 -40 -94 90 -41 -71 105 112 -116 -24 78 -134
6332 -134 -31 20 -1 -54 85 60 -144 7 176 -107 -35 129 -94 -58 40 30 -55 -14 83 -112 -49 154 -25 -65
6356 -65 123 -19 -74 70 86 -47 1 119 -39 -36 131 -5 -65 82 16 -38 73 72 -11 -35 106 -24 -89 52 6
6381 6 -96 83 68 -121 -6 54 -85 18 76 -13 -43 20 40 -84 -46 54 -120 -24 72 -15 12 61 7 -105 45
6406 45 54 -28 -12 112 -3 -46 55 -17 35 14 1 -5 -25 0 -12 -68 25 2 -19 41 15 -39 40 4 15 -35 18 16 -44 71
6436 71 44 1 53 -1 -65 56 32 22 23 5 40 19 7 -25 -43 -9 16 -43 41 -24 -39 6 -42 5 6 -45 22 1 -40 30 12
6467 12 -40 22 -9 3 -17 -27 42 -13 24 46 -18 35 56 29 37 20 2 -4 22 13 -78 9 24 -81 -51 85 -53 -8 6 9 -57
6498 -57 -35 68 -20 -14 71 -63 -48 82 -79 -43 62 -13 -38 56 34 -42 -19 106 33 3 108 41 -93 95 108 -72
6524 -72 27 11 -51 -62 25 -18 -107 34 -31 -135 11 50 -123 -31 9 -70 -97 3 10 -65 66 82 -159 37 121 -3
6550 -3 15 80 -36 -80 58 110 -11 87 80 -89 -30 152 -41 -60 91 59 -65 47 101 -67 -42 167 -45 -169 82
6575 82 3 -56 82 49 -89 -52 -7 -36 -62 83 3 -128 72 69 -75 78 86 -19 -55 30 40 -129 -17 168 -100
6600 -100 -38 143 -73 -28 99 16 -76 65 93 -94 10 110 -44 -94 163 4 -176 69 139 -131 15 86 -71
6623 -71 -102 109 56 -193 87 79 -166 48 109 -62 -34 160 64 -178 103 71 -205 51 176 -165 -22 195 -26
6646 -26 -96 158 23 -192 114 185 -162 -5 204 -84 -100 167 23 -188 96 99 -182 15 190 -152 -120 198
6668 198 -24 -202 146 81 -140 96 194 -155 -107 228 -67 -172 171 106 -181 41 157 -174 -40 117 -156
6689 -156 -82 142 -9 -208 84 125 -182 -1 171 -106 -124 199 -48 -138 97 105 -189 13 148 -97 -26 213
6711 213 27 -117 163 40 -150 93 132 -120 -123 118 -40 -65 115 -6 -121 73 116 -84 29 110 -81 -124
6733 -124 138 0 -164 58 101 -158 1 116 -85 -68 116 50 -104 92 105 -69 -14 143 -87 -90 115 3
6755 3 -100 92 114 -50 -40 128 -31 -51 153 10 -85 58 126 -110 32 91 -63 -82 139 37 -124 153 55
6778 55 -169 36 107 -126 -61 81 -1 -105 133 43 -167 54 102 -116 -54 153 -67 -139 99 75 -126 98 54
6801 54 -149 -1 118 -81 -21 142 -9 -83 67 32 -121 -14 90 -142 -87 191 -8 -82 140 18 -118 9
6823 9 80 -105 46 116 -63 -66 89 -14 -125 121 47 -98 -16 119 -100 -35 84 7 -15 32 17 -90 -13 105 -49
6848 -49 -34 45 -47 -125 33 7 -14 24 70 -87 -1 46 26 -20 40 1 -79 20 53 -25 11 27 -10 -34 21 -15 -58 18 44
6877 44 -58 -13 19 -37 -39 0 13 -30 -20 -10 -45 -4 -12 18 -9 60 -16 10 -5 55 -46 -71 4 -29 -42 -6 5 36 -55 69
6907 69 -13 -24 76 -62 -32 79 20 5 -37 -13 -38 -54 28 0 -25 16 16 -68 47 52 5 10 17 5 -17 26 -4 -35 3 2 -25
6938 -25 -24 52 -70 -69 53 -32 17 -12 -12 17 -34 38 -58 23 60 -30 -10 35 38 30 3 48 -55 -30 101 -29 3 84 25 -30
6968 -30 17 -12 -14 85 50 -18 -38 57 27 -66 52 10 -55 79 6 -40 -4 -15 -42 26 38 -1 39 43 10 -15 40 9 -9 8
6998 8 24 -52 -24 -45 3 -48 26 54 -11 -14 23 -55 -42 30 -62 -35 74 9 -28 -17 -16 -22 11 28 -2 16 18 -18 -59 15 -5 29
7030 29 -35 42 7 21 -10 -4 42 23 57 -3 -15 33 9 -37 23 -21 12 -3 17 -67 -42 29 8 8 23 54 -22 -2 13 -22 -90
7061 -90 29 -8 -20 34 -30 -42 -3 24 -23 -12 63 -15 -87 27 65 -31 56 31 -52 -48 68 67 -45 61 0 -90 44 25
7089 25 -94 -6 106 -55 -56 69 18 -33 40 68 -145 -24 43 -19 -25 94 -17 -58 92 3 -52 -22 15 -76 -36 68
7115 68 -6 -75 59 72 -91 24 -3 -90 3 64 -57 -73 51 -5 -32 80 50 -74 55 78 -49 8 60 -21 -93 45
7141 45 46 -73 24 106 -71 -2 76 -66 -45 82 40 -117 28 57 -84 3 58 -52 30 7 28 18 39 40 -41 -16 103
7168 103 -52 -11 39 -14 -31 112 41 -17 -17 68 -52 -7 55 -21 -75 -7 36 -62 42 34 -26 -37 30 28 -73 18 74 -21 4
7197 4 47 -20 -57 24 25 -56 59 39 -16 12 95 -29 -124 79 -30 -71 -5 36 -85 8 58 -10 -36 62 -8 -84 51 38
7225 38 -85 6 11 -74 -26 107 -51 -93 38 35 -50 61 77 -108 -75 114 -58 -53 144 -55 -97 108 60 -49 40 38
7251 38 -45 -23 69 -2 -107 123 1 -49 25 65 -44 -36 73 -13 -114 91 15 -132 52 47 -75 -30 18 -65 -54 81
7277 81 -22 -109 88 45 -39 16 59 -54 -6 55 14 -89 45 80 -62 20 68 -53 -15 63 -39 28 39 42 -92 24
7303 24 63 -69 11 31 -8 -68 45 14 19 -29 -22 -40 0 25 1 -52 42 32 9 69 37 -28 36 21 -43 24 27 53 -28 50 56
7334 56 5 8 25 -12 -42 17 21 -8 -14 25 -34 -10 33 -2 -30 35 11 -58 29 -9 -37 22 68 18 -67 39 12 -58 -9 39 -62
7365 -62 61 18 -21 -55 20 24 11 -19 52 -23 15 -17 12 -15 6 -1 -69 -3 31 -19 -2 67 -53 6 41 -1 24 58 46 -31
7395 -31 -7 48 -32 -24 50 -75 -12 33 25 -13 52 -36 -63 -38 36 31 -15 62 43 -78 11 21 -72 19 -9 7 0 14 7 -24 7 -19
7427 -19 -24 9 90 -92 43 52 -31 56 -4 4 -27 44 -24 37 35 46 -34 -15 30 17 -12 43 -6 10 -20 5 7 -49 -44 6 20 6
7459 6 -14 30 13 -10 12 -18 61 15 -12 78 -42 57 -6 12 -31 63 45 23 29 -21 27 0 5 -46 -6 6 -33 -17 7 -5 38
7490 38 -15 -10 56 58 -1 8 -11 -18 -11 29 -16 -10 11 -49 20 -3 -32 -44 -2 -25 12 37 -18 -31 19 -34 15 -9 56 60 -11 27 -20 -11
7524 -11 -9 28 -44 32 11 49 -12 4 6 -32 11 65 -48 -3 59 7 -41 -4 12 -36 -19 29 -57 3 51 -47 -7 56 -72 -14
7554 -14 34 6 -33 -22 13 -32 -18 65 12 16 57 35 1 50 24 -84 -5 61 -50 -37 10 -8 -27 7 29 -109 0 52 -69
7583 -69 -12 52 -17 -57 44 27 -18 0 50 15 -5 -12 -31 -25 27 15 -5 16 0 -52 -18 52 -36 -3 -27 -18 -50 27 40 -31 9
7614 9 1 -81 -51 30 -10 40 83 -8 -33 -4 1 -11 8 45 -20 11 16 5 -27 35 48 -14 30 20 -23 30 54 20 -37 38 100 -60
7646 -60 20 61 -12 -6 -9 39 -8 -5 11 -29 -12 25 -89 -38 65 -25 -64 -16 -16 8 -5 68 37 -50 46 31 -60 63 36 -4 42
7677 42 108 8 -13 44 15 2 50 65 -86 16 61 -65 13 48 -28 -41 5 53 -97 -4 58 -74 -58 8 -116 -71 83
7704 83 -4 -97 63 -5 -84 -10 86 -15 -81 109 -24 -37 50 50 -86 73 36 -55 -8 81 -11 -81 17 -33 -92 75 47
7731 47 -87 19 54 -80 -21 71 30 -73 -4 -31 -74 61 80 -53 7 52 -64 -25 79 37 -48 53 -6 -129 6
7756 6 69 37 0 41 -28 -44 16 72 -64 -29 17 3 -14 22 -10 -73 73 41 10 8 54 -28 -12 57 19 -40 66 -10 -60 60
7786 60 -4 -79 19 52 17 -11 18 -15 -83 -16 7 4 22 22 -45 -36 42 -26 2 3 39 -29 -81 44 22 20 52 44 -67 -7 -25 -28 -6
7819 -6 -2 43 -27 21 59 -31 19 58 -52 -81 60 -10 31 92 -20 -104 19 20 -76 22 67 -35 -56 47 -26 -6 60 15 -7
7848 -7 -22 68 -70 10 131 -32 -32 66 37 -12 24 12 -23 -18 70 -27 -48 120 1 -86 16 -48 -44 -13 30 -61 -22 41 34 -40
7878 -40 104 37 -57 32 22 -55 -32 41 -19 -35 46 -39 -16 64 21 -36 15 2 9 45 -22 -46 -28 20 32 5 -26 20 -61 -7
7908 -7 33 -16 -69 4 -52 8 3 -2 -16 8 30 -8 -23 60 37 -39 6 15 -6 17 -18 -5 30 -17 3 -4 48 9 53 0 25 19 -20
7941 -20 -8 -12 30 14 21 -61 -27 -23 17 14 11 31 -13 -15 39 21 -33 0 70 -40 10 32 23 -24 7 -39 10 17 48 49 0 51 -41 30
7975 30 42 -12 16 40 12 6 37 60 35 -9 9 -20 -24 54 -99 13 35 32 13 21 -30 5 5 87 2 -16 33 -29 -10 26 -31 -81
8007 -81 1 -16 -30 -26 38 -7 4 72 -9 -13 41 -1 -34 46 24 21 18 30 -17 -44 1 0 -92 57 -37 -41 69 -15 -36 -5 4 -40 -27
8040 -27 17 20 -49 42 -10 -29 7 -11 -67 -50 -16 -33 -22 -29 63 -27 -8 4 -84 22 62 16 3 39 63 41 34 -62 -20 -24 14 -57
8072 -57 -41 42 82 4 22 -35 23 22 -17 41 -3 40 51 -38 -9 -12 -24 24 3 11 -2 -15 21 -11 -56 63 -24 -11 61 -14 51
8103 51 55 6 -47 -20 23 3 -70 37 -45 33 76 -8 4 -44 9 -34 0 -4 39 -50 26 78 -50 78 45 -45 61 27 15
8132 15 -37 55 -4 -88 21 29 -49 11 29 -20 -23 43 -43 14 48 16 -111 9 56 -43 -42 39 -73 -39 -7 9 -64 21 56 -58
8162 -58 13 78 -48 -34 111 -28 -98 39 -12 -75 80 40 -27 -41 22 -39 -74 9 47 -76 58 31 -47 25 52 -68
8188 -68 -31 -28 -28
8191b8
$$ Imaginary data points
##PAGE= N=2
##DATA TABLE= (X++(I..I)), XYDATA
0 0 0 0 0 0 0 0 0 0 0 8 -8 8 -16 16 -17 24 -32 40 -48 56 -65 80 -96 112 -130 152 -177 208 -239 273 -312
31 -312 354 -403 457 -515 580 -651 730 -814 907 -1009 1121 -1243 1376 -1521 1681 -1855 2045
48 2045 -2253 2481 -2732 3011 -3320 3664 -4049 4485 -4982 5553 -6216 7002 -7945 9110
62 9110 -10582 12511 -15156 19024 -25231 36796 -65538 285282 300061 -307681 116149 133760
74 133760 -196847 96396 363057 -82057 -77335 157657 -197428 -261200 321784 178052 -280051
85 -280051 -20491 103215 -263578 -102096 208606 -10120 -96826 100013 -124206 -256036
95 -256036 164490 211493 -156754 2402 179819 -136647 -136911 189154 109983 -18812 117607
106 117607 3959 -176060 87492 197803 -80589 -7735 181580 -80244 -181909 78229
116 78229 81342 -48011 25557 -10848 -151645 -36168 66790 -85343 -63957 92233 -49061
127 -49061 -178622 -21114 52982 -32329 -31890 1558 -44627 -49730 13321 -11415 -36252 54004
139 54004 34450 -89286 -40619 70227 18785 -50585 11165 38592 -39325 -27864 22919 -25888
151 -25888 -8795 40925 -47755 -72907 36657 19883 -82374 -28355 50459 -36167 -69577 22281
163 22281 -6788 -51857 24655 68 -66998 19483 49753 -60431 -39498 73452 6172 -69816
175 -69816 37308 42755 -56056 12097 46015 -49461 -684 67288 -39732 -57446 63408 18186
187 18186 -81760 18012 53399 -66595 -22836 49041 -45984 -32307 55265 -25821 -64867 41909
199 41909 23888 -69796 5478 60536 -42277 -28250 56735 -12934 -29741 55679 10318 -40231
211 -40231 38014 42365 -35687 5753 64959 -9033 -24129 52931 12541 -28135 39948 24675
223 24675 -30591 18737 35484 -24990 -9969 41155 -3672 -32769 25476 11425 -35097 10698
235 10698 16804 -30283 -3182 17891 -21051 -19032 16281 -2620 -28999 4669 9947 -26366 -4216
248 -4216 13193 -17828 -7706 11572 -7766 -10084 8688 6178 -9506 2545 16050 -4138 -658
261 -658 18338 2147 650 15076 6498 2496 9410 10421 3796 2028 11565 3973 -3636 8831
275 8831 2260 -5576 3145 -1419 -5782 -3885 -5003 -5532 -10465 -7618 -5916 -14488 -8741 -7188 -14447
290 -14447 -8135 -8249 -10541 -6390 -7693 -4272 -4018 -4735 2195 -981 315 6812 2445 6029 8690 5813
306 5813 10396 8365 8717 11808 6966 10358 10115 5511 9889 6283 4410 6850 1914 3316 1963 -1701
322 -1701 1563 -3398 -3987 -1145 -7331 -4841 -4303 -8792 -4826 -6676 -7508 -4849 -6923 -4021 -5166 -5380
338 -5380 313 -4779 -2664 3051 -3223 556 4291 -930 2291 4374 2907 1694 3086 7316 325
353 325 812 9640 -145 -27 9489 -455 -1041 7433 1633 -3017 3244 6528 -3581 -3561 8773 -2069
369 -2069 -6609 8871 -1280 -8145 6941 703 -9204 2420 7089 -6866 -7494 8224 -1502 -11552
383 -11552 7548 1859 -12448 4875 2654 -13080 1505 10205 -7090 -9001 9560 2616 -12006
396 -12006 7795 10793 -8181 5925 10516 -7876 5713 19161 972 -2891 15761 11434 -6145
409 -6145 8919 19790 668 4849 13156 -3130 3747 16922 1785 -3935 9534 7653 -8839
422 -8839 -3421 12174 1003 -6818 1399 -4222 -4390 3334 -2900 -5635 795 2739 -6030 -10372 6102
437 6102 9532 -7728 -4458 7012 2833 -1787 1864 5361 1706 4376 6614 -6929 2049 19377
451 19377 -4549 -14074 14348 11387 -12700 -3069 10314 -6646 -7976 9578 -7893 -12617 16695
464 16695 -6341 -32797 10075 18978 -23962 -12047 16993 -11920 -21907 14036 1339 -18630
476 -18630 18147 2997 -41629 6269 33347 -23307 -15885 29040 -9790 -35538 13714 11115
488 11115 -22980 14076 10260 -50173 -9320 35855 -25768 -26538 33331 -8976 -53480 3193 15532
501 15532 -26731 7409 19236 -48444 -23038 36668 -19053 -29177 43915 7614 -55742 -569
513 -569 27470 -18627 7461 35416 -30023 -27667 34838 -8993 -30728 46069 23451 -54504 -12446
526 -12446 26522 -19671 -6516 33913 -17614 -37406 16073 -10231 -39126 31210 28970 -49007
538 -49007 -24419 20784 -17442 -16583 30427 2588 -29302 7476 -156 -28645 25674 41979 -23197
551 -23197 -17161 26195 -1105 -12720 30109 25688 -9583 4039 8266 -15255 15022 39827 -5143
564 -5143 -15589 18203 2411 -19317 11038 26121 -2847 -10815 146 -11287 -4104 20414 2176
577 2176 -15817 5164 3351 -19971 -5116 23114 8988 -13913 -2064 3118 -6426 8448 15477
590 15477 -1723 2424 11252 -6808 -9084 21361 23077 -8555 -3739 15342 -3285 -4885 18960
603 18960 8145 -4850 8612 -130 -16756 8078 23860 -8758 -13258 15346 -3401 -20812
615 -20812 11698 12570 -12458 1528 4844 -19937 -4094 22199 -4964 -17493 15628 3016 -26555
628 -26555 6220 19825 -11682 -1831 12905 -14546 -10332 20882 2037 -16652 14678 10434 -25631
641 -25631 -324 22972 -8933 -6540 15945 -8717 -15774 14539 5273 -16028 8924 12809 -22089
654 -22089 -7986 19854 -6136 -11366 14412 -2829 -17833 7402 6786 -13479 3432 13552 -14720
667 -14720 -11453 15669 -1461 -12604 11811 4048 -15060 2775 8282 -9228 -116 12884 -6548
680 -6548 -11306 10871 2596 -11995 7239 7985 -11155 -1165 7735 -5936 -3387 9162 -1370 -9586
694 -9586 5321 4301 -9708 1799 8557 -6547 -3473 6437 -2218 -4166 5545 2495 -5326 1906
708 1906 5689 -4663 -1039 7883 -1151 -3235 5280 1391 -3151 2585 3829 -1964 -573 4494 -1194
723 -1194 -3473 4269 1028 -4089 1915 1561 -3534 -1055 1878 -1241 -2852 1363 26 -4483 648
738 648 1673 -3744 -348 1931 -2192 -1518 1521 564 -1593 736 2150 -1924 -110 3273 -911 -413
754 -413 2811 -44 -864 1379 1311 -565 -255 1840 -745 -1697 1862 -496 -2005 883 -639 -2031 -510
771 -510 -400 -1270 -1767 -425 -921 -2674 -173 -393 -2487 -212 -433 -1818 -420 -276 -515 -592 -161 408
789 408 -912 156 1147 -726 494 1024 -479 596 685 140 592 209 660 106 -179 966 -380 -262
807 -262 734 -776 -200 239 -803 -91 -432 -585 -360 -903 -73 -637 -1009 294 -851 -785 410 -878 -267
826 -267 393 -506 -1 129 309 187 -176 1048 213 -174 1379 128 -19 1375 51 4 907 417 28
845 28 -94 687 58 -872 761 -224 -1141 778 -467 -1368 402 -212 -1160 -495 32 -493 -1253 202 -82
864 -82 -1320 690 -18 -1411 924 605 -954 311 808 27 -214 751 716 -417 963 580 -920 1296
882 1296 984 -1208 517 880 -576 -187 276 -72 -357 282 -261 -1357 715 444 -1862 416 803 -1393
900 -1393 -41 497 -627 339 756 -541 -609 1480 656 -1515 1359 1684 -1382 678 1536 -800 891
917 891 1676 -969 -323 2163 311 -1757 1570 1851 -2017 291 1829 -1580 307 2059 -1699 -862
933 -862 2433 -135 -2221 1669 2078 -2295 -10 2440 -1558 -61 2817 -1381 -1043 2969 68 -2376
949 -2376 1955 2486 -2154 -423 2750 -1262 -931 2820 -971 -1732 2740 66 -2923 1517 2252 -2286
965 -2286 -1004 2395 -971 -1633 2302 -392 -1979 2314 414 -2894 1216 2437 -1779 -932 2248 -265
981 -265 -1719 1763 536 -1720 1661 749 -2425 722 2089 -1318 -1053 1486 92 -1611 582 595
997 595 -1329 449 471 -2012 18 1342 -1105 -1071 513 -8 -1125 -346 393 -547 -225 52 -1091 -62
1015 -62 768 -456 -533 194 226 -39 -345 398 727 -156 -271 80 598 703 197 445 88 -45 805 16 71
1036 71 1561 203 -1240 81 887 -83 -39 821 -474 -1289 451 -99 -1045 1377 523 -2407 -769 877
1054 877 -660 -429 1320 -201 -1939 243 480 -1196 1430 1906 -1837 -935 1624 -91 -266 2311
1070 2311 1227 -1506 314 1274 -941 1165 2999 -856 -1406 1593 -127 -1221 1893 1674 -1672 -774
1086 -774 700 -1528 -540 2496 -423 -2377 652 -362 -2352 679 1868 -1331 -1293 642 -1249 -1446
1102 -1446 2065 821 -1917 577 663 -2068 103 2410 -102 -859 1100 -195 -1549 1405 1730 -1076
1118 -1076 353 1393 -1521 -818 1970 336 -944 806 428 -1577 -39 1439 -816 -441 1348 -941
1134 -941 -1594 1013 555 -1103 278 803 -1219 -960 1083 -217 -915 1147 96 -1586 284 850 -851
1151 -851 -87 1194 -270 -1061 656 500 -917 705 1143 -931 -148 1133 -269 -492 1195 719 -827
1168 -827 234 977 -670 -74 1379 -174 -651 964 194 -873 500 967 -691 -471 980 -366 -935
1185 -935 1159 371 -1117 409 510 -1045 -133 1082 -380 -854 868 138 -1272 646 896 -1024 -27
1202 -27 886 -812 -660 1026 55 -1054 513 534 -1203 -25 1115 -768 -608 988 -410 -952 697
1219 697 420 -926 106 768 -829 -525 1066 -228 -854 835 109 -1058 332 581 -749 -311 637
1236 637 -437 -908 624 31 -1182 209 246 -1199 -298 440 -777 -757 156 -347 -1050 73 147 -1036
1254 -1036 -226 379 -875 -573 461 -319 -580 252 172 -619 9 585 -430 -203 627 -282 -322 615 140
1273 140 -288 312 306 -275 -35 499 -48 -275 450 23 -391 336 208 -277 94 193 -191 -126 148 -28 -278
1294 -278 186 76 -323 182 102 -234 145 76 -87 92 90 66 64 139 160 55 230 228 42 420 277 187 478 299
1318 299 233 565 311 244 441 415 194 274 452 169 26 403 31 -110 402 -96 -330 214 -60 -434 -163
1339 -163 -20 -379 -436 -3 -338 -502 181 -267 -654 283 6 -631 108 290 -141 20 440 85 -25 783
1359 783 212 -246 915 452 -385 579 688 -202 187 509 -158 -120 547 -213 -649 663 50 -1151 196
1378 196 339 -998 -185 300 -779 -250 508 -613 -750 812 87 -1165 663 873 -934 258 916
1395 916 -571 203 1195 -338 -391 1354 309 -1192 925 1203 -1086 103 1124 -913 -222 1248 -703
1412 -703 -825 1194 -133 -1674 650 1194 -1341 -246 1228 -1016 -593 1432 -496 -708 1502 75
1428 75 -1556 805 1561 -999 -97 1578 -642 -719 1381 -118 -591 1489 89 -1656 396 1161 -862
1445 -862 -371 1266 -480 -1154 657 -125 -533 1089 27 -1411 139 797 -562 -184 1087 114 -929
1462 -929 68 140 -85 867 318 -625 181 214 -330 -36 585 526 -347 -777 -197 231 105 -268 -2 72 -858
1483 -858 -418 41 -531 399 481 -1408 -646 861 -550 -1067 924 598 -1473 -228 674 -1272 82 1690
1501 1690 -1310 -1021 1775 -658 -2128 1603 1440 -1852 -29 1536 -1932 -795 2529 -839 -1621 2519
1517 2519 -279 -3310 1473 2168 -2254 -48 2530 -2157 -1977 2849 -382 -2236 3046 558 -4208
1532 -4208 854 2675 -2559 -325 3518 -1752 -3068 2640 190 -2799 3045 1894 -4331 54 3119
1547 3119 -2508 -864 4289 -613 -3425 2163 965 -3061 2376 3274 -3542 -756 3324 -2136 -1726
1562 -1726 4246 641 -3461 1324 1328 -3249 961 3641 -2486 -1622 2797 -1701 -2742 3166 1407 -3177
1578 -3177 332 1639 -2862 -538 3306 -1162 -2119 2310 -622 -3085 1965 2034 -2295 -155 1979 -1825
1594 -1825 -1525 2578 191 -2021 1546 545 -2794 442 2126 -1527 -972 1720 -710 -2228 1149
1609 1149 938 -2010 311 1246 -2058 -1041 1594 -650 -1600 1055 488 -2121 -186 1481 -1380 -958
1625 -958 1688 -711 -1723 1170 461 -1742 392 1519 -1421 -1082 1736 -331 -1742 1575 758 -1972
1641 -1972 552 1363 -1528 -464 2045 -455 -1679 1589 660 -2161 908 1815 -1808 -195 2054 -1126
1657 -1126 -1303 2064 476 -1881 1198 1539 -2082 52 2474 -1060 -881 2388 -197 -1822 1633 1292
1673 1292 -1662 593 2132 -1480 -861 2512 -206 -1371 2173 707 -1899 995 1792 -1176 -9
1688 -9 2287 -601 -1421 2132 582 -1530 1587 1459 -1743 178 1879 -705 -502 2087 181 -1630
1704 -1630 1281 1237 -1351 931 1978 -1199 -411 1695 -150 -774 1636 869 -1367 453 1397 -1005
1720 -1005 57 1920 -544 -976 1190 89 -944 874 1034 -1152 -429 1101 -715 -645 1462 -67
1736 -67 -1238 548 286 -928 288 960 -608 -705 699 -143 -883 934 508 -986 235 431 -669
1753 -669 -5 756 -235 -699 216 -1 -884 212 423 -913 -348 75 -778 -460 117 -322 -734 -361 -109
1772 -109 -692 -445 235 -618 -528 63 -389 -333 -59 -113 -261 -371 13 -68 -402 220 61 -390 38 56 -167 -179
1794 -179 56 33 -426 -24 322 -472 -94 391 -360 -286 220 -78 -338 -45 198 -404 -251 434 -394 -422 601
1815 601 -260 -503 454 71 -411 137 331 -382 -175 633 -269 -464 810 -85 -722 690 168 -583 390
1834 390 417 -392 -61 691 -204 -403 901 44 -706 859 336 -709 568 608 -497 246 688 -293 -283
1853 -283 963 -5 -783 884 394 -986 587 494 -853 221 579 -655 -267 842 -199 -861 936
1870 936 344 -1127 585 701 -1027 356 859 -844 -40 1055 -313 -666 1056 388 -1048 703 784
1887 784 -1097 459 965 -1008 63 1069 -700 -550 1038 56 -1039 583 526 -1210 308 885 -1137
1904 -1137 69 1017 -975 -514 1094 -138 -755 716 346 -1042 327 775 -1010 277 1110 -1061
1920 -1061 -288 1127 -437 -521 920 -11 -919 414 365 -909 418 863 -1263 -180 1056 -923 -379
1937 -379 1182 -428 -728 699 -116 -872 855 767 -1201 258 1194 -1226 -132 1597 -642 -540 1274
1954 1274 -481 -1045 1298 515 -1418 644 1244 -1687 -261 1788 -1034 -716 1682 -771 -1467 1452
1970 1452 273 -1699 890 1335 -1922 -380 1977 -1185 -1026 2134 -602 -1778 1699 286 -1905
1985 -1905 1125 1507 -1959 -397 2044 -1177 -1163 2398 -389 -2044 1734 478 -2202 1095 1700 -1874
2001 -1874 -493 2027 -1047 -1412 2264 117 -2076 1502 678 -2249 812 1782 -1598 -555 1811 -792
2017 -792 -1466 1828 474 -1912 1011 870 -2035 354 1721 -1167 -587 1394 -482 -1395 1200 851
2033 851 -1290 509 1037 -1454 5 1595 -560 -433 1166 -52 -955 666 928 -533 165 933 -775
2050 -775 -390 1066 -44 -246 643 62 -647 -30 586 125 -138 408 -123 -603 153 349 140 207 109 -81
2070 -81 -459 98 810 -19 -8 573 -428 -443 607 599 -42 152 434 -617 -468 1128 239 -448 889 -71
2090 -71 -1229 432 828 -363 37 669 -778 -1063 1021 445 -877 824 281 -1717 60 1085 -509
2107 -509 -84 941 -622 -1400 838 751 -1010 664 706 -1806 -347 1346 -500 -389 1022 -511 -1619
2124 -1619 498 898 -950 228 911 -1616 -913 1345 -257 -592 974 -269 -1691 150 1062 -575
2140 -575 -66 970 -1264 -1367 1214 176 -613 878 -59 -1681 -272 1014 -196 -276 873 -855 -1681
2157 -1681 684 626 -534 628 173 -1539 -631 825 303 -194 715 -384 -1723 160 934 -220 497
2174 497 481 -1209 -917 571 574 129 581 85 -1448 -432 948 110 385 742 -765 -1082 104 552 291
2193 291 440 340 -969 -869 635 354 209 769 -311 -999 -138 451 386 441 506 -399 -923 306 504 132
2213 132 765 132 -786 -254 280 390 370 356 22 -794 -103 477 55 443 375 -548 -337 143 327 306 261 233
2235 233 -419 -285 477 150 139 436 -130 -322 80 269 172 119 232 -96 -429 342 248 -175 341 20 -408
2256 -408 43 212 65 -22 136 29 -424 87 344 -280 195 197 -394 -5 308 0 -60 92 71 -320 54 378
2278 378 -297 -25 360 -397 -171 301 -35 -138 91 -5 -300 -39 313 -275 -78 359 -337 -210 374 -193
2298 -193 -187 246 -33 -211 -24 227 -172 -153 396 -243 -262 461 -174 -250 311 -91 -252 78 122 -214 -119 237
2320 237 -269 -276 437 -114 -290 326 -135 -355 233 -62 -259 48 214 -130 -224 383 -162 -339 413 -67 -381
2341 -381 425 8 -348 259 88 -263 -48 259 -160 -316 373 -71 -433 419 6 -472 346 108 -410 99
2361 99 226 -182 -183 358 2 -344 436 33 -479 365 136 -432 241 191 -285 5 266 -58 -297 300 60
2382 60 -471 350 106 -519 272 251 -435 49 236 -220 -179 294 6 -338 285 220 -458 250 301 -407 132 328
2404 328 -337 -79 286 -44 -193 267 181 -434 220 256 -522 169 353 -416 36 355 -280 -157 268 1 -330
2425 -330 205 219 -443 153 326 -457 34 357 -276 -82 342 -93 -204 186 159 -300 176 350 -472 24 415
2446 415 -366 -30 422 -209 -226 187 -28 -315 200 237 -365 49 375 -394 -57 486 -265 -97 341 -107 -195
2467 -195 261 195 -207 19 323 -360 -72 507 -207 -139 404 -132 -202 268 82 -205 62 224 -305 -77 344
2488 344 -154 -174 387 -122 -257 243 -2 -198 112 202 -136 -119 254 -101 -199 423 -60 -223 270 -101 -207
2509 -207 201 86 -76 -19 79 -56 -166 216 24 -183 261 -76 -214 132 83 57 71 9 -118 -182 34 160
2531 160 9 70 -75 -249 -12 -19 -23 252 -90 -108 -113 -227 75 147 43 -89 -240 -168 -94 40 302 -115 -125 -47
2555 -47 -359 6 276 18 -28 -121 -277 -160 85 286 -24 -103 -30 -394 -98 393 33 -49 -3 -354 -403 94 237
2578 237 -73 -139 7 -461 -311 364 47 -132 132 -313 -441 52 305 19 -58 89 -317 -384 383 234 -146
2599 -146 257 -148 -516 67 352 24 44 47 -308 -429 341 243 -238 142 -47 -592 -20 296 48 -13 114 -242
2621 -242 -404 237 413 -87 144 102 -423 -107 420 190 35 186 -72 -339 144 435 94 70 211 -322 -207
2642 -207 421 204 28 119 -62 -353 -48 415 129 -53 178 -196 -294 317 322 89 60 95 -132 -79 414 355 43
2665 43 197 -2 -277 182 472 143 110 71 -144 -139 299 391 4 49 89 -254 -36 316 152 0 52 -112 -217
2688 -217 17 370 127 -61 117 -187 -185 279 181 6 85 63 -134 -103 300 131 -115 111 -88 -337 142 196
2710 196 17 21 59 -216 -263 153 171 -130 83 81 -370 -32 197 -97 -109 76 -156 -325 35 166 -163 -13 84
2733 84 -310 -202 192 -96 -170 163 -73 -356 -34 86 -188 -14 135 -291 -247 203 -54 -175 190 -125 -336
2754 -336 -34 77 -138 23 201 -246 -240 173 -95 -164 265 -33 -290 8 51 -199 51 163 -158 -203 168 -91
2776 -91 -188 249 75 -246 102 89 -215 56 200 -176 -96 195 -139 -142 284 -5 -200 244 16 -216 177 188
2798 188 -173 34 161 -222 -99 268 -93 -201 285 -53 -252 267 102 -261 173 172 -222 50 298 -132 -131
2819 -131 393 -65 -260 353 90 -383 283 202 -382 87 311 -221 -124 405 -189 -370 398 -32 -394 313 198
2840 198 -519 149 306 -460 -68 431 -231 -382 538 -64 -482 403 191 -569 228 419 -522 -5 484 -328
2860 -328 -270 559 -71 -468 511 113 -666 307 326 -609 8 502 -466 -285 570 -186 -506 509 95 -669
2880 -669 374 383 -667 77 497 -590 -200 652 -326 -418 633 5 -639 436 326 -782 243 543 -647
2899 -647 -110 701 -393 -415 666 -12 -640 548 210 -786 272 542 -730 -3 690 -573 -338 688
2917 688 -162 -573 588 113 -761 349 488 -741 102 635 -679 -228 709 -260 -431 664 45 -726
2935 -726 391 454 -711 178 766 -669 -189 782 -383 -377 777 -16 -602 446 385 -680 248 691 -610
2954 -610 -136 781 -445 -368 813 -123 -600 546 147 -673 317 567 -656 -54 688 -537 -372 797
2972 797 -232 -480 687 75 -688 366 498 -525 185 707 -552 -265 765 -276 -373 805 13 -639
2990 -639 420 268 -622 267 607 -545 -214 591 -365 -469 803 23 -596 461 89 -687 337 577
3008 577 -443 -85 586 -326 -368 846 111 -476 525 130 -625 407 528 -382 149 527 -442 -324 638
3027 638 49 -329 539 41 -715 310 323 -412 110 338 -498 -301 360 -56 -290 485 -8 -654 270 250
3047 250 -350 286 375 -430 -142 381 -68 -106 500 70 -478 212 137 -362 341 339 -465 -137 229 -314 -124 353
3069 353 -135 -471 83 15 -489 204 300 -473 -87 211 -435 -62 380 -132 -304 111 -6 -389 252 420 -429
3090 -429 41 271 -397 -106 467 -123 -303 189 -46 -462 67 286 -424 -139 275 -427 -207 432 -189 -339
3110 -339 175 -14 -383 16 283 -256 -119 324 -274 -268 454 -51 -268 204 70 -274 73 370 -157 -187 228
3131 228 -187 -372 404 115 -309 141 42 -347 -19 295 37 -198 140 -109 -333 315 286 -255 110 6 -275
3152 -275 62 340 150 -21 5 -48 -336 146 515 38 83 88 -436 -141 296 321 200 8 -152 -420 -85 446
3174 446 261 122 42 -398 -326 138 372 435 55 -155 -354 -384 299 546 290 120 -328 -426 -174 290 655 280
3196 280 -122 -233 -580 -88 629 466 158 -5 -503 -536 101 714 477 3 27 -631 -595 528 530 116 215 -282
3218 -282 -777 -239 600 436 92 258 -435 -936 290 599 9 391 93 -884 -473 453 239 26 463 -127
3238 -127 -1027 38 519 -200 493 487 -797 -561 371 93 -34 645 138 -898 -160 467 -414 301 752 -567
3258 -567 -517 298 -208 -248 540 273 -660 -157 378 -538 76 789 -400 -422 442 -356 -318 543 267 -442 37
3279 37 291 -555 -14 742 -218 -269 556 -350 -414 561 164 -299 225 162 -480 9 503 -277 -168 550 -311
3300 -311 -435 597 -119 -382 462 33 -459 94 286 -350 -53 531 -298 -347 562 -259 -394 612 -48 -458
3320 -458 358 164 -423 134 423 -378 -191 645 -279 -477 745 -77 -569 541 94 -650 231 407 -502
3339 -502 -110 600 -322 -478 735 -111 -678 663 94 -739 472 384 -631 1 537 -406 -356 742 -141
3358 -141 -659 751 165 -859 568 387 -762 187 567 -515 -173 682 -139 -673 733 162 -916 583
3376 583 399 -901 263 526 -747 -184 625 -322 -589 669 42 -873 508 499 -957 249 639 -795
3394 -795 24 721 -445 -413 629 32 -699 502 462 -841 266 693 -866 -46 742 -545 -345 691
3412 691 -103 -657 398 321 -805 94 682 -804 -105 801 -629 -284 781 -301 -591 527 205 -621
3430 -621 226 589 -689 -127 821 -557 -278 817 -279 -450 542 43 -554 244 418 -512 -80 677 -479
3449 -479 -338 793 -316 -510 556 -63 -459 326 181 -417 14 484 -324 -274 656 -195 -357 628 -57
3468 -57 -421 433 75 -312 183 294 -218 -128 474 -217 -294 532 -121 -355 489 -83 -373 294 65 -261 115
3489 115 276 -200 -200 419 -108 -290 568 -92 -392 505 -44 -340 443 157 -348 47 386 -191 -181 632 -59
3510 -59 -481 571 -28 -520 648 248 -485 76 313 -361 -162 671 -61 -635 554 -2 -766 589 422
3529 422 -659 166 326 -550 -140 768 79 -583 464 83 -863 555 774 -614 107 472 -639 -333
3547 -333 801 320 -446 341 143 -1025 145 969 -433 -53 586 -736 -602 593 375 -350 220 286
3565 286 -938 -279 954 -149 -286 694 -448 -835 445 488 -220 209 359 -655 -555 770 140 -373
3583 -373 655 -104 -893 200 502 -197 -6 473 -302 -733 462 382 -508 393 280 -759 -74 492 -134
3602 -134 -175 280 11 -604 184 630 -454 -106 420 -442 -206 639 78 -399 62 125 -372 40 701 -180
3622 -180 -558 330 -200 -343 669 373 -442 -297 82 -178 -71 814 252 -768 -53 -5 -491 549 774
3641 774 -266 -578 -193 -62 -222 754 818 -684 -502 54 -590 202 1160 105 -655 -384 -187 -401 494
3660 494 1224 -261 -704 77 -593 -316 1240 668 -518 -356 -200 -649 134 1357 296 -774 90 -459
3678 -459 -802 962 1034 -329 -266 -43 -805 -415 1084 702 -621 90 -122 -1210 381 1117 -133 -146 193
3697 193 -700 -716 699 830 -367 150 227 -1169 -129 1160 -17 -118 493 -508 -878 355 776 -201
3715 -201 123 504 -880 -614 804 62 -208 591 -155 -781 4 445 -153 -11 561 -423 -728 549 69
3734 69 -345 560 125 -594 -29 232 -61 -22 406 14 -490 236 92 -363 356 258 -322 -10 27 -115 19
3755 19 232 179 -230 -68 101 -191 124 227 -104 72 -91 -122 167 -55 105 139 -184 4 28 -42 107 26
3777 26 114 -176 -110 234 -229 -44 409 -202 -201 247 -113 -133 193 205 -249 -64 403 -227 -249 593 -140 -382 433
3800 433 -46 -409 321 228 -331 -114 396 -197 -339 540 -55 -497 473 74 -619 330 281 -436 -49 392 -206
3821 -206 -363 542 63 -573 459 175 -700 345 379 -534 52 427 -249 -357 450 101 -540 422 313 -695
3841 -695 289 425 -501 127 446 -300 -242 381 7 -447 303 300 -596 178 473 -509 5 542 -400 -148 391
3862 391 -95 -323 282 211 -433 161 454 -506 -32 485 -373 -93 382 -207 -232 327 34 -365 135 294 -443
3883 -443 -1 466 -407 -154 466 -281 -273 382 -34 -250 134 201 -315 -5 412 -353 -173 505 -294 -260 446
3904 446 -111 -266 270 67 -269 88 261 -258 -118 441 -241 -263 446 -191 -308 333 -61 -204 118 176 -256
3925 -256 -81 323 -160 -195 447 -164 -303 402 -68 -312 297 58 -283 40 147 -233 -140 308 -143 -345 334
3946 334 -47 -301 301 -39 -359 153 135 -201 -60 216 -108 -214 337 -65 -383 422 11 -414 296 149
3966 149 -278 114 202 -154 -238 318 -62 -329 352 47 -509 234 178 -426 219 285 -266 -167 225 -43 -314 348
3988 348 196 -500 149 285 -453 122 430 -265 -102 237 -56 -261 273 259 -445 57 313 -419 23 468
4008 468 -236 -149 226 -120 -295 221 376 -353 -128 273 -326 -89 543 -61 -247 195 -88 -208 106 281
4028 281 -73 -245 202 -204 -345 421 103 -314 114 -30 -245 46 286 95 -241 71 29 -341 248 304 -242
4049 -242 51 135 -204 -58 209 128 -175 -37 222 -293 -8 344 -122 -82 164 -89 -103 100 239 -136 -224 199
4071 199 -77 -239 308 16 -241 92 44 -183 -48 239 -21 -310 218 171 -350 217 274 -305 15 292 -89
4092 -89 -142 226 141 -348 65 319 -279 74 364 -350 -256 307 3 -162 166 220 -431 -127 412 -186 -179 495
4114 495 -208 -524 262 111 -211 170 275 -300 -341 428 23 -368 510 48 -602 181 264 -334 72 452 -235
4135 -235 -386 355 173 -402 365 414 -627 -21 410 -297 -61 504 -104 -482 181 246 -410 147 520 -514
4155 -514 -253 421 -254 -221 423 77 -444 83 266 -357 -22 569 -226 -365 432 -94 -323 381 236 -355
4175 -355 -41 302 -160 -189 523 38 -509 284 128 -372 275 284 -255 -162 159 -39 -223 292 161 -424 92
4196 92 233 -329 76 265 -167 -233 50 33 -209 98 331 -234 -142 278 -208 -104 351 63 -132 -4 88 -37
4218 -37 -56 424 2 -308 182 -14 -262 153 163 -109 -125 60 -42 -217 171 221 -360 3 196 -281 18 307
4240 307 -97 -231 98 87 -276 40 391 -279 -118 402 -186 -217 416 -15 -245 163 257 -253 1 424 -145
4261 -145 -227 390 -94 -308 333 88 -330 89 191 -230 -197 356 -92 -373 375 95 -414 225 198 -422 53
4282 53 285 -229 -135 262 -36 -385 302 258 -377 158 285 -370 4 331 -138 -109 249 -10 -303 123 272
4303 272 -250 111 317 -350 -103 324 -93 -77 175 -30 -223 68 172 -163 24 235 -274 -150 283 -157
4323 -157 -68 180 -101 -192 12 72 -115 4 166 -204 -144 162 -71 -36 194 -59 -114 85 -14 28 49 120 -6
4346 -6 -46 130 -93 13 199 -150 -93 177 -78 -55 90 -24 -32 5 21 -67 37 126 -93 -115 121 -104 -35 159
4370 159 -96 -133 100 -49 -101 24 85 -69 -71 204 -37 -89 219 -34 -115 177 -49 -72 116 63 -74 -20 167
4393 167 -12 -120 232 -68 -164 197 -34 -137 205 35 -99 49 115 -36 -71 139 -17 -191 169 -2 -226
4414 -226 128 -38 -191 24 123 -87 -62 154 3 -153 178 62 -156 147 88 -195 104 138 -66 -26 118 17
4436 17 -175 94 63 -193 129 114 -228 58 133 -180 -21 69 -14 -85 104 113 -141 12 211 -192 -1 207 -150
4459 -150 -21 131 -56 -71 57 92 -108 72 185 -137 -61 242 -82 -96 171 1 -86 0 0 -48 -58 135 2
4482 2 -187 135 -28 -161 117 33 -131 12 -17 -30 -29 101 76 -180 58 100 -140 113 79 -36 -6 27 60 35 56
4507 56 206 -51 -24 119 -63 -56 110 9 -52 -44 95 14 -125 134 3 -188 77 -43 -205 47 76 -111 -82
4530 -82 95 -38 -212 119 120 -192 48 121 -224 42 253 -65 -136 115 67 -180 124 278 -103 -31 325 -121
4552 -121 -114 337 14 -114 191 114 -274 -39 296 -110 -233 265 -175 -396 180 158 -263 42 176 -342 -206
4573 -206 334 37 -312 280 14 -463 146 289 -304 58 347 -126 -322 353 134 -288 297 322 -490 -46
4593 -46 450 -163 -100 473 -19 -417 180 250 -320 125 481 -417 -276 344 -127 -294 464 125 -469 20 274
4614 274 -362 -84 582 -144 -487 304 -11 -417 305 363 -343 -34 326 -226 -266 601 110 -433 319 186 -473
4635 -473 226 551 -172 -202 325 -110 -424 342 371 -378 53 239 -514 -189 431 -23 -209 229 -21 -516 55
4656 55 436 -197 -96 362 -304 -426 422 217 -173 275 168 -458 -231 463 40 -158 457 -56 -584 141
4676 141 270 -217 135 337 -379 -504 316 137 -337 319 236 -609 -164 363 -156 -163 481 -7 -572 112 344
4697 344 -343 200 578 -402 -311 442 1 -214 507 272 -507 -12 420 -272 -71 622 -174 -541 302 92
4717 92 -499 282 352 -539 -162 383 -283 -336 555 40 -593 240 260 -512 87 535 -397 -299 480 -26 -433 414
4739 414 336 -564 167 460 -324 -78 532 -133 -296 466 159 -382 189 362 -422 -89 530 -308 -267 418 -101
4760 -101 -375 218 252 -378 9 366 -304 -187 468 -73 -318 380 17 -396 107 255 -146 -27 275 -170
4780 -170 -247 326 47 -237 198 158 -242 41 279 -59 -16 199 32 -173 116 157 -191 69 191 -161 -70 130
4802 130 27 -63 -42 51 -116 -44 169 -34 -103 122 -37 -155 6 112 -40 -90 65 35 -206 50 111 -213 -31
4825 -31 99 -73 -125 97 43 -183 128 155 -220 13 291 -133 -91 224 -54 -129 173 114 -142 33 183 -201
4847 -201 -151 273 -94 -160 252 -33 -304 99 133 -233 -46 193 -148 -202 236 -44 -261 212 89 -282 75
4868 75 175 -146 -58 266 -70 -119 202 23 -228 160 102 -220 112 202 -202 -59 195 -34 -114 193 49 -255
4890 -255 41 175 -249 2 162 -197 -72 135 -55 -155 91 30 -198 42 171 -150 41 194 -137 -12
4910 -12 166 -10 -3 97 67 -110 28 169 -77 -29 122 -65 -73 135 -65 -50 48 2 -71 -13 111 -83 -29 122
4934 122 -124 -81 89 -54 -14 93 -12 2 69 30 -49 -30 75 -21 38 138 37 -24 120 -35 -23 95 -28 30
4958 30 22 -43 5 -13 -18 21 2 -40 -19 -42 28 -94 66 76 -122 10 34 -55 5 21 -20 -33 1 17 -114 14 180 -96
4986 -96 9 156 -46 -14 233 52 -35 82 132 -123 -17 149 -124 -69 289 -81 -191 221 28 -194 145 176
5008 176 -239 -119 184 -145 -210 287 -51 -301 141 124 -237 86 257 -170 -183 270 -38 -309 377 156 -339
5029 -339 88 261 -297 68 425 -122 -217 273 54 -305 279 318 -374 84 313 -315 -126 474 23 -342 194
5050 194 90 -440 75 440 -283 -163 384 -309 -396 384 106 -388 74 214 -459 -184 481 -132 -278 438
5070 438 -67 -525 292 261 -262 143 326 -343 -332 415 123 -338 410 252 -610 34 385 -164 -44 459 -106
5091 -106 -447 221 200 -429 227 444 -459 -299 313 -160 -290 452 175 -543 -61 291 -361 -23 585 -124
5111 -124 -469 257 16 -385 354 525 -306 -193 336 -204 -268 665 253 -537 109 140 -472 26 591 -100 -374
5132 -374 247 -112 -670 400 547 -486 -44 379 -465 -337 676 157 -461 253 173 -714 104 728 -321
5151 -321 -248 589 -273 -600 610 385 -516 154 472 -665 -284 824 -138 -480 631 -64 -837 286 493
5170 493 -488 -21 592 -520 -630 643 114 -685 468 261 -835 45 684 -420 -180 697 -184 -701
5188 -701 515 358 -683 282 643 -712 -255 721 -250 -391 614 133 -691 236 550 -561 17 706
5206 706 -449 -512 539 6 -525 429 296 -594 -6 492 -363 -281 611 -151 -576 382 184 -537 159 409
5226 409 -396 -271 452 -78 -403 436 178 -486 150 352 -362 -27 432 -160 -360 302 186 -357 140 334
5246 334 -374 -150 367 -165 -264 319 101 -364 98 262 -275 -116 399 -151 -397 288 65 -344 175 273 -334
5267 -334 -177 368 -40 -258 361 128 -416 192 295 -322 47 427 -179 -265 329 90 -423 268 372 -443
5287 -443 -63 433 -268 -139 468 47 -459 197 226 -372 96 445 -362 -255 427 -184 -297 407 106 -425
5307 -425 127 319 -371 -98 504 -199 -398 431 16 -392 351 216 -377 41 345 -229 -159 470 -41 -381
5327 -381 315 124 -351 227 226 -344 -78 269 -129 -187 326 37 -390 168 166 -327 84 241 -295 -102 236 -110
5349 -110 -194 164 91 -254 72 168 -250 -18 297 -196 -97 184 -4 -84 94 58 -117 -81 155 -132 -55 170 -134
5372 -134 -39 116 -67 -33 125 23 -42 -18 88 12 -87 119 21 3 79 13 -30 40 -10 -11 3 -31 40 59 80 -3 -29
5399 -29 45 -37 -46 48 -54 -21 38 -56 19 97 -104 56 7 58 -35 -35 90 -96 -3 121 -84 12 86 -106 35 54 -40
5426 -40 -49 17 35 -45 -43 77 -97 -11 116 -134 -32 150 -23 -73 108 52 -75 -7 66 -135 -114 121 -75 -71 138
5451 138 -28 -82 135 3 -83 4 95 -56 -71 116 -16 -166 214 7 -111 109 38 -75 62 121 -45 -49 175
5474 175 -36 -194 108 71 -150 72 52 -172 2 98 -61 -62 127 -2 -170 110 125 -174 37 184 -197 10
5496 10 162 -37 -50 141 79 -181 52 182 -172 -6 223 -164 -116 197 -3 -53 149 78 -143 -71 158 -167
5518 -167 -70 229 -45 -175 163 -18 -143 65 136 -88 -57 136 -90 -180 211 117 -256 126 47 -162 42 132
5540 132 -17 -104 124 61 -231 75 206 -213 29 131 -112 -5 176 52 -99 9 100 -131 -59 264 -93
5561 -93 -142 180 -39 -191 80 91 -152 -84 180 -74 -203 249 28 -217 150 106 -137 -45 193 -30 -123 204
5583 204 -5 -270 141 234 -290 39 236 -202 -90 237 47 -181 163 139 -359 4 306 -267 -123 380 -170
5604 -170 -292 245 106 -237 49 287 -331 -163 400 -184 -273 417 -60 -423 202 148 -285 67 385 -212 -352
5625 -352 364 -3 -413 405 168 -463 87 298 -310 -77 446 -55 -351 289 97 -430 295 364 -420 -35
5645 -35 283 -263 -202 452 49 -338 132 176 -390 44 458 -221 -135 305 -198 -292 337 210 -293 46 194 -371
5667 -371 -128 529 -29 -196 260 -89 -386 177 324 -105 -25 203 -220 -319 418 173 -153 188 12 -439 34
5688 34 272 98 -13 112 -103 -362 128 308 -30 114 172 -358 -195 243 124 -16 64 18 -353 -103 366
5709 366 50 -5 223 -144 -332 119 243 131 142 140 -325 -356 294 142 -112 203 8 -434 6 276 42 -39
5731 -39 168 -115 -443 128 284 -185 166 158 -453 -101 312 52 -121 260 33 -412 37 383 -158 107 333
5752 333 -290 -277 297 47 -123 227 95 -352 -84 337 -72 -91 330 -175 -387 209 125 -137 129 152 -319
5773 -319 -133 299 -16 -172 304 -39 -429 157 166 -171 118 173 -190 -144 274 50 -157 225 29 -297 127
5794 127 253 -123 95 191 -223 -144 145 41 -127 202 103 -301 38 178 -136 25 160 -164 -128 76 48 -95
5816 -95 12 118 -221 -42 190 -118 11 147 -65 -61 42 -2 29 -47 87 -50 -50 76 20 -3 143 -19 28 38
5840 38 -47 89 52 35 47 -83 34 36 -52 60 -39 -30 47 -33 -3 39 -64 71 -67 -122 38 -12 -44 27 19 -5 4 21
5868 21 65 -75 45 62 -92 76 31 -5 17 22 17 -24 33 125 -41 -19 101 -126 12 62 -96 -6 32 -33 -7 38 58
5895 58 7 10 81 -88 -38 111 -79 -16 84 -49 -14 -15 40 23 45 105 -67 -73 135 -37 -40 125 -26 -26 76 22 -42
5922 -42 -3 -10 -2 -42 90 39 -120 106 -47 -28 72 -27 1 25 -21 29 -83 -2 9 -32 49 0 -88 124 -10 -88 105
5949 105 45 -45 42 51 96 -96 24 61 -109 60 89 -49 59 36 -37 72 -4 26 -64 -26 71 -58 -42 94 -94
5974 -94 -9 72 -92 -26 -27 -45 -13 -47 70 -32 -33 66 -79 45 106 -23 49 17 9 0 45 60 48 9 80 32 -22 69 -17
6003 -17 36 49 -12 -12 -40 -29 38 -76 37 2 -144 11 -33 -6 -11 -101 -37 -40 -109 20 -1 5 23 -32 38 51 -1 49 61 43
6033 43 -4 -11 63 102 -23 77 7 -81 127 40 35 46 8 -15 -74 16 45 -88 82 19 -109 -8 38 -71 -6 14 -25
6060 -25 -87 -27 55 -93 83 118 -137 35 63 -78 -11 140 -35 -43 5 32 -4 47 142 -91 -65 150 -59 -56 192 -49
6086 -49 -79 40 69 -64 -41 151 -47 -138 142 -20 -114 101 13 -125 44 100 -29 -69 85 -1 -155 163 54
6109 54 -137 97 112 -156 16 111 -4 -35 58 -12 -150 121 171 -195 9 87 -222 -43 150 -2 -103 57 23
6132 23 -114 20 207 -92 9 155 -141 -59 133 24 -44 3 22 -161 -80 216 40 -72 90 -70 -224 108
6154 108 115 2 -10 51 -122 -150 168 121 -76 93 67 -225 -24 173 -37 22 59 -80 -106 46 193 -67 29 79
6178 79 -248 -81 224 76 -32 88 -28 -173 10 265 -23 -8 175 -163 -166 232 102 -61 42 21 -197 -86
6200 -86 191 12 -123 127 -76 -279 101 153 -118 21 98 -213 -242 149 97 -140 120 64 -294 -25 155 -84
6222 -84 46 86 -110 -179 168 91 -145 82 198 -259 -41 253 -62 -68 212 -40 -179 96 168 -93 -2 181 -149
6245 -149 -162 212 48 -105 146 -43 -203 -21 185 -85 -133 148 -84 -206 190 39 -144 109 136 -148 -42
6266 -42 149 -39 -78 96 24 -196 60 151 -159 59 166 -75 -27 102 53 -66 106 130 -143 -2 202 -134
6288 -134 -47 100 -47 -103 88 8 -105 33 109 -89 -128 136 -64 -73 129 -16 -98 3 97 -30 -19 94 -15
6311 -15 -127 75 44 -77 43 59 -118 10 71 -27 -59 66 82 -89 72 87 -140 -3 141 -50 -86 78 -20
6334 -20 -64 16 81 -102 -36 170 -101 -49 98 -18 -93 73 63 -76 18 113 2 -92 172 18 -69 140 39 -112
6358 -112 82 21 -110 -60 42 11 -82 39 9 -171 45 72 -169 -13 81 -64 0 107 5 -50 53 81 -102
6381 -102 -13 116 -82 -6 93 91 2 97 5 -45 4 105 -44 -31 86 -76 -48 89 -81 -44 50 11 -43 -43 32 -32 -60
6408 -60 48 -2 -19 75 3 -24 10 32 -17 14 -36 53 -37 10 17 -17 85 -28 -80 70 6 6 -2 -13 -1 34 1 35 -56 10
6438 10 16 -55 -34 -27 -13 38 -1 59 18 -25 73 22 -1 81 23 6 43 -52 5 4 25 46 -26 -12 18 -28 -4 -5 -29 7 -25 -13
6470 -13 -59 7 40 -55 -10 54 -29 19 35 -3 -10 13 25 14 65 44 30 -50 115 57 -8 106 13 -9 39 19 -26 -40 7 42
6500 42 -25 56 11 -148 46 -38 -91 4 13 -113 -14 -1 -12 -57 50 0 -135 42 37 -117 101 101 1 56 146 56 -38
6527 -38 107 51 -103 24 42 -117 15 137 -41 -74 36 -31 -81 4 47 -8 -37 67 -113 -24 109 -92 -101 43
6551 43 1 -134 -20 107 -19 -91 114 -82 -36 117 103 -93 90 107 -66 24 146 2 -41 63 59 -125 72
6574 72 116 -110 19 51 -75 -78 38 -21 -88 2 20 -139 -23 65 -119 -39 82 -44 -97 77 33 -125 2 157
6598 157 -36 -61 130 -27 -66 148 51 -67 -28 66 -53 -50 88 -16 -105 126 11 -99 57 102 -92 -84 106 -51
6622 -51 -97 128 87 -170 -5 158 -140 -37 179 -106 -97 115 30 -109 35 78 -145 27 189 -70 -88 182 28
6645 28 -154 201 89 -165 18 161 -95 -131 202 -40 -202 122 45 -210 156 160 -163 -56 172 -95 -171 156
6667 156 32 -251 69 91 -202 27 179 -129 -110 157 -22 -196 166 110 -208 54 219 -187 -48 234 -39
6688 -39 -111 126 54 -213 47 177 -135 -89 189 -104 -140 173 38 -180 33 76 -170 -21 137 -82 -106 139
6710 139 3 -148 124 108 -121 -6 112 -36 -98 150 9 -95 125 71 -130 2 112 -84 15 123 -10
6731 -10 -75 108 121 -67 47 111 -87 -73 120 -16 -97 62 36 -170 -27 46 -83 -107 170 -9 -74 117 40 -161
6755 -161 10 117 -79 -68 120 -22 -112 104 56 -147 65 107 -99 -37 100 -58 -104 108 85 -101 31 107 -132
6778 -132 -18 155 -88 -73 135 -28 -121 61 150 -143 38 118 -77 -77 137 -17 -117 54 32 -144 90 127 -118
6801 -118 -121 106 -7 -134 159 28 -157 28 100 -109 5 208 -22 -72 123 1 -161 100 30 -134 46 129
6823 129 -88 -44 155 -3 -50 72 93 -86 44 113 -96 -23 77 -35 -69 126 -1 -102 17 99 -62 20 109
6846 109 -34 0 39 -14 -70 40 21 -60 38 36 6 -49 134 -23 -38 71 44 20 -34 57 -30 1 9 -3 -20 35 3 -51
6874 -51 -61 21 -76 -7 60 31 -16 -1 -20 14 25 47 2 5 -39 2 -10 36 32 -31 -28 -49 -26 -77 44 -4 -30 21 54 -11 -13 40
6906 40 38 3 24 -26 -73 1 59 -34 -13 24 27 4 -9 16 -43 33 7 -37 -24 37 -50 -123 26 -19 -19 10 -28 -15 -15 35 -54 29
6938 29 38 1 -43 39 17 -31 1 32 -77 6 40 -11 -40 23 -19 11 24 55 -49 -39 61 -30 22 24 -8 -47 32 13 -61 32
6968 32 8 -14 32 -5 42 -63 -8 -25 -16 101 -1 -34 15 103 6 57 11 -23 -21 73 13 -13 2 52 -22 -38 87 -30 18
6997 18 40 -35 23 29 59 -15 10 44 -10 22 74 3 15 -15 22 3 31 22 7 3 3 -20 11 65 -25 -39 36 2 -7 -14 9 35 23
7030 23 -1 -13 15 24 73 19 -20 19 12 14 16 -20 -20 -2 65 -11 1 45 -19 -30 58 -27 28 40 51 1 -75 34 -29 -37 -1 33 -70
7063 -70 36 98 -1 -11 33 13 -45 61 62 -81 69 95 -14 14 54 7 -65 84 5 -81 15 1 -73 24 31 -21 -59 26
7091 26 -59 -91 76 28 -80 17 70 -62 4 126 11 -94 92 -22 -67 100 47 -8 -22 113 -35 -83 91 -30
7115 -30 -75 76 41 -137 55 75 -40 -41 45 -14 -66 77 51 -74 83 64 -50 -58 84 -20 -26 86 -16 -25 66 82
7141 82 -13 23 80 -70 -17 39 -20 -84 28 34 -72 -6 130 -3 -10 84 -5 -3 92 60 -22 -26 69 -48 18 54 -41 -50 52
7170 52 9 -44 32 26 -38 62 26 1 -83 10 58 -60 -35 15 0 -13 54 -56 -54 17 38 -56 45 44 -54 -32 86 13 -56
7199 -56 63 66 -92 13 46 -74 -39 71 0 -98 16 12 -51 4 43 -129 10 34 34 -71 22 73 -91 57 32 -91
7225 -91 4 101 -75 -61 86 31 -128 77 25 -123 3 61 -38 -18 52 -16 -31 96 80 -44 -6 103 -94 -8 78
7250 78 -60 -65 82 20 -67 47 110 -79 -54 20 -21 -39 110 87 -91 43 20 -88 19 79 -36 -14 81 -4 -68 21
7276 21 46 -126 8 -1 -15 -5 41 -10 -21 23 8 -71 3 38 -81 41 27 -70 -56 79 -39 -23 23 5 17 -37 62 -17
7304 -17 -14 47 30 -26 64 3 -33 -10 15 -19 0 58 10 -23 14 -11 -80 10 1 -50 -26 4 -7 -55 39 72 -30 -4 4 13 38 36
7336 36 19 -7 -19 35 -13 56 7 14 -14 63 3 -71 -34 -55 -33 -31 30 -63 -44 23 7 -32 14 3 1 -12 -28 9 33 36 46 9
7368 9 31 100 -67 41 16 -7 21 44 -6 -23 -12 2 -29 49 80 -50 -7 14 -31 -34 30 23 -3 17 37 -32 -10 28 -66 -71 43
7399 43 -11 -19 -3 2 -19 28 -14 -36 9 61 -6 -37 57 -8 11 28 27 8 13 23 -34 -6 12 4 -17 27 -4 -23 19 48 -42 46 19
7432 19 -73 -4 39 -39 15 49 24 -47 -27 43 -5 -26 13 8 -41 65 -41 -50 -5 57 -1 -1 15 -10 -74 41 36 -11 30 28 -11
7463 -11 15 -34 2 -25 14 10 -69 -12 14 -5 -2 23 -5 -26 19 -59 -34 -7 17 -28 5 -38 -19 40 -20 18 -6 -2 -5 -8 -54 10 9
7496 9 -50 59 5 12 18 -3 -28 -3 16 -8 21 22 -9 0 -15 -23 -1 -9 26 21 -24 -27 32 -32 16 19 -40 -82 -65 -54 3 -10 11 -35 -31
7531 -31 -4 -54 26 47 -6 -60 67 42 -13 35 27 45 -11 31 -22 -64 31 -17 -37 14 67 -89 33 -33 -91 6 10 -68 -10 35
7561 35 -4 -78 31 39 -35 24 4 -68 -41 106 -26 -61 51 10 -36 6 29 -72 -19 71 3 -13 60 -24 -39 38 72 -35
7589 -35 44 65 -49 -6 22 -24 -56 -2 -11 -40 10 14 1 8 47 0 -64 81 2 -30 48 6 6 10 68 -7 5 110 36 14 7 -9
7621 -9 -62 0 14 -53 -19 19 -18 -48 35 7 -63 20 62 -34 -35 -5 -7 25 -33 -29 -33 15 92 -35 -35 44 -21 -15 72 66 -32 8 9 6 -8
7656 -8 92 -13 -14 38 -2 -117 -26 68 -34 -40 41 -22 -31 10 14 -73 24 6 -48 -44 89 -23 -70 85 39 -5 51 93 -70
7685 -70 38 117 -32 -8 115 -5 -39 48 -2 -33 7 68 -59 -31 67 19 -49 67 39 -43 44 44 -45 16 73 -26 -95 91
7713 91 41 -56 87 77 -69 34 43 -18 19 80 -1 -82 80 43 -65 31 107 -94 -46 56 -67 -98 48 58 -64 84
7739 84 -8 -65 -40 94 -64 -86 49 2 -92 57 3 -37 4 50 -59 13 81 4 6 100 -4 -29 15 86 -64 10 -24
7766 -24 -61 -7 66 -13 -111 5 68 -51 22 8 -37 -3 -22 -18 -42 -12 86 -48 16 55 -32 -60 89 -6 31 58 60 -37 6
7795 6 45 -7 -2 37 -19 -49 67 41 56 17 58 -25 -84 12 26 -30 21 33 -95 -57 44 -10 -10 29 14 -105 2 87 -88
7824 -88 -47 53 -44 -20 67 9 11 54 84 -31 -45 80 1 -5 103 -8 -64 42 10 -14 39 43 -15 -53 94 8 -13 44
7852 44 -10 -79 -3 52 -25 5 31 -45 -25 56 4 -22 29 45 -78 46 72 -54 10 50 30 -50 23 77 -10 42 47 -32 -12
7881 -12 14 41 8 47 -5 -12 28 14 -41 -32 49 -26 6 16 -17 -10 40 17 -26 18 4 -66 -68 -4 -60 -11 37 -34 1 36 -76 44
7913 44 -29 -3 -6 -7 24 -62 -1 -18 -18 -39 40 -33 -42 -21 18 4 -6 14 -4 7 61 -60 -28 -7 -11 -11 1 33 16 64 18 29 24
7946 24 -30 18 6 20 -44 -45 59 13 12 31 -1 -7 40 -34 66 14 -15 64 69 16 35 11 41 53 19 78 -57 -21 70 17 -2
7977 -2 53 36 -13 3 71 -25 -41 34 -27 0 71 -13 -56 35 -30 17 32 24 10 -4 38 8 -14 9 -3 -28 29 -15 2 -4 20 -16
8009 -16 -5 54 -1 -24 31 -16 -13 39 -22 -6 22 4 -20 10 14 34 5 33 51 7 18 81 -69 12 11 -6 19 22 -21 -46 0 -4
8041 -4 -22 -20 21 -19 35 -21 -62 -6 10 -5 -2 22 76 -4 40 32 14 32 4 -108 -7 -4 -2 0 10 17 -15 38 -1 55 -69 19 39
8074 39 3 25 -12 -48 18 -27 -5 -2 10 41 -38 -46 1 -86 17 8 -52 21 -14 -7 1 -15 85 10 -26 -17 13 -4 52 77 27 -34
8106 -34 -7 77 5 38 2 -17 18 7 -59 65 31 -3 -31 40 28 -44 54 92 -16 -3 55 -50 12 52 -22 -75 58 43
8134 43 -24 29 63 -8 22 71 18 7 18 34 -1 17 57 -40 -32 5 -14 -3 31 -53 -75 32 30 -69 21 70 -52 -64 64 -8
8164 -8 -63 80 -41 -108 80 52 -54 -3 33 -49 -14 28 12 -38 15 74 -63 32 60 -54 58 82 -22 -65 12 34 -31
8191c1
##END NTUPLES=NMR FID
##END=
