##TITLE=1H_-32-2023
 CDCl3
 8 sc, 
 19.5.2023
##JCAMPDX= 6.0         $$ Bruker NMR JCAMP-DX V2.0
##DATA TYPE= NMR FID
##DATA CLASS= NTUPLES
##ORIGIN= UXNMR, Bruker Analytische Messtechnik GmbH
##OWNER= root
$$ XWIN-NMR		Version 3.5
$$ Fri May 19 14:14:51 2023 Russian Standard Time (UT+4h)  she@DPX200
##.OBSERVE FREQUENCY= 200.13135
##.OBSERVE NUCLEUS= ^1H
##.DELAY= (6, 6)
##.ACQUISITION MODE= SIMULTANEOUS
##.ACQUISITION SCHEME= undefined
##.AVERAGES= 8
##.DIGITISER RES= 18
##SPECTROMETER/DATA SYSTEM= spect
##.PULSE SEQUENCE= zg30
##.SOLVENT NAME= CDCl3
##.SHIFT REFERENCE= (INTERNAL, CDCl3, 0, 15.7039)
##AUDIT TRAIL= $$ (NUMBER, WHEN, WHO, WHERE, WHAT)
$$ ##TITLE= Audit trail, XWIN-NMR		Version 3.5
$$ ##JCAMPDX= 5.01
$$ ##ORIGIN= Bruker BioSpin GmbH
$$ ##OWNER= she
$$ F:/spectra/data/she/nmr/H-F/1/audita.txt
$$ ##AUDIT TRAIL=  $$ (NUMBER, WHEN, WHO, WHERE, WHAT)
(   1,<2023-05-19 14:13:37.18 +0400>,<she>,<DPX200>,
      <created by zg, POWCHK disabled, PULCHK disabled
       configuration hash MD5:
       00 E9 B6 7A A2 85 ED C7 34 08 36 98 17 FE 4E 26
       data hash MD5: 16K
       41 1F B1 DB 74 80 4E 89 FE 56 61 3C 1A D6 F7 29>)
$$ ##END=
$$ 
$$ hash MD5
$$ 72 48 B8 A0 E7 5A F9 B7 4E F2 5A 5B 86 F0 64 92
##$RELAX= 
##$RELAX= 
##$RELAX= 
##$RELAX= 
##$RELAX= 
##$RELAX= 
$$ Bruker specific parameters
$$ --------------------------
##$DU= <F:/spectra>
##$EXPNO= 1
##$NAME= <H-F>
##$PROCNO= 1
##$TYPE= <nmr>
##$USER= <she>
##$AMP= (0..31)
100 100 100 100 100 100 100 100 100 100 100 100 100 100 100 100 100 100 
100 100 100 100 100 100 100 100 100 100 100 100 100 100 
##$AQSEQ= 0
##$AQ_mod= 1
##$AUNM= <au_zg>
##$AUTOPOS= <>
##$BF1= 200.13
##$BF2= 200.13
##$BF3= 200.13
##$BF4= 200.13
##$BF5= 200.13
##$BF6= 200.13
##$BF7= 200.13
##$BF8= 200.13
##$BYTORDA= 1
##$CFDGTYP= 0
##$CFRGTYP= 5
##$CHEMSTR= <none>
##$CNST= (0..31)
1 1 145 1 1 1 1 1 1 1 1 1 1 1 1 1 1 1 1 1 1 1 1 1 1 1 1 1 1 1 1 1 
##$CPDPRG= <>
##$CPDPRG1= <>
##$CPDPRG2= <>
##$CPDPRG3= <>
##$CPDPRG4= <mlev>
##$CPDPRG5= <mlev>
##$CPDPRG6= <mlev>
##$CPDPRG7= <mlev>
##$CPDPRG8= <mlev>
##$CPDPRGB= <>
##$CPDPRGT= <>
##$D= (0..31)
0 1.2 0 0 0 0 0 0 0 0.06 0 0.03 0 0 0 0 0.0002 0 0 0 0 0 0 0 0 0 0 0 0 
0 0 0 
##$DATE= 1684491216
##$DBL= (0..7)
120 120 120 120 120 120 120 120 
##$DBP= (0..7)
150 150 150 150 150 150 150 150 
##$DBP07= 0
##$DBPNAM0= <>
##$DBPNAM1= <>
##$DBPNAM2= <>
##$DBPNAM3= <>
##$DBPNAM4= <>
##$DBPNAM5= <>
##$DBPNAM6= <>
##$DBPNAM7= <>
##$DBPOAL= (0..7)
0.5 0.5 0.5 0.5 0.5 0.5 0.5 0.5 
##$DBPOFFS= (0..7)
0 0 0 0 0 0 0 0 
##$DE= 6
##$DECBNUC= <off>
##$DECIM= 32
##$DECNUC= <off>
##$DECSTAT= 4
##$DIGMOD= 1
##$DIGTYP= 9
##$DL= (0..7)
0 120 120 120 120 120 120 120 
##$DP= (0..7)
150 150 150 150 150 150 150 150 
##$DP07= 0
##$DPNAME0= <>
##$DPNAME1= <>
##$DPNAME2= <>
##$DPNAME3= <>
##$DPNAME4= <>
##$DPNAME5= <>
##$DPNAME6= <>
##$DPNAME7= <>
##$DPOAL= (0..7)
0.5 0.5 0.5 0.5 0.5 0.5 0.5 0.5 
##$DPOFFS= (0..7)
0 0 0 0 0 0 0 0 
##$DQDMODE= 0
##$DR= 18
##$DS= 0
##$DSLIST= <SSSSSSSSSSSSSSS>
$$ [...]
##$SUBNAM2= <"">
##$SUBNAM3= <"">
##$SUBNAM4= <"">
##$SUBNAM5= <"">
##$SUBNAM6= <"">
##$SUBNAM7= <"">
##$SUBNAM8= <"">
##$SUBNAM9= <"">
##$SW= 18.05172834244
##$SWIBOX= (0..15)
0 0 2 0 0 0 0 0 0 0 0 0 0 0 0 0 
##$SW_h= 3612.71676300578
##$TD= 16384
##$TD0= 1
##$TE= 0
##$TE2= 300
##$TE3= 300
##$TEG= 300
##$TL= (0..7)
0 120 120 120 120 120 120 120 
##$TP= (0..7)
150 150 150 150 150 150 150 150 
##$TP07= 0
##$TPNAME0= <>
##$TPNAME1= <>
##$TPNAME2= <>
##$TPNAME3= <>
##$TPNAME4= <>
##$TPNAME5= <>
##$TPNAME6= <>
##$TPNAME7= <>
##$TPOAL= (0..7)
0.5 0.5 0.5 0.5 0.5 0.5 0.5 0.5 
##$TPOFFS= (0..7)
0 0 0 0 0 0 0 0 
##$TUNHIN= 0
##$TUNHOUT= 0
##$TUNXOUT= 0
##$USERA1= <user>
##$USERA2= <user>
##$USERA3= <user>
##$USERA4= <user>
##$USERA5= <user>
##$V9= 5
##$VALIST= <valist>
##$VCLIST= <CCCCCCCCCCCCCCC>
##$VD= 0
##$VDLIST= <DDDDDDDDDDDDDDD>
##$VPLIST= <PPPPPPPPPPPPPPP>
##$VTLIST= <TTTTTTTTTTTTTTT>
##$WBST= 1024
##$WBSW= 4
##$XGAIN= (0..3)
0 0 0 0 
##$XL= 0
##$YL= 0
##$YMAX_a= 264657
##$YMIN_a= -222025
##$ZGOPTNS= <>
##$ZL1= 120
##$ZL2= 120
##$ZL3= 120
##$ZL4= 120
##$ABSF1= 10
##$ABSF2= 0
##$ABSG= 5
##$ABSL= 3
##$ALPHA= 0
##$AQORDER= 0
##$ASSFAC= 0
##$ASSFACI= 0
##$ASSFACX= 0
##$ASSWID= 0
##$AUNMP= <proc_1d>
##$AZFE= 0.1
##$AZFW= 0.1
##$BCFW= 1
##$BC_mod= 2
##$BYTORDP= 1
##$COROFFS= 0
##$CY= 11.3945322036743
##$DATMOD= 1
##$DC= 2
##$DFILT= <>
##$DTYPP= 0
##$F1P= 15.7292609196834
##$F2P= 12.9074282941183
##$FCOR= 0.5
##$FTSIZE= 0
##$FT_mod= 4
##$GAMMA= 1
##$GB= 0.15
##$INTBC= 1
##$INTSCL= 1
##$ISEN= 128
##$LB= 0.24
##$LEV0= 0
##$LPBIN= 0
##$MAXI= 10000
##$MC2= 0
##$MEAN= 0
##$ME_mod= 0
##$MI= 1.114404
##$NCOEF= 0
##$NC_proc= 0
##$NLEV= 6
##$NOISF1= 3.799351
##$NOISF2= 2.8
##$NSP= 1
##$NTH_PI= 0
##$NZP= 0
##$OFFSET= 15.70392
##$PC= 1
##$PHC0= -19901.84
##$PHC1= 12.25272
##$PH_mod= 1
##$PKNL= yes
##$PPARMOD= 0
##$PSCAL= 0
##$PSIGN= 0
##$REVERSE= no
##$SF= 200.130013532006
##$SI= 16384
##$SIGF1= 3
##$SIGF2= 2
##$SINO= 400
##$SIOLD= 16384
##$SREGLST= <1H.CDCl3>
##$SSB= 0
##$STSI= 0
##$STSR= 0
##$SW_p= 3612.71676300578
##$SYMM= 0
##$S_DEV= 0
##$TDeff= 0
##$TDoff= 0
##$TI= <>
##$TILT= no
##$TM1= 0
##$TM2= 0
##$TOPLEV= 0
##$USERP1= <user>
##$USERP2= <user>
##$USERP3= <user>
##$USERP4= <user>
##$USERP5= <user>
##$WDW= 1
##$XDIM= 8192
##$YMAX_p= 0
##$YMIN_p= 0
$$ End of Bruker specific parameters
$$ ---------------------------------
##NTUPLES= NMR FID
##VAR_NAME=  TIME,          FID/REAL,        FID/IMAG
##SYMBOL=    X,             R,               I
##VAR_TYPE=  INDEPENDENT,   DEPENDENT,       DEPENDENT
##VAR_FORM=  AFFN,          ASDF,            ASDF
##VAR_DIM=   8192,          8192,            8192
##UNITS=     SECONDS,       ARBITRARY UNITS, ARBITRARY UNITS
##FACTOR=    0.0002768,     1,               1
##FIRST=     0,             0,               0
##LAST=      2.2672688,     0,               0
##MIN=       0,             -222025,         0
##MAX=       2.2672688,     264657,          0
$$ Real data points
##PAGE= N=1
##DATA TABLE= (X++(R..R)), XYDATA
$$ [...]
2124C898n567J333M044o950J412M560l403K59Q79l49j433j214N096j937l440N890
2140C078l405l457O286j194j913J984q72p14j865K941K264n507L082J422o514
2155d384L785K832l485J652j7j290j123K85M522k766j604M677n313p68N948k577
2171C74l36J515j832l76j455L268J260m146L513j120n291N067R78k435K570j205
2187C49j549o22P08L794k910J71L226n939J080M162l010J459J018k459o13q75
2203b010K821K70k514L865k716l628M973r45r42K910k044m79o93N67K560k709
2219g14J701J715n362K342J822k896K928l06k013L18j133K166n57j317L296l080
2235a090j379M039k568P31K042k237O42n34J56J929k709K197N31m141L235Lk210
$$ plain form
2124 3898 -1669 -336 3708 -3242 -1830 2730 -673 -414 465 116 -1317 -2531 2565 628 -2812 3078
2140 3078 -327 -3784 2502 1308 -605 1379 507 -207 -2072 869 3133 -2374 708 2130 -4384
2155 -4384 -599 2233 -1252 400 383 -907 -2030 -1745 2777 11 -1593 3084 -2229 -2997 2951 374
2171 374 38 1553 -279 -655 -2110 1158 2418 -1728 1785 665 -4626 441 1419 -1016 1554 349
2187 349 -1200 -1822 -1114 2680 -230 -59 3167 -2772 -1692 2470 -540 919 1937 -522 -1135 -2010
2203 -2010 811 1081 -1433 2432 -284 -3912 1061 116 -826 2084 40 -439 -1132 -565 1995 -714
2219 -714 987 2702 -2660 -318 1504 -1392 1536 1230 -783 -465 -1598 568 11 -1306 1990 -1090
2235 -1090 -2469 1570 -998 -267 1775 -462 180 -354 -198 1731 -978 1219 1750 -2391 844 847 -1363
2252a363K858j698o26J056j501J962j020q06K845l113P5K862k752J440R44k185
2268a022J587j022M60J567k478J984l18k753L399j225j387K558k080K32Q73j799
2284a424K379j414l96K183l050J336J593k572K218k15j699K088j445O24J060k482
2300a216K361q43j515K815k125j7J925k573J408p3j575K524j739K48J631k884
2316a648K138L49k196K667j305o19K003k185J325K58j913K596j460q44K222k447
2332a059R79J175k741K063o92q81K178k178O48J356k439K280l34j604K747k112
2348f14N85J383k224J743j31j707K482j926m6J633k391J600K17k207K373j463
2364f93l10J877k507J503N20j870K532j372m86K163k090J081Q57k067K084q00
$$ plain form
2252 -1363 1495 -203 -829 227 -1274 688 -332 -1138 1707 -1406 -1331 1531 -1221 219 1163 -1022
2268 -1022 565 -457 3 1570 -908 1076 758 -1995 1404 179 -1208 1350 -730 -498 375 -1424
2284 -1424 955 -459 -855 1328 -1722 -386 1207 -1365 853 638 -1061 1027 -418 206 1266 -1216
2300 -1216 1145 302 -1213 1602 -523 -540 1385 -1188 220 147 -1428 1096 -643 -395 1236 -1648
2316 -1648 490 839 -1357 1310 5 -614 1389 -796 529 787 -1126 1470 10 -834 1388 -1059
2332 -1059 -80 1095 -1646 417 -275 -1156 1022 -1156 -508 848 -1591 689 355 -1249 1498 -614
2348 -614 -29 1354 -870 873 742 -965 1517 -409 -455 1178 -1213 387 604 -1603 770 -693
2364 -693 -1003 874 -1633 -130 390 -1480 1052 -320 -806 1357 -733 348 1205 -862 1222 422
2380D22r72K220k130P87J185k542J848p27j197K205j997L58J283k162J902m90
2396gj457K413j859L64J760k282J691K15j558K064j241l42J846k373J612J26k139
2413a167K333j262p41J940k024P06N91j799K020j174o28K085k147Q89J087k242
2429a533J848l73j040K209j879Q24R52k152J932n37j491K757k087O3J349k032
2445a190J566r3j208J829j782K09J711k591J684M86k073K172q04o79J593j499
2461f69J385L0j736K136j597j28K480k512O63J101j852J355m56l18J607k055R40
2478C74M60k429K554k56j408K247j851m78J430j394J665n74q64K007k360R3K125
2495A341k407J593P04k118J330r04j1J433j578J474l43k234K412j196n04K453
$$ plain form
2380 422 -550 1670 -460 327 1512 -1030 818 91 -1106 1099 -898 -540 743 -1419 483 -7
2396 -7 -1464 949 -910 -546 1214 -1068 623 838 -720 1344 103 -239 1607 -766 846 972 -1167
2413 -1167 1166 -96 -837 1103 -921 -215 376 -1423 597 -577 -1205 880 -1267 -378 709 -1533
2429 -1533 315 -58 -1098 1111 -768 56 1008 -1144 788 251 -1240 1517 -570 -507 842 -1190
2445 -1190 376 283 -925 904 -878 -669 1042 -1549 135 621 -1452 720 -84 -763 830 -669
2461 -669 716 746 -990 1146 -451 -579 1901 -611 52 1153 -699 656 200 -118 1489 -566 374
2478 374 834 -1595 959 703 -705 1542 -309 -787 643 -751 914 340 -524 1483 -877 -784 1341
2495 1341 -1066 527 1231 -887 443 -461 -472 961 -617 857 514 -1720 692 -504 -1008 1445
2511A445j978K37L14j437J646o44K28J624k782P86J066k448K229N02j647J083
2527B24j269J37Q13j004K294q97j408K069k072l2K607j317M53r6j653J214r46
2544h83J269J310k548J169j04k138K360j5p63J403j771K51j28n03K743j410n07
2561b65J760k806R56J743j503J198k69j139R05j189J323N55k138J945j245j463
2577a632K560r76k96J161j673N34j38j02J971j780K75J070k414J730J022j697
2593c85J156q38n03Q21q66J385l2j827J801j509p47K798j557J74N49j853J161
2610b72j95N49J444k204O85L64k143K545L08j452J408j443o32Q59n10J807n56
2627E62j460J339k351P87K492j587P87k43j797J248l06Q81J378j937J026r24j723
$$ plain form
2511 1445 -533 -296 18 -1419 227 -417 -189 1435 -1347 -561 505 -1943 286 788 -859 224
2527 224 -1045 -908 -95 -1099 1195 298 -1110 959 -1113 -1145 1462 145 598 502 -1151 63 -883
2544 -883 386 1696 -852 317 213 -1925 435 420 -343 1060 -711 -460 -588 -1091 1652 242 -265
2561 -265 1495 -1311 -355 1388 -115 1083 814 -325 580 -609 714 1269 -869 1076 -169 -1632
2577 -1632 928 -48 -344 817 -856 -322 -460 -562 1409 -371 -96 974 -1440 290 1312 -385
2593 -385 771 -67 -570 251 -615 770 738 -1089 712 -797 -1544 1254 -303 -129 420 -1433 -272
2610 -272 -467 82 1526 -678 7 371 -1772 773 1081 -371 1037 -406 -1038 -179 -689 1118 562
2627 562 -898 441 -1910 -1123 1369 -218 569 326 -1471 -223 -529 352 1730 -207 819 -105 -1828
2644a828K715j48q07J688k353j12O33n08J805j031m22J077k540J171J649j638
2660f49J768n67j423J004p96J082R06j462J263j262j137K308q17j40J211k056
2676g67M66o2l80J782j320J95O36k092J554M42j293J976j089q26J186j139J147
2693D16N50j393J385j386m52J934j512N41O80j782J052l92j89J326j268O71K63
2710D44j765J675k45q85J736j280k12R33j295J298j13r51J503j378K53J056j556
2727g82J154L26j466J369j089J54J171j456J018n7j290J695r62k13J317j606P55
2744C8M81j399J405o44m37J431j557N09P07j477J426j93r90J443j306M32P25j347
2762g53J305k95j012J684j256J51J002j446J116k10j100J484r75J90J024j665
$$ plain form
2644 -1828 887 739 -68 1620 -733 -845 -212 -720 1085 54 -368 709 -1831 -660 989 -649
2660 -649 1119 552 -871 133 -663 419 1325 -137 1126 -136 -1273 1035 218 78 1289 -767
2676 -767 -301 -363 -743 1039 -281 -86 550 -1542 12 454 -839 1137 48 -778 408 -731 416
2693 416 966 -427 958 -428 -880 1054 -458 83 763 -1019 33 -359 -548 778 -490 181 444
2710 444 -1321 354 109 -776 960 -320 -532 401 -894 404 291 -660 843 -535 -282 774 -782
2727 -782 372 698 -768 601 -488 -334 837 -619 399 342 -948 747 -215 -428 889 -717 38
2744 38 519 -880 525 -119 -556 875 -682 -173 534 -943 483 290 -700 743 -563 -131 594 -753
2762 -753 552 257 -755 929 -327 -176 826 -620 496 286 -814 670 -305 -115 909 -756
2778g56Q16K88j235J405o75l55J106j332O94L89j120J276o36k83J010j242O23
2795b7P72j489J265m14p37J425j240L79P43j342J065k34q67J452j215K90R29j605
2813h50J315k45r29J417j042j39J096j470J150o7j190J646r35j49J277j332Q60
2830D13O1j040J403q17m86J317j212N81M32j269J201p73m57J347j246L69O85j405
2848h96J373m99p12J604j472L08Q73j467J412j84p78J296j163K72R62j500R37
2865C66K2j023J431j002j50J003j312Q29P2j036J160o85l24J290j298P45L39j341
2883i14J472o55m42J206j032M61N41j222J057j35o16R97j062K03R28j509J227
2900E05m08q77J452j111J34P98j458J115J9r73J351p52l00J169j348P61K37j043
$$ plain form
2778 -756 60 348 -887 518 -157 -512 594 -738 -44 345 -775 501 -135 -418 592 -650 -27
2795 -27 745 -744 521 107 -630 795 -445 -66 677 -665 400 166 -701 751 -464 -174 755 -850
2813 -850 465 220 -709 708 -334 -473 623 -847 303 236 -954 692 -243 -392 885 -447 413
2830 413 474 -566 837 20 -466 851 -361 220 652 -617 584 -189 -646 701 -545 -176 509 -896
2848 -896 477 -22 -734 870 -602 -294 579 -888 524 340 -438 858 -305 -33 929 -571 366
2865 366 388 -635 796 -206 -356 647 -665 164 236 -800 360 -325 -649 641 -657 88 427 -914
2883 -914 558 -97 -539 667 -365 96 637 -585 472 337 -279 718 -344 -141 787 -722 505
2900 505 97 -780 672 -439 -305 493 -965 150 169 -804 547 -205 -505 664 -684 77 314 -729
2918g29J422q37k34J180j304O39L69j290J380q53j74J068j170M74M99j128J141
2935D53n58m49J370j403O05M88j408J294l00o05J384j232J76P81j376J194m9j023
2953f58J323r01R8P47j220J032Oq69J189j077n9J354j206N52K15j189J112o54
2971b05k61J214j268Q24R2j274J367n02n35J467j242K44L40r73J351n44j93R47
2989H49j209J99Q13j301J133o8r66J129r72m4Q44j079J131l00j139J318r20N3
3007e29J058j287P12K8o46J157p53L3R48j332P07L40j215J418l52o28O72o38J42
3026a65L92o67J088r12k56J265j268L94O27r17O55Ro74R59q33K40N84j312J288
3045D97j16j135J516q21l81P54q20P83J8o58J073j200J54J149j466P48O47j559
$$ plain form
2918 -729 693 -144 -378 802 -502 137 506 -784 596 -257 -431 637 -533 -59 440 -688 453
2935 453 -105 -554 816 -587 18 506 -902 392 92 -513 871 -361 -185 596 -780 414 365 -658
2953 -658 665 -236 -138 609 -611 421 427 -442 747 -330 -389 965 -241 311 526 -663 449 -205
2971 -205 -466 748 -520 304 396 -878 489 -13 -548 919 -323 -79 261 -712 639 95 -98 849
2989 849 -360 -161 652 -649 484 416 -550 579 -393 -437 407 -672 459 159 -980 338 -582 -529
3007 -529 529 -758 -46 -18 -664 493 -260 -227 721 -611 96 436 -779 639 287 -341 331 -307 -165
3026 -165 227 -440 648 -264 -520 745 -523 -129 498 -419 236 245 -429 530 -303 -63 521 -791 497
3045 497 381 -754 762 -59 -440 314 -506 277 295 -363 710 -490 -336 813 -653 95 742 -817
3063h17J023j26l30Q44r27P42k52j148J505m40p62J721j448j5N71p45Q48k75j0
3082d1Q13j542N66P89j478J315K83j308R45o28o1O58n42Q05n60q36J631j357P1
3101d77J485j430L59M92j023O43k35L61N02j479R52K05j479J830j38r94J082q83
3119b27j38M33k9Q85j048r8J067j922O83J417j389O19J27r83M38l25Q02K05j078
3138e61R97p31r67J986p55l5R20j247p9Q2N8J096p09P5N23k084J257P89j230J117
3158E02j46j030M82m42R44J21p12J250j579m68J747j025M29J062j474J7Q5Q1Q90
3177G34r80P00J02j643J306K7r63J778o92n66K20n31R33q9j60R46j556LJ229j508
3197g10R39O42j266M20j55J46K94o50J205m63j316J724p86o33J372p10m71O89
$$ plain form
3063 -817 206 80 -250 594 -333 409 157 -991 514 74 -688 1033 -415 -430 141 -604 244 -31 -41
3082 -41 772 -770 -204 585 -893 422 705 -603 342 -286 -347 311 -231 574 14 -822 809 -548 -477
3101 -477 1008 -422 -63 429 -594 49 -186 175 677 -802 150 355 -1124 706 568 -426 656 -227
3119 -227 -365 68 39 924 -124 -222 845 -1077 -394 1023 -366 253 380 -603 -165 -490 312 517 -561
3138 -561 436 -295 -1262 724 -31 -66 854 -393 -472 -390 -332 764 55 130 653 -1431 -174 615 -615 502
3158 502 356 -674 -192 -634 310 431 -281 969 -610 -1078 669 -356 73 1135 -339 -322 -237 -156 734
3177 734 -246 454 556 -1087 219 246 -717 1061 369 -197 23 -508 425 336 176 1122 -434 -431 798 -710
3197 -710 229 871 -395 25 -130 16 310 -340 865 402 -914 810 24 -609 763 53 -418 271
3215B71o96O89k51k19J178j672N21J043j651J094R6j107R24n41J14K91p33J082
3233D33r43o02J725j071M1J122j337J36N84m82P79n56J69L63j313J136J93j013
3251f36J224n01q15Q95n39N54J69o63R19r97k88J348r94K88P83j213K10M67l96
3270a85R11o32J67K40j286J188j24n87J344r79m11P33p23N63K1l29Q02q61k0Q10
3290F42j117P16L39j015O91l30k36R20p01N51k84p49J147q07k58J238j239J92
3308c00O30r74Q57j13l97P92q15J65O16j401J206p2p28R75p43K19M37r95R24k32
3328E1n45J054j016P2O81p95L25M87p98Q86l86k85P55j074O86M23r45J020n33
3347F3l68R44r44M22L64r01Q35l92m59J018r87L72M25j067P39r3m74Q17n18K4
$$ plain form
3215 271 -425 264 13 -206 972 -700 -179 864 -787 307 403 -704 220 -321 -207 84 -649 433
3233 433 -510 -1112 613 -458 -417 705 -632 -496 88 -394 385 -171 -2 361 -952 184 377 -636
3251 -636 588 87 -728 167 -372 182 351 -312 607 -390 -678 670 -324 -36 747 -466 -256 211 -185
3270 -185 726 94 261 501 -785 403 279 -308 1036 57 -354 379 -344 219 240 -89 713 -148 -168 642
3290 642 -475 241 580 -435 256 -74 -310 610 -91 460 176 -573 574 -233 -491 747 -492 -300
3308 -300 330 -644 213 100 -297 495 -320 -155 461 -940 266 194 -534 441 -302 -83 354 -641 283 51
3328 51 -494 560 -456 -384 297 -498 -173 314 -484 402 16 -269 486 -588 98 521 -424 596 63
3347 63 -305 639 -305 117 481 -420 415 23 -436 582 -405 -33 392 -675 64 -29 -503 314 -204 -180
3367a80N87j024Q24o6o37R70p00q2P33q20M44J93p43P61l67r4P98j128M89L44
3387C02r40J089n97l08J007r86M14L65r44J004l49m80R76p35J22N22q96P98j73
3406A91m95Q81r61L16N99r27Q19j02p18J004o39P4O14j022P05j72m05Q83o34j92
3426a81O92r08P41Np77Q43m95k44P82p81M93Q3p75R60n47j98Q64q51Q4N23q17
3447e04O77j94k09N80q59M25L51q87Q25j25o15Q86o11J21L13n82N85k07n54J060
3467D76p24m3Q43q93L93K53o73Q62n07N5N23j092P09K62j115J132m40n45R54o11
3487a81%M30n47P43n70j85R73j053L51Q21j256N61J87o01O70n04M41O4q60R03
3507C87l07p85J484p49m19Q33o00M9J72k66O91p12J81P30j309P45M08j053O59
$$ plain form
3367 -180 407 -617 207 141 -496 474 -226 -308 425 -395 49 242 -501 260 -107 -201 597 -531 -42 302
3387 302 -638 451 -146 -454 553 -433 -19 346 -598 406 57 -423 553 -182 -60 462 -434 364 191
3406 191 -304 577 -384 -68 531 -396 423 321 -397 607 -32 42 656 -366 339 167 -238 645 11 -181
3426 -181 511 -397 344 349 -428 415 -80 -324 458 -323 170 253 -522 438 -109 -307 557 -294 -210 313 -504
3447 -504 173 -21 -230 350 -509 -84 267 -620 205 80 -535 351 -260 -139 174 -408 177 -30 -584 476
3467 476 -248 -291 552 -341 52 305 -368 494 -13 42 565 -527 182 444 -671 461 21 -524 430 -181
3487 -181 -181 249 -298 445 -125 -310 663 -390 -39 782 -474 87 274 -327 343 -161 280 344 -516 387
3507 387 80 -705 779 30 -389 444 -156 -107 65 -201 490 -222 -41 689 -620 125 533 -520 139
3526A39L5n32M22k84L99j43m06P71r27j17J392j015L3Q57r01J87k9L72m6o73Q01
3547C35J70j310J253J99j392J100m74l75L85qM66n02j20Q51j269K93J404j354
3565c48K28O50r72K64J91L55m2o21Q61o03j018J838m74q69J210q86n23L92L44
3584b3M61o22K02L86j631J035J075j314P42L38j224K21L23O19l15l12P78j282
3602e43l16J438o23k50J074j078m96P32J46K56m73O69j29j504J115N81j129J130
3620F00Q2j409N15L53J52k85K17N67j581J91J374j169J55J368j489j29O64j93
3638a7J25j14N91n44r52J479j25r45J311l99r92O96Ok09j51L19L25j343Q18Q17
3658F96j500O97P76j351J46Q86k41j38r7N39p32m94J677p12o84J437r82p28J073
$$ plain form
3526 139 174 -358 64 -220 179 36 -370 401 -526 -643 749 -266 -233 624 -277 -90 -119 253 207 -466 335
3547 335 505 -805 448 647 -745 355 -119 -494 -109 -117 349 -153 -273 578 -691 -398 1006 -348
3565 -348 -120 530 -442 -178 13 368 326 -295 566 -37 -1055 783 309 -560 650 -236 -759 -367 -23
3584 -23 438 -184 18 404 -1227 -192 883 -431 311 649 -575 -354 -31 588 273 -39 739 -543
3602 -543 -859 579 -44 -294 780 -298 -794 -62 84 340 -133 536 407 -1097 18 599 -530 600
3620 600 682 -727 -212 141 293 8 225 792 -789 -598 776 -393 -238 1130 -359 -488 176 -17
3638 -17 108 -6 585 41 -911 568 443 -502 809 410 -582 114 120 -89 -240 79 404 -939 -121 696
3658 696 -804 -107 669 -682 -536 350 109 -29 -126 413 -319 -813 864 152 -532 905 -77 -805 268
3677B68Jk16j22K36nj259J129N41j252R05Rj217P15L44k4J21j68J71q17n2J503
3698H11q82N2R31j389j14R40l10J63O5J41m69r71J287K41r89J259l20j300Q11
3717d3J42j53K32J73J58j206M55R67r53M32O75j357J50N57l27Q3K27J13l67o40
3737f82R95k36o47J466q13o65Q86l98o5J01L20J40p86L05M08j032Q79N39j297
3756e82O07J62o02L42LK85l31j85P95q44k84J362j060N2P07p69J79K68K6K6m95
3777c38M73P8p05P08k1p30P83r0n01K83j88L41k02j9M47o39k4R84j040L85L35
3798C20n32L77k5j0J68l88M30j42n19P38k51o69R39o33k3N32p68M93k19m7N64
3819C35p52K11N26p74M48K35o72P74m16R4K57m90M09r4l37O21m36j32N18o69L07
$$ plain form
3677 268 269 53 -69 167 162 -1097 32 573 -679 226 235 -982 -267 77 53 174 6 177 -640 -692 811
3698 811 -71 -19 912 -477 -591 349 39 202 267 408 -61 -1032 255 496 -493 766 446 -854 -43
3717 -43 99 -54 178 351 509 -697 -242 725 -228 204 879 -478 -328 229 -98 -15 212 325 -42 -682
3737 -682 313 77 -570 896 83 -582 304 -94 -159 -58 262 402 -384 -79 329 -703 176 715 -582
3756 -582 25 187 -415 -73 -70 215 -116 -301 494 -350 -634 728 -332 -280 427 -342 -163 105 131 157 -338
3777 -338 135 213 -492 216 195 -535 248 158 -343 -60 -248 93 -109 -128 319 -320 -344 640 -400 -15 320
3798 320 -212 165 140 130 298 -90 340 198 -321 417 166 -503 436 -197 -220 312 -456 37 -182 -229 335
3819 335 -417 -206 320 -454 -6 229 -443 331 -85 9 266 -224 185 91 -246 375 -61 -193 325 -344 -37
3840c7R0l76L74j59o6M10p35M93K63p53O76j65l16O40l79R5K53n39N76l38j72
3861a65N63o39K82L50n97L85l2m80M99m79K73K50n28M20l2k63M36m26J06L29m72
3882b20K02P3l23M77k11j93M53m61M10P1o72O36l43k6L10m12K33J6k14M53k68
3903il04O39n48P0M91n68L61j10j91L65m27K14K65n82M90M3m05N77n16J41L37
3924C33p27M41k2m80Q53m87Q0L83o41K15K64n47N73k34r8L17m36M89j72m53N87
3945B38j55m23M72k63Q6j8k99M62k61j61N57n15K47L45n83K09J89l98M34k96J40
3966GO9k14M21k38k64M93m23j88N42m37K54O0j38K53m70K69J35m83M86Q2o05M90
3988A01J36m12M43l08jK16k80N46n32j05P36o55k0N67n35n4K66k31J83k23L37
$$ plain form
3840 -37 53 -323 51 -108 -174 236 -499 -6 257 -496 180 15 -301 339 -40 55 308 -231 345 7 -165
3861 -165 398 -241 41 391 -206 179 147 -333 166 -313 -40 210 -318 102 70 -193 243 -183 -77 252 -220
3882 -220 -18 55 -268 209 -2 -195 258 -203 207 278 -394 242 -101 -127 183 -229 4 20 -194 259 -9
3903 -9 -313 326 -222 -152 339 -229 132 22 -169 196 -231 -17 248 -334 156 199 -206 371 -145 -4 333
3924 333 -394 47 25 -455 398 -89 -9 374 -267 -52 212 -335 238 4 -94 223 -213 276 104 -349 238
3945 238 83 -340 132 -131 -45 -63 -362 100 -161 -322 235 -280 -33 312 -271 -62 127 -271 163 -133 7
3966 7 76 -138 283 45 -219 274 -149 -337 205 -232 22 82 -56 197 -273 -4 131 -352 134 216 -389 101
3988 101 237 -175 268 -40 -41 175 -105 441 -91 -196 540 -115 -135 432 -103 -157 109 -122 61 -162 175
4009A75np43Q48N2p90P20k10l77M84l4j55oj52M41n95J79N55q48M63M19p90J86
4031a83J56k5M9j88L80l79l53J024m47m92Q95n84k77N77M0j94j46L02k5o67P15
4052A78K23q64O54J47q16L92L26j62N8j48N10p02j24R63q06%R17j002l16Q67j08
4073A87k32J55J82k60o38Q87J00r93Q56J28r73N13K82l95J48J96P8o02K07P11
4093E37j083M29P99j061J0P29o40K09J1K97l67m65J013l70p57J272m77p99R85
4112B72j5m38P1K59p8o78O86L50q74O03L52j059N24N13n58p7K21J39m80l1J130
4133H32p33l78J021r46m76J170l68k48J58J79k17n96Q82P1r45Q96J01j244R15
4152G4L44o72J83L52k26m97M85N72r84J15J074j342J72O61o45o1M79r3l47k54
$$ plain form
4009 175 170 -573 275 327 -463 257 47 -330 154 120 -35 -41 -193 248 -347 -168 387 -461 2 421 -369 -183
4031 -183 -27 -52 -3 -191 189 -190 -543 481 34 -458 437 -147 -424 153 193 -1 -147 155 130 -537 178
4052 178 401 -463 191 338 -478 -86 240 78 136 -12 498 -204 -328 635 -171 -171 746 -256 -572 295 187
4073 187 -45 110 292 32 -606 281 381 -612 244 372 -601 -88 194 -201 -53 143 221 -381 -174 537
4093 537 -546 -117 682 -379 -369 360 -280 -71 -60 237 -130 -595 418 48 -709 563 86 -713 272
4112 272 257 -181 -110 149 71 -607 79 429 -445 158 510 -549 -25 488 -70 -147 74 213 -267 -298 832
4133 832 99 -279 742 -204 -680 490 122 -126 32 211 -6 -602 280 351 -594 302 403 -841 74
4152 74 418 -254 -71 281 55 -442 43 615 -369 -254 820 -522 -350 311 -334 -395 84 -9 -356 -610
4172f10R49m91n74J373n16q17R54k04n14N11K35k11n54O34L39r04N01N55j359
4191g03M17P01o93J92L24j69m47J8P24p52J0J082p82m11P79l87j2L79J09m08k69
4212b98O29p0p80Q60J93j023O46K41q29M88K91l25o7Q3L99o53n2J021r46Q8O84
4233E80q38L3M33J5k14j92L31j25n75Q31L4o83P96m40n40N62J28m9l6k4K50o12
4255c35K85O55r52J49O58q42L54K21k82l0o2M83o35j52O09k94l08R49o82k20M83
4276E2mL7k12J93R1n58N49J34o74M87K04n71M28j8j63J18n2K90m62q1O11n24j67
4299b92O71n30J00L13j98k3k0lK65p18P47p3n05O81k86l66M25j17j8J21k03P2
4321D3j58jM68q25L88L02o25N74l3m07K68j04k1K02l35M95j18m09O19l76k08N84
$$ plain form
4172 -610 339 -152 -726 647 131 -686 268 64 -450 61 296 85 -469 165 504 -400 101 656 -703
4191 -703 -286 415 -278 -86 238 69 -378 -360 364 -388 -378 704 -78 -489 290 -97 -109 270 379 -29 -298
4212 -298 331 261 -519 341 534 -489 157 398 -431 57 348 23 -44 39 438 -215 -267 754 -192 -104 580
4233 580 -258 -225 208 223 9 -183 148 23 -552 279 313 -370 426 -14 -554 8 136 87 51 27 277 -335
4255 -335 -50 605 -347 -198 460 -382 -28 193 -89 -119 -181 302 -333 -485 124 -170 -478 471 -211 -431 52
4276 52 48 85 -127 66 157 -401 148 282 -392 95 299 -272 156 138 -25 93 41 331 -131 -212 399 -125 -292
4299 -292 379 -151 -51 262 64 41 21 18 283 -435 312 239 -266 415 129 -237 188 71 53 174 -29 43
4321 43 -115 -116 352 -473 -85 217 -408 166 133 -274 -6 -110 -131 71 -264 231 113 -296 323 -53 -261 323
4343C23n36R0K50j15J59k42R2K91m56K1K59m27K99Q2n8J41k55L3J25q7R3Q1k58
4366i5M85l91j31K42k94L01j18j34K56j41j5K51l96L10L6m54M53j39r5P5l16L94
4388H4Q9k85L55k39j31L24m71J91J80k15K13k2k71L63m77J78R4l09M42j02j66
4409a75K73j27Q5j8k31N6J70j06J69k18p7L99m47L43J8m30M31j75R0J64m40K97
4431E1M6k48M39l73j92N43l69J00R7k87K55j04K05J60m57L54J51n56L22J00k99
4452f2J97k37J28M5k33K75j80k02N70m14K6L22l52J94j20j17K86j51o9R5j37K37
4474A01q6k39M96k15l08N88k88j87J81j66K80l12l2M85n53K15K13m30L54r7j38
4495a38J81m6Q8O5m37N72k59m23Q60m70l38N31k82J45m4R0M9n07L48K76m88M35
$$ plain form
4343 323 -213 -123 127 12 171 -71 21 312 -144 -123 136 -291 8 90 32 173 -82 -49 76 -11 82 163 -95
4366 -95 390 -1 -132 110 -184 117 -1 -135 121 -20 -35 216 -180 130 166 -288 165 26 -69 6 -310 84
4388 84 173 -112 243 4 -127 197 -274 -83 97 -118 95 73 -198 165 -312 -134 -40 -349 93 -9 -175
4409 -175 98 -29 56 38 -193 -137 33 -73 96 -122 -199 200 -247 96 114 -316 115 -60 30 194 -246 51
4431 51 97 -151 288 -85 -277 266 -103 -3 94 -193 62 -42 163 323 -134 220 371 -185 137 237 -62
4452 -62 135 -102 26 71 -162 113 -67 -269 301 -113 -87 235 -117 77 -43 -160 126 -25 -94 1 -136 101
4474 101 15 -224 272 57 -251 337 49 -138 43 -123 157 -155 -187 298 -255 -40 173 -257 97 0 -138
4495 -138 43 -3 85 150 -287 285 26 -397 463 -7 -345 186 -96 49 5 95 144 -363 -15 261 -227 208
4517B08j5l24J31O7j57J09N1M1k89K29J44m67K23L40l29j28N05m08LJ25l1r5k16
4540b83M95j49k91M56q1l64L92j86j64J53j0k9j3r6L91o41L91P41j197M15L35
4561B65n80J87K28m9j00L4J83l42j74Q94n62k29P25l44k84J59J00r3j7P8K36o39
4583c24N37K21q00M78K82o76J25K12J12l46J07M04n69MO43o60k1N02l22q8K10
4604C1mk00j16N87k13n94P02Q9o96N80J06o41L86Q8j59k92L17M14o63J92M57o77
4626c06J59N10o16J03N09l45k76J87L58m68j09P51n50k39O10j43m18N22j6n19
4646b96J08L41r6m21O63J59p89K58K61m77K28L14j08l32K08K10m68K77L96m57
4666b1l77P94m38k17O35M3m89o2L47k51k31P53k42o76N47q4n99O25J97k42r9J78
$$ plain form
4517 208 193 -131 0 67 -90 19 70 111 -178 51 195 -272 -49 291 -38 -166 339 -69 -66 59 28 -67 -283
4540 -283 212 63 -228 228 147 -217 175 -11 -175 -22 -32 -61 -74 -170 221 -420 -29 712 -485 -70 265
4561 265 -315 -128 100 51 -49 -15 168 -174 -348 546 -16 -245 480 136 -148 11 111 18 1 79 315 -324
4583 -324 213 434 -366 112 394 -282 -157 55 167 -179 -72 332 -237 -233 410 -250 -271 231 -91 -179 31
4604 31 27 -173 -289 298 85 -509 193 282 -414 166 272 -369 17 105 -54 -346 -29 385 -278 -86 371 -306
4626 -306 -147 363 -253 -150 359 14 -262 -75 283 -185 -294 457 -93 -332 278 135 -283 239 223 -296
4646 -296 -188 153 57 -364 299 458 -331 -73 188 -289 -61 253 145 -187 21 231 -237 40 436 -21
4666 -21 -398 396 -42 -259 376 419 -70 -132 215 -36 -267 486 244 -432 115 31 -568 57 254 12 -87 91
4688I1j97l12M82L82p65J78L94n56k7O35k42k22K11J32l27j57N73j37m00M76r4
4709A18n65N37n3j65N9L66l34l29M43M0n38N87K06o45R7M45m52M4K70n9j56Q7
4731CK98k69k00N47m80k26N60j84j58J95P9o1k85M22k26j88L93L1m80N82k04m37
4753b88J34K58j6j83P7J60m76L10J91l43M0M50n14L7J42K71k02j45L81m30j85
4774c31M89pl45L61n4l33NJ98j24OJ94K16o08K64M47m04j50K96k77J97Nj38J50
4797E7j69K99k62k39N71k56k7L55m37j19L34q0q6k4J01J31m62M58l6j68K16R6
4819B53l39K83j89j40J54MJ94l03j34M32l19l5M27l15j26K25m5p3p8K16n5j00
4841f3K21j73k03L33k12p6J96m5O1o6Q8p7k41K82K1j51J34M4k44K06mQj2j03J53
$$ plain form
4688 91 -106 -418 64 446 -319 -141 253 -303 -330 305 63 -159 52 184 -143 -300 273 136 -264 212 118
4709 118 -447 90 37 -128 -69 297 -37 -366 77 117 -421 166 372 -273 -176 269 -183 -139 131 72 -84 3
4731 3 301 32 -168 379 -101 -327 233 49 -109 86 165 104 -181 241 15 -173 220 251 -229 353 149 -288
4753 -288 -154 104 88 -95 -18 142 -334 -24 167 -176 -136 314 -200 -163 -21 250 48 -97 284 -146 -331
4774 -331 158 151 -194 167 113 -220 -215 -17 -141 -135 59 275 -333 -69 378 -26 -176 120 -157 40 45 -93 57
4797 57 -112 187 -75 -314 257 1 -26 329 -108 -227 107 27 -59 -83 18 149 -313 145 109 -59 157 253
4819 253 -86 197 8 -132 22 26 220 -83 -217 215 -104 -139 288 -27 -153 72 27 -46 -124 92 37 -63
4841 -63 158 -15 -218 115 -97 -173 23 -22 39 -27 61 -16 -257 25 46 -105 29 73 -171 35 31 39 27 -76 77
4866G7O3m64M19n8j29K31k18k2K05r6L2J42j95J36k34L9K84m54K57N0j83J88n5
4889A5q0K25k92K88n8p0k2L0L4O5j26K0K61l42K57k13r3K16k17J06L9m7k7r2%
4914a23N8J89r0o3M6k7o9K4pJ3j09K19l31K25J49k80L77j42J92j81k68J56K42
4937B00l39J83r1qL6N2M3q7q4K28k53o6K41Nj91K16k74J67O3j96L36k63J55J33
4961B06j31r9J81k45K78k27J01L1k21J58k7mj8k09K23lj14K66m9k73L44p3k89
4984a94K56K7n0Rj46K89r3j26L26m42J11J57j12O5j30j6J0q2K21m5j66J26o3j0
5008g8J59r3K0P4k9Qm8p5R5q4N7R7l55M36j73m0J10q2N3J02j92J44j94P3K12k23
5034b6j81L71j84r6J73o8J5m5K26k0m15L27q8j8K94j86k62J61R1j51j6J80m2j04
$$ plain form
4866 77 140 -324 95 37 -92 139 -79 -101 104 8 40 182 -13 123 -111 -72 212 -242 15 65 -118 70 15
4889 15 -65 160 -132 156 98 28 6 36 70 135 9 29 290 -52 205 -8 -101 115 -102 4 43 -4 -31 -123 -123
4914 -123 -65 124 34 -29 17 -10 -79 -55 -62 -49 -158 61 -270 -45 104 -176 201 59 251 70 -198 -42 200
4937 200 -139 44 -47 -55 -19 33 76 -11 -95 133 -120 -186 55 60 -131 85 -189 -22 41 -155 181 -82 73 206
4961 206 75 -24 157 -88 190 -37 64 95 -126 32 5 1 -17 -226 -3 -6 -120 146 97 -176 168 95 -194
4984 -194 62 89 39 48 -98 191 98 -28 298 -144 -33 124 12 77 -53 -69 -59 -141 80 35 -131 -5 -68 -78
5008 -78 81 -12 8 82 53 61 13 -62 33 -51 6 103 -252 184 11 -29 81 -1 52 154 -38 106 -88 -15 197 -26
5034 -26 -207 164 -20 -116 57 -11 4 -41 185 165 -250 77 -11 -29 265 79 -183 -22 69 -82 -98 82 40 -64
5058f4k0K29k43j04M48k90k7K59j26r4O7K6o0o0J82J7k77J94K6k15K41j65o7O3
5082f0J39K4l69M40Q1m15R1K38l59J88K36l49P2Q0J10l30J76L27k97k72L52j86
5104h3m5J51J45k78j6J83m6j43K79K6m09J70J13k25K09K33l88M7K22m5k88J79
5126iK10j80j99L00j27k07K54R1k53K19K9k74j47N06j40j50K76j28l79M19M2j60
5148gmJ62k26j29K04J62l30J33J67l41K38J93m17R4N8P3j81J26K42j54j51L08
5170B20j76k53L45j15j98J31N8l2j10K42R8m35K62K21o01L21pl35L48L02j53j56
5192b3lJ31l13P3M22l38o5N51m65k65M14q3L0k4N6j62k13L56N1k54L01j00l12
5215b35K36J41j08m2J77K9m08K68J66k98K09J04l32K0O6n3K9P2r2j30m0L26q7
$$ plain form
5058 -64 -84 145 -98 -202 246 -44 -71 188 62 -32 35 61 1 -59 123 140 -137 57 83 -132 109 -56 -123 -60
5082 -60 79 103 -266 174 255 -160 -69 169 -190 -2 234 -115 -43 37 147 -183 -7 320 23 -249 103 -83
5104 -83 -128 23 168 -110 -126 57 11 -132 147 173 -236 -66 47 -178 31 264 -124 -77 145 100 -188 -9
5126 -9 201 21 -178 122 -5 -212 42 133 -120 99 128 -146 -293 213 73 -77 199 71 -308 111 153 -7
5148 -7 -11 151 -75 -204 0 162 -168 -35 132 -209 29 222 -195 -101 -43 30 -151 -25 217 63 -88 220
5170 220 44 -209 136 21 -177 -46 12 -20 -130 112 210 -225 37 258 -343 -22 -29 -364 -16 286 133 -23
5192 -23 -26 105 -208 -135 287 -51 -116 435 -30 -295 119 36 66 42 98 -64 -277 79 130 -124 177 77 -235
5215 -235 1 142 34 -8 169 198 -210 58 224 -74 135 239 -93 -73 -7 -60 -31 41 -51 -181 -221 105 18
5238A8k44K04J71l71L77j47r6J0J01J73m21L26J36l44J44J36l41j17L81j79K27
5259A44k7Pj25n0J95n4k35K13j47J22j24J11P7k06J70pl7j24M8k7J27N2j57J28
5283G4J0j60J56j31K74k62n8J58j72J91k3m1m4J76k36j68J83n4J72q2O1n3j5J49
5307A05J23k37J37k05M6qL7l7pJ33J4rj47%m9J01N0r1J33p0K0q8kJ39o9k80L13
5334E2j07m1J42j9p9J08k12K62j19N2J34j99K2J32k35J07j15Q0n0Q5m8L7o5R4
5358A8j00j22M04l59J95n9p5RJ24N2l07L30O0k13j77L65j22j58J74J1l6J92j80
5381B6k5R9k31K60j38M9R0j27k7k8J14K57l97R9Jo6K9K9m7qP8k15K87k43r8L29
5407I7j23R4n0k19K12q5r3K37j2L2j75M7Q5ol8J76l31J35J42k26P1j10J05J5P
$$ plain form
5238 18 -226 -22 149 -222 155 8 -88 -78 23 196 -225 101 237 -107 37 173 -168 -285 96 -83 144
5259 144 117 124 -1 -51 144 90 -145 68 -79 43 -81 30 107 -99 71 64 27 -97 -49 -76 51 103 -54 74
5283 74 84 -76 80 -51 223 -39 -97 61 -111 80 57 16 -28 148 -88 -256 -73 -127 45 -37 24 -29 -44 105
5307 105 228 -9 128 -77 -31 -39 -2 -39 -46 87 101 92 -55 -55 -104 -3 47 -44 89 19 39 -49 -51 88 19 -261 52
5334 52 -55 -96 46 27 -52 56 -156 106 -13 39 173 -26 -4 128 -107 0 -115 -35 -85 0 -48 -11 -76 18
5358 18 -82 -204 200 -159 36 -23 -98 -89 35 87 -220 110 170 -43 -220 145 23 -135 39 50 14 206 26
5381 26 1 100 -131 129 -9 40 130 3 -24 -52 62 319 -78 21 22 -44 -15 14 -33 -41 37 -178 109 -134 -232 97
5407 97 -26 68 18 -201 11 -74 -167 70 58 90 -85 -38 47 41 3 179 -152 -17 125 -101 -30 -140 -35 -20 -13
5432a3N5q1J13J09k35m5J82q1JM3jO1q2j00J42O6k12J07J23k0n4k75O5K83k81
5457a30K58r7O7j69j43J35M0O9K4r5m3K44j59j59K57m7L4j71J50k0Rjj46K17j17
5482Gk5j14P4q6p2L23r8P0j90lJ21l6J40j81l7K45l52L51j24k21J34m2J33k3L1
5507B5Q3r0r5QJ58m7J04r2j1r2k6O3K3j61K77k03o5L22j62k30K90k5p9%r0J21
5533Fj48J48l6j30K65K7j89%K15k30m3L97l85K82k41J89o6j25J01o7q2K39k31
5556a04N8J41j4j2j47K02j34NJ45r0j15J81K0l36K44O9j25j22R1K94l97J93q9
5579d2m6k1K92j75j71K67m4j35J05J34j80j47L15p1q0K36l85J57J6KQ2l03K43
5602D9M1l00L78k19j13L9J94j90J23J41j19j09J28K7j54N1K1J7r6P1J13l4l5K1
$$ plain form
5432 -13 42 -39 74 183 -52 -97 85 4 5 48 47 108 26 -74 68 134 -78 29 152 132 78 -197 -132 151 -130
5457 -130 128 31 98 -71 -214 -79 -39 30 54 -41 -84 160 1 -158 99 52 86 -85 65 45 54 53 -93 124 7
5482 7 -18 -132 -58 -144 -216 107 9 79 -111 -114 7 -29 111 -70 -107 138 -214 137 13 -208 -74 -116 17 -6 25
5507 25 108 18 -77 -69 89 42 146 54 43 -49 -75 -12 11 -150 127 -76 -141 181 19 -211 79 54 -25 -25 -115 6
5533 6 -142 6 -30 -160 105 132 -57 -57 158 -72 -115 282 -103 179 -62 127 61 -64 37 -30 -112 127 -104
5556 -104 -46 95 81 69 -78 124 -10 -5 140 50 -65 116 136 -200 44 113 -12 -134 -43 251 -146 47 -42
5579 -42 -88 -109 183 8 -163 104 60 -75 30 164 -16 -163 152 81 1 237 -148 9 25 27 109 -194 49
5602 49 90 -210 168 -51 -164 -125 69 -121 2 143 24 -85 43 70 -84 -33 -12 5 -91 -20 93 59 24 45
5626D5r4J05K4j34j0J51j89j11K96l9r2M8j4j37K8P4J45k50Q7K48J7m29L36r4
5650A1K2k2Kj04Q9N4j67M2K25j48k69M15k43K9J42r9j63J38R6l6j30K38lm39M33
5675A13j36r9L02j15j72J43K0J21l51Q5K17k75K4K94j48j79K95q8k47j0L38Nj00
5698C7K19l04m4J05J77k60L13j25K7q3k3L5k28J19J54k37M7K53k53q5J04n8J08
5721bM6N7j74q6K88p7j86K74L0k61kM8j5QJ67j01j54K37O6j88J07O2l44O6K36
5746A02r4j03J74l6j8N0oj13k44L10J33j88K09j35Rq0K2K3J07Q0k22k16J96J19
5770G9o6KK6p8n6J18j02L8nM9j9k78M35j39j06J92O8k48J20K6n5N7o2R7l27K81
5796D7oj53mJ52J3j39J42J09j84kJ88k62o9L00l25P8K76k17K8Q6j84K15Jk00L2
$$ plain form
5626 45 -49 56 80 -54 -64 87 -102 -213 83 44 -48 0 -14 -151 -123 -49 96 -154 -67 181 198 -231 105 11
5650 11 33 11 13 -91 -2 52 -115 -73 152 4 -265 150 -93 -64 78 -21 -184 -46 50 14 -116 122 119 -320 113
5675 113 -23 -122 180 65 -107 36 56 177 -174 -89 128 -147 -123 171 23 -156 139 51 -196 -206 132 137 37
5698 37 256 -48 -92 13 190 -70 243 118 145 62 39 74 -154 -35 119 -118 -71 182 -71 -156 -52 -110 -2
5721 -2 44 101 -73 -159 129 52 -134 140 170 -91 -93 -45 -60 -52 115 14 -140 97 163 -25 82 144 -200 -134 102
5746 102 8 -95 79 43 25 75 69 -44 -288 22 155 -33 176 41 50 -30 -8 15 122 202 -20 -236 -40 79
5770 79 13 15 41 -37 -93 25 -77 -39 -44 5 -14 -292 143 4 -102 90 158 -90 30 56 1 58 -4 93 -234 47
5796 47 41 -112 -116 36 49 -90 52 161 -23 -25 163 -99 -168 132 -193 -115 161 -56 -28 58 -126 89 90 -110 -78
5821g8O4K8j03J20l4J30k79K1O7J13JJ5J20l02J25L8lp8P0j09J44N3j94J77j13
5846gJ21k76R7J09J32j08N8m8j80Q0nN5n0n9k1Q0R1J96l63J59j5K0pp0j77K65
5872G7j47M5j55J33JL0Q7%k69J88J40k69J48o3k7N4l3p9J18j24K14m4O2k6K8r8
5898in2K16r5m5K2j24J59o6Q6j46jJ32j31R0o5j35L15n9m3m8k5Qj6j48K58o6j24
5925a12J28j02J4N5l0k3o2J65j33j9Q5O0k1M1q5J01j54K06j53r0Q3n1N7K03j58
5950EJ33j82J33l9m1K08k36J09j93K30K8j29k0o0K2J20j86J82j35l1J84Qj53J88
5974A45k82J36R8l7K5k12J58o9J19M5p8k74L51j95M1m2J07k3O5KP8j04l5L3r4
5999d2k2J30k35K2K34k32K16j19J60n8k6J8m5O5m4L6k77J61k2j05J35M0o2M6l
$$ plain form
5821 -78 -14 14 -89 31 -3 127 -152 -131 -64 49 50 65 185 -117 8 46 43 -35 35 -74 70 123 -71 106 -7
5846 -7 114 -162 -65 44 176 68 126 78 -102 -22 -27 28 -22 -81 -102 -22 69 265 -98 61 46 66 59 -11 -188 77
5872 77 -70 -25 -180 -47 -46 -16 71 71 -198 -10 130 -139 9 -54 -81 -27 -60 -139 -21 -145 69 25 87 61 89 -9
5898 -9 -61 155 60 15 37 -87 72 6 92 -54 -55 77 -54 36 -29 -164 151 92 49 1 -24 -16 -32 -180 78 12 -112
5925 -112 16 -86 -72 -17 -47 -70 -132 33 -100 -119 -34 26 5 46 -39 62 -92 114 -39 -129 -46 -97 -40 163 5
5950 5 138 -44 89 50 9 217 -19 90 -103 127 155 26 6 -54 -32 88 -98 84 -51 -82 102 110 -43 145
5974 145 -137 -1 97 60 85 -127 31 -38 81 126 48 -226 125 -70 -29 -71 36 13 78 80 158 54 19 52 -42
5999 -42 -64 66 -169 -147 87 -145 71 -48 112 54 28 46 1 66 22 58 -219 -58 -80 -185 -50 -10 -72 -26 -29
6024b9o9R4p0J24k13J70K7J12j27Q0k09R5m2R4j62n8K04j94K58p0Lj19J59m6J35
6049A47J6j88P7j06J93j20j45J70K2k03P2J17r4m2J56L3j2j17p3J62m3j48P7J57
6073A08k8j51Q8k5O2j73J10O3Rj92J88K3j13L7J06j54K4j4Q5j76M2rk9J98J05
6098A84l77J87J18j94n1K69M1k14N1J4j14j8J97k15mK14q8O7j24J17j78N2K27
6121A61j85k1J27N6k32Q8J13j70R3M0N3n8O0j24n6M8J51k20o3J96j15j9J47J0
6145H0j25p7J65q8k3K50q3j13J92j96l6Q4J70j74J7j2l9k87L16J98l36L2J59j84
6169a10K18O3k17l0K03j8k58K4L23m47K32J64j90l9J32J26j86M0m6m9q1L02o1
6192I5k13J82J6j33M5J18L8j99M8J96l06PL02j71j01J66o6k27K65M6j48p4K38
$$ plain form
6024 -29 -98 -4 -74 50 -163 7 34 146 19 99 -110 -15 -57 37 -125 -183 21 -173 85 15 18 -101 58 12 147
6049 147 163 -25 52 -54 139 19 -126 44 66 -137 -65 52 -42 -84 72 105 93 -24 -97 65 22 -126 -49 108
6073 108 80 -71 17 -8 54 -119 -9 54 63 -129 59 82 -31 6 112 -42 -18 -32 53 -123 -81 -90 -119 79 184
6098 184 -193 -6 112 -82 -133 136 177 -37 14 28 -86 -104 93 -122 -126 88 0 67 -57 60 -118 -66 161
6121 161 -24 -45 82 138 -94 -6 107 -63 30 70 123 65 125 1 -55 -7 144 -76 -139 57 -58 -77 70 80
6145 80 -45 -122 43 -45 -68 182 99 -14 178 -18 -54 30 200 26 43 31 -8 -295 21 219 -117 -85 74 -110
6169 -110 108 171 -46 -76 127 109 -149 -125 198 -249 -17 147 -43 -82 50 176 -10 30 -16 -65 -146 156 95
6192 95 -118 64 80 -53 -8 110 148 -51 -3 193 -113 -106 196 25 -76 90 24 -203 62 108 -40 -114 124
6215A24j2l24K68r8OM6J6k1p2J2N5p6K73j77j91J93R3k45J29q3r2J17P4j16q4
6240a85K03L8m9j33L01k71K2J91j77j65J79J93k13l8K6Oq2J20K12k65J31J49l69
6263a76J22J74k15J30j36K34k43oJ21m4q7K76l26J98J0r3j26J05R5k1J12o8l6
6286@j93K10N8j2p4j03M6K2J11l2j38J2K34j90r0K92j99p8L30j76Oj94J87J1j31
6311i1J47q7j19M08k12k45Q0M3J3J50pK6j51K15j41k70L52J06l95Q7J49j42J84
6334A00k76J62J13P7Jj22j15M1Ol6l1J09M7q9l5jM4R4L6k69J06N8Q0J01j94K1
6360B8P1J17j71j03q1K33l2j43J86j27j8J29n3p9K8Q3n7m1N2j24Q8r2J57k19K01
6385C3O7l6q2r2P1J13j05L0M5k42K71n6Q3J9k02P8p5l6J86k21J78p1rK1nq9K20
$$ plain form
6215 124 112 -212 56 -42 -36 10 26 5 -67 -55 0 -76 197 20 -171 22 115 -130 -1 -84 -176 -59 15 -101 -185
6240 -185 18 56 7 -126 175 -96 -74 117 -60 -225 -46 147 -66 -104 -78 -72 -154 -34 178 -87 44 193 -176
6263 -176 -54 120 -95 35 -101 133 -110 -116 5 -39 -126 150 -176 22 32 -61 -187 -82 13 -8 104 36 0
6286 0 -193 17 75 63 -11 -114 -68 -46 65 33 -105 -93 141 -49 -139 153 -46 -124 206 30 36 -158 29 40 -91
6311 -91 56 -31 -150 258 46 -199 -119 -76 -63 87 80 106 -45 170 29 -241 111 217 -178 -91 58 -84 100
6334 100 -176 -14 99 176 177 55 -60 -19 -13 -49 -80 29 76 -13 -48 -49 -5 89 125 -144 -38 20 100 201 7 28
6360 28 99 216 45 -58 -139 94 62 -81 105 -22 -40 89 36 -43 -15 68 11 -30 22 -102 -14 -106 51 -168 33
6385 33 100 64 -18 -110 -39 74 -31 -1 44 -198 73 17 100 119 -83 -5 -80 -116 70 -151 27 -44 -53 -32 -37 -126 94
6412I4j64O6N6k10K24j17n1K77m6k77L9j6rK24j99J33O7p3L7j52K63k44n4J04
6436b8p6Q3P7j42M5J75k49j02J38nJ27k36L1J69M5j30L3j5L8rK24k34K5K0m7K9
6462a4P5p7k0N2o1jK04k63J77j27K7J01j6RO3k39K42j51J01N5j05K6K2qO5j65
6488b8J99j18m5J58N2k67P5N7k21J92j35J21M4k50J90q4K77l6k45J66r9l0l7K61
6512A97k03n5J39n7j06j26J05J62k54L01p5k16J37RK9j19J93j5p6l9J07k04J30
6535c6O6j16K31r6n5j78J32J83j43LJ30l2l26K17J67j72L1P5r9k0n2J61k33K62
6559A00nl50M09j32m8K68k22k38J24O5J37j09kJ93k46O6K48l30J2K11k14J54j99
6582a08J96j38M7J17n0j99K42o5k73K58M2p9j01O8K06m76L65or2QJ69k18RK26
$$ plain form
6412 94 -70 -4 52 -158 66 -51 -102 175 129 -148 -109 -125 -134 90 -109 24 91 18 55 -97 166 -78 -132 -28
6436 -28 -104 -21 56 -86 -41 134 -115 -217 -79 -84 43 -193 -162 7 52 -78 -45 -60 -22 -31 193 -41 -16 4 -43 -14
6462 -14 61 -16 -36 16 -45 -46 158 -105 72 -55 -28 73 57 66 129 -110 132 -19 82 137 32 58 80 72 137 -28
6488 -28 171 53 8 166 218 -49 26 83 -138 54 -81 40 84 -166 24 -60 217 181 -64 102 3 -27 -64 197
6512 197 -6 -61 78 21 -85 -211 -106 56 -198 103 28 -188 -51 -42 -13 -132 61 46 -30 -69 38 -166 -36
6535 -36 30 -86 145 49 -6 -184 -52 131 -12 -9 121 89 -237 -20 147 -25 6 81 -18 -38 -90 71 -162 100
6559 100 95 -255 154 22 -26 242 20 -218 -94 -29 108 -1 -3 190 -56 10 258 -72 -60 151 -63 91 -108
6582 -108 88 -50 -3 114 64 -135 107 42 -231 27 69 -10 -111 -43 163 -313 52 46 -46 -38 131 -87 -78 148
6606A48k31J47j85J78j56l2K01j95m0K34k18j5K57m5r0N5n8K25l60K80J1l11J18
6629h2J72r1O8K49l03l9K7k1J98k94L39k06p1J84j53m9K13k08J70k07K31j13k26
6652b12K81k07R2K33J3k27K14m0j35J85j62R4k31k5K71j86n3K40k80L5L19l95
6674a76K03K9L2k66L6M3J32j78L59k57k98K78R0o3J36o0Q9l00Q9J78k83K83J10
6697B06l87J84J20j76o9K16k9j30J2J66k09j29N06l98O1J19Nj71Q4J40j07n7R1
6720D8j18j62K50n6k5J25p0L0K4o1K7r3J33o5j96J68K24j36j20J82l11R9L29r8
6744A28j96j31J98j06K8N8j5J08q9q4K3J62J06k58L4N0J07l32L04Q8l04K02O3
6767A44j42m7%K6j32Q5J3j13K29K34l63p6K12o6k08J00J0l0R4N1k7j25M8N2K5
$$ plain form
6606 148 -83 64 -121 57 -99 -131 70 -125 -165 69 -149 -164 93 48 -42 13 -45 180 -180 100 111 -200 -82
6629 -82 90 -1 67 316 13 -26 1 -20 178 -116 223 17 -54 130 -23 -72 141 -67 103 -104 127 14 -212
6652 -212 69 -138 -46 187 200 -27 187 147 12 197 35 129 -102 -127 144 -42 -95 145 -135 -100 219 -176
6674 -176 27 56 88 -178 -142 -99 33 -145 214 -43 -341 -63 27 -36 100 40 129 -171 -82 96 -187 96 206
6697 206 -181 3 123 -53 -122 94 65 -65 -53 113 -96 -225 281 -117 -56 63 68 -103 -19 121 14 -43 48
6720 48 -70 -232 18 -38 -63 62 -8 22 46 -15 12 -81 52 -13 -209 -41 183 47 -73 109 -202 -103 226 128
6744 128 -68 -199 -1 -107 -79 -21 -36 72 -17 -101 -78 84 190 -68 -34 16 123 -209 95 183 -121 81 144
6767 144 2 -45 -45 -19 -151 -66 -53 -166 63 297 -66 -142 70 4 -204 -104 -94 -124 -30 21 -6 -131 -83 -31 -6
6792fJ24l2k64J10J28j75J24j11K50l29K32Rj7M5J43l88R2K85k20n1j1K28l12
6815a46RK92j75M1Q2N8k20R7N4j15j59J96k7k52K45J06n3J56q3l78L43j16J7J11
6839H3kN9k27R2M4L1q7M6k91K23J12j71R4R5l6M3j87J49O5l57K38Q6j36L0J76
6864A72k55K6P3q2J23j78K28l01J33J26p5m4J49j08pkj32K76j04N0j06l5M7n4
6888h0J18P2k90M2J44m7N9R7j57J18j57j2R1L2r1J45j28K53j35o3o3j9k4L8k5
6913h2J58j71J15NM9M2M0k22J10l6N5J24k57Q9j56N4j15K70j79L12l01l3K15j31
6937d5O8m6o0K29j86R3j5j40K97k39r5J85j14J5J9p5J26j20l1L62j87j80K09O6
6961A36k82K31q3J17k17M7Pj29L16j15n3O8J00l23KNK41p6J6j09J34l2l2K53l16
$$ plain form
6792 -6 118 86 -178 -68 60 -115 9 -102 148 -181 51 60 43 88 231 -157 -65 220 0 -51 -62 166 -146
6815 -146 -137 155 -20 21 103 161 -59 38 92 -23 -182 14 -13 -265 -20 86 33 189 106 -272 71 -45 -28 83
6839 83 81 140 -87 5 49 80 -7 39 -252 -29 83 -88 6 101 65 108 -79 70 135 -222 16 102 -34 -4 172
6864 172 -83 -57 16 -66 57 -121 107 -194 -61 65 -10 -54 95 -13 -20 -22 -154 122 18 68 -38 -73 -26 -80
6888 -80 38 110 -180 -138 6 -41 18 115 -42 76 -81 -93 -2 30 -61 84 -44 209 74 11 -52 -71 -95 -57 -82
6913 -82 76 -95 20 25 74 116 156 -66 44 8 63 187 -70 19 -137 -83 -198 72 -107 205 -96 -129 86 -45
6937 -45 23 -23 -83 146 -40 53 38 -102 195 -44 -139 46 -68 -53 -34 -109 17 -103 -134 228 41 -139 70 136
6961 136 -146 85 2 119 -98 -51 -44 -173 143 28 -25 43 143 -180 -178 -173 68 -8 8 -101 33 1 -31 222 -94
6986i4J70j47R6O2o7Q0j72J38O6j73r1K5kP9M0j7N3j36K02r8j20J14LJ45J16l22
7012e0P7P3j01N1Q8k41J10J9J55j99p2R5k0oj6m4J32l6k3j81L8O0J89j15p7P4
7038b0p1J25M6j49O8n3J4r7L4J27J4j65K65j45M6pJ1j65J77p8J65j25Mj13l9K99
7064A68k25RK37Lp1p9j76R8j18J77J30j89K3jL1j86K37j1m1j08j9N8k8R8Rk06
7090a80J62J38k55L33k55N7K6L9o6j54J97P2l78J67J26j07N8J97j57L0J19N7k75
7113d9j62K40j5j86L53j94j57K24k41j6K35Q8O3k05o5J97l18L17j6l18J22m6J10
7136c9J2J22j49P7j52K47j64J72M4k31j73K62L5j57R5L0l0q7J40m6j06J23L8j53
7160i0R2l0j25J39K00k91J24o4J65k40J1K92k58k0J66j77L7K97j97j01j40K26
$$ plain form
6986 -94 76 -71 25 87 20 100 -72 66 132 -41 -132 -107 -109 -30 10 -7 46 -90 112 14 -106 8 11 156 272 -50
7012 -50 27 100 -1 50 138 -103 7 26 181 -18 -90 5 -15 -21 -37 -81 51 15 -8 -189 -151 -91 98 -17 -94 -20
7038 -20 -91 34 80 -69 -1 -54 -40 -137 -103 24 38 -127 138 -7 39 32 43 -122 55 -23 142 17 21 -92 -131 168
7064 168 -57 -48 189 192 121 42 -134 -36 -154 23 153 -36 -13 -14 17 -169 68 57 16 -92 -111 -53 -81 17 26 -180
7090 -180 -18 120 -135 198 -57 0 26 65 -1 -155 42 114 -264 -97 29 -78 -20 177 20 50 169 226 -49
7113 -49 -211 29 14 -172 181 -13 -170 54 -187 -203 32 120 183 -22 -87 110 -208 109 93 -225 -103 -149 -39
7136 -39 -27 95 -54 23 -129 118 -46 126 170 -61 -234 28 63 -94 1 31 1 -86 54 8 -98 25 63 -90
7160 -90 2 -28 -153 -14 186 -105 19 -45 120 -120 -109 183 -75 -95 71 -106 -69 228 31 -70 -210 16
7182A6j21j26K69N0m4J63k02k38J42L4N8L3j63J31p3J32J15l43K89Q1l44K7J43
7205B9j41K0J7J40j5k3oj30K1P0r6lJ04k9j22J35J31k80P2K40pl97K42j12j5J59
7231Do3m8j55K83O6k45J62J42j14j04J53m3j75K71l12J39J17j26j2J69Q1k44k01
7254b55L01jj35J60p2pQ3j6j79l8J42j4N4L4J25l88P8k5Q5K62k98J68L8j67K77
7279B12l30O3J90k89O1J63M5j77K44k38J78k29K22m2l22K64R4k97J71N0j88K07
7301E2p7L2m9p7J39j06O0Q7j34j49K70j87K12j69K57j97j3RJ1n8K64n1j35N4m
7326D1n6P4j16O7N4j35J66k91K03k5JKR6j19J16N6M4j41O3n1P6q5L8j65J09Q9
7352A11j68J3pN3nj14J35m2%RJ26j89N1J09j79K29k94K72q6p6K8j10J3J97j27
$$ plain form
7182 16 -105 -231 38 88 44 207 5 -233 -91 -57 1 34 -129 2 -71 61 176 -167 122 203 -141 -114 29
7205 29 -112 -92 -75 65 50 27 21 -109 -88 -18 -114 -117 -13 -42 -164 -29 102 -178 -106 134 127 -270 -28 -140 -155 4
7231 4 -59 -107 -262 21 87 -158 4 146 32 -72 81 38 -137 134 -178 -39 78 -48 -60 109 190 -54 -255
7254 -255 46 45 -90 70 -2 -9 74 58 -121 -159 -17 -31 23 57 182 -206 -128 -153 -68 194 -104 64 102 -65 212
7279 212 -118 -55 135 -154 -93 70 115 -62 182 -56 122 -107 115 73 -249 15 109 -188 -17 33 -155 52
7301 52 -25 7 -42 -119 20 -86 -26 61 -73 -222 48 -139 73 -96 161 -36 -49 -40 -29 -87 177 126 -9 45 41
7326 41 -15 59 -57 10 64 -71 95 -196 7 -18 -17 -15 81 -38 78 134 178 37 100 49 125 40 78 -87 22 111
7352 111 -57 -44 -51 2 -3 -117 18 -24 -24 -15 111 -78 -27 82 -97 132 -162 110 24 -52 -24 -134 -121 76 -51
7377e1K2K45m40L51j43O2J3P3j62J33j72J82O5k96J92m6M2P1p0j6p3k2K88l23
7401g5j08J75j53K2J78k36J98P5l5J68k04j30K42j47J21j5j24Q7j65Q9J12k40
7423a65K20N5l5Lj40Q1O3j49J42q9l17L73Jm4M8k9p4mp4J13NQJ35k36M9Kq2K63
7451A23k81J49m3J6%Q2n5M5Nk24M07k80J82l0p9L6q1n6J19j45k0J68j92J10K0
7476b4r5J20j0P5O0j72P8j16qK81j72J9Q4r2j15jK6O5J76k06P9j57Q0Nr2P5O1
7503B4p4N0M9j89J73n5R6r4J5J36j14j00L39j44P4j38k62K91r3J23p3j45K44j24
7527Ij34L20j38J6r7j6L9L4l8O8l4p7L8j37K79p1n0P9p7M1j43N5K8P6p8k6J8n5
7555g1K3l2J46J4k74J92r1qJ81j02J05p8j49J96j38k9K16n4k6J46l89K28q2K6
$$ plain form
7377 -51 -29 216 -224 127 -16 46 59 132 -30 103 -69 113 178 -118 74 28 70 141 71 55 -18 -40 248 -75
7401 -75 -183 -8 -161 -139 39 -197 1 76 41 209 5 -125 117 -30 91 76 -48 39 -126 -37 75 -165
7423 -165 55 110 75 78 -62 19 82 -67 75 -14 -331 42 43 -1 47 18 -56 -60 -134 -21 -16 -8 127 -109 -60 -58 -140 123
7451 123 -158 -9 -52 -36 -36 46 -9 36 41 -183 224 -56 126 96 17 53 -28 -84 35 -110 -130 38 -154 -44 -24
7476 -24 -119 1 -9 66 126 -46 32 -84 -92 189 17 36 120 28 -87 -88 -62 3 179 -27 52 -105 -25 -20 -112 -37 24
7503 24 -50 0 49 -140 33 -22 74 -20 -5 131 17 -83 256 112 186 48 -214 77 -16 107 34 -111 133 9
7527 9 -125 195 57 73 -24 -40 -1 33 -5 63 29 -48 -10 -147 132 61 11 90 13 54 -89 -34 -6 70 -8 -34 -16 -71
7555 -71 -48 -80 66 80 -194 -2 -93 -101 80 -22 83 5 -144 52 -86 -115 101 47 21 167 -222 6 -76 -50
7579e0O3q5j62K94Rk12J62j11kr9K01J19k86J62K01l37J17J03j11N1r1J50j14
7602b8k5K27J08k55J48l59K02O3k29K98j08o2j04J93j20n8j0M3J63k45K88k19
7624h9L0J33n1M0j80K1J03j0O2l6p5Q1M7k41J60L81n50n4J17J75j11K05j29l8
7648iq6O9j10R7mo0K1L6q7J41r1PK12j40J59K9l94L70k13m2J44q7O4n3o7J45l7
7675A4j60J97p6K5M8k71K04k2j9P6J6Qj5j49K61j72j09K22j95J00J8N1Q9j71M4
7700A4J14p6K5N5k38J65J21j42j14Q8K1MmP9o8j45J40p8m2K19j56j2%J57j99M2
7726c0q6RR2L6m8j56J71Q8j37J50j56P7k5k53K96r7R6J44l53J22K47k27p2J75
7750F3j31J09k4N6l1M4L0j44p1K13j91Q4N0n7J33l4k49J32O4j20J63j15J14r5
$$ plain form
7579 -50 13 -72 -234 60 69 -143 19 -92 -94 -193 8 127 -159 3 204 -133 -16 87 -24 27 -64 86 -28
7602 -28 -53 174 282 27 175 -184 18 81 -148 150 42 -20 -124 69 -51 -109 -119 -76 87 -158 130 -89
7624 -89 -59 74 23 63 -117 -96 7 -3 59 23 -52 29 76 -165 -5 376 -174 -228 -111 64 -47 158 29 -9
7648 -9 -95 -26 -136 -39 -43 -103 -82 -46 -133 8 -83 -76 136 -4 155 184 -210 160 -53 -95 49 -38 26 -27 -94 51 14
7675 14 -146 51 -25 0 48 -223 -19 -41 -60 16 32 40 25 -124 137 -35 -144 78 -117 -17 1 52 141 -30 14
7700 14 128 52 77 132 -106 59 180 38 -76 12 33 37 33 112 44 -101 39 -39 -81 138 -18 -30 -30 127 -72 -30
7726 -30 -116 -107 -15 21 -27 -183 -12 76 -61 89 -67 10 -15 -268 28 -69 27 171 -182 -60 187 -40 -112 63
7750 63 -68 41 17 73 42 86 116 -28 -99 114 -77 7 57 0 133 99 -150 -18 46 -74 89 -26 88 -7
7774gp6L6J05m1J38k75K02K2j4L7j39n1J66j21j0k3K6J05m8qN3l2o1O4j27l2J52
7801D1j87K41R7j48J19j47L5j80K1L2Pn1K02q3r3J99j56K9J04n5J05k73J21l2
7825e2k08M15n9p4P2j6k7K2r7O8p7PL9nJ48j89O1o3P7o9K3P0j00NJ2r2J68m7l6
7854b4n8J04J50k24M3N6j27J37o2j36K35j11K1J0j65J48Q3n5J7o6J91j40j79L00
7878A48j14o2J60j25j67O5P2J27p1j01P6J93l34J90j38JL7q3J68o7k60K81Ro3
7902e8J35q2M0n3j26L14r8k39J94p7O0m1L3J51k48J02p8j3J67k4k51K69k36o0
7926b19K45r5J32k7j09K94l13J07L8j94J20lo3K71j99k9J85j93N2k8j77K52q5
7949c8lK07j58n0L8j11J00n7J21k0q8L6J87k30J94n9j23J61o2O3M4l90K99l00
$$ plain form
7774 -7 -83 -47 58 17 155 -120 82 104 90 127 -12 -63 103 -18 -28 -51 -25 80 32 24 77 45 -16 48 -79 -111 41
7801 41 -146 95 192 44 163 16 51 -129 -108 -76 -69 -120 82 -1 -94 105 -51 -22 82 27 132 -141 -20 -52
7825 -52 -260 155 96 22 94 78 51 73 -24 44 -33 -26 13 8 156 -33 28 -35 42 -27 -4 66 -34 -29 -17 -109 59 12 -24
7854 -24 -82 22 172 -52 -9 47 -80 57 -5 -141 94 -17 4 14 -151 -3 80 25 42 -24 167 27 -152 148
7878 148 34 -28 132 7 -160 -95 -23 104 33 -68 8 201 -133 57 -81 -80 -43 -126 42 -25 -285 -4 5 -58
7902 -58 77 -5 35 -18 -144 170 72 -167 27 -50 10 -31 2 153 -95 7 -71 -84 83 59 -192 77 -159 -219
7926 -219 26 -69 63 36 -73 221 -92 15 53 -141 -21 -24 -87 184 -15 -44 141 -52 0 -28 -205 47 -38
7949 -38 -41 166 8 -42 -4 -115 -15 -72 49 29 -59 -23 164 -66 128 69 -54 107 45 108 152 -238 61 -239
7973b39J69K83j72j09J59p3n4O3j58J95j28JJ74k24J79m2m2j12J64o3J17q5k6
7996b3M0o4J35r5N3j3r0j8K64j93M6j51O8k6j5J17R0l17L32n4l75L95k51J63L8
8021E6o2L0m2jn6N6j12K33k51K19kk00J82j28K23j32l1J02k01J1J52p1m8K13j60
8046b0Q6p8q6J48j86J08M4j26K85r9j02N1K1o3J33l0l8J31j75J17j63J59J8p2
8070F3k06K21k38J60n8j15K69j68L3o3k0P0r9P0J14r2R7N8j06J9j12M5K31j38
8094C5j40J55j0l8j03O1J08r9J56N9l18J11L3l5l3N6j4J91k69Q7J41l28J49J30
8118H5j26JPM7O8n0n1j7Q0J43q6j60J89m16L82k02M6K94m25J53K03j32j4J49j97
8143b9J10l2j55K87k93K27n2j10R8j38J07p2lP7N1j36J4R6m6M1q1k0J42j94K64
$$ plain form
7973 -239 -70 213 41 -68 91 18 -36 27 -131 64 -64 -63 111 -113 66 24 -18 -130 34 -29 88 3 -23
7996 -23 17 -47 88 -7 46 33 -57 -75 189 -4 42 -109 -41 -67 -82 35 125 -192 140 86 -289 106 -145 18 56
8021 56 -6 24 -18 -19 -75 -19 -131 102 -149 70 68 -132 50 -78 145 13 -18 84 -117 -106 46 -25 -73 140 -20
8046 -20 66 -12 -98 50 -136 -28 16 -110 175 76 -26 25 46 -17 116 86 48 179 4 121 -42 117 135 63
8070 63 -143 78 -160 0 -58 -173 96 -72 -39 -102 -122 -52 -151 -81 33 -59 38 96 -10 9 -103 -58 173 35
8094 35 -105 50 40 2 -101 -40 68 -31 125 184 -134 -23 10 -25 -58 -2 -16 175 -94 -7 134 -194 -45 85
8118 85 -41 -40 -33 14 82 32 -19 -36 44 187 101 -59 130 -286 96 -106 -60 234 -191 -38 165 33 19 168 -29
8143 -29 81 49 -106 181 -112 115 63 -47 51 -87 20 -52 -55 22 73 -63 -49 47 1 42 -39 -59 83 -111 153
8168A53j13j52K6M8J4J1q4M5J17j47J09J7r1K23j86J25o0k3N4r3OL9j0
$$ plain form
8168 153 40 -112 -86 -38 -24 -13 -97 -52 65 -82 27 44 -47 176 -10 115 55 32 86 -7 -1 38 28
8191B8
$$ Imaginary data points
##PAGE= N=2
##DATA TABLE= (X++(I..I)), XYDATA
0@%%%%%%%%%%Qj6J6j6K4l2M0m8N6p2Q8j04J20j42J67j94K26k63L03l46L97m55
32b43N19n89O65p49Q42r45J058j181J316j465J627j804J997k205K433k685K961
49A552l261L591l956M361m810N311n875O513p240Q081r068J0243j1669J3441j5714
64h500J8754k3045K9602m0991O6299k22396M0016K50166k50439J22646P4020k08974
76a52842o9183K61705M1723j52725J36524J11680l13955K4825K31769j29689R98
87i170J99942j47514k15350Q3386J53262q7998l179J64702j77411j68681K50860
98D2849N810j47524J76773O8308j79041j5474J29093l6681p0305K01919K1916
109A97643k73751P6693J33561j61943O7519J38601j59978r7925J13932K5445j29755
$$ plain form
0 0 0 0 0 0 0 0 0 0 0 0 8 -8 8 -8 16 -16 24 -24 32 -40 48 -56 64 -78 89 -105 121 -142 161 -185 212 -243
32 -243 276 -313 352 -397 445 -500 558 -623 693 -772 855 -949 1048 -1157 1276 -1409 1552
49 1552 -1709 1882 -2074 2287 -2523 2788 -3087 3426 -3814 4267 -4801 5442 -6227 7214 -8500
64 -8500 10254 -12791 16811 -24180 42119 -180277 -140261 109905 -140534 -17888 56132 -152842
76 -152842 -222025 39680 81403 -71322 65202 176882 -137073 -112248 119521 -10168 -9170
87 -9170 190772 43258 -172092 -88706 64556 -23442 -26621 138081 -39330 -208011 42849
98 42849 48659 -98865 77908 146216 -32825 -48299 80794 44113 -26192 175727 197643
109 197643 -76108 585 134146 -27797 39722 178323 18345 -79580 34352 59797 -69958
120f9958N0751J41338j53890m9750J67052j18841p4952J95785l849j31267K8176
131a9405O4605o1090k9238J38463m5809j60236J38786M3003j64339P1306P0603
142D6649j05920K652Q2293l8216j00440P9920R3246j33157J1404J16503j18136
153f3202j828J34255p3427o9838P6335M1477o2553j7280Q0332o1400n8233J39082
165F3720l3739j17872R6252K3622p4524L0077L7051l4456l2672P5303K0979j17474
177f3733N3122Q4012r4944K6891O0595q5821n459O9375R60n8173j185O3174n4386
190e572k6202Q9105o5247m5722J01952k4797n9243L0906J5914j0176q029L8568
202C1457j5077o9543P3014L2820q3951L8208K2344n1840K7633J9067k5393k4483
$$ plain form
120 -69958 -19207 122131 -31759 -81509 85543 -33298 -108250 87535 83686 -47581 -19405
131 -19405 45200 -15890 -45128 93335 47526 -112710 26076 69079 -95260 -23954 46649
142 46649 -59271 -56619 25674 -12542 -112982 -33062 60184 -72973 -61569 54934 -63202
153 -63202 -65030 69225 -4202 -74040 2295 43772 -18781 -36061 44271 -17129 -75362 63720
165 63720 29981 -87891 8361 31983 -42541 -12464 24587 -9869 -42541 32762 53741 -63733
177 -63733 -10611 73401 -21543 5348 65943 -19878 -25337 44038 44998 -13175 -14360 48814 -5572
190 -5572 -31774 57331 -7916 -53638 48314 23517 -35726 -4820 11094 918 -7111 31457
202 31457 16380 -53163 19851 52671 -31280 6928 29272 -22568 5065 24132 -1261 -25744
214b5744J9119M3770n3572j5512N5167n0332M547O1793n4200k0643L6805N426
226F624m543j5866J9763m505k7550N7643j3947n9396N4886O830l0204K2218j3546
239a593q052N988J0941J5744m8182O282M4655m0119J1719J9802m4995K2370K1662
252A6222j4559l372j6611K5562N935k4192K9129k3450j8744N2615j9332k0086
264a0883J5713j4178J6866J549j2495Q516k5198K1851K4042m3028J2674P899j8456
277a5128L0834j1506j7597J2479p978K3448o001k7229K5698j0578J307K5759l5395
290a1887J720J8730j1246J7734j7679j2123K4032j3878J3462J167l3391K7126
302C767M304j1763J6297k6230N035K2022j6919J2635j3685j3314L3418j3597l309
$$ plain form
214 -25744 -6625 37145 -16427 -31939 23228 -27104 -22557 39236 -14964 -35607 1198 6624
226 6624 2081 -13785 5978 1473 -26077 31566 17619 -41777 13109 19939 -10265 11953 -1593
239 -1593 -9645 -3657 7284 23028 -25154 -18872 25783 -14336 -2617 17185 -27810 -5440 16222
252 16222 1663 -1709 -18320 7242 13177 -11015 18114 -5336 -24080 28535 9203 -10883
264 -10883 4830 -9348 7518 9067 -3428 5088 -20110 1741 25783 -17245 -4571 3328 -15128
277 -15128 15706 4200 -13397 -918 -8896 14552 8551 -18678 7020 -3558 -2251 23508 -11887
290 -11887 -10167 8563 -2683 15051 -2628 -14751 9281 -4597 8865 10032 -23359 3767
302 3767 8071 -3692 12605 -13625 -8590 13432 -3487 9148 -4537 -17851 15567 1970 -1339
315a339P698k5562K4478P770k0453J3130j7396O261K4470k4553O129j597j2504
328a3468L1592j3517j3848J4311j6724J8865O977k7011J3476o817K619K1353k9169
341a1361K681J1098j3908K4316j1193j9339K1349p753R913M528k6175J8675L29
354C160m793K0693k8970n59K4381j6084R189o151j6677K1050o985L562K484k8728
368b4428K4939Q042k1700J9555j4412o140K6759j0804j65n446n356K8292j5589
381C547n231J6538k8485J6868K1343l0064L963K225j949J1287j4878P091m763
394b508j3895L6799j5137k7569L1781p557m772J8669j4976l332O0J3206J2177
407B2946l4783J2456J9470l2801K2470R100l8343J5737J5013q415q717o507J8744
$$ plain form
315 -1339 6359 -19203 5275 13045 -7408 5722 -11674 -5413 19057 -5496 633 -964 -13468
328 -13468 18124 4607 -9241 5070 -11654 7211 14188 -12823 653 -6164 -3545 17808 -11361
341 -11361 -8680 2418 -11490 12826 1633 -17706 3643 -4110 5803 10331 -15844 2831 3160
354 3160 -1633 19060 -9910 -10469 13912 -2172 7017 866 -15811 5239 -1746 1816 4300 -24428
368 -24428 511 8553 -13147 6408 -8004 -14144 12615 1811 1646 -3800 -9156 19136 3547
381 3547 -1684 14854 -13631 3237 24580 -5484 -1521 704 -1245 10042 -4836 2255 -2508
394 -2508 -16403 20396 5259 -22310 9471 1914 -2858 15811 835 -2497 -2437 10769 22946
407 22946 -11837 619 20089 -12712 9758 18858 -19485 -3748 11265 2850 -5867 -12374 6370
420F370j3615m680L3644l6189j1769M8862k1348j6453J8870p668k416L952J4724
433A2284j2871l3725M0581Q171m4608L2861L960l8270K7132J2322k2395o201K1294
446E35J7364l6524N404L2680m2857J6954N1094m9272j7213L4233p187j1261J2685
459F635J7702k9836j8957M9553k5227l9009O4113j767m5878K8467J014k9972J5919
472g243M4538o273n1302K6497K1910n2000M0800M2356o3658K688L5883l4788k0129
485b0721L4552K3068l9472o848L3907n8587j2239Q6768k4131m4508L6771j5425
497f865l5236L1177M2449k4203l1724M7074j3317o4420O1858L1511n7182L0269
509A1391J8406o4950r858N5523J3026m2449J6190J9589p4587J5658P7780n0830
$$ plain form
420 6370 -7245 -11925 21719 -14470 -26239 22623 1275 -15178 3692 -3976 -6392 -2440 12284
433 12284 -587 -34312 6269 14440 -30168 2693 6653 -31617 -4485 7837 -14558 -20759 535
446 535 17899 -18625 -13221 19459 -23398 -6444 44650 -4622 -21835 12398 5211 -6050 6635
459 6635 24337 -5499 -24456 25097 -130 -39139 24974 23207 -22671 5796 6810 -23162 -7243
472 -7243 37295 31022 -20280 6217 28127 -23873 16927 59283 -4375 -1687 34196 -592 -20721
485 -20721 13831 36899 -2573 -9421 24486 -34101 -46340 40428 16297 -28211 8560 -6865
497 -6865 -42101 -10924 31525 7322 -24402 22672 9355 -55065 6793 38304 -18878 11391
509 11391 29797 -35153 -45011 10512 23538 -18911 -2721 16868 -57719 -42061 35719 -15111
521a5111j6081N9493l3343m4423L6797L0658k8608M131N4289n1312n5139P9506
533B0857O462m9239N4128L116o8418J2918M8330j8008l0776M7967Q166p6548L2332
546h713M5467o5033K3868O1743n6028l5130M2135J0107l2836K4739M2037o6615
558a4259k1999P8826l5587m0184P0855r900n5412K9059K3419m1213p859O4081
570C9827j6056o8258N1343J5390o7082M8911L9618o8906m606M8134j7569l6684
582c5938L7823K7346o2324J2786N7301o5919j2684P7301k8155l9073L8743M155
594A1362m0196J4966N3054l8093m1068O5470j0631n7595N7475J3090n7269K4965
606d470L2740l7979k3534M7062J1832n3838L0206L1150o8979J9745O1116m8724
$$ plain form
521 -15111 -31192 28301 -5042 -49465 -12668 17990 -10618 -6487 47802 -3510 -58649 20857
533 20857 27319 -21920 32208 35324 -33094 -20176 28154 10146 -20630 27337 35503 -41045 -8713
546 -8713 36754 -28279 -4411 57332 1304 -33826 8309 18416 -14420 10319 52356 -14259
558 -14259 -36258 42568 6981 -33203 37652 27752 -27660 1399 24818 -16395 -24254 39827
570 39827 23771 -44487 6856 22246 -44836 4075 43693 -25213 -29819 18315 746 -35938
582 -35938 1885 29231 -33093 -20307 36994 -28925 -41609 35692 7537 -31536 7207 11362
594 11362 -28834 -13868 39186 1093 -39975 25495 14864 -42731 14744 27834 -29435 -4470
606 -4470 28270 -9709 -33243 13819 25651 -28187 2019 33169 -35810 -16065 45051 -3673
618c673j7145M4106r644l3280K2731L1544m4270p940O2317m0227m1914O3010q295
631A7320m1195L7727R191m3323j249M5032j1807m3265M3579J0330n9473L7811
643F78L0201n6286J2250M0856k5689k4746K5548J4073l7285J4513M1452n4002
655a8437j1456N7892k9017k4261L8542o462k7808J4399K5441k6526k1682M9076
667A9701o779m3683M2094L706m3395L1796K0006l1839o304K5635J898l0954K0048
680A930K1725m6060J5830L8960m4745n385L4546j4232j2456J5221P816k4357k376
693a3583L8663k3351k5289M2921j1779k6163L1035l608k2453J0921J7021q007
705F328k3042J9996R799l1574K3762J4091l9242J4653K0797j9965k221Q765K905
$$ plain form
618 -3673 -20818 23288 13644 -19636 3095 34639 -9631 -17571 44746 4519 -37395 25615 17320
631 17320 -23875 13852 23043 -20280 -21529 23503 11696 -31569 12010 22340 -37133 678
643 678 30879 -25407 -13157 27699 2010 -22736 2812 16885 -20400 -5887 35565 -18437
655 -18437 -29893 27999 -1018 -25279 13263 6801 -21007 -6608 18833 -7693 -29375 19701
667 19701 12922 -30761 11333 15039 -28356 3440 23446 -8393 -14697 10938 12836 -18118 1930
680 1930 23655 -22405 -6575 32385 -12360 -17745 16801 2569 -9887 5334 13150 -11207 -13583
693 -13583 25080 1729 -23560 19361 7582 -18581 12454 8846 -13607 -2686 14335 6328
705 6328 -16714 3282 13081 -18493 5269 19360 -19882 -5229 15568 -4397 -6618 2147 5052
718E052j1714K244J9852k5874n273L5311k0353j1855K2226j2677m468J2024J560
731F055o952j0927J8912K647k3301K0612P30k2067K2685J320j7420O419L247L904
745E864p351j941J2086j7312M928J9991k4498Q08J5505j1863M781J508m952K187
759b59m887J2945l591j6691J8933l242j0819J6073j0353n300J0894m133L526p268
773d172k441J2830j1533M293P307j8572J0906P118j1139O853n345O46P985q859
787d123P162l759q308J7868p822o343J0431j0685O287N771j0470O468n521J041
801b003J1222j3613L887M475j0010J3391l898q839J0026o799M840M403j2945Q893
815C030j592l996J1855j2350p25R046q872Q288k766r139J1743n653J186N826j3654
$$ plain form
718 5052 -6662 -4418 15434 -10440 -15713 19598 -755 -12610 9616 -3061 -7529 4495 6055
731 6055 -897 -11824 7088 9735 -13566 7046 7776 -14291 8394 9714 -7706 -1287 1960 5864
745 5864 -1487 -3428 8658 -8654 -3726 16265 -8233 -7425 8080 -3783 998 2506 -2446 -259
759 -259 -5146 7799 4208 -12483 6450 3208 -7611 8462 -1891 -7191 3703 -430 3096 -4172
773 -4172 -6613 6217 -5316 -1023 6284 -12288 -1382 5736 -5403 1450 -3895 -3249 4736 -4123
787 -4123 3039 -720 -9028 8840 1018 -5325 5106 -5579 708 6479 -3991 2477 -3044 -2003
801 -2003 9219 -4394 -507 3968 -6042 7349 3451 -5388 4638 -2161 2679 7082 -5863 3030
815 3030 1438 -2558 9297 -3053 -3778 5268 -3604 4684 1918 -7221 4522 -1131 55 5881 -7773
830g773Q570L398p822R586q898j594J1150r076M602o31r151J2653m271m045P384
845D082j1842P059N751j1203P826m745k832J1644r461J808K892q676J2942l314
859A931p917J0448q408L530Q307j2148N416k32l049J0322j0692P57P011j0658
873e382J0723o79j2843J1348k941j741O264r822N118N67m516J1369j1348k347
887f230J4209j1359L483N263j1011P685P67j093K459j0590R686K588j1896J2855
901F816n263j0299J5341n284n094M185l608O242n679p18Q250j5089Q305J2788
915A0893j9098N304O826r738P203R71j120k289m582J4477q476j0253J9793j0089
929a78p518J7041j1397n957Q943J783n0r449O324M088j6283J6838N494k3101J4073
$$ plain form
830 -7773 797 4195 -3627 5959 -2939 -4533 6617 -2459 2143 1512 -7639 5014 743 -3302 4082
845 4082 -7760 -701 5050 -6153 1673 -3072 -5904 5740 -3721 -1913 979 -7697 5245 1931
859 1931 -5986 4462 -3946 -416 7891 -4257 1159 927 -2122 8200 -2492 -1735 5276 -5382
873 -5382 5341 4662 -8181 3167 226 -1515 4749 -5073 45 612 -3904 7465 -3883 -6230
887 -6230 7979 -3380 103 5366 -5645 2040 2807 1714 4173 -6417 3269 5857 -6039 6816
901 6816 1553 -8746 6595 1311 -3783 402 -3206 3036 -2643 -3361 4889 -10200 -1895 10893
915 10893 -8205 -2901 3925 -5813 1390 2361 1241 -1048 -5630 8847 371 -9882 9911 -178
929 -178 -7696 9345 -2052 -8009 934 2717 2667 -6782 -458 3630 -12653 4185 9679 -13422 651
944F51O778j4591N583L976k59m549K047J0505j9000Q8K4737j8110m052J8151j6331
959d376m170J4072N78p290m379J4500o206j6735K4140l131k0192K4102p19k2041
973a1847J0089Q830m220n505Q674L197k4169J3266K0362k8338O698K0162k3334
986f135k027J5320m189p972O613J4550k0382j1781K9399j2140j3156L0218j2794
999E524k2977J6909O479j0321j133J5384n376k4749K0640P710k9282K3358J6473
1012A8639l1475J365J4109q927l487J6912Q138k8944m51K6741k3576j359L4783
1025B2468k1140j7282K0252m526j4444J1127K1576j4465k1495K3713p155k3706
1037b5077L8288P226l4080J0760R477j7332J260K3450K740k6938J1726J3961l5331
$$ plain form
944 651 7429 -7162 -1579 2397 2138 -2411 -364 10141 -8859 -8771 15966 -2144 -6196 11955 -4376
959 -4376 -8546 5526 6104 -1186 -5565 8935 2729 -14006 10134 7003 -13189 10913 10194 -11847
973 -11847 -1758 7072 2852 -2653 6021 9218 -14951 -1685 18677 -9661 -2963 17199 -6135
986 -6135 -8162 7158 2969 -5003 1610 16160 -4222 -16003 13396 1256 -11900 18318 5524
999 5524 -17453 -544 5935 -4386 -5519 9865 4489 -20260 380 8090 -21192 2166 18639
1012 18639 -12836 -11471 2638 -6289 -9776 7136 15274 -13670 -14121 12620 -10956 -12315 22468
1025 22468 1328 -15954 4298 -228 -14672 -3545 18031 3566 -17929 5784 -1371 -25077
1037 -25077 13211 20437 -13643 -2883 6594 -10738 -9478 13972 16712 -10226 1500 15461 -19870
1050a9870J3110L5471k6265o531J8813j7692j3574K0537J8546k0226r337K4012
1062A6994k2381j7028M1179n577k4907K3427n54k6153M928K3337m101j7352K1101
1075A2913j624l8475K4875K3791l1325Q652J8551k5306r194K0685N750k0583R021
1088b269K2483l3400p269L5907j9825j1032L1898j0682k4056J2177J4759j3628
1100d937p385K6898r997k8430L0500L045l1876K2782J4442k3900R9J5148o180
1113B09j6505J8900J5045l2297P497K6241k9934q92K8394j5970j0592J7702K892
1126A0690j9530j36K4797j4377j4008L0814j3558k4861K8167K380k0546J0905
1138G37J1019j2815j1140J8279K784k4345K0638J4010l2997Q531J8403j9716J881
$$ plain form
1050 -19870 -6760 28711 2446 -4085 14728 -2964 -16538 3999 22545 2319 -7018 16994
1062 16994 -5387 -22415 18764 13187 -11720 11707 11153 -15000 -10072 13265 9164 -8188 12913
1075 12913 11289 -27186 -2311 21480 -9845 -1193 17358 -7948 -17142 3543 9293 -11290 -2269
1088 -2269 20214 -13186 -20455 15452 -4373 -15405 16493 5811 -18245 -6068 8691 -4937
1100 -4937 -12322 14576 4579 -23851 6649 9694 -22182 600 15042 -8858 -8759 6389 209
1113 209 -16296 2604 17649 -14648 -7151 19090 -10844 -11736 16658 688 -9904 7798 10690
1126 10690 -8840 -8976 15821 1444 -12564 18250 4692 -20169 7998 10378 -10168 737
1138 737 11756 -1059 -12199 6080 8864 -15481 5157 19167 -13830 -5299 13104 -6612 -4731
1151d731J6873n505j5918N945J6086j9123k180K6981k0106j1865K5016j1027j3244
1164a2798J6640M720j1723n010J3839m883j5657K3683J620k6063J7449P318j9071
1177i936Q231R259o908o605Q080O869j8872N612J9291k1219K3J8462j6748l081
1191g542J4355l248q099O34J0948p328r546J9180p270j5288K0781k450j4603J1110
1205A634K248o148j278O153K067j3624R656R769k0427P427J1270j5086M772P148
1219E581p091k521J989P666p046n361J4630r718o843J6620q666o117J0867l016
1233I74k723j021L195K384q957R406K833j5812J1101M683j1693P841Q52m750J932
1248B45l27M599o115j375J1409j0280j496J0911j0547J307P697o464M89j157J960
$$ plain form
1151 -4731 12142 6637 -9281 -3336 12750 -6373 -8553 18428 -1678 -13543 11473 446 -12798
1164 -12798 3842 8562 -3161 -8171 5668 785 -14872 8811 10431 -15632 1817 9135 -9936
1177 -9936 -1705 7554 646 -5959 2121 8990 -9882 -4270 15021 -6198 -6175 12287 -4461 -7542
1191 -7542 6813 3565 -4534 -3900 7048 -280 -9826 9354 2084 -13204 7577 5127 -9476 1634
1205 1634 3882 -2266 -3544 2609 4676 -8948 708 10477 -9950 -2523 8747 -6339 -1567 5581
1219 5581 -1510 -4031 -2042 5624 -1422 -6783 7847 -1871 -8714 7906 -760 -6877 3990 974
1233 974 -1749 -2770 425 2809 -6148 3258 6091 -9721 1380 6063 -5630 2211 3063 -1687 245
1248 245 -82 4517 -1598 -2973 8436 -1844 -3340 7571 -2976 -1669 6028 -436 53 -1104 856
1263H56K288p232P562r05r396J1306k122p789Q548l236r72K742l443M088m351
1278b056L10P907j0079J925O976r332N314J898o249M563k396J336J757o881O824
1293A817j534n263Q872o163k380P709n856K197J014m477N904l540L33M896q118
1308d589N053K955p170O499k156l112O563n025J722J512n561O749k586l558O580
1323C876o479J731M704p059M517j081k984O509n295O17M062o434N787l38n091
1338b958O736m293K57M874p008L742O41m494O500m716j218N234o183L509J226
1353A849o377O313k501j690N177o479L033K505n504N957k667k949O860n346J374
1368d45K978n992N325j162k907N261n848J731M247p136M716j90m623O410l395
$$ plain form
1263 856 3144 -4088 3474 2569 -6827 4479 2357 -5432 3116 -120 -1092 1650 -1793 2295 -2056
1278 -2056 -1746 6161 -3918 -1993 4983 -4349 965 2863 -3386 1177 -1219 117 1874 -5007 1817
1293 1817 283 -4980 3892 -2271 -4651 3058 -2798 -601 413 -4064 1840 -1700 -1367 3529 -4589
1308 -4589 464 3419 -3751 2748 592 -2520 4043 -982 740 2252 -3309 3440 854 -2704 3876
1323 3876 -2603 -872 3832 -3227 1290 209 -2775 3734 -1561 -944 3118 -3316 2471 2133 -2958
1338 -2958 3778 -515 -258 4616 -2392 1350 1991 -2503 3997 -719 -1937 3297 -2886 623 1849
1353 1849 -4528 1785 -716 -2406 2771 -3708 -675 1830 -3674 2283 -384 -3333 3527 -1819 -445
1368 -445 2533 -3459 1866 704 -2203 3058 -2790 -1059 3188 -3948 768 578 -4045 2365 -1030
1383a030o16L274m991N037p96m228O713m663o76O759o842J856K731m248M371k960
1399c09l73L533o150N290J063p806P314j522m327O249l681n2J901k516M136m340
1415a590n52P536p521J913N716r015L714L002l907K681k301J589q9n244P790k889
1431H33n698R945n100n056O981l021J25K015q57J324o562M144N792r387O257L794
1447E529j0864M853K733m383K829Q31J591m921l502Q976o063j318J1940r838m815
1462f422P826l936J6L565J870k057p237P024P03q902J2853J324j2459O369K70
1477H07n626M844M482M92p866o4O888j0291M655J2548j2761j224P296q094q46
1492d760P046L691m439n054P348o422o491J7121k101j1014R379l200q197O003
$$ plain form
1383 -1030 -1646 1628 -3363 1674 878 -3350 3363 -1300 -1976 4783 -2059 -203 2528 -1720 2651 -309
1399 -309 -682 2851 -3299 1991 3054 -4752 2562 1040 -3287 2962 -719 -771 1130 -1386 2750 -1590
1415 -1590 -2142 5394 -2127 -214 5502 -3513 201 3203 -704 1977 -324 1265 1176 -4068 3722 833
1431 833 -4865 5080 -20 -5076 1905 -1116 -991 1024 167 1491 -5071 -927 4865 -4522 1735 5529
1447 5529 -5335 -482 2251 -2132 697 1528 3119 -1802 -5304 3672 -2391 -3709 8231 -1607 -6422
1462 -6422 1404 -2532 -2516 1049 2919 862 -6375 649 1352 -7550 5303 6627 -5832 537 807
1477 807 -4819 25 4507 4999 -2867 -2931 3957 -6334 -1679 10869 -1892 -3116 4180 -3914 -4760
1492 -4760 2286 5977 1538 -3516 3832 -2590 -9081 8040 5939 -5075 4304 1104 -7093 -1090
1506a090N866j043o375N155J565j4049R277J0412j3434M837O503j2309p56P866
1520B425J979n081M04P221j1566l917J6419q508n926J4248o578r101O588L392
1534A999l955j800R769l233j3555J2956L049j4130J1927N311j2994K591O257m046
1548A46n193P015O427j3559K014J1719j5298Q8J5416r534n043Q416j464p200J650
1563d400J0484n935p399J4965n809j3069J5462J548j0673P799L747q260l870Q924
1577C514K542j1765Q635O642j8157M650J1505j2385J422R940n498p831L973P258
1591D445q564m10J4914j1617q327J5988n398p700J2014O43q574m46P482l067q359
1606f976J3198J367j6532R816N211j3989O535P858p350m213N470K854r937M132
$$ plain form
1506 -1090 4776 3733 -2642 2513 4078 -9971 -694 9718 -3716 1121 7624 -4685 -5441 2425
1520 2425 4404 -677 -273 6948 -4618 -8535 7884 -624 -6550 7698 1120 -7981 -1393 1999
1534 1999 -1956 -3756 6013 2780 -10775 2181 5230 -8900 3027 8338 -4656 -2065 4192 146
1548 146 -5047 1968 8395 -5164 -3150 8569 -6729 -6641 8775 -759 -5802 2614 1150 -6050 -4400
1563 -4400 6084 149 -7250 7715 1906 -11163 4299 5847 -4826 2973 6720 -1540 -5410 3514
1577 3514 6056 -5709 2926 9568 -8589 -3939 7566 -4819 -3397 6543 1045 -6786 -2813 4445
1591 4445 -4119 -4529 10385 -1232 -9559 6429 1031 -6669 5345 5988 -2586 -3032 4450 1383 -6976
1606 -6976 6222 7589 -8943 873 6084 -7905 -1370 6488 -862 -5075 395 3249 -6688 -2556
1620b556J1761j3782j022J3804j0726l752J1952k816n881K598N145n792m948J3152
1634G137l923j1722J3353o63j1978R387L299p721K4N821q03q467O693O392j3489
1649f660N007R548j3049J883R208o519k894M340K860o521o97J0437q025n945J3436
1664F409n496p514J0420j578n960K737L922k348n468P850J572j1728Q368M481
1678E667j1656O076M957p378j73L836N63m806J532P326q884j401J0650q616k130
1693d437R460m655l282L638J030k222k493P276j841q216R159p14q360Q515O40
1708C498o241K588J440r16l070K934M429q536K174O541r261K437O737o217R5K391
1724A023j118r92j138N918l184m618P955l953m495Q189k658k904L265j326m42
$$ plain form
1620 -2556 9205 -4577 -5599 8205 -2521 -6273 5679 2863 -3018 -420 4725 -1067 -6015 7137
1634 7137 3214 -8508 4845 4182 -7796 1591 4890 -2831 -2807 3014 2211 -6256 437 6829 -6660
1649 -6660 -1653 7895 -5154 -3271 5937 -582 -3476 864 3724 -2797 -3494 6943 -1082 -7027 6409
1664 6409 913 -6601 3819 2241 -3719 -982 2940 592 -4876 2974 4546 -7182 1186 5667
1678 5667 -5989 87 5044 -2334 -2507 1329 1892 -2914 -1382 5944 -2940 -4341 6309 -2307 -4437
1693 -4437 5023 368 -2914 724 1754 -468 -2961 4315 2474 -5742 3417 2703 -5657 2858 3498
1708 3498 -2743 -155 1285 369 -2701 233 4662 -3874 -1700 4841 -4420 -1983 4754 -1463 -1368 1023
1724 1023 -95 -1087 -2225 3693 509 -4109 3846 -107 -4602 3587 929 -1975 1290 -36 -478
1739d78j658K552K784o491L387K670p534M897K704n046K788j21j114K2j236M379
1755B505k666k314O000n135j327O498m258L09K309k729J170j285J523J806m859
1770b453M088L46n527N397p91k919L835k239l16O47j772L635k457q72M275n069
1786b192J155L600m597K737M25k142K470k158J099J551l762L652q18l353M593
1801B260k633q88L193l481J471L14k222L498k733k86L213m115K387J300l610L680
1817A348j319j261L150l324J936J117l477L835j737j708L828l589R32J650l389
1832b008K858r03j853L400l191Q10K239l801L101j1k444L836k552J06K617l615
1848a411K588K1k589L657k387q76L306l887J735P25k892L189k084n77K973l573
$$ plain form
1739 -478 -2136 416 3200 -3291 96 2766 -4768 129 2833 -2213 575 454 -660 -638 -1874 2505
1755 2505 -161 -2475 3525 -1610 -2937 3561 -697 -388 1921 -808 362 -923 600 2406 -2453
1770 -2453 1635 1981 -3546 1851 1060 -1859 1976 -263 -579 68 -1704 1931 -526 -1398 2877 -2192
1786 -2192 -1037 2563 -2034 703 1128 -1014 1456 -702 397 1948 -1814 1838 1020 -2333 2260
1801 2260 -373 -1261 1932 -1549 -78 236 -1986 1512 -1221 -1507 1706 -2409 -22 1278 -2332 1348
1817 1348 29 -1232 1918 -1406 530 1647 -1830 2005 268 -1440 2388 -1201 -269 1381 -2008
1832 -2008 850 -53 -1906 1494 -1697 -887 1352 -2449 652 641 -1803 2033 -519 -413 2204 -1411
1848 -1411 1177 1198 -1391 2266 -121 -997 2309 -1578 157 882 -2010 1179 -905 -1482 1491 -2082
1864b082J860J123l323L751j298j528L534k819J066J529l041L061j213j419L345
1879B546l519R15K082l984K781k62k558L404k596L08J660l105K757j32k484M050
1895A863k606o82L480l470K037P26k366K910k102j76K802m013K609Q26m055L422
1911A205j076j708K814k255Q56M95k796L490k079r65M480m251Q23K659l625K424
1927D91M47j339K005k419J115J144l472M156n95l700M343k438j404K876j791J127
1943E46m53j469K634l307J115L516m861K039K011m398K679L77q85J561k139K207
1959A173r70k735N465k581k179N137l539j044K907j787P63n52K98J568m644K933
1975B13K131n344M157Q61m856L003J67j327Q84o46K367k800q39M902m564r7N469
$$ plain form
1864 -2082 -222 901 -2422 1329 31 -1497 2037 -782 284 1813 -1228 1833 620 -799 2546
1879 2546 -973 -58 2024 -1960 821 559 -1999 1405 -1191 -883 777 -2328 429 297 -2187 1863
1895 1863 -743 -1425 2055 -1415 622 1348 -1018 1892 -210 -386 2416 -1597 1012 1838 -2217 1205
1911 1205 129 -1579 1235 -1020 -164 331 -2465 1025 -1054 -2019 2461 -1790 -967 1692 -1933 491
1927 491 938 -401 1604 -815 300 1444 -2028 2128 1533 -2167 2176 -262 -1666 1210 -581 546
1943 546 93 -1376 1258 -2049 -934 2582 -2279 -240 1771 -2627 52 429 -456 1105 -1034 1173
1959 1173 203 -2532 2933 352 -1827 3310 -229 -1273 1634 -153 610 58 356 1924 -2720 213
1975 213 2344 -3000 1157 2018 -2838 165 332 -995 -111 -757 1610 -1190 -2029 2873 -1691 -1788 3681
1992C681m811p9L170k433M20j3J500N5l999M448q21n020O272q33m491M002j043
2009Ej745P63N05J755l731J156L749o086K276M900n774J538K993l288L81N95K040
2026B032j513k339N324l274l732P231l058l300N000k146j988J055J100L84l418
2041b642L181J625o801M777K791o106L871K124m174O99J244J421k168j87M836
2056D491n699j198O740n037j047N591l741j913J355P81l10k224M393j020n983
2071d821O043K53n315N758M41m143J263O79O75k006J682L518o564R84M928o337
2087b962J811M991m565q16J334M2r33l31M651k984m240O382k578l906P086j397
2103A585l385K084k80m85j459L403J667o406L181K318o543M466L244m852R00R70
$$ plain form
1992 3681 -1130 -1209 1961 -472 -52 -65 1435 1490 -2509 1939 1118 -3902 2370 1537 -2954 1048 5
2009 5 -1740 -977 -472 1283 -2448 -1292 2457 -3629 -1353 3547 -2227 -689 2304 -984 -603 -8 2032
2026 2032 519 -1820 3504 230 -3502 3729 671 -2629 2371 225 -1763 -708 392 776 -2642
2041 -2642 539 2164 -4637 140 2931 -3175 696 2820 -1354 -655 589 2010 -158 -345 4491
2056 4491 -1208 -2406 4334 -703 -1750 3841 100 -1813 -458 323 13 -2211 2182 1162 -4821
2071 -4821 1222 1475 -3840 1918 2359 -1784 -521 158 833 -1173 509 4027 -2537 -1553 3375 -2962
2087 -2962 -1151 3840 -725 -1541 -207 -165 -1098 -1429 3222 238 -4002 2380 -198 -4104 2982 1585
2103 1585 -1800 284 4 -481 -1940 1463 3130 -3276 -95 2223 -4320 146 3390 -1462 -562 408
2119D08q35j004P70M299l916j947N697m991j232O803l344j779J943r02o42p91
2135a463L587l74n095M463N9n568N791R83m287K196j7q11m76J456L018m743J67
2152a114M303n712J413N412m827o0J260j677nJ46L260j457m055M500k015l441
2168d069O728j067l335K567j593o70Q76J682J914m372Q59K179n303L930L135m408
2184i47J291Lk343R50L87K991j701k529L468l737r62O362k617j022K046k825k65
2201a450J102J480J377l623J683K69m569M522J139l539K856j420j950J316Q8K548
2217A829j864j193L068l937N59M510l548R67J486k963R55j42P37J095k695K294
2233A158r19l256M452q21k199K928k009o53J267o81J891j773J7K479l766J546
$$ plain form
2119 408 -427 -1431 -661 3638 -278 -2225 3472 -1519 -2751 4052 708 -1071 872 -30 -672 -1463
2135 -1463 2124 1750 -3345 1118 1177 -4391 1400 2383 -1904 292 275 -536 -1012 444 3462 -1281 -1114
2152 -1114 3189 -2523 -1110 4302 -525 -585 675 -1002 -1007 -861 2399 942 -3113 1387 -628 -4069
2168 -4069 2659 1592 -1743 824 -769 -1439 -563 1119 3033 -1339 -480 1699 -3604 326 3461 -947
2184 -947 344 347 -1996 -1046 -659 2332 631 -1898 1570 -2167 -3129 3233 616 -406 1640 -1185 -1450
2201 -1450 -348 1132 2509 -1114 569 838 -3731 791 1930 -1609 1247 -173 -2123 -807 -719 1829
2217 1829 -35 -1228 1840 -2097 -1538 2972 -576 391 1877 -1086 -131 -273 464 1559 -1136 1158
2233 1158 239 -3017 1435 614 -1585 1343 -666 -1319 -52 -733 1158 -615 -598 1881 -1885 -339
2249c39K634l559K243L99k552J967r40P22N16k371K561j436j812L835k348n82
2265a062K281k628J002P04j130K147j995L07J700l195K556Q00k830K594r56j380
2281a085K135j771J032N29k290K455j551n64K847k982N79J623k634J879j19j114
2297a031K399k178P25J220k756K591q0j987K587j760m19J976k210J452j42j652
2313a265K590k144J4K081k705J567Q10k349K263j188n01K184k344J518L84k111
2329a196K599j122j024K344k236P44R90k235K142r87j226K496k281M95J425k494
2345a566K047l85j551K385j655M37J483k261J707j11j478K463j681j36J881k378
2361g99J370K86k072K414j427o99K034k589J354N44k232K255j128n63K269k308
$$ plain form
2249 -339 2295 -1264 979 1378 -1174 793 -147 575 1091 -1280 1281 -155 -1967 1868 -480 -1062
2265 -1062 1219 -1409 -407 297 -833 1314 -681 -374 1326 -1869 687 1487 -1343 1251 295 -1085
2281 -1085 1050 -721 311 840 -1450 1005 -546 -1110 1737 -1245 -666 957 -1677 202 83 -1031
2297 -1031 1368 -810 -85 1135 -1621 970 890 -1097 1490 -270 -689 1287 -923 529 387 -1265
2313 -1265 1325 -819 -805 1276 -1429 138 948 -1401 862 -326 -827 1357 -987 531 915 -1196
2329 -1196 1403 281 -743 1601 -635 109 1099 -1136 1006 19 -1207 1289 -992 -497 928 -1566
2345 -1566 481 96 -1455 930 -725 -288 1195 -1066 641 530 -948 1515 -166 -302 1579 -799
2361 -799 571 857 -1215 1199 -228 -927 1107 -1482 -128 416 -1816 439 -689 -1252 1017 -1291
2377a291J039Q71j931K197q02r51K330k159J052R98k266J927m24j266K075j877
2393d78K34J235k391J862j56j819K495j748q9J656k094J413K25j479K386j537
2409b85q2J841k235J399M53j873K214j051n88J834k182J001L35j811K154j239
2425a15q66K308k341O10J056j928J669m62q32J785j841Q45J061k414K258l17j715
2442a239K475j562QJ391j949J498n07j204K272j846N6K009k854J123P14j806J965
2459E44q45l43J211k032J382L00j936K787j048j212K190j903N28J082j383J628
2475I50j089n84J931j960R65J292k515J564nj674J953j103N41P72j850J529q58
2492a41j104K902j782m35K050k417Q40M38q87J788j180P9R39k496J944M03j932
$$ plain form
2377 -1291 -252 619 -1312 885 83 -868 1462 -697 355 1353 -913 1014 590 -676 1399 -478
2393 -478 -244 991 -1400 462 306 -1513 982 -766 -855 801 -1293 120 345 -1134 1252 -285
2409 -285 -367 1474 -761 638 1091 -782 1432 381 -207 1627 -555 446 781 -1030 1124 -115
2425 -115 -981 1327 -1014 -404 652 -1276 393 -69 -901 884 -957 -112 949 -1465 793 476 -1239
2442 -1239 1236 -326 -318 1073 -876 622 115 -1089 1183 -663 -607 1402 -1452 -329 385 -1421 544
2459 544 -301 -644 567 -1465 -83 217 -1719 1068 20 -1192 998 -905 -377 705 -678 950
2475 950 -139 -723 1208 -752 213 1505 -1010 554 549 -1125 828 -275 266 1038 -812 717 -141
2492 -141 -1245 1657 -125 -560 1490 -927 -87 351 -536 1252 72 151 1090 -1406 538 941 -991
2509i91K618q49j772J530j190J060O10j369J609j683p03K500k352J120J508k439
2525g93O79k38p51J667r15J029rk619J993k34j307K899j058j007R68j793J219
2542b70L65j69J801k282j37J404k499K124J279k400J151r18o71J366q04J543n85
2559B98j886J936j457l82K983j670K4P11j555R52K8L89J323k249O15Q44k261K441
2577A084J44j958J612j085l19R78r20J466q73j242K028k021M90K282k236M94N40
2594D64j517J538j53M45M48k365J514J91j660K695p61j844J776j776L77J017n56
2611a67J418j720p19J728j809J533J611k456P42j77j082J676j97N40M4k193J333
2628A05o18p46L118j503j032Q87j952R74J080k21J162j935j73R46j509K174P84
$$ plain form
2509 -991 1627 778 -994 536 -654 406 1016 -353 1256 -427 -1130 1370 -982 138 1646 -793
2525 -793 -114 -352 -1103 564 -351 678 669 -1950 43 -191 -1498 1401 343 -664 304 -1489 -270
2542 -270 95 -74 1727 -555 -692 712 -1787 337 1616 -784 367 -551 -1222 144 -660 883 298
2559 298 -1588 348 -1109 -1491 1492 -178 -154 557 -998 -46 -18 371 1694 -555 60 904 -1357 1084
2577 1084 1228 -730 882 -203 -522 456 -464 1002 129 -1113 915 -1106 -616 1666 -570 -76 464
2594 464 -1053 485 332 777 1225 -1140 374 565 -1095 1600 839 -1005 771 -1005 -628 389 -167
2611 -167 1251 -469 -1188 540 -1269 264 1875 -581 161 -16 -1098 578 381 921 965 -1228 105
2628 105 -513 -1259 1859 356 -676 211 -1741 -767 313 92 1254 -681 -854 92 -1417 757 1541
2645A541k126J259j030q18J669l85R32k58j841J285j179j42K667j699j86O49k027
2662a689J223N44k38J341j654K61N11j677K252K51j521J541j427n45J413p67J402
2679A221o86j255J237j530M75J822j877O84K29j682J474m11J50J052j632Q97J30
2696B98j420K166p08o42J483j757L06R73j004J118p39m47J105j593P50Q71j622
2713h62J353k80j277J662j104L75R03j621J129l18r32J900j042j19J097j728R58
2730I4J73j004J504p51l24J044j614J020M27j400J600r10n39J536j330O34K41
2747D01j263J416p12m02J515j601M80Q97j662J357l38j019J665j092J05Q98j677
2764a032J313n3q02J625j310j13J101j441J143M7j064J584j274J80R79j651J030
$$ plain form
2645 1541 -585 674 -356 -1174 495 110 1042 784 -1057 228 -951 -1093 1574 -125 -311 338 -1689
2662 -1689 -466 78 -160 1181 -473 -212 299 -1378 874 1125 -396 1145 -282 -827 586 -181 1221
2679 1221 535 -720 517 -1013 -538 1284 -593 91 320 -1362 112 -299 -149 903 -729 168 298
2696 298 -1122 1044 336 -306 1177 -580 -274 699 -305 813 74 -373 732 -861 -111 760 -862
2713 -862 491 211 -1066 596 -508 -133 770 -851 278 -40 -972 928 -114 -233 864 -864 94
2730 94 267 -737 767 16 -308 736 -878 142 569 -831 769 -141 -680 856 -474 160 401
2747 401 -862 554 -158 -560 955 -646 -166 731 -931 426 88 -931 734 -358 -253 645 -1032
2764 -1032 281 228 -574 1051 -259 -372 729 -712 431 478 -586 998 -276 -96 883 -768 262
2781B62L64j175J181q39k96J521j570O56K45j194J396o20n39J228j324O27N68
2798D91j314J304m83o33J495j371L99Q09j480J261m42o95J477j222L58P88j471
2815g29J116j65j041J564j084p9J197j480Q03R5j081J343r01M9R99j230Q26K46
2833D48j212J395p97j74J246j289N90M35j286J301m66p98J406j522P63N98j355
2850g17Q82j51p58J513j246J71Q13j536J294l9r21J316r78rJ147j381J020Jj062
2869f41J501r38j57J221j494Q33J33j221J427q83j85R89j504R01M28j316J319
2886D13m96p04J520j205L41O75j168J109k68p42J377j279M33P31j264R47j02q51
2904e33J271j031K15P75j628J245p2j001J333q37K6P59j222O86O6q63J336o87
$$ plain form
2781 262 626 -549 632 -207 -503 1018 -552 104 349 -845 551 -69 -608 620 -704 -77 491
2798 491 -823 481 -2 -635 860 -511 -112 697 -783 478 36 -659 818 -404 -46 742 -729
2815 -729 387 222 -819 745 -339 -418 779 -701 102 197 -884 459 -442 -393 606 -624 202 448
2833 448 -764 631 -166 -340 906 -383 207 642 -644 657 191 -607 799 -723 40 638 -717
2850 -717 165 14 -744 769 -477 -306 507 -1029 265 226 -695 621 -357 -366 781 -600 420 421 -641
2869 -641 860 -78 -235 986 -508 325 458 -763 664 -219 -404 585 -919 -18 410 -906 413
2886 413 -83 -787 733 -472 -131 544 -624 485 217 -525 852 -427 6 737 -527 420 318 -533
2904 -533 738 -293 -78 697 -931 314 242 -759 574 -263 -237 522 -700 -14 52 -811 525 -162
2922a62j37J103j413O82M18j209J247o37l90J322j448O88M26j153R97j42q29J210
2940E73j124N07N23j130J076k77p28J194j221L14J013j384Q42j25p66J325p72
2957a60j59J013j402J093k76q20J498o98m58J107j429O91N44r96J273o34m76J037
2975G48j478Q45M76j086J124p25o22J233q22M18M55r86P81n13n74J469q51K76
2993A68O28j343Q30n7n42J127r39Q4O77j354J134j54j019J501q01n27Q85j097
3011g99P36K05o26R54r40k34J292j254Q03M32j292J091l08o04J020q53O74k4j111
3030h38J358m71q88J436j075N5P24q16R39m61l49Q00r71O32P25j684J091J90j273
3049h76J305m16j96O73q08N76l26n93J603j098j06J064j385L21P43p12P82m84
$$ plain form
2922 -162 -299 804 -609 73 491 -718 529 -108 -498 824 -624 64 490 -663 334 192 -637 573
2940 573 -551 -44 479 -651 425 148 -580 614 -607 -293 720 -664 178 53 -713 612 -160
2957 -160 -319 694 -708 385 109 -711 787 89 -369 738 -691 0 544 -452 821 187 -289 748
2975 748 -730 115 591 -495 629 -96 -718 515 -307 111 566 -420 361 -152 -726 743 -108 168
2993 168 796 -547 283 226 -316 811 -128 -44 633 -721 413 259 -760 741 -60 -587 298 -799
3011 -799 -63 142 -484 470 -470 -704 588 -666 137 569 -723 368 60 -544 476 -377 297 273 -838
3030 -838 520 49 -839 597 -478 -423 301 -515 424 -37 -386 414 -557 75 800 -884 207 397 -876
3049 -876 429 13 -183 490 -318 258 -68 -661 942 -156 -262 802 -583 -262 481 -231 551 67
3067F7QN22j485J132N09j448J617o61j121J317n66J22M53o94N26q17p9J527j535
3086f06N78R95j890P41N59q45R26m25J45K20j177J359k50r74J823j184q37J176
3104C34p78M17K04l14N95j155J50J094j511J153P68j749Q54K1p96R69j51L52o6
3123C91j182J336p29k92J859j310l29O80j127O83L83k43N17j230N32K78j263J618
3141E72K3j284J273q45o98J182k51N14l77o72J083j279K09J720j505M37N39j355
3159g14L66J95L01M88j126P56l86j187K095m41j017J464j120m74R22m80P88l80
3177E0k51M36j515Q96J444j609J129j1j606Q21lJ69M65p57R82q59q26J871r19
3196i3j40J372j484j28P03l76N88l99J34M27j564J244N11j373J110n6j137J004
$$ plain form
3067 67 75 597 -888 244 753 -695 922 261 -860 457 -109 13 466 -228 298 -519 -598 929 -606
3086 -606 -28 967 -923 -182 377 -468 458 33 178 398 -779 580 330 -644 1179 -5 -842 334
3104 334 -444 -27 177 -137 458 -697 -547 547 -964 189 957 -792 62 83 -713 256 105 457 391
3123 391 -791 545 -184 -476 1383 73 -256 424 -703 -20 363 120 637 -593 -61 217 -1046 572
3141 572 595 -689 584 -261 -959 223 -28 486 109 -563 520 -759 -550 1170 -335 102 641 -714
3159 -714 -348 -153 148 636 -490 266 -120 -1307 788 347 -670 794 -326 -800 122 -358 430 50
3177 50 -201 235 -1280 -384 1060 -549 580 569 -1037 -216 -219 -50 415 -342 640 -219 -1045 826 -93
3196 -93 -233 1139 -345 -473 230 -146 442 43 177 604 -960 284 795 -578 532 476 -661 343
3214C43l24R1M01o99R54r37l3J200j189J39J068j612O82K58m54N81o51K20K92
3233C30j173J421j73j273J495j021l78R90l25N5Q6o09O24o03L88J054j224L69
3251C3L35j329J085J29m23N17p97K57j18m13J438m79q85J192j346K77R59q05O19
3270B46j22n05M86r39O15R49j307R61k03j014J056k75l2P19r11N62m50n39J472
3289G69r35m0J258j530L40O03p74R41m53j97M99r49P35L07j051J160m78p63J069
3308E11p81J13O55r00R00o73l13J220j272M73O09j086O60J08n81Q03n27J11M15
3327D45q96O88J0p65J156q14j62Q01j072P67J13r85J054o03j61Q20r75N21K94
3346B36q29R93m30k52P89p06L12K80p58P84l94m19R27q53J48Q81j353J189n48
$$ plain form
3214 343 19 110 511 -188 766 -171 -204 996 -193 -54 1014 -598 84 342 -112 469 -182 38 330
3233 330 -843 578 405 -868 627 -394 -772 218 -107 -52 34 -575 49 -554 -166 888 -336 33
3251 33 368 -961 124 253 -170 347 -450 -193 -311 -724 714 235 -650 542 -804 -527 432 -373 246
3270 246 124 -381 105 -834 -219 730 -577 384 181 -833 223 -52 -84 635 -276 286 -164 -703 769
3289 769 -166 -206 1052 -478 -138 465 -309 632 179 -18 481 -468 267 574 -477 683 205 -558 511
3308 511 -270 -157 498 -402 498 -175 -488 732 -540 -67 542 -544 116 224 -357 446 -81 30 445
3327 445 -451 237 247 -518 638 -176 -338 463 -609 158 271 -714 340 -263 -424 396 -579 -58 236
3346 236 -593 400 -30 -282 507 -199 113 393 -365 419 25 -394 533 -320 -172 709 -644 545 -3
3365cn26J037p49K38L10q93P90k8p53R31n67M5P17j074N64J71q75J149p24p0R75
3386F65j086N30J63j020R72k77n06R57r27L83L85r45J054l51n30R89r02K70N26
3405C50q55Q48l21o72J019q24K98N75q91O20j7n96R87n69N3O31r99N89j51n40
3425d65J080o92p0R19j088M77K56o91P70n13j85P69q66N85J06q66R74m95k88Q17
3445E34p44K23M72p96P73k61o36J117q30J10O27r38N37J11o10O80o03K53K29q43
3465e95P65l30o16J060m79k43P37p96L20L98o34O12n94J69P61j019N40L57j034
3484f21Q15j88k58N82o69L65J39p27Q94n47l75J107r09J4Q90p04J76J24l34O09
3504C83o53K86M47j122J007O8r17Q74m29l18O22k33J33j94l67J103j021kJ238
$$ plain form
3365 -3 -529 508 -241 -3 307 -586 204 176 -577 354 -213 -168 549 -525 39 210 -665 484 -240 -310 665
3386 665 -421 109 272 -748 224 -53 -559 398 -529 -146 239 -706 348 -3 -533 456 -446 -176 350
3405 350 -505 343 22 -650 369 -455 -157 418 -473 147 130 -466 521 -48 5 636 -363 226 75 -465
3425 -465 615 -77 -147 772 -316 161 417 -274 496 -17 -202 567 -299 286 392 -474 500 5 -283 534
3445 534 -210 13 485 -311 462 201 -435 682 -148 -38 589 -349 188 299 -311 369 -234 19 248 -595
3465 -595 170 -160 -776 284 -195 -438 299 -497 -177 221 -413 199 -395 -226 535 -484 56 413 -621
3484 -621 194 6 -252 330 -339 26 165 -562 332 -215 -590 517 -392 -378 512 -192 -16 108 -226 383
3504 383 -270 16 463 -659 348 416 -501 373 -56 -374 248 15 148 -46 -413 690 -331 -333 905
3523I05j288M42M20r52L11K92j23K34p25Q70l53q46J393l86p35R91o40k01N70
3542A79m1J36n63K5O72j021P86O17j326P82J33q79N72J2J63k82m45R25o67n26
3562g48J717j014o08J055q28k8P44j24O8o30L66L68j188J361L79j435Q77N8j177
3581g87J039J95p3l17l18M90r23L11J505j317j96R27j283J42J028k28K1m59L68
3600A25m19q69J855j08j140J145n27j031R73K95p7k86P7j05j059J084R44j294
3618d17N04M35j480M80P05m9J16k08K53o12m70J656o26q38J498j117o60J121j68
3637A23N1j96J56l4q75R94O87j699J149L05j437Q69M21m66o7J72J79r15L44J339
3657A100j470j40J337j286j23J237m53m07k7J85j04o93J555k15j262J176j48j175
$$ plain form
3523 905 -383 59 479 -473 -162 130 7 241 -484 386 33 -813 580 194 -541 450 -190 -391 179
3542 179 138 274 -289 -264 408 -613 173 790 -536 246 379 -500 72 84 247 -35 -480 445 -222 -748
3562 -748 969 -45 -653 402 -426 -454 290 166 234 -396 -30 338 -850 511 890 -545 332 390 -787
3581 -787 252 447 374 57 -261 229 -694 -383 1122 -195 -391 536 -747 -605 423 195 216 -243 125
3600 125 -294 -1163 692 584 -556 589 62 -969 4 299 222 -64 13 -92 -1151 -67 877 -417
3618 -417 87 522 -958 -478 227 178 294 86 339 -273 -743 913 287 -551 947 -170 -830 291 123
3637 123 174 -22 134 100 -775 219 906 -793 356 661 -776 93 514 48 -19 153 332 -583 -239 1100
3657 1100 -370 -510 827 -459 -582 655 202 -205 -232 -47 -151 -844 711 496 -766 410 262 -913
3675i13J378J54n32j8K2J2n02M33R08j455L04O73j268M99Q16n55O2k17K22l90
3695c67m46J646n70p99J042q28o55J246p7j97L7j0j18o72Q21Q76j304P38J02j467
3715a002Q43N58m02J35L3k10m74J0J002n37k05Q62j274K5J144n96Q7L17j90k98
3735a72l07O30L33q88J052l89r68J201l34l93M98mo7n68P9O71p47K54J105j454
3755d68K21O80o96J80L48j95M2m43O54k33m94R24m11q36J073m62j20N38m39J69
3775C2r8j38N00q30L53O97j081O43K79q64M91J29l1Lm08M93l44l95Q63o52j75
3796e33R29p07J22L76k88J23j66K01K74p00L97K97o66P79M0q51O17r1r9K0l43
3817b69N90m48k03O61o02NO08p88L76J26l73M37m44L78J92p92Q30l3p15P69k61
$$ plain form
3675 -913 465 619 87 69 91 103 -399 34 942 -513 -209 464 -804 -305 511 -44 18 -199 23 -367
3695 -367 -813 833 263 -536 506 -322 -977 269 192 -5 32 22 -96 -768 53 929 -375 363 465 -1002
3715 -1002 -159 399 -3 132 165 -45 -519 -509 493 -44 -249 613 -661 -636 508 -88 -1 316 126 -172
3735 -172 -479 151 484 -404 648 259 -709 492 158 -235 263 259 192 -376 -297 374 -373 -119 986 -468
3755 -468 -247 433 -263 -83 265 70 112 -331 323 90 -404 520 109 -727 346 -116 -236 302 -137 32
3775 32 -66 -204 296 -534 -181 516 -565 78 357 -507 -16 113 82 85 -323 170 -174 -569 294 -358 -533
3796 -533 396 -311 -189 187 -101 22 -144 57 331 -369 28 325 -341 438 478 -373 244 153 54 74 -269
3817 -269 321 -127 -330 331 -271 -266 342 -446 -70 56 -317 120 -324 54 246 -546 284 251 -464 305 44
3838D4l29M91m62L46p4k33M06l38J6M78o41J17L07m03L16kk84L88l09L19p2m56
3860c75N82j14j89N20p10L12K72m70L86j00l21O24n34J79L93q49N47R2l79L46
3880B12l01l7L60n46L69Q8m12M50k16k67M52l50L41J71n20M93l54j4N49p05K26
3901a1K22p57P51k18l35N56n49J81K50o47P66j53k91N44m53J40K88n39K97Q8m56
3922c26M47k25O8L86n09J81J05o45Q09l55o6M60m43j3K85k96M03l15k0M40n30
3943a59L11K58n25M01j86k44M80l42M5P1m06N62l85k17N96n03J49L25n00J55K10
3964I6l09M45l22Q6K64n55L75O7m63O00j97l72N56l35N3j93qL72m53J35M86o32
3986c04K44K07o59M83n7R4J99l82N33k93k98O01k72m91Q50l74j52L96l95J4j73
$$ plain form
3838 44 -285 206 -256 90 16 -217 189 -149 -133 345 -296 -179 128 -275 41 39 -245 143 -166 153 81 -375
3860 -375 207 93 -96 424 -286 26 298 -172 214 114 -207 417 -117 62 455 -394 153 245 -134 212
3880 212 -89 -126 234 -312 57 145 -267 183 -33 -300 152 -198 143 314 -206 287 -67 -81 468 -237 -11
3901 -11 211 -546 205 -13 -348 208 -341 -160 90 -557 209 56 -235 309 -144 -4 284 -255 42 130 -326
3922 -326 121 -104 -36 350 -159 22 127 -518 291 -64 -130 330 -113 -126 159 -137 266 -49 -69 371 -159
3943 -159 152 410 -115 286 100 -144 336 -6 39 110 -296 266 -119 -336 260 -243 -94 231 -269 -114 96
3964 96 -213 232 -90 -4 260 -295 80 147 -316 284 87 -285 271 -64 -11 -204 -212 160 -293 -158 328 -304
3986 -304 -60 147 -512 -29 -86 8 207 -175 358 65 -233 368 96 -395 455 81 -71 325 -70 -56 -229
4007b29P6M05o64L65N29j074M45L64n77M78J59k22l3j15M53n69p8O95m50k87P05
4028C76o32q9P01l44J0l7K3K6m22Q85j63q03O76K7p39O16J80k39j49O0J56m89
4050c70K62O52r13L1O65r28L17P20l15j67O8J89k38m91J125m03o93R64l82o29
4070e36Q30j09l93J86J40k3o45P61L82j082M96M61j180O10O36o43kJ76J27m41
4090b49jP52n43l69J014m96n40R03k68n17L67P6j72k61P24o2j003R58r2j002J051
4111B70J99q41J69K67j06l21L45O93j177O4J036j001nJ050o92l13M55o8l54j00
4131d30J046m02q85J212n48p04J114o9n24L49J89m88l06O62M10j138P07N43j333
4150e95N41O21p24q8O27l30k61K3O54m90k73J175q11n71J191o23m74P63Nn02k19
$$ plain form
4007 -229 -153 252 -412 -47 482 -592 -147 217 -360 118 277 55 22 -93 360 -209 -287 408 -42 -329 376
4028 376 -256 -345 356 12 22 -15 8 34 -388 497 334 -469 207 234 -505 111 291 52 -97 -37 119 -370
4050 -370 -108 544 -369 -338 327 -601 -284 436 121 -46 22 211 -27 -518 607 204 -489 475 93 -536
4070 -536 294 185 -208 -22 118 95 -550 211 593 -489 7 468 -712 -102 534 -109 -111 65 192 -249
4090 -249 -250 502 -41 -410 604 108 -432 471 203 -314 53 129 -43 -304 420 358 -645 313 221 -781 270
4111 270 469 -372 -203 64 -42 -363 -18 675 -502 -438 598 -403 -408 642 -50 -363 92 24 -330 -430
4131 -430 616 214 -671 541 -7 -711 403 334 -190 159 348 -140 -446 216 626 -512 195 738 -595
4150 -595 -54 567 -157 -245 382 52 -209 -186 468 -22 -295 880 69 -502 689 66 -408 355 360 -142 -361
4171c61O48j62p64R30J15j252Q47M27q28L14M21k13m87M31L10o54J43Q41j056
4190c50k35J247o74k00N70l03j61k48P82n39l58R64k32r76R51m6p37N43J54k71
4210a19k57L99K10o71O02M36j104M04N90p59K24M67m09j96J41M05n35o2Q69o31
4230Dm36Q79m95l57P36p1m48O8K76m3n58O61J35r00O71K29q37L88O22n74l2N4
4252b8M05n04j38Q29p17k65R79p60j24O72k80j24k0J57m1m63P74k66n22Q04l03
4273F5n54O75k6l10K35l43K34m70K61N43r19M71O44q49J61M54l93K42mq1m6l27
4295c37N85k74l77P80k22o39O17m1j75N5O9m3k13J12K96m41K65K17m61K77k7k18
4317a95L57j50M9l8j14M12m16k09N94m26J3K98m78J42K31k23K92j31n8L44o90
$$ plain form
4171 -361 287 125 -639 291 406 -846 1 428 -400 -86 335 122 -365 66 376 -278 -135 706 -350
4190 -350 -585 662 -12 -212 358 55 -106 -354 428 -111 -469 495 263 -713 238 192 -545 -2 152 -119
4210 -119 -376 23 233 -438 164 600 -504 -100 490 -269 -45 422 13 -183 -42 363 -172 -234 635 4
4230 4 -432 447 -48 -405 331 260 -188 -120 156 113 -445 216 351 -549 122 351 -486 -98 524 -50 -82 -28
4252 -28 377 -127 -265 564 -153 -418 561 -199 -323 349 69 -55 -75 82 41 -422 352 86 -436 368 65
4273 65 -489 186 160 -150 85 -258 -24 -494 -233 310 -609 -138 506 -343 -182 272 -121 121 117 36 -10 -337
4295 -337 248 -26 -403 377 155 -484 133 92 -83 -28 41 -2 -215 -103 193 -248 17 234 -227 50 23 -195
4317 -195 162 12 61 23 -91 321 -95 -304 290 -136 -123 175 -303 -161 70 -153 139 8 -50 294 -396
4338c96L59L62n18K97q9j50K71l26M07j19k37K87k44r4M97l05J4J60m42K48J78
4359A60k21L31m84J92J22l94L87k1k38M71k69m2K18l39M60l27k49M88k55j19M51
4380C22o28L58K1j75J95j22j97L48j01J42K1k24L85n33J52N7j19K00J83l71K75
4401A89k78j59M85m33K30%k23L83j81k61L71l01K32q5k55M65k28k83M95l35J9
4422a53K67k74J19J00k51K71j48J3K56k77J06j4j54L08k12l6K04k09o2K33m09
4443c22N64k91j76L42l85J77K90k77K06k8j84J91k37J31J44l32M04q2m68N62l50
4464a21J87K82m32J59j87M5K72l45K43R5m58K42J18k03J83k00K5K09j93J01J5
4485C7j37M16l00o4L68m98K25K11m44J67j30Q1J12l31L65Pm61O16k15k54K82j21
$$ plain form
4338 -396 -37 325 -193 104 15 -135 136 -190 217 98 -139 148 -96 -190 307 2 16 176 -266 -18 160
4359 160 -61 270 -214 -22 100 -294 93 72 -166 305 36 -6 212 -127 333 6 -243 245 -10 -129 322
4380 322 -306 52 73 -102 93 -29 -226 122 21 163 184 -40 345 -188 -36 21 -98 102 285 -86 189
4401 189 -89 -248 237 -196 34 34 -189 194 13 -248 123 -178 54 -31 -286 179 -49 -332 163 -172 -153
4422 -153 114 -160 -41 59 -192 79 -69 -56 200 -77 29 15 -139 169 -43 -79 125 -84 -146 87 -322
4443 -322 242 -49 -225 117 -268 -91 199 -78 128 100 -84 107 -130 1 145 -187 217 135 -333 229 -121
4464 -121 66 348 -84 75 -112 -67 205 -140 103 198 -260 -18 100 -103 80 -120 -95 114 -79 22 37
4485 37 -100 316 16 -48 320 -178 47 258 -186 -19 -149 -68 44 -287 78 85 -376 240 25 -229 53 -68
4507f8j74K41mN7j67l7M33n35K39K11n84M22K12m40K67J1n2k0o9K33j97j46N64
4530C97m46k15M72j34l32L73j32J23l18L65R8n80L71K57n90L24J43l81J48J32
4550G5k21l9n4M28l42j54P79o48q5M95m10k4L53p4o3j93O9K47n01O22q0p52P05
4573A33Q8m44K63J9j22k8J23J38n37J68M76o63M13M47q50K52K83p4j79J49K41
4594B96l74j50P06m54l79N98k27m37N40Pj01j49J41J21o15O08J18o25M32L80o51
4615b15J15N02k70j08j46L83m77Q6N32n09k38Q68m86k46N03m49p6L0K85R0l48
4636a74L05J99r02O30J79n83L97Q0l40j1K52K7m85M81L20o02J54N16o45j83N85
4657B00j44l17K35L20m97q2O70k92m51O34k01k52N25p3m59J1K38J52m04N25j2
$$ plain form
4507 -68 -242 -1 -5 52 -115 -152 281 -254 -15 196 -388 34 246 -194 73 84 32 12 -57 176 -21 -167 397
4530 397 -49 -264 208 74 -258 115 -17 106 -212 153 251 -329 42 299 -291 33 176 -205 -57 75
4550 75 -146 -185 -239 189 -153 -307 472 -176 -261 234 -176 -200 153 79 16 -177 -108 139 -362 260 180 -572 133
4573 133 221 -223 40 59 -63 -91 32 170 -367 -199 277 -386 27 474 -376 -124 159 85 -94 55 296
4594 296 -78 -228 478 24 -355 243 16 -421 119 126 25 -124 17 138 -477 131 249 -376 56 436 -215
4615 -215 -100 402 132 24 -122 261 -216 -130 402 -107 -345 523 37 -209 294 -155 -231 -201 84 174 -174
4636 -174 131 330 -572 58 237 -346 51 131 -209 -220 32 59 -426 55 375 -227 -73 443 -202 -385 200
4657 200 56 -261 -26 294 -203 -285 385 93 -358 276 75 -177 348 275 -184 -173 65 217 -187 338 326
4678C26q18L48M11n58L02N44l21m47M55j10k24L4M73n93l41Q25m17k52O95k48
4698H4k76L32j28l7k58N97l2o51M12K2o33N42K89m64K51J65k00k23J12L13m49
4719b32K25M06o07j61O00k17j28J33J22k31k25M56p0k17L30r9o09N70m5j89K44
4740E6J66k84j50J63K14n29L71L67o12J95K49n94K33L31j79n5j21L36m37j8N88
4761B90j46m37O01l59k38M36l1o0j90K59m7m55N78P2n04K53J97l63K44q2l0MP7
4784F9J78m03J14L62m90N7N17m98j8J76k3l8j08M5L6j23K58q3l42N23j99k57J45
4807a02O5J0J8lK32k83k5L53l62l3L02m75L34Q0j81K12j32R9j16j25L06q6j07
4830a9J48L0l26K64k53J85r7J72pk02J23Q8l04K48J9k37P2J08o2p7J32K24k80
$$ plain form
4678 326 -492 -144 267 -291 11 555 234 -213 242 132 -92 -58 415 -178 -519 306 -111 -363 332 84
4698 84 -192 140 12 -25 -283 314 282 -369 43 65 -568 -26 263 -201 50 215 15 -208 -96 217 -232
4719 -232 -7 399 -208 -369 231 14 -114 19 141 -90 -315 141 71 -146 184 85 -524 46 1 -188 56
4740 56 222 -62 -212 -49 165 -364 7 374 -238 -43 206 -388 -155 176 -3 -58 -179 157 -280 -298 290
4761 290 144 -293 308 -51 -289 147 116 56 -134 125 78 -377 201 273 -231 22 219 -144 100 18 -12 -8 69
4784 69 247 -156 -42 320 -170 -113 404 -94 -112 64 41 3 -105 -60 -24 -147 111 28 -314 209 10 -247 -102
4807 -102 -37 -27 -9 -12 220 -63 -88 265 -97 -130 172 -303 31 111 -70 142 10 109 -7 -132 174 88 -19
4830 -19 129 159 -167 97 -156 29 -68 104 97 -105 18 106 -198 50 69 -168 -96 12 -50 -127 5 229 -51
4853e1MJ68k52O0K33j07k39J35j37J01o5P8K74m41J72J69k60K09M3j55K63Ml31
4876a25L1j8J60k05J30J30j97N6J32o9j02J95j55J24j41KJ09j94J51o3k7J83p9
4899B8j58N05n29p7K77j44L42k42q0K67q5k31K29j96K77j41p3P8j06Q6J71k59
4921f1M2o5q1J20L2K4J63l03J45O4j29J15j48J18J03j34M6J39k52K21j85j29Q2
$$ plain form
4853 -51 -47 121 -131 -71 162 55 -184 -49 -186 -85 -150 -72 202 -239 -67 102 -158 51 94 -61 202 206 -125
4876 -125 -94 -112 48 -157 -27 103 -94 -38 94 25 -77 118 -37 87 -54 -52 57 -137 14 -49 -76 107 28
4899 28 -130 375 -154 -231 46 -98 244 2 -78 189 104 -127 102 -94 183 42 -31 47 -59 27 198 -61
4921 -61 -19 -84 -165 -45 -13 11 174 -129 16 80 -49 66 -82 36 139 5 51 190 -62 159 -26 -155 -73
$$ [...]
8191e1
##END NTUPLES=NMR FID
##END=
