##TITLE=1H_114-2024-Bay
 CDCl3
 8 sc, 
 23.12.2024
##JCAMPDX= 6.0         $$ Bruker NMR JCAMP-DX V2.0
##DATA TYPE= NMR FID
##DATA CLASS= NTUPLES
##ORIGIN= UXNMR, Bruker Analytische Messtechnik GmbH
##OWNER= root
$$ XWIN-NMR		Version 3.5
$$ Mon Dec 23 13:51:44 2024 Russian Standard Time (UT+4h)  she@DPX200
##.OBSERVE FREQUENCY= 200.1315
##.OBSERVE NUCLEUS= ^1H
##.DELAY= (6, 6)
##.ACQUISITION MODE= SIMULTANEOUS
##.ACQUISITION SCHEME= undefined
##.AVERAGES= 8
##.DIGITISER RES= 18
##SPECTROMETER/DATA SYSTEM= spect
##.PULSE SEQUENCE= zg30
##.SOLVENT NAME= CDCl3
##.SHIFT REFERENCE= (INTERNAL, CDCl3, 0, 15.7039)
##AUDIT TRAIL= $$ (NUMBER, WHEN, WHO, WHERE, WHAT)
$$ ##TITLE= Audit trail, XWIN-NMR		Version 3.5
$$ ##JCAMPDX= 5.01
$$ ##ORIGIN= Bruker BioSpin GmbH
$$ ##OWNER= she
$$ F:/spectra/data/she/nmr/H-F/1/audita.txt
$$ ##AUDIT TRAIL=  $$ (NUMBER, WHEN, WHO, WHERE, WHAT)
(   1,<2024-12-23 13:50:29.73 +0400>,<she>,<DPX200>,
      <created by zg, POWCHK disabled, PULCHK disabled
       configuration hash MD5:
       00 E9 B6 7A A2 85 ED C7 34 08 36 98 17 FE 4E 26
       data hash MD5: 16K
       CE AD E6 EF 40 01 81 79 4F 05 B6 81 E7 73 49 2D>)
$$ ##END=
$$ 
$$ hash MD5
$$ 1E CE 75 FB 03 60 60 19 54 B3 48 B3 76 75 3A BC
##$RELAX= 
##$RELAX= 
##$RELAX= 
##$RELAX= 
##$RELAX= 
##$RELAX= 
$$ Bruker specific parameters
$$ --------------------------
##$DU= <F:/spectra>
##$EXPNO= 1
##$NAME= <H-F>
##$PROCNO= 1
##$TYPE= <nmr>
##$USER= <she>
##$AMP= (0..31)
100 100 100 100 100 100 100 100 100 100 100 100 100 100 100 100 100 100 
100 100 100 100 100 100 100 100 100 100 100 100 100 100 
##$AQSEQ= 0
##$AQ_mod= 1
##$AUNM= <au_zg>
##$AUTOPOS= <>
##$BF1= 200.13
##$BF2= 200.13
##$BF3= 200.13
##$BF4= 200.13
##$BF5= 200.13
##$BF6= 200.13
##$BF7= 200.13
##$BF8= 200.13
##$BYTORDA= 1
##$CFDGTYP= 0
##$CFRGTYP= 5
##$CHEMSTR= <none>
##$CNST= (0..31)
1 1 145 1 1 1 1 1 1 1 1 1 1 1 1 1 1 1 1 1 1 1 1 1 1 1 1 1 1 1 1 1 
##$CPDPRG= <>
##$CPDPRG1= <>
##$CPDPRG2= <>
##$CPDPRG3= <>
##$CPDPRG4= <mlev>
##$CPDPRG5= <mlev>
##$CPDPRG6= <mlev>
##$CPDPRG7= <mlev>
##$CPDPRG8= <mlev>
##$CPDPRGB= <>
##$CPDPRGT= <>
##$D= (0..31)
0 1.2 0 0 0 0 0 0 0 0.06 0 0.03 0 0 0 0 0.0002 0 0 0 0 0 0 0 0 0 0 0 0 
0 0 0 
##$DATE= 1734947429
##$DBL= (0..7)
120 120 120 120 120 120 120 120 
##$DBP= (0..7)
150 150 150 150 150 150 150 150 
##$DBP07= 0
##$DBPNAM0= <>
##$DBPNAM1= <>
##$DBPNAM2= <>
##$DBPNAM3= <>
##$DBPNAM4= <>
##$DBPNAM5= <>
##$DBPNAM6= <>
##$DBPNAM7= <>
##$DBPOAL= (0..7)
0.5 0.5 0.5 0.5 0.5 0.5 0.5 0.5 
##$DBPOFFS= (0..7)
0 0 0 0 0 0 0 0 
##$DE= 6
##$DECBNUC= <off>
##$DECIM= 24
##$DECNUC= <off>
##$DECSTAT= 4
##$DIGMOD= 1
##$DIGTYP= 9
##$DL= (0..7)
0 120 120 120 120 120 120 120 
##$DP= (0..7)
150 150 150 150 150 150 150 150 
##$DP07= 0
##$DPNAME0= <>
##$DPNAME1= <>
##$DPNAME2= <>
##$DPNAME3= <>
##$DPNAME4= <>
##$DPNAME5= <>
##$DPNAME6= <>
##$DPNAME7= <>
##$DPOAL= (0..7)
0.5 0.5 0.5 0.5 0.5 0.5 0.5 0.5 
##$DPOFFS= (0..7)
0 0 0 0 0 0 0 0 
##$DQDMODE= 0
##$DR= 18
##$DS= 0
##$DSLIST= <SSSSSSSSSSSSSSS>
$$ [...]
##$SUBNAM2= <"">
##$SUBNAM3= <"">
##$SUBNAM4= <"">
##$SUBNAM5= <"">
##$SUBNAM6= <"">
##$SUBNAM7= <"">
##$SUBNAM8= <"">
##$SUBNAM9= <"">
##$SW= 24.0689530833862
##$SWIBOX= (0..15)
0 0 2 0 0 0 0 0 0 0 0 0 0 0 0 0 
##$SW_h= 4816.95568400771
##$TD= 16384
##$TD0= 1
##$TE= 0
##$TE2= 300
##$TE3= 300
##$TEG= 300
##$TL= (0..7)
0 120 120 120 120 120 120 120 
##$TP= (0..7)
150 150 150 150 150 150 150 150 
##$TP07= 0
##$TPNAME0= <>
##$TPNAME1= <>
##$TPNAME2= <>
##$TPNAME3= <>
##$TPNAME4= <>
##$TPNAME5= <>
##$TPNAME6= <>
##$TPNAME7= <>
##$TPOAL= (0..7)
0.5 0.5 0.5 0.5 0.5 0.5 0.5 0.5 
##$TPOFFS= (0..7)
0 0 0 0 0 0 0 0 
##$TUNHIN= 0
##$TUNHOUT= 0
##$TUNXOUT= 0
##$USERA1= <user>
##$USERA2= <user>
##$USERA3= <user>
##$USERA4= <user>
##$USERA5= <user>
##$V9= 5
##$VALIST= <valist>
##$VCLIST= <CCCCCCCCCCCCCCC>
##$VD= 0
##$VDLIST= <DDDDDDDDDDDDDDD>
##$VPLIST= <PPPPPPPPPPPPPPP>
##$VTLIST= <TTTTTTTTTTTTTTT>
##$WBST= 1024
##$WBSW= 4
##$XGAIN= (0..3)
0 0 0 0 
##$XL= 0
##$YL= 0
##$YMAX_a= 747237
##$YMIN_a= -972003
##$ZGOPTNS= <>
##$ZL1= 120
##$ZL2= 120
##$ZL3= 120
##$ZL4= 120
##$ABSF1= 10
##$ABSF2= 0
##$ABSG= 5
##$ABSL= 3
##$ALPHA= 0
##$AQORDER= 0
##$ASSFAC= 0
##$ASSFACI= 0
##$ASSFACX= 0
##$ASSWID= 0
##$AUNMP= <proc_1d>
##$AZFE= 0.1
##$AZFW= 0.1
##$BCFW= 1
##$BC_mod= 2
##$BYTORDP= 1
##$COROFFS= 0
##$CY= 11.3945322036743
##$DATMOD= 1
##$DC= 2
##$DFILT= <>
##$DTYPP= 0
##$F1P= 15.6554695791079
##$F2P= 12.8336369535428
##$FCOR= 0.5
##$FTSIZE= 0
##$FT_mod= 4
##$GAMMA= 1
##$GB= 0.15
##$INTBC= 1
##$INTSCL= 1
##$ISEN= 128
##$LB= 0.24
##$LEV0= 0
##$LPBIN= 0
##$MAXI= 10000
##$MC2= 0
##$MEAN= 0
##$ME_mod= 0
##$MI= 1.114404
##$NCOEF= 0
##$NC_proc= 0
##$NLEV= 6
##$NOISF1= 3.799351
##$NOISF2= 2.8
##$NSP= 1
##$NTH_PI= 0
##$NZP= 0
##$OFFSET= 15.70392
##$PC= 1
##$PHC0= -26576.84
##$PHC1= 19.38744
##$PH_mod= 1
##$PKNL= yes
##$PPARMOD= 0
##$PSCAL= 0
##$PSIGN= 0
##$REVERSE= no
##$SF= 200.130013532006
##$SI= 16384
##$SIGF1= 3
##$SIGF2= 2
##$SINO= 400
##$SIOLD= 16384
##$SREGLST= <1H.CDCl3>
##$SSB= 0
##$STSI= 0
##$STSR= 0
##$SW_p= 3612.71676300578
##$SYMM= 0
##$S_DEV= 0
##$TDeff= 0
##$TDoff= 0
##$TI= <>
##$TILT= no
##$TM1= 0
##$TM2= 0
##$TOPLEV= 0
##$USERP1= <user>
##$USERP2= <user>
##$USERP3= <user>
##$USERP4= <user>
##$USERP5= <user>
##$WDW= 1
##$XDIM= 8192
##$YMAX_p= 0
##$YMIN_p= 0
$$ End of Bruker specific parameters
$$ ---------------------------------
##NTUPLES= NMR FID
##VAR_NAME=  TIME,          FID/REAL,        FID/IMAG
##SYMBOL=    X,             R,               I
##VAR_TYPE=  INDEPENDENT,   DEPENDENT,       DEPENDENT
##VAR_FORM=  AFFN,          ASDF,            ASDF
##VAR_DIM=   8192,          8192,            8192
##UNITS=     SECONDS,       ARBITRARY UNITS, ARBITRARY UNITS
##FACTOR=    0.0002076,     1,               1
##FIRST=     0,             0,               0
##LAST=      1.7004516,     0,               0
##MIN=       0,             -972003,         0
##MAX=       1.7004516,     747237,          0
$$ Real data points
##PAGE= N=1
##DATA TABLE= (X++(R..R)), XYDATA
$$ [...]
2371B177k352J84J994j511n86J316r02J35J111j289k68K140j350j939K686N62
$$ 2177 -175 9 2003 492 -94 1222 320 455 1566 277 9 2149 799 -1140 1546 2108
2387B108k979J398K063k297o53K496r55j472J026J02k66O49j150j28K081j278
$$ 2108 -871 527 2590 293 -360 2136 1181 -291 735 837 571 1220 70 -58 2023 745
2403G45k344K200J580l289n6L214k075j660K329%j635K31N65q9O65j163p84K196
$$ 745 -1599 601 2181 -1108 -1164 2050 -25 -1685 644 644 -991 -760 -195 -284 381 -782 -1566 630
2421F30l66k649J551K433l228j073L953q27l109J628J429j201n34N86O8P99q29
$$ 630 264 -2385 -834 1599 -1629 -2702 1251 424 -2685 -1057 372 -829 -1363 -777 -709 90 -739
2438g39j573K720K02l143J061L149k053k534L060J032l188P8K260q39m13j13J56
$$ -739 -2312 408 610 -2533 -1472 1677 -376 -2910 150 1182 -2006 -1928 332 -507 -920 -1033 -877
2455h77J014n34j846J753K121l641o54M445q22l974K430K731k637j202K011L14
$$ -877 137 -397 -2243 -490 1631 -2010 -2664 1781 959 -3015 -585 2146 -491 -1693 318 632
2471F32q03p4L5R41P1k052Q29L225k900j728L342J218l820P17K697j217j851J232
$$ 632 -171 -245 -210 731 802 -1250 -421 2804 -96 -1824 1518 2736 -1084 -367 2330 1113 -738 494
2489D94R31o93k38r22J816O53k756Q0L224q31l863K988K217l585o38L143o69k355
$$ 494 1425 732 494 -428 1388 2041 -715 -635 2589 1758 -2105 883 3100 -485 -1123 2020 1351 -1004
2507a004J243R31J15n96r19O46K040k502j304L271N31l932Q54L454k178k017K721
$$ -1004 239 1170 1285 689 -230 416 2456 -46 -1350 1921 2452 -1480 -626 2828 650 -1367 1354
2524A354M54k462L79R59K86m86j054K55J719p76k873K175K378l452q38L662j339
$$ 1354 1808 -654 -275 684 970 484 -570 -315 1404 628 -2245 -70 2308 -1144 -1982 1680 341
2541C41k676J492K095k196p95J414L17L4j150m76J769K08k851Q87L264k351k281
$$ 341 -2335 -843 1252 -944 -1739 -325 -8 26 -1124 -1600 169 377 -2474 -1587 1677 -674 -2955
2558b955L539L01l231Q90K142j013j165Q95J34K79l33j451J849J276k698n57L453
$$ -2955 584 885 -2346 -1456 686 -327 -1492 -597 -463 -184 -517 -1968 -119 1157 -1541 -2098 1355
2575A355j405k797K928J570l276j54K302m52j268P16J45O28l14j583P82K282k287
$$ 1355 -50 -2847 81 1651 -1625 -1779 523 71 -1197 -481 -336 292 -22 -1605 -823 1459 -828
2592h28j096L506k95l561J967K241k470p87K299M25j536j7M80K84J27j214L32
$$ -828 -1924 1582 1287 -2274 -307 1934 -536 -1323 976 1401 -135 -152 328 612 739 -475 -143
2609a43K307j687k167K960J105l463M19L500j741k189J952J073j475M5J42K39
$$ -143 2164 477 -1690 1270 2375 -1088 -669 2831 1090 -1099 853 1926 451 496 638 877
2625H77Q72j871k69K468o92k876J868K749l522j171L461q9k803J043J651j213
$$ 877 1749 -122 -391 2077 1385 -1491 377 3126 -396 -1567 1894 1805 -998 45 1696 483
2641D83m29k1O81M68j270j154K749N04l519Q99L541k589k882L199J056k794K62
$$ 483 54 33 714 1182 -88 -1242 1507 2011 -1508 -609 2932 343 -2539 660 1716 -1078 -816
2658h16J724l55p68l55M98R58p98k018K094J683l467o63L730p66l574K366J824
$$ -816 908 553 -215 -570 -72 886 88 -1930 164 1847 -1620 -2283 1447 681 -2893 -527 1297
2675A297k055j373J898M66j139j56j19J641l96k132R90L075k576k199L008J174
$$ 1297 -758 -2131 -233 233 -906 -1062 -1181 460 64 -2068 -1078 1997 -579 -2778 230 1404
2691A404l486N33K719j110k187J754R98r93o14k62J505M12k215l82L255q45l056
$$ 1404 -2082 -1549 1170 60 -2127 -373 625 -368 -982 -1244 261 673 -1542 -1924 1331 486 -2570
2708b570K150K369l044r57L122m92j916M37J424j98l93q36Q86J733k030j410K832
$$ -2570 -420 1949 -1095 -2052 1070 578 -1338 -901 523 325 -68 -904 -18 1715 -315 -1725 1107
2725A107Q54l306O60K822j582k015K494P22j876j2O21N73j98r61k51K160n17k960
$$ 1107 1961 -1345 -685 2137 555 -1460 1034 1756 -120 -132 489 1062 864 -97 -348 1812 1295 -1665
2743a665K276J581k710n80L478q10k788J699J188j131o78O80K64O37j065r07J915
$$ -1665 611 2192 -518 -1098 2380 1570 -1218 481 1669 538 -140 540 804 1441 376 -531 1384
2760A384K62k646L64K927j317k186K200M62k328R91J150j252n3K14n22N85K43
$$ 1384 1646 -1000 -636 2291 974 -1212 988 1450 -878 113 1263 11 -42 172 -350 235 478
2777D78j781J437J452k217n11K905r49k668J918J179k119%J118o90j49L32o10
$$ 478 -1303 134 1586 -631 -1142 1763 814 -1854 64 1243 -876 -876 242 -448 -597 -265 -875
2794h75N51L32j340O32J342r29j575K096M24k703J482J269j489l80J004k04q99
$$ -875 -324 8 -1332 -700 642 -287 -1862 234 658 -2045 -563 706 -783 -1163 -159 -363 -1262
2811a262J319n96q2O65r53m67J761k04j999J992K84j706K75J672j260o53J518
$$ -1262 57 -539 -621 44 -909 -1376 385 181 -1818 174 458 -1248 -973 699 -561 -1214 304
2828C04n23p18N54J80o05R67J95j276J192P96k361R01J579j466r58K322o77j577
$$ 304 -219 -937 -383 -203 -808 159 354 -922 270 1066 -1295 -394 1185 -281 -1239 1083 406 -1171
2846a171J368L86q86M34K70o21Q17J5j029R99Q87k047J65K087j397j389K063L00
$$ -1171 197 583 -303 131 401 -220 597 612 -417 582 1469 -578 -413 1674 277 -1112 951 1251
2864A251j668Q91R13j127P6O27p18K99M95r32J36J321j575m31K012m69j753J195
$$ 1251 -417 474 1387 260 336 963 245 544 1039 107 243 1564 -11 -442 1570 1101 -652 543
2882E43J099k247Q20Q28q55q8P44j017M72R62j376k34J984r28j945J868M75k331
$$ 543 1642 -605 215 1043 188 100 844 -173 299 1261 -115 -349 1635 707 -1238 630 1105 -1226
2900a226Q86J674j272p66J395p04j00M48p94n3J237j066n35J654n56k005J173
$$ -1226 -340 1334 62 -704 691 -13 -113 335 -459 -512 725 -341 -876 778 222 -1783 -610
2917f10J785k399k2J889m36j462R97m9l37N49q40j66J591q32j511J721R60k435
$$ -610 1175 -1224 -1246 643 207 -1255 -258 -307 -644 -95 -935 -1101 490 -342 -1853 -132 828 -1607
2935a607N68J665j439m06J273j35q94Q09n8m52M91l01r07J767K38k226J283J308
$$ -1607 -1039 626 -813 -1219 54 -81 -975 -166 -224 -676 -185 -486 -1393 374 612 -1614 -331 977
2953I77j714n71J701k9j962J703L00o99q8L96k65L49K3q81R75P73j615n5J923
$$ 977 -737 -1308 393 364 -1598 105 405 -294 -382 14 -251 98 121 -760 215 988 -627 -682 1241
2972A241r79j362J814L42j505P21R43r76l0L09n93R58L32j896R94R80j292o37
$$ 1241 262 -1100 714 1056 -449 272 1215 239 209 518 -75 883 1215 -681 313 1293 1 -636
2990f36J932l78j789J368J095j522M7J068q83j05P12r06K55R62j415j92J683p64
$$ -636 1296 918 -871 497 1592 70 117 1185 302 197 909 3 258 1220 -195 -387 1296 532
3008E32j595K146K77k077R83R85j068n73R07J17o90N91n38j55R27q87n79J745
$$ 532 -1063 1083 1360 -717 266 1251 183 -390 517 634 -56 535 -3 -158 769 -118 -697 1048
3026A048j84k418J789R97j980J58J121n28q74R95L8p18N20k6p65Q74l56q51J274
$$ 1048 864 -1554 235 1232 -748 -590 531 3 -871 124 162 -556 -36 -62 -827 47 -309 -1160 114
3045A14M26k092P21J745j394q03J625m67r08O73R2o93L85M9n1L74M8j544J378
$$ 114 540 -1552 -831 914 -480 -1283 342 -125 -1033 -360 -268 -961 -576 -527 -578 -204 -156 -1700 -322
3064c22Q22j880L76J634o82j523J351P69j718M76Q42m36J21l31j70Q35J36j166
$$ -322 500 -1380 -1004 630 -52 -1575 -224 545 -1173 -697 145 -291 -170 -501 -671 164 300 -866
3082h66N41J519j756r11K147k19j888J145J615j548k78J005j05k11K8m36O06M49
$$ -866 -325 1194 -562 -1473 674 455 -1433 -288 1327 -221 -499 506 401 190 218 -218 388 837
3100H37j548L65J690j018j592K254M54k045Q48J256p84q32O61K55l12k41k0K09
$$ 837 -711 -346 1344 326 -1266 988 1442 -603 245 1501 717 -115 546 801 489 248 228 437
3118D37Q91j527m43J959P5k276J183J568j889o51K037n30j165L45M35J44l64m17
$$ 437 1328 -199 -642 1317 1392 -884 299 1867 -22 -673 1364 834 -331 14 449 593 229 -188
3136a88J94J075o96j315J868L89k446O04J787j148j262J589R3j013M15N27j44
$$ -188 6 1081 385 -930 938 1327 -1119 -515 1272 124 -1138 451 544 -469 -54 473 329
3153C29l66l12k66J129l7j939J413J033j798p25K420o19j901J708N78r94j85L78
$$ 329 -37 -349 -615 514 477 -1462 -49 984 -814 -1539 881 262 -1639 69 647 -347 -532 -154
3171a54L2K13n66k81Q72j6j716Q20J680j616j115J920J96j835P39J260q46l00
$$ -154 -122 91 -475 -756 116 100 -1616 -796 884 -732 -1847 73 269 -1566 -827 433 -413 -713
3189g13K14k6M35k54o25N70J230j831l22K180l12k475J891R97j638j64J545o98
$$ -713 -499 -525 -90 -344 -969 -399 831 -1000 -1322 858 546 -1929 -38 959 -679 -843 702 4
3207Dl78J06J35L26m0p11K23R22r30q02K010l1k134J167J317j548k35J230j34
$$ 4 -374 -268 -133 193 153 -558 -335 587 -343 -1145 865 834 -1300 -133 1184 -364 -599 631 497
3226D97q09N26j25K89M38r12K2J184n56j557J934P51k340K72J916j003j191J693
$$ 497 -312 214 89 378 816 -96 -74 1110 554 -1003 931 1682 -658 -386 1530 527 -664 1029
3244A029j70r29O82p4J67K03n81o11J755l43j842P60J325j382n17J472k41j118
$$ 1029 859 -70 612 538 705 908 327 -284 1471 1128 -714 46 1371 -11 -528 944 703 -415
3262d15L62R23q20J49j32j03Q26n75p97P96J026j810j83K042j257j100J302K95
$$ -415 -53 870 50 199 67 -36 790 215 -582 214 1240 -570 -753 1289 32 -1068 234 529
3280E29j329K11J143o55l12L04n05N06K58q57q2J648j511l91J665k17j638J098
$$ 529 -800 -589 554 -101 -413 -109 -614 -108 150 -707 -789 859 -652 -1043 622 405 -1233 -135
3298a35J086j418j85O17P8n47K48k98M53P5m54k58J321p85j416J975J81j855N05
$$ -135 951 -467 -652 -35 43 -504 -256 -554 -101 -26 -480 -738 583 -202 -1618 357 538 -1317 -812
3317h12J250n65o60P77Q8n42J78j42K37N25m99p15J612o36j627J043J583j576
$$ -812 438 -127 -787 -10 78 -464 -286 -428 -191 334 -165 -880 732 96 -1531 -488 1095 -481
3335d81q43K059o30p09M36J56K81J6l87L6J068p60r32J349L63j814M32J596r65
$$ -481 -1324 735 105 -604 -168 -12 269 285 -102 -66 1002 242 -690 659 1022 -792 -360 1236 271
3354B71j094J566j81p08L14K21j72N45l55o47J154k94j347J082J054j570rJ575
$$ 271 -823 743 562 -146 168 389 217 762 407 -240 914 620 -727 355 1409 -161 -170 1405
3372A405o20r21M96M20n99k11L30o7L93k43o59P81N63j390P2J333q90q16R39M45
$$ 1405 785 -136 360 780 181 -30 300 233 626 383 -276 505 1068 -322 -250 1083 193 -623 316 761
3392G61j504O85J023m35r18N01l15K35L50j176N67R40j147k67J442o87j194P73
$$ 761 -743 -58 965 530 -388 113 -202 33 383 -793 -226 714 -433 -700 742 55 -1139 -366
3410c66J072j396K8R08J70r30J99p6J15O93r25j97J209o58p76J020L93j379J41
$$ -366 706 -690 -662 246 416 -514 -315 -391 -276 417 -508 -705 504 -154 -930 90 483 -896 -755
3429g55J176r16m63J213m93j61l5K2J9N05m72n05J081O7j528R80R52j356R5J240
$$ -755 421 -495 -958 255 -238 -399 -434 -412 -393 112 -360 -865 216 283 -1245 -265 687 -669 -574 666
3449F66r32m99O13L34m37M43l75j23P67n07n62P29J53q13L21J105j095m40J068
$$ 666 -266 -765 -152 182 -255 188 -187 -310 457 -50 -612 117 270 -543 -222 883 -212 -652 416
3468D16l06m82O64J99n10k6M3k95O13L06j313J048J57o93Q6J107n49p02R19N1
$$ 416 110 -372 292 491 -19 -45 -2 -297 316 622 -691 357 514 -179 -93 1014 465 -237 682 733
3488G33j136N89N00j59j31J11M6L01l61o30K17J258j310m93J214l14p58R06K37
$$ 733 -403 186 686 527 396 507 553 854 493 -137 80 1338 28 -465 749 435 -323 583 820
3507H20r62pQ01l85k47M23m62J6N93n59k58Q88k56r94J106J8q54j44P63j80n09
$$ 820 -142 -149 652 267 20 443 -19 -3 590 31 -227 661 405 -589 517 535 -319 -463 300 120 -389
3528c89M66j84r6j27J77l61Q09m93p16R81k0j150J291L18r72j74O90j06l97J92
$$ -389 77 -107 -203 -330 -153 -514 295 -198 -914 67 47 -1103 188 506 -466 -640 50 -56 -453 -261
3548b61J47n19M11J49m25P70n37n90O71N83j286L76Q51q08j78O43p9n98K59P45
$$ -261 -114 -633 -222 -73 -498 272 -265 -855 -184 399 -887 -511 340 -468 -646 -3 -82 -680 -421 324
3568C24q01L26J93m67N99j30p50O68O66q32l06P58k70q84J062K07n69J44J42n6
$$ 324 -477 -151 42 -425 174 44 -706 -38 628 -204 -510 248 -22 -906 156 363 -206 -62 80 24
3588B4J76J08m00L69M14j250L19P72m84m66N49L73r08K26P52n89k85N41j99J32
$$ 24 200 308 -92 277 691 -559 -240 532 48 -418 131 504 -404 -178 574 -15 -300 241 42 174
3608A74L16n21l0R10n53m04Q79m81p56J026J73q18J30O78q09J24M28l49l1N25
$$ 174 490 -31 -61 849 296 -108 771 290 -466 560 733 -85 45 723 -86 38 466 117 86 611
3628F11m57k05Q48p77j98Q33N6j376O83J086p92p06N72P9j12m4j39j17K77k96
$$ 611 154 -51 797 20 -178 655 711 -665 18 1104 312 -394 178 257 145 101 -38 -155 122 -174
3648a74n7O19r3j138J008K24j040M12R14q15n62J009n86k98N27k32k94P75l39
$$ -174 -231 388 295 -843 165 389 -651 -239 675 -140 -702 307 -279 -577 -50 -282 -576 199 -140
3667a40j61M26L02j347O42Q21q18l43Q59m54m10L58M23n55J64n1N4K48j88p77
$$ -140 -301 125 427 -920 -278 543 -275 -618 241 -213 -623 -265 158 -397 -233 -284 -230 18 -170 -947
3687i47P31M58r84N1J172m01q91P80M07j196K76N41j27P7j82P2L22K98p80J98
$$ -947 -216 242 -742 -691 481 80 -811 -31 376 -820 -544 -3 -130 -53 -235 -163 159 457 -323 -125
3707a25J209j387k68J218n26p16O42M70q45j24R88o85K28J7j44mN97p26K96N87
$$ -125 1084 -303 -571 647 121 -595 47 517 -328 -452 536 -149 79 96 -48 -52 545 -181 115 702
3727G02o73m76Q13N47j325L46Q14o89l72P66r4k47K75l76L56M16q40l97O96O65
$$ 702 29 -447 366 913 -412 -66 748 59 -313 453 359 112 387 11 367 783 -57 -454 242 907
3747I07j209M43P17q87k71J198j18q83L42J62m43L94m45k38J315q31m76N06K39
$$ 907 -302 141 858 -29 -300 898 780 -103 239 401 -42 352 -93 -331 984 153 -323 183 422
3766D22p08K91Q76r32m38M94J00o45O53K71m89K57m39K45L81j04j116P09O88p86
$$ 422 -286 5 881 -51 -489 5 105 -540 113 384 -105 152 -287 -42 339 235 -881 -172 516 -270
3786b70j73Q65l35p83N98L73m53k29L87N8j80k9k50M55K09j172J49J130o31l01
$$ -270 -443 422 87 -696 -98 275 -178 -407 -20 38 -142 -171 -421 34 243 -929 -780 350 -281 -582
3806e82P60N0q70J46O62o55%L27l58N63r7l99L92L55q85O1Q71l57o27Q85J79o10
$$ -582 178 228 -642 -496 166 -489 -489 -162 -520 43 -54 -453 -61 294 -591 -530 341 -16 -643 242 421 -189
3828a89k29N98j92j1K40l71J07L45m41J72M53m17n04Q22J5r60OJ501p07n74J098
$$ -189 -418 180 -12 -23 217 -154 -47 298 -143 29 482 65 -439 383 398 -562 -556 945 238 -336 762
3849G62k81l19J07j78J32J90k70m21O64J95j001N48Q08q48l7O64p59k17M07M08
$$ 762 481 162 269 91 223 413 143 -278 386 581 -420 128 936 88 51 715 -44 -261 146 554
3869E54j70p7l74M24j79J8l71N87L89j027J8J428r53o44J248o07p47N02N44o43
$$ 554 384 307 -67 357 178 196 -175 412 801 -226 -208 1220 267 -377 871 264 -483 19 563 -80
3889h0j00L98k1p2K87p97M89O32j191o2J009k92j102Q31M35q88J35O33k62j08
$$ -80 -180 218 197 125 412 -385 104 736 -455 -517 492 200 -902 -71 364 -524 -389 244 -18 -126
3909a26K53k98P4M21r35M18M50m92o27J099k77q52N75M32p55R9O45m36k02L45
$$ -126 127 -171 -97 324 -611 -193 257 -235 -862 237 -40 -892 -317 115 -640 -541 104 -332 -534 -189
3929a89j64K84R9o15j07J131M8j480R54J73o50K12Q23m92m13K67J40k49J48j08
$$ -189 -353 -69 30 -585 -692 439 487 -993 -39 134 -516 -304 519 27 -386 -119 21 -228 -80 -188
3949a88L0N38l46o99Q58k8q21M78P17o79j74P16m97j98M71k9k05MK35k69K09K6
$$ -188 -158 380 34 -665 193 165 -656 -178 539 -140 -314 402 -95 -293 178 149 -56 -52 183 -86 123 149
3971A49n13O20N12r20N3O52p50k46P26M7m79K42K60q4R2j27k84K82L83q67J98
$$ 149 -364 256 768 -152 -99 553 -197 -443 283 330 -149 93 353 269 361 234 -50 232 615 -252 -54
3992e4J007j042l18J228k75q16Q02K69p18q3L40l59M12j89k69N23k0l28k06J073
$$ -54 953 -89 -407 821 546 -270 532 801 83 0 340 -19 393 204 -65 458 438 110 -96 977
4012I77r00k22M36r0o99L45N69m89m7J99n7L37n57j30K49M18n15k79P38l35p03
$$ 977 77 -145 291 201 -498 -153 416 -73 -120 79 22 359 -198 -328 -79 339 -176 -455 283 -52 -755
4033g55J012K2q05J86L53k25k94M40m24J40J71j76J71M06m76o16P68K10m19J59
$$ -755 257 279 -526 -340 13 -212 -506 -66 -490 -350 -179 -355 -184 222 -254 -870 -102 108 -311 -152
4053a52K53n35j59O07O2m37N32O5o69N06l14j74L27K52o93L44M14o70k5P49l00
$$ -152 101 -434 -593 14 76 -361 171 236 -433 73 -241 -415 -88 164 -529 -185 229 -441 -466 283 -17
4074a7n45N53n1o9O7K93m34L56j17p30R46K01p92J38N01m68l26R15M4o05L42K69
$$ -17 -562 -9 -60 -129 -62 231 -203 153 36 -694 252 453 -339 -201 300 -168 -494 421 465 -140 202 471
4096D71n38L8K40o9L70j57m48rO15q28J43P08p5r77Q57N2J0j30M67p29J56q8k55
$$ 471 -67 -29 211 142 512 355 -93 -102 513 -315 -172 536 461 -516 341 393 403 273 740 11 167 79 -176
4119a76N37O7o94L13M26j52p19J044m61m64M15L95l67k20O68n81J97M3j99j93
$$ -176 361 428 -266 47 473 321 -398 646 185 -279 136 531 164 -56 612 31 228 271 72 -121
4139a21N35m87J13K78j82o55M94K76l35m4K81k05j75L32j46r8K60n02J42L81l76
$$ -121 414 -73 40 318 136 -519 -25 251 -84 -128 153 -52 -227 105 -41 -139 121 -381 -239 142 -234
4160b34q0O84j68r95N59L40p48M2O78k91k81L40k00m76P47m06l71P23K05n47M6
$$ -234 -314 370 202 -793 -234 106 -642 -600 78 -213 -494 -154 -354 -830 -83 -489 -860 -137 68 -479 -433
4181d33R20q32j52R25n01m33O68l35k35N43l0q06P52q3n43M70K51m05o2O56r24
$$ -433 487 -345 -497 428 -73 -506 162 -173 -408 135 105 -701 51 -32 -575 -105 146 -259 -321 335 -589
4202e89J8P35j57p01Q76k31r5P3J52k39L5K90p88N78P85p24n1M49k37q51J015
$$ -589 -571 164 7 -694 182 -49 -144 -71 81 -158 -123 167 -621 -43 742 18 -33 416 179 -672 343
4223C43j1m15Q6L52k67P5M27p53L06R4m89jN12k91k77R83n21k06L10J08l97J42
$$ 343 332 -83 3 355 88 163 590 -163 143 237 -252 -253 259 -32 -309 674 153 -53 257 365 -32 110
4245A10M13m38k8R5l81L82M01n62l7M88k08m48M95M16j053K44P12o90k01N12L7
$$ 110 523 85 57 152 -229 153 554 -8 -45 443 235 -213 282 698 -355 -111 601 -89 -290 222 259
4266B59k26L29n89K36m2m28P1J022l50q30J01R81q96L10L79o80K30J67l28l58
$$ 259 33 362 -227 9 -33 -461 -390 632 282 -548 -447 534 -362 -52 327 -353 -123 44 -284 -642
4286f42M77J33n33P39j63q04P74J70o50jN05J21m48O37m73o69P43r8k59L52p5
$$ -642 -165 -32 -565 174 11 -793 -19 151 -499 -500 5 126 -322 315 -158 -827 -84 -182 -441 -89 -164
4307a64k3J35j07j78K38K54n36k14J156o07o40J184k32o13N39j8l87L10M3k04
$$ -164 -187 -52 -159 -337 -99 155 -381 -595 561 -46 -686 498 266 -347 192 174 -213 97 140 -64
4327f4J9N91q62J07N31m73j92P02j83n95L65M97n37j48N60k98K6K20k68Q0L68
$$ -64 -45 546 -316 -209 322 -151 -343 359 176 -419 -54 443 -94 -242 318 20 46 266 -2 78 446
4348D46l86j09Q11l99m90M97%p04M23N33k24n59J57K21p9n0K01l24M14k75k16
$$ 446 60 -49 762 363 -127 370 370 -334 89 622 398 -161 -4 217 138 88 289 -35 379 104 -112
4369a12N94j97o01N06K42n92K17P78o51l6M7l6l79N71j7n51N32m82n4M17L02j098
$$ -112 482 285 -316 190 432 -160 57 835 184 148 195 159 -220 351 334 -217 315 -167 -221 196 498 -600
4391f00M14R15m98o10Q41k56m71K11qk83N40l54j53L01M19j105R43K22p18MM91
$$ -600 -186 729 231 -379 462 206 -265 -54 -62 -345 195 -159 -312 -11 408 -697 246 468 -250 -246 245
4412B45n5p29K56L37j96k81L73l4n4J39k80M15Qm86P2N89j83m14L37J10n30J53
$$ 245 190 -539 -283 54 -142 -423 -50 -84 -138 1 -279 136 144 -342 -270 319 136 -278 59 169 -361 -208
4434b08J69k33K77J86m62j6O05p90L54J94j55k59P47n2o61L87L08o46J89K89k52
$$ -208 -39 -272 5 191 -271 -287 318 -472 -118 76 -79 -338 409 357 -304 83 391 -255 -66 223 -29
4455b9J44J25l81J41K80k27j44Qo4l8k5Q33j214P67J80l16m9M50l1l97N68o32
$$ -29 115 240 -141 0 280 53 -91 -83 -147 -185 -210 623 -591 176 356 40 -9 441 410 13 581 -51
4477e1L7M25n65j01N54J7o32L43O91p89n0Q10k28q41O15j02k6k7L01m62J19K92
$$ -51 -14 411 -154 -255 299 316 -316 27 718 -71 -121 689 461 -380 235 133 107 80 381 -81 38 330
4499C30n67M39J39o43L40M26m25k23Q14m17l73n5N92l39k5J92n65L94r2m54M40
$$ 330 -237 202 341 -302 38 464 39 -184 630 213 -160 -215 377 38 13 205 -360 34 -58 -512 -72
4520g2M79k09j020J026J35j164R27K60o38J61N10n48R2R9k57L90n7j05O3Qo28
$$ -72 407 198 -822 204 339 -825 102 362 -276 -115 395 -153 -61 38 -219 171 114 9 72 80 -548
4541e48J00M99J69r67J41R13o18n8N10l00L2K01p01L65L00l60oN18j59o24P79
$$ -548 -448 51 220 -747 -606 307 -311 -369 141 -159 -127 74 -627 -262 38 -322 -328 190 31 -593 186
4562A86o5n25k45R12m89p6M64j31Mp4j01K11N42q91j53N82j27j21J33K99o69K28
$$ 186 121 -404 -649 263 -226 -302 162 31 35 -39 -140 71 613 -278 -431 151 24 -97 36 335 -334 -106
4584a06O94o43J11J94j70j24K57J12o21Q26k12m32K44L91n44mO27k67l68M00J51
$$ -106 588 -55 56 250 80 -44 213 325 -296 530 318 -114 130 521 -23 -27 600 333 -35 365 516
4605E16o18L16k99L33j10J33l08L05K35p08p6R12p14n0N94k78k64J85L62o27J64
$$ 516 -102 214 -85 248 138 271 -37 268 503 -205 -281 631 -83 -133 461 183 -81 104 466 -161 3
4626CK01QK92q1l52o1M63p49M18J61l07n85P34L14q07J59N26l45j89L36k27J71
$$ 3 204 212 504 423 71 10 473 -276 142 303 -4 -589 145 459 -348 -189 337 -8 -197 139 -88 83
4648H3o1l32L41L57o54l9M36M0m34O0L17k75j38K65k20O1K32l05j2J57j99k06
$$ 83 22 -310 31 388 -266 -305 131 171 -263 -203 114 -161 -299 -34 -254 -193 39 -266 -278 -121 -320 -526
4670e26N70l81k18J45N64m59lK96k70N8M28K3o62M27k4m0K18k30j69R9L41q39
$$ -526 44 -337 -555 -410 154 -305 -308 -12 -282 -224 204 227 -435 -8 -32 -72 146 -84 -253 -154 187 -652
4692f52O80P3m49r5M74q0j90M28j22m09L07K63n04O48K2o15K02K94k71r0M24l28
$$ -652 28 101 -348 -443 31 -49 -239 189 67 -342 -35 228 -276 372 394 -221 -19 275 4 -86 338 10
4714A0J02J01k81q8L08L35p08L97Jl25M90j15k58K11L15m09j73O45m00k07L61
$$ 10 112 213 -68 -156 152 487 -221 176 177 -148 342 227 -31 180 495 86 -87 558 158 -49 312
4735C12j80k11l2K63k1k06M68n00K42K31k91k00P48n97m31P88n8p18O42K83k55
$$ 312 132 -79 -111 152 131 -75 393 -107 135 366 75 -125 623 26 -405 383 325 -393 249 532 277
4756B77n53O57o74J63N65l46k77N02k01o46N04K11m24O66j63k55j06O10o63k66
$$ 277 -276 381 -293 -130 435 89 -188 314 113 -533 -29 182 -242 424 261 6 -100 510 -153 -419
4776d19N09j67l61N18j41k67O55l93l44J26J28l00LQ10q78J47L89J53n98N20L3
$$ -419 90 -77 -438 80 -61 -328 327 -66 -410 -284 -156 -456 -453 357 -521 -374 15 168 -430 90 123
4797A23m91K90J2n16O13K3n32J60N74m40j67N43m88%J90LM0j02l88K82J07J65
$$ 123 -368 -78 -66 -582 31 54 -478 -318 256 -184 -351 192 -296 -296 -106 -103 -63 -165 -553 -271 -164 1
4819Aq1p0L24k82j92O28l78l39N98j42l66M11k04L58n97L61j67K57K24o12K68
$$ 1 -80 -150 174 -108 -300 328 -50 -389 209 67 -299 112 -92 266 -331 30 -137 120 344 -268 0
4840@J21N9q0L81m18k87P49m33k64K24L59m58M21%m63K30j14J6L9N83p01l28P58
$$ 0 121 180 100 481 63 -224 525 92 -172 52 411 -47 374 374 -89 141 27 43 82 665 -36 -364 394
4863C94l5m21L02K39k10l38M17j63n69M64K56j63M13o70k43O98J5j022R93j12
$$ 394 359 -62 240 479 269 -69 348 185 -384 80 336 173 586 -84 -327 371 386 -636 357 245
4883B45n20Q3J67j82l9K25n3K03k64M02m10M22m41J4M16k71l76L01j01m0j63M87
$$ 245 -275 -192 -25 -207 -246 -21 -74 129 -135 267 -143 279 -162 -148 268 -3 -379 -78 -179 -219 -382 105
4905A05l3n83N66j17M8k40j9K27J2K99m33L27L9n01J34M98k83o53J100n19q4K79
$$ 105 72 -511 55 -62 -14 -254 -273 -46 -34 265 -168 159 198 -303 -169 329 46 -607 493 -26 -110 169
4927A69k50k73K79L2j97L37j2p3k50K96lk89L60N1o25N27K21n10N2L46m51L24
$$ 169 -81 -354 -75 -43 -240 97 85 12 -238 58 55 -234 126 177 -448 79 300 -210 -158 188 -263 61
4949F1J59k39k5L34k41j13M58j33l19M49Q4p97M60J11j92m0J47k00l43O04J34
$$ 61 220 -19 -44 290 49 -64 394 261 -58 391 475 -322 138 249 57 17 164 -36 -379 225 359
4970C59k00M70n75m00Q82j20m23M02O8n13J43J48k42J07K6L18k23j3r7j97M07
$$ 359 159 629 54 -346 536 416 -7 395 463 -50 93 241 -1 106 132 450 227 214 117 -80 327
4991C27k57n14J049n11m87N23j2q6k72M69J17m66L11j49J26K08j60k84M41K5q39
$$ 327 70 -444 605 94 -393 130 118 32 -240 229 346 -120 191 42 168 376 216 -68 373 398 -441
5012d41Q7M90k97k8M75k70l57P19j69p38J14K69J83j9Lj52l0K66o09L17L64m20
$$ -441 -354 136 -161 -189 286 16 -341 378 209 -529 -415 -146 37 18 21 -131 -161 105 -504 -187 177 -243
5034b43p8N21k58j39K19Kl44K0Q9o7p6O17o17K0N63n45n8N54l88k44M68j4p3m7
$$ -243 -321 200 -58 -197 22 24 -320 -300 -211 -278 -354 263 -354 -334 229 -316 -374 180 -208 -452 16 2 -71 -118
5058a18mL64l77j33%K35J75l42QL44k08k19N96l32k14L11J86l39l78O50r4l39
$$ -118 -122 242 -135 -268 -268 -33 142 -200 -192 152 -56 -275 321 -11 -225 86 272 -67 -445 205 111 -228
5080b28L07k69K18M37m43l86N54k28R6K04Q0m42K66J97j01m8j22J21j09J63l05
$$ -228 79 -190 28 465 22 -364 190 -38 58 262 342 -100 166 363 262 214 92 213 104 267 -38
5101c8j59L68l36K31J6K26o49L26O58o81P7O9Q1j40j00R0k1O9L05q49P50p4k70
$$ -38 -197 171 -165 66 82 308 -341 -15 643 -38 39 108 189 49 -51 39 18 87 392 -457 293 219 -51
5124e1J77J58m31J70L75m74N9K16L9j22Rj60j31K76M7k58l1L9M8J96n3k78J59
$$ -51 126 284 -147 23 398 -76 -17 199 238 116 125 -35 -166 110 157 -101 -132 -93 -45 151 98 -180 -21
5147b1k32K17j97J19K87l88j7O56m18j47J03j28j18N60n29K02J87mj46m0K43m81
$$ -21 -253 -36 -233 -114 173 -215 -232 424 6 -141 -38 -166 -284 276 -253 -51 136 132 -14 -54 189 -292
5169b92J49N5K07k61K54o9j60j02M4J22L19l71k94M34q1l40M28P6p4j76L40p3
$$ -292 -143 -88 119 -142 112 43 -117 -219 -175 -53 266 -105 -399 35 -46 -386 42 118 44 -132 208 135
5191A35n30K62P8k30M03k54q7N43o28j99Q20l44k88L57J80o2m7m4L2k66Q2K38
$$ 135 -395 -133 -55 -285 118 -136 -223 320 -308 -507 313 -31 -319 38 218 156 109 65 97 -169 -87 151
5213A51j62p4J42l16N80j55j86K9J06%O8K96m59k67L62J10j07L24J12p34J80K89
$$ 151 -11 -85 57 -259 321 166 -20 9 115 115 183 479 20 -247 115 225 118 442 554 -180 0 289
5235B89n66L51J32j92j04N67m27l70Q12k82k97M1N46m89K49p6Q2m09M96j16j92
$$ 289 -277 74 206 14 -90 477 50 -320 492 210 -87 -46 500 11 260 184 266 -143 353 237 45
5256D5M41m11k74M27Mm96M01l6n60L08J3J99j54L35k54r1K25k19l55N20l65J19
$$ 45 486 75 -199 228 232 -264 137 101 -459 -151 -138 61 -93 242 -12 -103 122 -97 -452 68 -297 -178
5278a78L70q1m83M05K14m59j53M86j17q3J95j95k45J27L9j52O01k71m21J56N15
$$ -178 192 111 -372 33 247 -212 -365 121 4 -79 116 -79 -324 -197 -158 -310 291 20 -401 -245 270
5299B70o07M86K78p77n7L22J05k63K67j44n46P70j7j96K93j11k93J22N77n66K84
$$ 270 -337 149 427 -350 -407 -85 20 -243 24 -120 -666 104 87 -109 184 73 -220 -98 479 -87 197
5320A97l48L28j54P6J20n38M38K4j79k0kk00K55K80l85j32P12l78m54O86k28m91
$$ 197 -151 177 23 99 219 -319 119 143 -36 -56 -58 -258 -3 277 -108 -240 472 94 -360 326 98 -393
5342c93N60p7j10p1k0r4M72J7p6m50N06k88j62M30J78l41J52J0m85L63r0N7j3
$$ -393 167 90 -20 -91 -111 -205 267 284 208 -242 264 -24 -186 244 422 81 233 243 -242 121 31 88 75
5365G5L73k57k67M69n36j69Q74o81KK16Q8m46J64K34m9n2J97j10k33q4N8J48O6
$$ 75 448 191 -76 393 -143 -312 562 -119 -117 99 187 -259 -95 139 90 38 235 125 -108 -192 -134 14 80
5388H0q1l71M14m6k65K99Q1m35n0N84o04J17K53k11R3J22j39r7L15q2k04J07J73
$$ 80 -1 -372 42 -4 -269 30 111 -324 -374 210 -394 -277 -24 -235 -142 -20 -159 -256 59 -23 -227 -120 53
5411E3l77K66O2n02L04N6L36n19L33Q8j98J52j40j32M79j91l74K2M82n08Q4K72
$$ 53 -324 -58 4 -498 -194 -138 198 -321 12 100 -98 54 -86 -218 261 70 -304 -282 200 -308 -224 48
5433D8k22j34K03j8Q1m35M15J11j93J42l91J65L12j19o6L77j50p97O57J9l34L29
$$ 48 -174 -308 -105 -123 -42 -477 -62 49 -144 -2 -393 -228 84 -35 -101 276 126 -671 -14 5 -329 0
5455@r5j79M35l02M7K16Q6m55P7N19m84Q2K38n5l93L48R8m26L45L6j21L60k17
$$ 0 -95 -274 161 -141 -94 122 208 -247 -170 349 -135 -53 185 130 -263 85 183 -243 102 138 17 377 160
5478A60N0k18N02p17K79l4K06j13rl25Q5l0K84q1l18M33l16o3M59n1j90M43m85
$$ 160 210 -8 494 -223 56 22 228 115 106 -219 -134 -164 120 39 -279 154 -162 -225 234 183 -7 436 -49
5501d9J10pR6l77K84j13L1j71M41o12J97K68r7k14p2J66j97N49o4k60M2K19n35
$$ -49 61 54 150 -227 57 -56 -25 -196 245 -367 -170 98 1 -213 -285 -119 -316 233 169 -91 -49 170 -365
5524c65K44M79m44j99L71k0j90K21k1k53Q1l4L2L04j09m63K15K23k58j77N50k95
$$ -365 -121 358 -86 -285 86 66 -124 97 76 -177 -96 -130 -98 206 97 -366 -151 72 -186 -363 187 -108
5546a08l60N09N0l41R2jm1LK17j07j92L57r4j68K55m61k8N86j29k40P2J07j04
$$ -108 -468 41 91 -250 -158 -159 -200 -197 20 -87 -279 78 -16 -184 71 -390 -418 168 39 -201 -129 -22 -126
5569a26J06J22k53J3L27k36k95O65m9l70K26p9j58K63K55n80K68k44J42p0L77
$$ -126 -20 102 -151 -138 189 -47 -342 323 274 -96 130 51 -107 156 411 -169 99 -145 -3 -73 304
5590C04m70K90O5j49k22L99J19m07K53K92o10J32M05m46L37N0l77P1K99P6m88
$$ 304 -166 124 189 40 -182 217 336 -71 182 474 -136 -4 401 -45 292 342 -35 36 335 411 -77
5611g7K19k89q3M55j00n28N60M3m83J98M74n81J79L74l28K33m88L17n37M02J81
$$ -77 142 -147 -230 225 125 -403 157 200 -283 -85 389 -192 -13 361 33 266 -222 95 -442 -40 141
5632A41j24R9R6n99L68M27n16j44N89j27k66K70k84j41K06j31j99J14K51k83K80
$$ 141 17 116 212 -387 -19 408 -108 -252 337 210 -56 214 -70 -211 -5 -136 -335 -221 30 -253 27
5653B7J45l90j6M13p5k91K58o8j78O8j78L5J61q8o2K32K11o86J06Q18n67l91P80
$$ 27 172 -218 -234 179 104 -187 71 3 -175 -107 -285 -250 -89 -177 -239 -7 204 -482 -376 442 -125 -516 264
5676B64j99m97M14l5l91L46K21n46N72j48K32m36J11J12l10M29N3m58J59L29k12
$$ 264 65 -432 -18 -53 -444 -98 123 -423 149 1 233 -203 -92 20 -290 139 192 -266 -107 222 10
5697A0p3L20j04J36m76O4K36Q0J%J1k22j7K95l28k10K02J13k12k22O36l66k28
$$ 10 -63 257 153 289 -187 -123 113 193 194 194 205 -17 -34 261 -67 -277 -75 38 -174 -396 240 -126 -354
5720c54O22J82l29K3j13K08K03po70L30K75k94PK86j77k00N98k16m16L57K46o70
$$ -354 268 450 121 144 31 239 442 435 -235 95 370 76 83 369 192 -8 590 374 -42 315 561 -109
5742a09J43Q2l77L86P0j1j02J63j13k45K17l3l37N36p8J08k81O4j35O2K72k55
$$ -109 34 116 -261 125 195 184 82 245 132 -113 104 71 -266 270 192 300 19 83 -52 10 282 27
5764B7M0K54n48j79P54p1o42M12L28l92k77N61k39k91L88m8j45J95l68J40J62
$$ 27 67 321 -227 -406 348 277 -365 47 375 -17 -294 267 28 -263 125 77 -68 127 -241 -101 61
5785F1k62j6M24J9p15J72L97o94K95M05m48J55K78j23l34J65K01j03K50k9k42
$$ 61 -201 -217 207 226 -489 -317 80 -614 -319 86 -362 -207 71 -52 -386 -221 -20 -123 127 98 -144
5806a44J09j59j01L92%L6l99M63o91L22J42j12j20R5L53j92Q0P7l26L27J63k83
$$ -144 -35 -194 -295 97 97 133 -266 197 -494 -172 -30 -142 -262 -167 186 -6 74 151 -175 152 315 32
5828C2k60P65r25K83N53n94L04L55o8k15o4j83Q6L11R0n60J43M40m88K6K40k57
$$ 32 -228 537 -388 -105 448 -146 158 513 445 230 166 -17 69 380 470 -90 53 493 5 31 271 14
5850A4j26J41L12k50N5L72n68K46L1m15L90l75N7K47L52n07m85P97o7l47J62L67
$$ 14 -112 29 341 91 146 518 -50 196 227 -188 202 -173 -116 131 483 -24 -509 288 221 -126 36 403
5872D03m71J60r1j39J47J79l93L54J72m18J49L81k68l24K48R3l88J00K25j84l38
$$ 403 -68 92 1 -138 9 188 -205 149 321 -97 52 433 165 -159 89 182 -206 -106 119 -65 -403
5893d03M26k49Q5J37N4k67L04P0p77J043k32o00J29L12j26n6J76l60L33n4m78
$$ -403 23 -226 -141 -4 50 -217 87 157 -620 423 191 -409 -280 32 -94 -150 26 -334 -1 -55 -533
5914e33N89L5p5k40J71J13k69K69k73L6n01R78l29j66J41k13J12L31k76j47L04
$$ -533 56 91 16 -224 -53 60 -209 60 -213 -177 -678 300 -29 -195 -54 -267 -155 176 -100 -247 57
5935E7Qj32J04K54o85J24M09m83J15K74J72o24L33N3k85N45k38j63P1K03l02J09
$$ 57 65 -67 37 291 -394 -270 139 -344 -229 45 217 -407 -74 -21 -306 239 1 -162 -91 112 -190 -81
5957h1L55k41j30M00l81l01N34J10n38K86K17k14K15r6j7j78L35n26M2O08l50
$$ -81 274 33 -97 303 -78 -379 155 265 -273 13 230 16 231 135 118 -60 275 -251 -209 399 49
5978D9j92J57J00m56N60k52l11J78L90k85K81R2k46l37L77Mk58n8J79j46K63O6
$$ 49 -143 14 114 -342 218 -34 -345 -167 223 -62 219 311 65 -272 105 109 -149 -207 -28 -174 89 155
6000A55l00R0K64l99J20K87j66j67N76k95j43J02L0m08L43J96m70K21jo6l38K03
$$ 155 -145 -55 209 -190 -70 217 51 -116 460 165 22 124 154 -254 89 285 -185 36 35 -31 -369 -166
6022a66K22j8J00m81k6O72l54k37M60l93k19O17L00r03J00M26J08m58K53k19J98
$$ -166 56 38 138 -343 -369 303 -51 -288 172 -221 -440 177 477 -426 -326 100 208 -250 3 -216 -18
6043a8J26k25R9j76P2NM7R5q9%L53n57r7M86o4n08L25M38p70P84p2m59J84K61
$$ -18 108 -117 -18 -194 -122 -117 -70 25 -64 -64 289 -268 -365 121 57 -451 -126 312 -458 326 254 -205 -21 240
6067B40l25p3L14m09j47N12j43N8K18l66k99J92M31m25J1N27j86j04J42p9p7K58
$$ 240 -85 -158 156 -253 -400 112 -31 27 245 -121 -420 -228 203 -222 -211 316 130 26 168 89 12 270
6089B70m85K0K67K18m18M92j3k47K17M1l24M7k03J66k39J97O0l39K11J23k05L18
$$ 270 -215 -195 72 290 -128 364 351 104 321 362 38 85 -118 48 -191 6 66 -273 -62 61 -144 174
6111A74N3k07N3J31J04p44P34jq9K32k31j15l65K22k20L44N9k23M0L09j92R2J12
$$ 174 227 20 73 204 308 -436 298 297 208 440 209 94 -271 -49 -269 75 134 -89 -49 260 68 160 272
6134B72k93r1J87j87q9Q1L11l92M09m68l13K57M05l2j58J43j82k34L61j35J27
$$ 272 -21 -112 75 -112 -201 -120 191 -201 208 -260 -573 -316 89 57 -101 42 -140 -374 -13 -148 -21
6155b1%J80n16K13K45m17L95k3k50j94O17m29k00N33k01j62K64J03k95k73J13
$$ -21 -21 159 -357 -144 101 -316 79 56 -194 -388 229 -200 -400 133 -68 -230 34 137 -158 -431 -318
6176c18J60k5J62j2k20L0L81l08L65k13m13P09q9m43K26r3L9K24L2j25R6L6l11
$$ -318 -158 -183 -21 -33 -253 -223 158 -150 215 2 -411 298 209 -234 -8 -101 -62 162 194 69 165 201 -110
6199a10J45K42l24n2O52n65N0L61K00p07R1J21r6K7K75k2j67n3K58j66J43k10
$$ -110 35 277 -47 -99 553 -12 38 399 599 -108 -17 104 8 35 310 288 121 68 326 160 303 93
6221I3K8P6L1l83K30K60n25K94J75m34O7nJ43k1k6k9j8N22j07m53L19k22j53o2
$$ 93 121 197 228 -155 75 335 -190 104 279 -155 -88 -93 50 29 3 -26 -44 478 371 -82 237 15 -138 -200
6245b00L70k76J62K60k03Rk8K56m23j47J23l31P81k51l58L19K35j34m03K20N6
$$ -200 170 -106 56 316 113 122 94 350 -73 -220 -97 -428 353 102 -256 63 298 164 -239 -19 37
6266C7q1Q1j27r3oK61k08L0m4k66L17L14j27k28L98j6m30M26l10o8l74Q49o67
$$ 37 -44 37 -90 -183 -189 72 -136 -106 -150 -416 -99 215 88 -140 258 242 -188 238 -72 -140 -514 335 -332
6289c32O95j77m20K07m07J89Q4L19j03j59J58j92Q1K01o8N9l32L55q6k75J90M5
$$ -332 363 186 -234 -27 -434 -245 -161 158 55 -104 54 -138 -57 144 76 135 -197 158 72 -203 -13 32
6311C2k25jJ57j80M47l37j88L14L25k85p9K92o4j81K50m61l4L37k80k57K26R8
$$ 32 -193 -194 -37 -217 230 -107 -295 19 344 59 -20 272 208 27 277 -184 -218 119 -161 -418 -192 -94
6333i4m17R34j27p58P28Q4n12K70J31k21P0J89q2k26K58l03O97n50j74j20P2K09
$$ -94 -511 423 296 -462 266 350 -162 108 239 18 88 277 195 -31 227 -76 621 71 -103 -223 -151 58
6355E8J67j61l9j24n9O94k84j93k8Q7k08J30M99q91M58L00k57N3Rk63j32L02j5
$$ 58 225 64 25 -99 -158 536 252 59 31 118 -90 40 539 -352 106 406 149 202 211 -52 -184 118 103
6378A03j27K08l20J71J06k97J56K10l0m21K82J02n52J60J18K5k12L96K45m82R4
$$ 103 -24 184 -136 35 141 -156 0 210 180 -241 41 143 -409 -249 -131 -106 -318 78 323 -159 -65
6399f5J94n02R9N64o00L24l8k79L37L51m31k77K88J93k36j16J54j44J42P0M4j
$$ -65 129 -373 -274 290 -310 14 -24 -303 34 385 -46 -323 -35 158 -78 -194 -40 -184 -42 28 72 71
6421G1J49r7l08k2K8r7J46L3J11k1j3k38K1N59l95k7K39m0k78k6J57q5M45o09
$$ 71 220 123 -185 -207 -179 -276 -130 -97 14 -7 -20 -258 -237 322 -73 -100 139 99 -179 -205 -48 -133 312 -297
6445b97L0N35m45J10l8J80m70K04M85n26J20K78k61j28M04k32N29l72K2j1k25
$$ -297 -267 268 -177 -67 -105 75 -395 -191 294 -232 -112 166 -95 -223 181 -51 478 106 128 117 -108
6466a08K46m26J45M32l50m99Q55J76m13R8J77j68J82J9k37j61J27K7K39j93p0
$$ -108 138 -288 -143 289 -61 -560 295 471 58 156 333 165 347 366 129 -32 95 122 361 168 98
6487I8m20M77k74k35P64k42l38L53j63k17M1O53p69J22K43l22L25r9r4k9L24j69
$$ 98 -322 155 -119 -354 410 168 -170 183 20 -197 -156 497 -272 -150 93 -229 96 -3 -97 -126 198 29
6509B9o50P26N4l51J39J48k70MJ01%P8L34n72L87j65J50o22L94K36n92J58P01
$$ 29 -621 105 159 -192 -53 95 -175 -171 -70 -70 8 342 -230 157 -8 142 -480 -86 150 -442 -284 417
6531D17m60k05K77j00j9M7N44p88M98q1l38M6J56l18K58M02k32q3J51k54k88K83
$$ 417 -43 -248 29 -71 -90 -43 501 -287 211 130 -208 -162 -6 -324 -66 336 104 21 172 -82 -370 -87
6553h7L75l38l8J4k2m5P9l8J04J81l31k6J83l9j14L00l36L4M81m19j84J80K79
$$ -87 288 -50 -88 -74 -96 -141 -62 -100 4 185 -146 -172 11 -28 -142 158 -178 -144 337 -82 -266 -86 193
6576A93j93j09K55l10O8K30l22j60M83K8r5o7J57m51J28K07k14K06O6k87k2L36
$$ 193 0 -109 146 -164 -96 134 -188 -348 135 163 68 1 158 -293 -165 42 -172 34 100 -187 -209 127
6598A27N4k51P0M19n45M00k45j65pK95J0r6K3j69M7J91k95J74J49l90K41J49l20
$$ 127 181 -70 0 419 -126 274 29 -136 -143 152 162 66 89 -80 -33 158 -137 37 186 -204 37 186 -134
6621a34k2J42J70k94J53J39j90r9J82l19M98k57n9K15j00q2j94M28l02l91L91
$$ -134 -156 -14 156 -138 15 154 -36 -135 47 -272 226 -31 -90 125 25 -57 -251 177 -125 -516 -125
6642a25J6q6M4J15R6k86L62j82l39M24n0j21o1L99n56J91O6J89j01L93l64m23
$$ -125 -109 -195 -151 -36 60 -226 136 -46 -385 39 -11 -132 -193 206 -350 -159 -93 96 -5 388 24 -399
6664c99L85O8l38L38Q5l46Q3K27k08m0L62l83j10L91m61J11J96J22k00O3N6j5
$$ -399 -14 54 -284 54 139 -207 -124 103 -105 -145 217 -166 -276 115 -346 -235 -39 83 -117 -54 2 -13
6686a3j76K92O6m42N61m29J38j77k4k28L70Q2k2K29k33q0K32j08r4J5K31l19L51
$$ -13 -189 103 169 -273 288 -141 -3 -180 -204 -432 -62 20 -2 227 -6 -86 146 38 -56 -41 190 -129 222
6709B22n8j90j84N68l29J94J40k71j82K90L1l10J04K38j66k23O0o1J70L0m1k67
$$ 222 164 -26 -210 358 29 223 363 92 -90 200 231 -79 25 263 97 -126 -66 -127 43 73 32 -235
6731b35M38k20K93o20N68j96r5L62q6l77M19q3l51N69k46k43L75k49k60M18j06
$$ -235 203 -17 276 -344 224 28 -67 295 209 -168 251 168 -183 386 140 -103 272 23 -237 181 75
6752G5m31M63j30j07J54j1K76o58L87Q9j77J22J04l18M0K38l37j4J55ok60O70
$$ 75 -356 107 -23 -130 24 13 289 -369 18 107 -70 52 156 -162 -122 116 -221 -235 -80 -86 -346 324
6774C24m37j22N09r1k40K29l93%K2L48m56O19k12m06K99K03l75Q5J52k76K10j25
$$ 324 -113 -235 274 183 -57 172 -221 -221 -199 149 -307 312 100 -306 -7 196 -179 -94 58 -218 -8 -133
6796a33K06n76L03M66k41J02k23o2O1j19R2p5K96l87L71Q2j97j33R0L44l58j15
$$ -133 73 -503 -200 266 25 127 -96 -158 -97 -216 -124 -199 97 -290 81 163 -34 -167 -77 267 -91 -206
6818b06K15j65L3K02k82R3l6J66Q8J47k77J29j22Kj47J22M16k92p8N7j03J59j61
$$ -206 9 -156 -123 79 -203 -110 -146 20 108 255 -22 107 -15 -13 -160 -38 378 86 8 65 -38 121 -40
6841d0K9J10k24J77j59J81j1j87qL44k13j24M06l81K94J43l81L99j74M0l84J30
$$ -40 -11 99 -125 52 -107 74 63 -124 -132 212 -1 -125 281 -100 194 337 -44 355 181 221 -163 -33
6863c3l26L07K82k21j54R8N0j48RJ87n9J20l03L67k38K00N2l32j58M47m46J44
$$ -33 -359 -52 230 9 -145 -47 3 -145 -136 51 -8 112 -191 176 -62 138 190 -142 -300 147 -299 -155
6885a55Q7j57J76O4k70l3J63q0j06k36M73j2J45jl27L38J02j79k05J35j05k25
$$ -155 -68 -225 -49 15 -255 -288 -125 -205 -311 -547 -74 -86 59 58 -269 69 171 -8 -213 -78 -183 -408
6907d08N26p3n8R1r8m43K06K24j21Q7R3k30J50L87l45j80L54J8l75J66J39m79
$$ -408 118 45 -13 78 -20 -463 -257 -33 -154 -67 26 -204 -54 333 -12 -192 162 180 -195 -29 110 -369
6929c69L74J8j92L4J20k3O0m5k54L25L13l87M6j9K15k04K46J57m91j24M90k74
$$ -369 5 23 -169 -135 -15 -38 22 -23 -277 48 361 -26 20 1 216 12 258 415 -76 -200 290 16
6951A6l07N88j29n32O07J0n72K45L45m84L70J46n14J7O01m31Q1K2J34o07M32N2
$$ 16 -291 297 168 -364 243 253 -319 -74 271 -213 157 303 -211 -194 407 -24 57 79 213 -394 38 90
6973I0n07O48j53K75l18J99j9k31K46k68pl3J20o0J26J74l68J24J28j8l65K20
$$ 90 -417 231 78 353 35 234 215 -16 230 -38 -45 -78 42 -18 108 282 -86 38 166 148 -217 3
6995Cj76k69K65m0L99j52K42o36K85L63j92L19o29L09k5O99j323K61J81j76L27
$$ 3 -173 -442 -177 -217 182 30 272 -364 -79 284 92 411 -218 91 66 765 -558 -297 -116 -292 35
7016C5Q7j19j01J72q1l88N14%l21J34M8p5J57K2l2k31K98k41R8q8M5l99L67J07
$$ 35 122 3 -98 74 -7 -395 119 119 -202 -68 -20 -95 62 84 52 -179 119 -122 -24 -112 -67 -466 -99 8
7040Hj77n6J66l00L18K04k78J58L3k21J50K14J82p10J19K03J27k97L75m26K67
$$ 8 -169 -225 -59 -359 -41 163 -115 43 76 -145 5 219 401 -309 -190 13 140 -157 218 -208 59
7061E9o6K19l94K13K18l26N66l68l00J39K66l77K31M1l39n1M60l25q6J48K8Q8
$$ 59 -7 212 -182 31 249 -77 489 121 -179 -40 226 -151 80 121 -218 -269 191 -134 -220 -72 -44 44
7083D4q6M6K61l50O6j35K23L10o27K38M46n8m34mJ97q6m4j54J91j21N66o95J97
$$ 44 -42 4 265 -85 -19 -154 69 379 -248 -10 436 378 -56 -60 137 51 7 -147 44 -77 489 -206 -9
7106iJ87K6j62K1j14K89j44j7l65O09k22j18o8J51l83L03K70j85k3l1j41N4K61
$$ -9 178 204 42 63 -51 238 94 77 -288 321 99 -19 -87 64 -319 -16 254 69 46 15 -126 -72 189
7129A89j60J81Nl21j41L35J4p5j44K65l36Q1Q9j98J7J28j12r8N96k44j09J71o1
$$ 189 29 210 215 -106 -247 88 102 27 -117 148 -188 -107 -18 -216 -199 -71 -183 -281 315 71 -38 133 72
7152G2M1l36M28k08k30r8M43k40J33k06J18L07l55J5J62J75k74N0M87k78m37O28
$$ 72 113 -223 205 -3 -233 -331 112 -128 5 -201 -83 224 -131 -116 46 221 -53 -3 484 206 -231 397
7174C97m05N2j27k81j79M32J09k26j8K84L2j20L00k61n37P11l52N0K51k77K09
$$ 397 -8 44 -83 -364 -543 -111 -2 -228 -246 38 70 -50 250 -11 -548 163 -189 -139 112 -165 44
7195D4l9m4L05l79J16k12J9L20k37J71m9q9k1L68l49j95K02K09m43L08l7q0K94
$$ 44 5 -39 266 -113 3 -209 -190 130 -107 64 15 -74 -95 273 -76 -271 -69 140 -303 5 -32 -112 182
7218A82j82r8j6M34k08m60O46l81q9P7K62k29J91l53R8j0N4J7l9O40o92J60J02
$$ 182 0 -98 -114 320 112 -348 298 -83 -172 -95 167 -62 129 -224 -126 -136 -82 -65 -104 536 -156 4 106
7241A06j55j21R6j41k1J45K91m79K9O84n02n1J14M35m56k36J79J16L6J39m27M47
$$ 106 -49 -170 -74 -215 -236 -91 200 -279 -250 434 -68 -119 -5 430 -26 -262 -83 33 69 208 -219 228
7263B28n37J62L38k59Q2QjP5j29J52l69J23j02R0J36O1K01n11K58q8K7k82K91
$$ 228 -309 -147 191 -68 14 22 21 96 -33 119 -250 -127 -229 -139 -3 58 259 -252 6 -82 -55 -337 -46
7286d6P9o4J11l76Q8K76L2k26L8J7k75Q0L86j08k99M81o75L87J92l96K9K94q2
$$ -46 33 -31 80 -296 -208 68 100 -126 -88 -71 -346 -266 120 12 -287 194 -481 -94 98 -298 -269 25 -57
7309e7j29KJ99j68M06p2l35J5J73o5J85j2q6k54J84j63Q6K08k3l19K14K71P5l64
$$ -57 -186 -184 15 -153 253 181 -154 -139 34 -31 154 142 56 -198 -14 -177 -91 117 94 -225 -11 260 335 -29
7333b9L31n66M08J37n78NN30J63o21K43J76Ml27J98J2Q4J92j16k97K29k53M6K10
$$ -29 302 -264 144 281 -297 -292 238 401 -220 23 199 203 -124 74 86 170 362 246 -51 178 -75 -29 181
7356A81k49j31L07p7J6k05O61l74m1K3j51K13j58j69J72N7nJ7k19O6k87J16J45
$$ 181 -68 -199 108 31 47 -158 503 129 88 111 -40 173 15 -154 18 75 70 87 -132 -66 -353 -237 -92
7379i2K21l05L73O3m0k53L7j00n1L10l60n3M19l31j19L84k31K62j90J86m66K99
$$ -92 129 -176 197 260 220 -33 4 -96 -147 163 -197 -250 169 -162 -281 103 -128 134 -56 130 -336 -37
7401c7J42m04J28J59r4l3L39n84O5K66K05j71Q7m54K74N38m09j24J14L65m50j64
$$ -37 105 -299 -171 -12 -106 -139 200 -384 -319 -53 152 -19 68 -386 -112 426 17 -107 7 372 -78 -242
7423b42L03j88K02l9k1k51J66N0r8K47k69o4K09K45l90K85J47k28k20L75p7n0
$$ -242 61 -127 75 36 15 -236 -70 -20 -118 129 -140 -204 5 250 -140 145 292 64 -156 219 142 92
7445I2K08l55p1o1R2R2L35m28Q4o8j13J96l9M95l01k20K68n3l52K26L6m4M56k84
$$ 92 300 -55 -126 -187 -95 -3 332 -96 -12 -80 -193 3 -36 459 158 -62 206 153 -199 27 63 19 475 191
7469A91l38L43k81j10O5J99k75M73j96P3J18l13K27k28R6K62l00n7k2M4J53J16
$$ 191 -147 196 -85 -195 -130 69 -206 267 71 144 262 -51 176 -52 44 306 6 -51 -73 -29 124 240
7491B40j00M8J8q5j5j5j33k43O16p0m12P1lj68K27k88J92J74Q6l13K58J38j47
$$ 240 140 188 206 121 106 91 -42 -285 331 261 -151 -80 -83 -251 -24 -312 -120 54 140 -173 85 223 76
7514G6l61J06K45k24K51j55r1K3K05m8k13K94j45kJ9p0n1J41L1J3J57O5m21j04
$$ 76 -285 -179 66 -158 93 -62 -153 -130 75 27 -186 108 -37 -39 -20 -90 -141 0 31 44 201 266 -155 -259
7538b59L75l23Q5L4N6p5L89l72k9J09O8k52j08M48l29L96l39J26j84L50j10k30
$$ -259 116 -207 -122 -88 -32 -107 282 -90 -119 -10 58 -194 -302 146 -183 213 -126 0 -184 166 56 -174
7560a74L17k95L90M4l58K45l32L30n41K31J95j26j8P2q3l9LK94j67n5N7r2K59
$$ -174 143 -152 238 282 -76 169 -163 167 -374 -143 52 -74 -92 -20 -103 -142 -139 155 -12 -67 -10 -102 157
7583A57m4j46j0L56m90K34J13Kr5o3k79K32K48p1l95M08l08M12r8k62N1K52J85
$$ 157 113 -33 -43 313 -177 57 170 172 77 14 -265 -33 215 144 -251 157 -151 261 163 -99 -48 204 389
7606C89n02L82l27K5l87N92j3k66J70m8J13k93O8o6J48j51K9J05M0j81L0o0N30
$$ 389 -113 269 -58 -33 -420 172 159 -107 63 15 128 -165 -97 -163 -15 -166 -137 -32 8 -173 -143 -203 327
7629C27n53K24R4O1j39j45J13j22J74r3k71M52l54J59j41L41k60N8L07m16Q8J08
$$ 327 -226 -2 92 153 14 -131 -18 -140 34 -59 -330 122 -232 -73 -214 127 -133 -75 232 -184 -96 12
7651A2l33K63N3j60J5K11oL3l74M70l58Q7K27m75M4L79l18k59L06J1K70j51M2
$$ 12 -321 -58 -5 -165 -150 61 55 88 -286 184 -174 -87 140 -335 -291 88 -230 -489 -183 -172 98 -53 -11
7674a1k05L68L26m07K59m8l76J38R3m45L58Q4J32l49K38k24O7K38k76k27J79J84
$$ -11 -216 152 478 71 330 282 -94 44 137 -308 50 134 266 -83 155 -69 -2 236 -40 -267 -88 96
7696I6p5R6j56r7M25m7k54q1L51j00j30o6J24k19K85j74K8n5J17O0k44O29n54
$$ 96 21 117 -39 -136 289 242 -12 -93 258 158 28 -38 86 -133 152 -22 6 -49 68 128 -116 513 -41
7719d1j5Q9jj36L23j36K15k10k54J67q3M26L6l05j43K66l82J76Q3l03J06L26j64
$$ -41 -56 33 32 -104 219 83 298 88 -166 1 -82 344 380 75 -68 198 -184 -8 75 -228 -122 204 40
7742D0j73J70l4r1J3j41j9L27rm09M00j18M70n22L20m01L03N4k39J31k73R2j64
$$ 40 -133 37 3 -88 -75 -216 -235 92 83 -326 74 -44 426 -96 224 -177 126 180 -59 72 -201 -109 -273
7765b73L84k27KN1r1k50M48oq3J92k30j97K03L26k03l30k2O2L34O5m9k62K84k82
$$ -273 111 -116 -114 -63 -154 -404 44 38 -45 147 -83 -280 -77 249 46 -284 -306 -244 90 155 106 -156 128 -154
7789a54P6N5J18m04L40k1J31j28p2o6J91j5J02j66J45r3k96J24R5r8O1k9K0M4
$$ -154 -78 -23 95 -309 31 10 141 13 -59 -125 66 51 153 -13 132 39 -257 -133 -38 -136 -75 -104 -84 -40
7813d0K98j60k43K16j81K40j99J53m8JK96m2l70L68K4k89j72L92m14J25J18j88
$$ -40 258 98 -145 71 -110 130 -69 84 36 37 333 291 -79 289 313 24 -148 244 -170 -45 73 -115
7835a15o8N58l94k85L07K1K19j92j9n3j5J12k74L27N4j29l9O6J2K6j33l17K28
$$ -115 -183 375 -19 -304 3 24 243 51 32 -21 -36 76 -198 129 183 54 15 81 93 119 -14 -331 -103
7858a03L58j5m30K92Q7k31JR4q0K64m01P2K02k22R1j62L77j45p2o2M23j95j5q
$$ -103 255 240 -190 102 189 -42 -41 53 -27 237 -164 -92 110 -112 -21 -183 194 49 -23 -85 338 143 128 120
7882A20l04M24l59K61k75P5pJ26J10l01k40L93l07J5M31q9L1l13K02j94K73L02
$$ 120 -184 240 -119 142 -133 -58 -65 61 171 -130 -370 23 -284 -269 162 73 104 -209 -7 -201 72 374
7904C74o10J09K55k95K56n1k5k2J8J47l70K44j54k85M15J5m67P4M8J46K6N63n32
$$ 374 -236 -127 128 -167 89 38 13 -9 9 156 -214 30 -124 -409 6 21 -446 -372 -324 -178 -152 411 -121
7927a21l01M42j41K65r5J56N4l74O2J98m0K97l49k20L94j10l81N63j37j86k94
$$ -121 -422 20 -121 144 49 205 259 -115 -53 145 105 402 53 -167 227 117 -264 299 162 -24 -318
7948c18J55J14L11k27J21j90M86n95K33K15l25j18M22k62J38K04j07m80J32nP
$$ -318 -163 -49 262 35 156 -34 452 -143 90 305 -20 -138 284 22 160 364 257 -223 -91 -96 -89
7969h9K10J03n29M47k24J76j09k1J91p2K6m76J95J22L46l46j59J91J55l85M31
$$ -89 121 224 -305 142 -82 94 -15 -36 155 83 109 -367 -172 -50 296 -50 -209 -18 137 -248 183
7990A83r2J10Q6m01J68j55K12k61K39l2k7K27k15k90J71M29n29J73o8M5o4J64
$$ 183 91 201 287 -114 54 -101 111 -150 89 57 30 257 42 -248 -77 352 -177 -4 -72 -27 -91 73
8012G3l19L03J04M11n80l44L41q5J20Q0k42j60L37J30l33L9k2k7M24k34k92M38
$$ 73 -246 57 161 572 -8 -352 -11 -96 24 104 -138 -298 39 169 -164 -125 -147 -174 250 16 -276 162
8034A62r5J4m7J23l13J39Q4k61lr8M45j19r1M72p24N58J9m58J56J83j85K82j76
$$ 162 67 81 34 157 -156 -17 67 -194 -197 -295 150 31 -60 412 -312 246 265 -193 -37 146 -39 243 67
8057F7l30K40PL74n54L26k41J99P4k22M15j28k74J22r6k3R1L5J38k8k11n2rr6
$$ 67 -263 -23 -16 358 -196 130 -111 88 162 -60 355 227 -47 75 -21 -44 47 82 220 192 -19 -71 -80 -176
8081a76J85j11J10j93K67M0j69L05K20q4j70q5j88K52n63L25L13k45R1j46K87
$$ -176 9 -102 8 -185 82 122 -47 258 478 394 224 139 -49 203 -360 -35 278 33 124 -22 265
8102B65K67l98l97K50p2J03J78k22n7J73k61J98r2M5N5n5K71m42K41p5q3j32J32
$$ 265 532 134 -263 -13 -85 18 196 -26 -83 90 -171 27 -65 -20 35 -20 251 -191 50 -25 -108 -240 -108
8125a08J53k70L17l26J20L61k74j26L8J81J22P5M4n32J89N10m68r4L93m56n3L28
$$ -108 45 -225 92 -234 -114 247 -27 -153 -115 66 188 263 307 -225 -36 474 6 -88 305 -151 -204 124
8147A24l03L81k43J01j87L37m07l2M38k64j63j39L19J37l49O5K13p9K42l1J5l97
$$ 124 -179 202 -41 60 -127 210 -197 -229 209 -55 -218 -357 -38 99 -250 -185 28 -51 191 160 175 -222
8169b22K67o0J74k5m62N93j10l97K43J11o2M8k10K85k12N9m9j79M63j79k90J53
$$ -222 45 -15 159 134 -328 265 155 -242 1 112 50 98 -112 173 -39 20 -29 -208 255 76 -214 -61
8191f1
$$ Imaginary data points
##PAGE= N=2
##DATA TABLE= (X++(I..I)), XYDATA
0@%%%Qk4L2l2M0o4Q8j04J28j68K08k48L02l66M40n20O07p18Q46r76J123j298J494
$$ 0 0 0 0 8 -16 16 -16 24 -40 48 -56 72 -96 112 -136 166 -200 240 -280 327 -391 455 -521 602 -696 798
26G98j705J937k201K495k813L162l549L978m447M954n513O136o812P545q361R264
$$ 798 -907 1030 -1171 1324 -1489 1673 -1876 2102 -2345 2609 -2904 3232 -3580 3965 -4396 4868
42D868j0257J1353j2574J3944j5482J7218j9204K1504k4196K7395l1274L6104
$$ 4868 -5389 5964 -6610 7334 -8148 9070 -10134 11370 -12826 14569 -16705 19399
54A9399m2304N0583o2291Q0251j11564J81479n92965J11677J112972p07621m96745
$$ 19399 -22905 27678 -34613 45638 -65926 115553 -477412 -365735 747237 39616 -457129
65d57129M51325K62613p75849j53133Q05317L79328o22024j41647N15822j31393
$$ -457129 -5804 256809 -519040 -672173 133144 512472 -109552 -251199 264623 133230
75A33230p81920K76594J057967r851r69819n9660O71747q8425n67400K85103O38854
$$ 133230 -648690 -372096 685871 676020 -293799 -353459 318288 229863 -337537 -52434 586420
86E86420k01939n99221J08936L56269k82219l00375N50830M72367o10131o53394
$$ 586420 384481 -214740 -105804 250465 -31754 -332129 218701 691068 80937 -572457
96e72457M31225N10834l96339l32174M96381L03903n23197l81774L39579K54251
$$ -572457 -141232 369602 -26737 -358911 137470 441373 -81824 -463598 -124019 130232
106A30232k48943j7854M14420n0245o22227p4168O30472J46396m86662j1087M73198
$$ 130232 -118711 -136565 277855 227610 -394617 -468785 161687 308083 -178579 -189666 283532
117B83532q3543n19117K7648M61181P3650k42914K7651J44488k06716k44428K64197
$$ 283532 199989 -319128 -291480 169701 243351 437 28088 172576 -34140 -278568 -14371
128a4371L71592j89876l46557J69959K52719k58043k66795K64269L07162j44215
$$ -14371 357221 167345 -179212 -9253 243466 -14577 -281372 -17103 290059 145844
138A45844k48604K4777Q6932p5401k9558J80406R0691k12496j44879J84370J00977
$$ 145844 -102760 -77983 8949 -66452 -96010 84396 175087 -37409 -182288 2082 103059
149A03059k11962n7246K76222J06713k44540j58497J27313J33615l5133m8869
$$ 103059 -108903 -166149 110073 216786 -27754 -186251 -58938 74677 39544 -9325
159i325O2136K7154j13200m9828J26197M2847j24009J3915J60622m1493k10089
$$ -9325 52811 79965 -33235 -83063 43134 85981 -38028 -24113 136509 95016 -115073
170a15073j7552J78554P5203j05063q9863M8115N4955p5274o0769R3129N8100
$$ -115073 -132625 45929 121132 16069 -73794 -25679 29276 -45998 -106767 -13638 44462
181D4462r2159k5732Q4680m1010j21833N7072J62499r256j54441l7260J32145
$$ 44462 -47697 -73429 11251 -29759 -151592 -94520 67979 58723 -95718 -132978 -833
192h33N8617j20616m4118J52660N2440j46986k6655J33107j3869j05447P8724
$$ -833 57784 -62832 -106950 45710 98150 -48836 -75491 57616 43747 -61700 17024
203A7024J25247r1437j39789P3069J50216m8209j52891M4022J63560n3338j78626
$$ 17024 142271 50834 -88955 -15886 134330 86121 -66770 -22748 140812 87474 -91152
214i1152N2991J54292p5095j19502R9225P4288j37001p0618J35567O8041j33113
$$ -91152 -38161 116131 41036 -78466 20759 95047 -41954 -112572 22995 91036 -42077
225d2077p9878J25776Q8097j36796j02182J44214J02555j42125p0235J46325L2534
$$ -42077 -121955 3821 91918 -44878 -147060 -2846 99709 -42416 -112651 33674 66208
236F6208j42110R331J48134j6787j33100K5574J36430j4775j38176J4181J57223
$$ 66208 -75902 -66571 81563 64776 -68324 -42750 93680 78905 -59271 -45090 112133
247A12133q086j59823J9576J50786m5591j32815P0042J07932r2927r3603Q9101
$$ 112133 104047 -55776 -36200 114586 68995 -63820 6222 114154 21227 -72376 16725
258A6725P2777r2662p7290Q3728P9370r2070r6771R0662Q9506j04392p4595J12503
$$ 16725 89502 -3160 -80450 3278 82648 -9422 -106193 -15531 73975 -30417 -105012 7491
270G491M6950j16762k0276J11992M530r5808Q161R3302J050q6630l839R9659J5215
$$ 7491 54441 -62321 -82597 29395 33925 -61883 -53722 39580 40630 -46000 -49839 49820 65035
283F5035j00018j3J08369j3345r8040L5653Q6166m8862o6165N1614M8114n0356
$$ 65035 -34983 -34996 73373 60028 -38012 -2359 83807 34945 -31220 20394 68508 18152
295A8152m7591L6401M5193l8657o1824L2341N7737n2313o1330N4764L8990o9201
$$ 18152 -29439 6962 52155 13498 -48326 -15985 41752 -10561 -71891 -17127 21863 -47338
307d7338k6207N9524L919n2648J158L9116K762l1327r492L5806K2241l8009j3922
$$ -47338 -73545 -14021 -10102 -62750 -61592 -22476 -19714 -51041 -60533 -24727 -2486 -40495 -54417
320e4417N5581J2882m9166J1883N2875j4343k9265K7878K4225j4599p634J0853
$$ -54417 1164 14046 -35120 -23237 29638 15295 -13970 13908 38133 23534 15900 26753
332B6753J4272K954j9959k267K9814o077l5609J4832K6398k9093k0652K3807o29
$$ 26753 41025 43979 24020 21753 51567 45490 9881 24713 51111 22018 1366 25173 24544
345B4544k4726n23M419p011k796r654o806J3581n715k3009J1723J7064k2798o671
$$ 24544 -182 -705 3714 -3297 -6093 -15747 -22553 -8972 -14687 -37696 -25973 -8909 -31707 -38378
359c8378K4769l741j4660J3918P069n444Q284L342m095J4374M797j3456J3285
$$ -38378 -13609 -17350 -32010 -18092 -11023 -16467 -8183 -4841 -8936 5438 10235 -3221 10064
372A0064J6780j5343j420K1748o121j1140J4113J086j0931P671N10j1865Q176
$$ 10064 26844 11501 10081 31829 25708 14568 28681 29767 18836 26507 27017 15152 23328
385B3328J774j7599M375R921j8306n631J4700j0162j3322J0934k500j1656P922
$$ 23328 25102 7503 11878 21799 3493 -2138 12562 2400 -10922 12 -2488 -14144 -6222
398f222m10j1402R093L670j4968O790J2925j3779j917J7987o559q784J4851O63
$$ -6222 -6632 -18034 -8941 -5271 -20239 -13449 -524 -14303 -16220 1767 -4792 -13576 1275 1938
412A938r165R127K726q670Q835L255j2919P811J0122j7185k427J6884r949j2979
$$ 1938 -7227 1900 4626 -4044 4791 8046 -4873 2938 13060 -4125 -6552 10332 383 -12596
426a2596J2117J88j3644N655K515j0188L797J074r549P236M772j5875M395J8252
$$ -12596 -479 -291 -13935 -8280 -5765 -15953 -12156 -11082 -20631 -13395 -8623 -24498 -20103 -1851
440a851j3821j0788K1114L113j5881R675J1863q570J463Q628j377M466J449p147
$$ -1851 -15672 -26460 -5346 -2233 -18114 -8439 3424 -5146 -3683 4945 3568 8034 9483 2336
454B336J2112J0411j9834j553K6720p585k3773J6323J2494k0379m718J4546n507
$$ 2336 14448 24859 5025 3472 30192 22607 -1166 15157 27651 7272 2554 17100 11593
467A1593j1164k00K211M283p777j8268J1352J9059k5192j9370L0177Q097l2678
$$ 11593 429 229 2440 6723 -1054 -19322 -7970 11089 -14103 -33473 -3296 4801 -27877
480b7877L658K6659j1867j6035J6130J3010r321j1314P349K4182Q40k9074O738
$$ -27877 -24219 2440 -9427 -25462 -9332 3678 -5643 -16957 -9608 14574 15414 -13660 -6922
493f922M1426j1070l6629K4921L1337k7848j4838L1099L752k9013N74K5729L603
$$ -6922 34504 23434 -13195 11726 43063 15215 377 31476 35228 6215 6789 32518 36121
506C6121k7557j5869K8413J8918m1626k3844M4351J2480n0241m201L8321j5856
$$ 36121 8564 -7305 21108 40026 -1600 -25444 18907 31387 -18854 -23055 15266 -590
518e90l3499K2312K4822k6774k5877J9372K9528j5053l8431J6754M9837j7983
$$ -590 -34089 -11777 13045 -13729 -39606 -20234 9294 -5759 -44190 -27436 22401 4418
530D418n0357K6455M2487k9487k0270M0239Q348l9096J373L9244J893l4083n043
$$ 4418 -45939 -19484 23003 -6484 -26754 13485 21833 -17263 -15890 23354 25247 -8836 -13879
543a3879L8672J5448m7362k4699M9624K2142m7426r395L8645j4385l6804K3126
$$ -13879 24793 40241 -7121 -31820 17804 39946 -7480 -16875 21770 7385 -29419 -6293
555f293K6028k9391k1766K4703J9892k6252l5197J8157M7452j0590m8389J0463
$$ -6293 19735 -9656 -31422 -6719 13173 -13079 -48276 -30119 17333 6743 -41646 -31183
567c1183L5819j9335j8567L2292R495k8719N751K7478j1137k5128J1316L5702
$$ -31183 4636 -14699 -33266 -974 8521 -20198 -14447 13031 1894 -23234 -11918 23784
579B3784J2856l2608k6737K8295K8945k2106j2922K5063K84k0021P242M245k0021
$$ 23784 36640 4032 -22705 5590 34535 12429 -493 24570 24854 4833 12075 16320 -3701
592c701M471K6542Q61k4403k1086K08K6383J1888k6578j3283J9700K409j8386
$$ -3701 770 27312 28173 3770 -17316 -17108 9275 21163 -5415 -18698 1002 3411 -14975
605a4975m286K452P294K0579j634l0295o710J6708P544J0397Q379k1271j1543
$$ -14975 -19261 -16809 -9515 11064 9430 -20865 -27575 -10867 -3323 7074 15453 -5818 -17361
618a7361K6233R468k4079n868K7180K3457j0531l6212r968L5895J6737k1487J777
$$ -17361 8872 18340 -5739 -11607 15573 39030 28499 -7713 -17681 18214 34951 13464 15241
631A5241J4211k6562j4745L5458M719m1031M336M7013n470n6977k1106M6334L7563
$$ 15241 29452 2890 -11855 23603 28322 -12709 -8373 38640 33170 -23807 -44913 1421 38984
644C8984l3143l7539K7730J7003m2426l857N0720r576m8281K9651M6874m7417
$$ 38984 5841 -31698 -3968 13035 -29391 -33248 17472 7896 -40385 -10734 36140 -11277
656a1277n7880M5844P3179k1615p0878P426O2108j0174n6554K7347N8612l8620
$$ -11277 -69157 -23313 49866 28251 -42627 -35201 26907 16733 -39821 -12474 46138 7518
668G518m5541N2378K5173p4332j4819R3343K4141r2635l9752P5435M1596o7687
$$ 7518 -38023 14355 39528 -34804 -49623 43720 67861 -24774 -64526 10909 52505 -15182
680a5182l7957P0480L1925p7421k3086P3489l709p4714L5822Q4807n2832r6727
$$ -15182 -53139 17341 49266 -28155 -51241 22248 18539 -56175 -20353 64454 11622 -85105
692h5105M6653R6696l3070q7496L1370Q5618l0521q6531L3648Q1284m0794n8331
$$ -85105 -38452 58244 25174 -62322 -30952 54666 24145 -62386 -28738 52546 11752 -46579
704d6579O7081M2094r4039l6193J07961L9589j01428l7535R2909L6047r1101m0627
$$ -46579 20502 62596 -31443 -67636 40325 79914 -21514 -59049 33860 69907 -21194 -61821
716f1821Q8079M1367q2542k7339P8647m248q9398K9258R9744m2444j02477M3737
$$ -61821 26258 67625 -14917 -42256 36391 32143 -57255 -27997 71747 29303 -73174 -29437
728b9437R4288m4797r1984M1052R2873l0784q8500K7120P5602l8083n9877O5068
$$ -29437 64851 20054 -71930 -30878 61995 31211 -57289 -30169 45433 7350 -52527 12541
740A2541N3244q3990m5384R3948L8145r3000k9532R3376L3859q5080m0377P3810
$$ 12541 65785 -18205 -63589 30359 68504 -24496 -54028 39348 73207 -11873 -52250 21560
752B1560L9304o4586k4986O7671L837p8129J1182Q1265k6631q0457L5616P4344
$$ 21560 60864 -3722 -28708 38963 42800 -35329 -24147 57118 30487 -49970 -14354 59990
764E9990m0558p5992K8902O9990j7652o3488J2346N2309k3179m9031L6108M4662
$$ 59990 19432 -56560 -27658 42332 24680 -38808 -26462 25847 2668 -46363 -10255 34407
776C4407m8992l5413N8482K4881o3945j9937O3263K5858m9679k8416L7848K8428
$$ 34407 -14585 -49998 8484 33365 -30580 -50517 12746 38604 -11075 -39491 -1643 26785
788B6785l0801k2591L6851J7096m0647n131M3306q729m3970J9870M5208k0528
$$ 26785 -4016 -26607 10244 27340 -13307 -18438 24868 16139 -27831 -7961 37247 16719
800A6719m2294R526L3760m07k8810n096K6617K775k9879L26K5097j1141j9429
$$ 16719 -25575 -16049 17711 17304 -11506 -16602 10015 12790 -17089 -16763 8334 -2807 -22236
813b2236K1784J3626k8879j3554K3530J4443j1524j4666K691J9069J037k1822
$$ -22236 -452 13174 -15705 -29259 -5729 8714 -2810 -17476 -14785 4284 5321 -16501
825a6501P43K4132r42j5695P753P483j2164N43J5099K061q230o106K058J4243
$$ -16501 -15758 8374 7432 -8263 -510 6973 -5191 -4648 10451 12512 4282 -1824 234 14477
839A4477m92k1235L359K7251n911k7197O187J7813q711q452P189L972p085p894
$$ 14477 13985 -7250 -3891 23360 17449 -9748 -3561 14252 5541 -2911 4278 8250 1165 -6729
853f729K950J3472n298k0670J1782K5142j9545k7868K3809K3052k1474j4099J9235
$$ -6729 -3779 9693 4395 -16275 -4493 20649 1104 -26764 -2955 20097 -1377 -15476 3759
866C759Q428j4680o649J3300J1296j3097j3170K0602J4874k9077j2959L7358R255
$$ 3759 12187 -2493 -9142 4158 15454 2357 -10813 9789 24663 -4414 -17373 19985 29240
879B9240l6763l354L1734l377k5568M258K0019k530k0411o43K0620o80k9311M520
$$ 29240 -7523 -10877 20857 17480 -8088 -3830 16189 13659 -6752 -7395 13225 12545 -16766 -12246
893a2246L3624j2436l6664J6948L0851k2180k3658K1652J6411j8576j3702J3824
$$ -12246 21378 8942 -27722 -10774 20077 -2103 -25761 -4109 12302 -6274 -19976 -6152
905f152J4489j2321j7097J7071K0479k3558j9655L0698J6314l2825p884L2228
$$ -6152 8337 -3984 -21081 -4010 16469 -7089 -26744 3954 20268 -12557 -20441 11787
917A1787K388k6657J280K1156k07j7105j979J7747L767k2459l286K7431k532l0457
$$ 11787 14175 -12482 -11202 9954 9747 -7358 -9337 8410 12177 -10282 -13568 13863 11331 -19126
931a9126Q601K7748j4767k3192J5915J5325j4340j0843Q961J0334o303j3805O722
$$ -19126 -10525 17223 2456 -20736 -4821 10504 -3836 -14679 -5718 4616 -1687 -15492 -8770
944h770J7700j0152j8870J6821J7294k1584j0529K3591N178j9456O66J4564O88
$$ -8770 8930 -1222 -20092 -3271 14023 -7561 -18090 5501 10679 -8777 -8111 6453 7141
957G141r388k531R096P664j0953q866J7358O278k1114l32K1409n334j8431R224
$$ 7141 -2247 -4778 4318 11982 1029 -7837 9521 15799 -5315 -5647 15762 10428 -8003 1221
971A221J1774r381o719M557M907r97p668j952J1814n29j5851M781J5895j1216
$$ 1221 12995 3614 -3105 1452 6359 5362 -2306 -4258 7556 7027 -8824 -4043 11852 636
985F36j1391J3707N915j2848l66Q558k27l616r90J030O454j149r726O546J0357
$$ 636 -10755 2952 8867 -3981 -4347 4211 3984 368 -622 408 6862 5713 -4013 2533 12890
1000A2890j1169o605J4231P97j2363L838Q019n491l177K229p16J925j439o057
$$ 12890 1721 -4884 9347 10144 -2219 1619 9638 4147 970 3199 2483 4408 2969 -3088
1014c088M633N275j0496k859J1846l371j1119P086N441r177p20N543k335j353
$$ -3088 1545 6820 -3676 -6535 5311 1940 -9179 -2093 3348 -5829 -6549 -1006 -3341 -4694
1028d694J863l379K864L382o684k57R583m073p480Q484L329q779K685O209n506
$$ -4694 -2831 -6210 -3346 36 -6648 -6905 2678 -1395 -8875 -391 2938 -5841 -3156 3053 -2453
1043b453m01M495l104m53M833m796j210O676l470n533O833Q48p792L261M050o123
$$ -2453 -2854 1641 -1463 -1916 2917 -1879 -3089 3587 117 -5416 1417 2265 -5527 -2266 1784 -4339
1059d339K82N028n301j084N569m098k883O423j765n566N646J999o510K701M812
$$ -4339 -4057 971 -4330 -5414 155 -3943 -6826 -403 -2168 -7734 -2088 -89 -6599 -3898 914
1074I14n122J755M015m696J011O356m912k675Q334j713o692O759L223p163J776
$$ 914 -4208 -2453 1562 -3134 -2123 4233 -679 -3354 4980 3267 -3425 3334 6557 -606 1170
1089A170N293l757n22K436l033J448L863o194j040Q328n071o181Q586J115j0171
$$ 1170 6463 2706 2184 4620 1587 3035 6898 704 -336 7992 2921 -3260 5326 6441 -3730
1104c730L151P694o551l745N235K36j524M88l236K315N641o981k838R958j712
$$ -3730 -579 7115 564 -3181 2054 2290 766 1254 -1982 333 5974 -1007 -3845 6113 4401
1119D401r848P558P994j1673k678J1553o44q043J751L689Q27j141m355J358P205
$$ 4401 -5447 2111 10105 -1568 -4246 7307 6663 -1380 371 4060 4887 3746 -609 749 7954
1134G954o043o818J1279J445j4495L554J3646r152j0571R287O471q039l578K528
$$ 7954 1911 -4907 6372 7817 -6678 -3124 10522 1370 -9201 86 6557 -1482 -5060 -2532
1148b532L092j20o171O20Q211m445j0597J1281Q146j6491m180J8640m03j6036
$$ -2532 560 440 -5731 -5111 3100 -1345 -11942 -661 7485 -9006 -13186 5454 5051 -10985
1162a0985K979J1593k569o605Q36M775K273o908k090J1383j444j4725P294J6865
$$ -10985 -8006 3587 1018 -5587 -4751 24 2297 -4611 -6701 4682 3238 -11487 -4193 12672
1176A2672j3487j4521J6156R825j4813n440J0544K430o371k775M873M447p561
$$ 12672 -815 -15336 820 10645 -4168 -9608 936 3366 -3005 -5780 -907 3540 -4021
1189d021n618J3007M406j9128j389K2696k715k1706O668J7251p930j0291P026
$$ -4021 -9639 3368 7774 -11354 -12743 9953 7238 -14468 -7800 9451 1521 -8770 -1744
1202a744O168m209m301L728P423n987j1151J1696J4427j6843j3094J9789R490
$$ -1744 4424 215 -4086 -358 7065 1078 -10073 1623 16050 -793 -13887 5902 15392
1215A5392j9371l012J5548j354r614L165N804l307n399J996R066j288j5236K524
$$ 15392 -3979 -6991 8557 7203 -2411 754 6558 3251 -2148 -152 8914 7626 -7610 -5086
1229e086J9161n703j9395Q929J5186j1099p994J0108J247q271K616O840k455o658
$$ -5086 14075 8372 -11023 -2094 13092 1993 -6001 4107 5354 -2917 -301 6539 4084 -2574
1243b574j840R600N535j3323o725J6684M367j6945L71J3058n626o384R035L95
$$ -2574 -4414 5186 10721 -2602 -9327 7357 11724 -5221 -4850 8208 2582 -3802 5233 5628
1257E628j0313J782Q849l30o438m512N519Q330o463j0760Q391P160j0016n18R141
$$ 5628 -4685 -2903 5946 5616 -822 -5334 185 8515 2052 -8708 -317 6843 -3173 -3691 5450
1272E450p603p176J2660M171j3995j827R936J822n863l879J826O200j058o490
$$ 5450 -2153 -9329 3331 7502 -6493 -8320 1616 3438 -2425 -6304 -4478 1722 664 -5826
1286e826L620L199q964L029J3079q669j4266J2567J1965j2974q099J0264N043
$$ -5826 -2206 993 -7971 -4942 8137 -532 -14798 -2231 9734 -3240 -11339 -1075 3968
1299C968n255l035J742K670k799k909Q511K751j5017j803K0806j910k2255N894
$$ 3968 -1287 -4322 -2580 90 -2709 -5618 2893 5644 -9373 -11176 9630 7720 -14535 -8641
1313h641J9960p629j4489P103Q054n586m260O433M988q061r101J2100J2958j7242
$$ -8641 11319 3690 -10799 -3696 4358 -1228 -5488 945 5933 -2128 -11229 871 13829 -3413
1327c413j3359K3032J1660k5149p762K2997K110j6714L159J2343n220j1716N554
$$ -3413 -16772 6260 17920 -7229 -14991 8006 10116 -6598 -3439 8904 3684 -8032 -2478
1340b478J4794m627j8934N896K4306r940k7175J3291K5900j5422j8780J6448J0647
$$ -2478 12316 7689 -11245 -5349 18957 9017 -18158 -4867 21033 5611 -13169 3279 13926
1353A3926j7264m880J6017M107j5774n934J7749Q160k2350j0111K7619R856k9297
$$ 13926 -3338 -8218 7799 11906 -3868 -9802 7947 16107 -6243 -16354 11265 21121 -8176
1366h176o310K6927o50k2509O752J8133r797j4680R114J4490r217j7211J0241
$$ -8176 -14486 12441 11791 -10718 -3966 14167 4370 -10310 -1196 13294 4077 -13134 -2893
1379b893K1928j1519k6678J4047K4724j6730j8658J9517J1386k0518o066J8172
$$ -2893 19035 7516 -19162 -5115 19609 2879 -15779 3738 15124 -5394 -11460 6712
1391F712K559j7070j414J7012L875k1180p132K4017Q198k6249m554K6073k699
$$ 6712 9271 -7799 -9213 7799 11674 -9506 -16638 7379 15577 -10672 -15226 10847 8148
1404H148k3029O970J8774j0484j3203J1339J0161j1405j1511R915J6052r435j8945
$$ 8148 -14881 -7911 10863 379 -12824 -1485 8676 -2729 -14240 -4325 11727 2292 -16653
1417a6653J0943J9235j4564j6127J7576J0389j7708l863J5508n26j3348K052J2554
$$ -16653 -5710 13525 -1039 -17166 410 10799 -6909 -10772 4736 4210 -9138 -7086 5468
1430E468M23j2466m226J4497N897j7142m217J9367P07j8394M079J3908q181q486
$$ 5468 5891 -6575 -10801 3696 9593 -7549 -11766 7601 8308 -10086 -6007 7901 -280 -8766
1444h766J0072N509q474m576M890P225l833r643M585J2589p121j1913R498Q391
$$ -8766 1306 6815 -1659 -6235 -1345 5880 2047 -7596 -3011 9578 2457 -9456 42 8433
1458H433j0886k383J0802k557p833L868N102k460k694r35L717M302o605m717Q469
$$ 8433 -2453 -4836 5966 3409 -4424 -556 4546 2086 -608 -1543 2174 6476 -129 -4846 3623
1473C623L259q824J146O925m783l414O454p48m157K567J019j797J882j648l133
$$ 3623 6882 -1942 -796 6129 1346 -2068 4386 3638 -519 2048 3067 1270 3152 1504 -1629
1488a629N356J733o608Q37M875l186j909L713k388j369M601k421l989M543M00
$$ -1629 3727 5460 -1148 -311 4564 1378 -531 3182 794 -575 4026 1605 -2384 2159 2559
1503B559m936K894L644n817j115N321j475k655J826n95N69K218m598j625P312
$$ 2559 -2377 517 4161 -1656 -2771 2550 1075 -1580 246 -349 220 2438 -2160 -3785 3527
1518C527j539p487N542M849q340j482Q104j810n430K232K570o71j990k462L012
$$ 3527 1988 -5499 43 4892 -3448 -4930 3174 1364 -4066 -1834 736 65 -1925 -4387 -1375
1533a375N057n635n283Q822K283j0943J619J0296n145p973O631M586n772k643
$$ -1375 3682 -1953 -7236 1586 3869 -7074 -5455 4841 -304 -8277 -1646 2940 -2832 -5475
1547e475L064L027j13n866K80Q765k701r067O166Q307r571m804J0389J350q933
$$ -5475 -2411 616 503 -5363 -5083 3682 981 -8086 -1920 6387 -3184 -7988 2401 3751 -5182
1562e182J495O224r78l928r24L607L971n408m886Q363M070j1053l62J1818l565
$$ -5182 -3687 2537 1559 -2369 -3293 314 4285 -1123 -6009 2354 6424 -4629 -4991 6827 3262
1577C262r491O166O835o866l244L614K994j438m050J94O703r96r126M529R362
$$ 3262 -6229 -63 6772 -94 -3338 276 3270 1832 -2218 -2024 4679 3683 -5443 -914 8448
1592H448q138o610R990L267r493j5P417j454m222J74K793K333l052m617O117M610
$$ 8448 310 -6300 3690 6957 -2536 -2551 4866 3412 -810 -636 2157 4490 1438 -3179 2938 7548
1608G548r176j860J0448j542r738M646O998o173k731L541J578j551j523j064L808
$$ 7548 -1628 -3488 6960 5418 -4320 326 7324 1151 -1580 1961 3539 1988 465 -599 3209
1623C209J325p363J343P634m231p041P088L839q597j30O091j448l870J301Q73
$$ 3209 4534 -2829 -1486 6148 1917 -5124 1964 5803 -2794 -2924 3167 1719 -2151 -850 23
1638B3Q38j087k739K290M083m972m047Q066P16q466K649O718n403k956M547M3
$$ 23 861 -226 -2965 -675 3408 -1564 -5611 2455 3171 -5295 -2646 4072 -1331 -4287 260 303
1654C03k362N38m40J033J789l686j208N999j828o103M860L626n999q27N364j947
$$ 303 -2059 -1521 -1961 -928 861 -2825 -4033 1966 138 -5965 -1105 2521 -3478 -4305 1059 -888
1670h88l114K520N26j333J401j183q80L369j581l310M049K013n778J556N101m042
$$ -888 -4002 -1482 -956 -2289 -888 -2071 -2951 418 -1163 -4473 -424 1589 -4189 -2633 2468 -1574
1686a574j840M540m46l352K948K74j957K218K18k979L120O50m230K311L262m196
$$ -1574 -3414 1126 680 -2672 276 550 -1407 811 1029 -1950 1170 1820 -2410 -99 3163 -1033
1702a033p98M989k689k850M510n59l556L035R51l154J303J908k890J075K320k710
$$ -1033 -1831 3158 469 -2381 2129 1570 -1986 1049 2000 -1154 149 2057 -833 242 2562 -148
1718a48p0L101k675j219L975j203l740M342J779n148J634L471l150o44L006j349
$$ -148 -218 2883 208 -1011 2964 1761 -1979 2363 4142 -1006 628 4099 949 305 3311 1962
1734A962j019J541q71o38K814k635j907M761p05n579L581L504n499n71M510j647
$$ 1962 943 2484 1613 975 3789 1154 -753 4008 3303 -2276 1305 4809 -690 -1261 3249 1602
1750A602k992K512k7j453R32r52m85K833k545l073N204J300o838J604N868m128
$$ 1602 -1390 1122 1095 -358 574 -378 -863 1970 -575 -3648 1556 2856 -3982 -2378 3490 -638
1766f38l459M885P31l813R33J805r97L22j203l62L562j584n016M398M322o679
$$ -638 -4097 788 1519 -2294 -1361 444 -553 -231 -1434 -1796 1766 182 -4834 -436 3886 -2793
1782b793j845P337j576n869L836K754l753j043J750J069l36k301q83M600O09p228
$$ -2793 -4638 2699 1123 -4746 -910 1844 -1909 -2952 -1202 -133 -469 -2770 -3653 947 1556 -5672
1798e672K292O389m753m843P183J382o474J311M967k004k970J135J755J901k538
$$ -5672 -3380 3009 -1744 -6587 596 1978 -4496 -3185 1782 -222 -3192 -2057 -302 1599 -939
1813i39l177M954L174o618j154P719j522o848M719M943o540k095N887P24l575
$$ -939 -4116 838 4012 -2606 -3760 3959 2437 -4411 308 5251 -1289 -3384 2503 3227 -348
1828c48r35J604K828j000n422K737O152n023n067P810J031p760J716P368m167
$$ -348 -1283 321 3149 2149 -3273 -536 5616 593 -4474 3336 4367 -3393 -1677 5691 1524
1843A524n267M094L708k594k925L92L901R51n325m14P143k409o508N567M943p970
$$ 1524 -3743 351 4059 1465 -1460 -1068 2833 3784 -1541 -1955 5188 2779 -3729 1838 6781 -1189
1859a189k091Q425l46o734Q60M810m7l287j675L154K881m840k669O637J07q261
$$ -1189 -3280 5145 4799 -1935 -1075 3735 3688 401 -1274 1880 4761 -79 -2748 3889 3996 -4265
1875d265L403P453o348n522O830L145n975k167M041J440j877k372R95L903l438
$$ -4265 -862 6591 243 -5279 1551 4696 -1279 -3446 595 2035 158 -2214 -1219 2684 -754
1890g54m066N877K735q200l25R093k401q075M385M853l541k810K028J549o3k223
$$ -754 -4820 1057 3792 -4408 -4733 4360 1959 -6116 -1731 3122 -419 -3229 -1201 348 285 -1938
1906a938q0L504j472n004M063N385p075m069Q626J626q368Q96N618k220k742J763
$$ -1938 -2018 1486 14 -4990 -927 4458 -2617 -6686 1940 3566 -4802 -3906 1712 -508 -3250 -1487
1922a487J418o60j380j41L283k46o293K604P138m536o277O534M103o598j002N387
$$ -1487 -69 -729 -2109 -2250 1033 787 -5506 -2902 4236 -300 -6577 -43 4060 -2538 -3540 1847
1938A847n66l889K078K084j273j904m7L969R94o247k20P804j566p604M316N538
$$ 1847 1281 -2608 -530 1554 281 -1623 -1670 2299 3293 -2954 -3174 4630 3064 -4540 -224 5314
1954E314o139k385O266k16n290J874L750o00l863o95L821K844n990k312P262R09
$$ 5314 -825 -3210 3056 2840 -2450 -576 3174 2574 -1289 -1984 1837 4681 -1309 -3621 3641 4550
1970D550q027K159O959n259m244O564K698o375j182M591J808k919l349K946M852
$$ 4550 -3477 -1318 5641 382 -3862 2702 5400 -975 -2157 2434 4242 1323 -2026 920 5772
1985E772m177m997O296L135q101n08Q717l159p491M600O186n413m521M174L159
$$ 5772 1595 -3402 2894 6029 -2072 -2580 6137 2978 -4513 87 6273 860 -3661 513 3672
2000C672j750m636J094N695k126o664M020O081p544m247R740J198r848Q33Q156
$$ 3672 1922 -2714 -1620 4075 1949 -4715 -695 5386 -2158 -6405 3335 4533 -5315 -4482 3674
2015C674j672o106P66M980N91m907j628O356N40p204J067Q842m543q217P294N845
$$ 3674 2002 -4104 -3338 1642 2233 -2674 -4302 2054 2594 -4610 -3543 5299 756 -7461 -167 5678
2031E678p885l920P408K058n302j865L434K819l260m315N268L561p536k368R443
$$ 5678 -2207 -6127 1281 3339 -1963 -3828 -394 2425 -835 -5150 118 3679 -3857 -6225 3218
2046C218o1r612K188Q738l627o799L889M227k542l320J543L891r76n205K073O404
$$ 3218 3157 -6455 -4267 4471 844 -5955 -2066 2161 -381 -3701 -2158 1733 757 -4448 -2375 4029
2062D029m405o109P006N044p902l041Q071R15o030P69L744R3k761p70L010J985
$$ 4029 -376 -6485 521 5565 -2337 -5378 2693 3608 -2422 -1653 2091 2184 -577 -1347 1663 3648
2078C648n133j196O785k57p414K214P212l850n470M604K980m062j366K691Q57
$$ 3648 -1485 -2681 4104 3847 -3567 -1353 5859 2009 -3461 1143 4123 61 -1305 1386 2243
2093B243j568j810J096L683k359l935M275L251o344j014O248l90n529K104L435
$$ 2243 675 -1135 -39 3644 1285 -2650 1625 4876 -1468 -2482 3766 3376 -2153 -49 3386
2108C386k158j334Q53M82M13j041j147L257N25m965J327M570k900m090M344J200
$$ 3386 1228 -106 747 1229 1642 601 -546 2711 3236 -1729 -402 4168 1268 -2822 1522 2722
2124B722l655N10K416k058n7P73j211R58J03k298J336K191l032j382L898p31l398
$$ 2722 -933 -423 1993 -65 -122 651 -560 398 501 -1797 -461 1730 -1302 -2684 1214 483 -2915
2141b915K778J043k835L66K538k045q31J831r74j23J403j605k28J925n76k321
$$ -2915 -137 906 -1929 -1563 975 -1070 -1901 -70 -1044 -1167 236 -1369 -1597 328 -248 -2569
2157b569K762M3l000K014J748l093M62K277j302j522K074l66j378J518k66r15
$$ -2569 193 236 -2764 -750 998 -2095 -1633 644 -658 -2180 -106 -472 -1850 -332 -598 -1513
2173a513J204n16j574K551L50l129J456K759l289o62L365n50l042K091J231j712
$$ -1513 -309 -825 -2399 152 502 -2627 -1171 1588 -1701 -2363 1002 452 -2590 -499 732 -980
2189i80N13M01k23J129n12j492K089J233m061O93M659k783k843L799R41l671Q08
$$ -980 -467 -66 -289 840 328 -1164 925 2158 -1903 -1210 3449 666 -2177 1622 2563 -1108 -300
2206c00K038p74k31l87o8J571n28k543J808K707l689j259M446m00m265K053K619
$$ -300 1738 964 733 346 278 1849 1321 -1222 586 3293 -396 -1655 2791 2391 -1874 179 2798
2223B798k174j503J871J00l02K36j100J693Q40l130O0M117j642l951L549K063
$$ 2798 624 -879 992 1092 790 1026 -74 1619 2459 -671 -611 3506 1864 -2087 1462 3525
2239C525l839n72L308n38j972L26L72O67j6j970R11K374k918k033M155K01m499
$$ 3525 -314 -886 2422 1884 -88 238 610 1277 1261 -709 202 2576 -342 -2375 1780 1981 -2518
2256b518J473L370k681j801K480K85j716K23k20R28P68k499m28L678r88l915K512
$$ -2518 -1045 2325 -356 -2157 323 608 -1108 -885 -1105 -177 591 -1908 -2336 1342 354 -3561 -1049
2273a049L065l843p55L610q64k157J158Q29j69k94j187M64K593k045k226L154
$$ -1049 2016 -1827 -2582 1028 164 -1993 -835 -6 -175 -469 -1656 -1192 1401 -644 -2870 284
2289B84J330m268O41L690k067k732L108P58k478P99L03j54O66r54j045K877q7
$$ 284 1614 -2654 -2013 1677 -390 -3122 -14 744 -1734 -935 -632 -786 -120 -1074 -2119 758 671
2306F71l322J859K376k870j145L486l18k678J604J426j830NO17l14J403m94j705
$$ 671 -2651 -792 1584 -1286 -2431 1055 737 -1941 -337 1089 -741 -736 -119 -433 970 476 -1229
2323a229K113J162l143L96L329j610k196K527Q68k432L95J461r51o7O44j205Q99
$$ -1229 884 2046 -1097 -701 2628 1018 -1178 1349 2217 -215 180 1641 690 623 1267 62 961
2340I61M43j823P96J964k053j311L085m28k863K380J174k734N15J680j580k9J058
$$ 961 1404 -419 377 2341 288 -1023 2062 1634 -1229 1151 2325 -409 106 1786 206 177 1235
2357A235o01J65N29j246k13K146j223j546K562N4k924J267J865k067o80K174o27
$$ 1235 634 799 1328 82 -131 2015 792 -754 1808 1862 -1062 205 2070 3 -677 1497 870
2374H70j577J392k79p81P66m29j341K260m74k347K245Q65k810J10K689j837j451
$$ 870 -707 685 406 -375 391 -38 -1379 881 407 -1940 305 1170 -1640 -1530 1159 -678 -2129
2391b129K546Nk005P31M83n42M32m89m48J642k15k409J433K102k687o73L418j409
$$ -2129 417 422 -1583 -852 -369 -911 -479 -968 -1416 226 11 -2398 -965 1137 -1550 -2223 1195 -214
2409b14k442K211J175j727l40O73l22Q69n92j002J334R61k692J037K622k266k215
$$ -214 -2656 -445 730 -997 -1337 -664 -986 -117 -709 -1711 -377 584 -2108 -1071 1551 -715 -2930
2426b930L530M42l169P42K233j375p95R85N9P7j4j057J271J310k678K48L481j409
$$ -2930 600 1042 -2127 -1385 848 -527 -1322 -337 -278 -201 -215 -1272 -1 1309 -1369 -1121 2360 951
2444I51l183K779J999l546J57K424l34j254M35L05P78q10j416J620J673k375j366
$$ 951 -2232 547 2546 -1000 -843 1581 1247 -7 428 733 1511 701 -715 905 2578 203 -1163
2461a163L905n81l837J621K933k068j602K170O0j369J10N13L52M67k119N83K577
$$ -1163 2742 2161 -1676 -55 2878 810 -792 1378 1438 69 179 692 1044 1511 -608 -25 2552
2478B552j917k452K948J768l826l2L549j156k497J470J301j022p33K72P11O58
$$ 2552 635 -1817 1131 2899 -927 -959 2590 1434 -1063 407 1708 686 -47 225 936 1594
2494A594k172n54L008Q6m263J684L294k726k321L467N79l265O09J724r67j82k45
$$ 1594 -578 -1132 1876 1962 -2301 -617 2677 -49 -2370 1097 1676 -1589 -980 744 -223 -405 -650
2511f50K90J384j581k121L106J076m119M30L679j474l036K692J410k641j12J752
$$ -650 -360 1024 -557 -2678 428 1504 -2615 -2185 1494 20 -3016 -324 1086 -1555 -1667 85
2527H5l62n75n98J94J934m78k685J696K489k733j837L673J28l493J312K511k058
$$ 85 -277 -852 -1450 -1256 678 200 -2485 -789 1700 -1033 -2870 803 931 -2562 -1250 1261 -797
2544g97o40J256L96m62p70j73J830P2k833L16L305j834k283K954J730m190P10
$$ -797 -1437 -181 215 -247 -1017 -1190 640 712 -2121 -1805 1500 -334 -2617 337 2067 -2123 -1413
2561a413L067j458j520J354M82l36l64r41J416J586k365q80L256k87l218J877
$$ -1413 1654 196 -1324 30 512 176 -188 -1129 287 1873 -492 -1372 1884 1597 -1621 256
2577B56K720l150j072K929Rj909N76N93L80l25j141P30J557j563j533K395Q98
$$ 256 2976 -174 -1246 1683 1692 -217 359 952 1332 1007 -134 596 2153 590 -943 1452 2350
2594B350l761J184K974j841k385K891O09j998J79K34M34oj091J24J945p02k499
$$ 2350 -1411 -227 2747 906 -1479 1412 2021 23 202 436 870 864 -227 -103 1842 1140 -1359
2611a359J979K195l865n36L827p92k904J881J150j450q21J038J3j78m29l94J489
$$ -1359 620 2815 -1050 -1586 2241 1449 -1455 426 1576 126 -695 343 356 178 -251 -645 844
2628H44J72l009J569K861k961k095L428L51l189O31K651j343j369Q14M48l03m89
$$ 844 1016 -1993 -424 2437 -524 -2619 809 1160 -2029 -1398 1253 -90 -1459 -645 -197 -500 -989
2645i89n06J642J448l590m28M003j571l151L047J412l034k64K524m44j314J21
$$ -989 -1495 147 1595 -1995 -2423 1580 9 -3142 -95 1317 -1717 -1981 543 99 -1215 -1094
2661a094M39O37o33j791K073J920k533j340L683l33l654J334L001k339j679K476
$$ -1094 -655 -18 -651 -2442 -369 1551 -982 -2322 1361 1028 -2626 -1292 1709 -630 -2309 167
2677A67N95j600jM84P44mj935O88K554j447k866L174J592l438m65L604q44k644
$$ 167 762 -838 -839 -355 389 385 -1550 -862 1692 245 -2621 553 2145 -1293 -1758 1846 1002 -1642
2695a642J537J498j052m22k4J131O05j820o44K836j31l368J792K376k634j593
$$ -1642 -105 1393 341 -81 -105 1026 1631 -189 -833 2003 1872 -1496 296 2672 38 -1555
2711a555L380M79k684L98J596o77n57j09RJ768j204k198K562R10l273O3L560j137
$$ -1555 1825 2304 -380 18 1614 937 380 271 280 2048 844 -1354 1208 2118 -1155 -1092 2468 1331
2729A331k610K126J520k747K7J256K11p13m16n18J762o0k603J435K604k932j320
$$ 1331 -1279 847 2367 -380 -353 903 1114 401 -15 -533 1229 1169 -1434 1 2605 -327 -1647
2746a647L300j39k798J146J702j672q74Q46L57r4j75o88R93Q32k246l34K589r10
$$ -1647 1653 1514 -1284 -138 1564 -108 -982 -136 221 127 -48 -736 257 1089 -1157 -1491 1098 188
2764A88k259J746J208k473rJ867m42j015J062n49L40M26j235L30J543j411j291
$$ 188 -2071 -325 883 -1590 -1599 268 -174 -1189 -127 -676 -336 90 -1145 -815 728 -683 -1974
2781a974K305K78k567R26K092j905o03J934r56n68Q20l45J04P33r37n77J624o15
$$ -1974 331 609 -1958 -1032 1060 -845 -1448 486 -470 -1038 -218 -563 -459 274 -663 -1240 384 -231
2799b31j647K064Q88k341K93J870j030j270J659K6j144Q59j31m02J158m33j177
$$ -231 -1878 186 1074 -1267 -974 896 -134 -1404 255 281 -863 -4 -135 -537 621 188 -989
2816i89J264P61k126J217J337j777l17J855n57j325J608J61j542P26N08r82P15
$$ -989 275 1036 -1090 127 1464 -313 -630 1225 668 -657 951 1112 -430 296 804 -178 537
2833E37L08p85N44Q02j730M01J861j360j207J821P4j852J197Q58j306L9O44q40
$$ 537 845 60 604 1406 -324 77 1938 578 -629 1192 1266 -586 611 1469 163 202 846 6
2851FM42K41o21L98J113j921n30K228m21j715J341R57j937M61R09p91l50P66l81
$$ 6 448 689 68 466 1579 -342 -872 1356 935 -780 561 1518 -419 42 951 160 -190 576 195
2870A95k31O37r28QJ574j275j381K001M44k283R86J306j574m84J534n08q18O14
$$ 195 -36 601 -327 -319 1255 -20 -1401 600 1044 -1239 -253 1053 -521 -1005 529 21 -797 -183
2888a83j28l42J041j084n19J372l85j532J239J196k058O81J295j194q45J279k11
$$ -183 -311 -653 388 -696 -1215 157 -228 -1760 -521 675 -1383 -702 593 -601 -1446 -167 -378
2905c78o33L28O4l16J157j042p43J904K23k257P98J811j533r40J807J1j522R65
$$ -378 -1011 -683 -619 -935 222 -820 -1563 341 564 -1693 -895 916 -617 -1557 250 261 -1261 -296
2923b96M83o32J50k8o28J231j09j587J358J155j935k98K522j386j425J871L98
$$ -296 187 -445 -295 -323 -951 280 171 -1416 -58 1097 -838 -1136 1386 0 -1425 446 844
2940H44j210K60N04k92J83M9q76J002L93j618Q46J389j248j024K007L37k183Q97
$$ 844 -366 -106 398 106 289 338 -538 464 857 -761 85 1474 226 -798 1209 1546 -637 260
2958B60J087j143q5O09m43L29L41j017N32P98j379k26K011p78j852J678P05k039
$$ 260 1347 204 119 728 285 614 955 -62 470 1268 -111 -337 1674 896 -956 722 1427 -612
2976f12L95J217n29n98Q55l85L7K08p61k42J741j214p70J694q4j954Q55J360j466
$$ -612 -217 1000 471 -127 728 343 380 588 -173 -415 1326 112 -658 1036 952 -1002 -147 1213 -253
2995b53k91J042l62o18Q11j9n64O46p46m57J401m84j665J485O23j964J9K074q20
$$ -253 -544 498 136 -482 329 310 -254 392 -354 -811 590 106 -1559 -74 549 -1415 -1396 678 -142
3014a42j441J288J83n36M16l72o8P65q71m33J215J22j914J039J441j446m26J672
$$ -142 -1583 -295 -112 -648 -232 -604 -672 93 -778 -1211 4 126 -1788 -749 692 -754 -1180 492
3032D92o04j448J444M52j286M42K31k36M50O5j264J066R44k225O11J803j256j204
$$ 492 -112 -1560 -116 336 -950 -508 -277 -513 -63 2 -1262 -196 748 -1477 -866 937 -319 -1523
3050a523J989J47j690P29R07j020N8L90M7j24O76j043J91J404j787m49K384q82
$$ -1523 466 613 -1077 -348 559 -461 -403 -13 34 -90 586 -457 -266 1138 -649 -1098 1286 404
3068D04j501J369P76j215l19J287p24J89L61m27J53M32j002M49J288j061j307
$$ 404 -1097 272 1048 -167 -486 801 77 266 627 200 353 785 -217 232 1520 459 -848
3085h48J815K25j797M39J738j245o41R48k4l09L66l97K98N99j108m97J665o41
$$ -848 967 1192 -605 -166 1572 327 -314 634 610 301 667 270 568 1167 59 -438 1227 586
3103E86j583J371J416k552J15J987q77j063Q61L93p36k3K09oM80p47n92J538j96
$$ 586 -997 374 1790 -762 -647 1340 463 -600 261 654 -82 -105 104 98 578 -169 -761 777 581
3122E81k180J069J739j823m10J487j10j161O86L68n77j03j16K91N54l51j643J815
$$ 581 -1599 -530 1209 -614 -1024 463 353 -808 -122 246 -331 -434 -550 -259 295 -56 -1699 116
3140A16R58k319J76J808r13j665J570J258k036J53P83j47l56J63n20J181r6j357
$$ 116 1074 -1245 -1069 739 -174 -1839 -269 989 -1047 -894 -111 -258 -614 -451 -971 210 114 -1243
3158a243O53J699j772j098K600l89k166J082J241j171k24P57J66k01l51m7N34
$$ -1243 -590 1109 -663 -1761 839 450 -1716 -634 607 -564 -788 -31 135 -66 -417 -464 70
3175G0O17j672p5K494j457j561J800Q49k125M67J572r73p54R92K3j23L30p70L66
$$ 70 687 -985 -1060 1434 -23 -1584 216 1065 -1060 -593 979 6 -748 244 267 144 474 -296 70
3194G0R34j164o48J809k08j880J507J182j743n12J573j04r91L75P45n70K17n47
$$ 70 1004 -160 -808 1001 793 -1087 420 1602 -141 -653 920 816 -175 200 945 375 592 45
3212D5P7J190j091r79J742M52j896M58J837j244j278J424L45j401L35N41l44J32
$$ 45 122 1312 221 -758 984 1436 -460 -2 1835 591 -687 737 1082 -319 16 557 213 345
3230C45n69J50P25Pj492J241J124k184l79K018o03j475Q79J162j340J13J30J07
$$ 345 -224 -74 651 658 -834 407 1531 -653 -1032 986 383 -1092 -213 949 -391 -278 -148 -41
3248d1K39k93o04Q42L31j679Q02J248q37j275J689o1j300O64M79l70l84P22k08
$$ -41 198 -95 -699 143 474 -1205 -403 845 8 -1267 422 361 -939 -275 204 -166 -550 172 -36
3267c6j03j39o16M66O66j220k49K085p33k031J774P25j335K63Q39n62l99K94l29
$$ -36 -139 -278 -894 -428 238 -982 -1231 854 121 -1910 -136 589 -746 -483 356 -206 -605 -311 -640
3286f40O54J75r79K81J139r12p57J457N1j846P31J418q70p50Q80p3j61P9q9K32
$$ -640 14 189 -790 -509 630 -282 -1039 418 469 -1377 -646 772 -98 -848 32 -41 -202 -123 -212 20
3306B0K86p90r8J615p94j293J508P25j773J34J440n13q56P21K69m65k10N00m57
$$ 20 306 -484 -582 1033 239 -1054 454 1179 -594 -460 980 467 -389 332 601 136 -74 426 -31
3325c1O97k55j022J607o2j551O86J298j245p98J470J3p83J13O86n08q4P1k10P46
$$ -31 666 411 -611 996 934 -617 69 1367 122 -676 794 807 24 137 823 315 231 302 92 838
3345H38m70q11J056L66j244r6J715r93j097J205J74j054K95M30k98n6M53l78M54
$$ 838 368 -443 613 979 -265 -361 1354 361 -736 469 643 -411 -116 314 16 -40 413 35 489
3364D89j28r22K08J111r53r62J868l01j287J086L56r04j59O48k82Rk7o11J001
$$ 489 361 -561 -353 758 -195 -1157 711 410 -877 209 565 -339 -498 150 -132 -123 -150 -761 240
3383B40M55j427k42J384o27q58R35O44j496M12N14k36l33M15K23l52K98n64L82
$$ 240 695 -732 -974 410 -217 -1075 -140 504 -992 -580 -66 -302 -635 -220 3 -349 -51 -615 -233
3402b33O16r93n27J436J49j667O12J316p61j141J317L79p68j37p6L25J69l60k65
$$ -233 383 -610 -1137 299 448 -1219 -607 709 -52 -1193 124 503 -265 -402 -478 -153 16 -344 -609
3421f09J040n2j323J017L71j377L22J516q50p80Q64J91m16K91j1k5J50j96n36
$$ -609 431 379 -944 73 444 -933 -611 905 55 -725 139 330 -86 205 194 169 319 123 -413
3440d13J048K00j216J29J399r51r56J602p4j225Q93M08p78J09L89m98L65L46p69
$$ -413 635 835 -381 -252 1147 196 -760 842 768 -457 436 844 66 175 564 66 431 777 8
3459HM44M01j187M50R73p75j129J655J77j186L96M95n79L36J24n20M18Pq47M85
$$ 8 452 853 -334 116 1089 314 -815 840 1017 -169 227 722 143 479 603 83 501 508 -339 146
3479A46N51o95k64R60l55q72P59N13q41q6P66l28l12M35m44l3O60r28j70J033
$$ 146 697 2 -262 698 343 -529 230 743 -98 -184 582 254 -58 377 -67 -100 560 -368 -538 495
3499D95n38p32R04L39r16K28R08j244l41J096m30l13L22pn9N27n66l98O79k00
$$ 495 -43 -775 129 468 -448 -220 688 -556 -897 199 -231 -544 -222 -229 -288 239 -327 -725 -46 -246
3519b46p75J082M50j065q9O37l49n08O06J77m99J07L34k36K17k68n73J475j30
$$ -246 -1021 61 511 -554 -643 -6 -355 -863 -257 -80 -579 -472 -138 -374 -157 -425 -998 477 347
3538C47j475O67J086p46p22J274k32p64L03M80o34L33L5n38J057J4r06N26O25
$$ 347 -1128 -461 625 -121 -843 431 199 -565 -262 218 -416 -83 -48 -586 471 485 -421 105 730
3557G30p65o34J541r02l98O42L77q76L56L54m09O2L47n48K91N98r96K81O83m44
$$ 730 -35 -669 872 -30 -428 214 591 -285 71 425 16 78 425 -123 168 766 -230 51 734 290
3577B90n22R11r3o10L95M03l51m29M72r9j49L79p79L97O90o68k18O90l06p63R49
$$ 290 -232 679 586 -24 371 774 423 -6 466 367 218 597 -182 215 905 237 19 709 403 -360 589
3598E89K25q35J01M74l14l16N69l32k85N60j51l22N81l47r03J089R2j132R42J86
$$ 589 814 -21 80 554 240 -76 493 161 -124 436 285 -37 544 197 -706 383 475 -657 285 471
3618D71l91m93R90n94l39L37J79l76K18l38r2N43k50l69K57N08q44k49J097n28
$$ 471 80 -413 577 -17 -356 -19 160 -216 2 -336 -428 115 -135 -504 -247 261 -583 -832 265 -263
3638b63l99O44l32j83L22n0J64J05l06l34O79K82j175O36O09j072j55J039j99
$$ -263 -662 -18 -350 -533 -211 -261 -97 8 -298 -632 47 329 -846 -210 399 -673 -828 211 12
3657A2q91P65j63K61l11M45m21L90j3p99P20N1m02n9R40n57o16O61J02k62J01
$$ 12 -879 -114 -277 -16 -327 118 -303 87 74 -725 -5 46 -356 -415 525 -32 -648 13 115 -147 -46
3678d6M84p14J89J51k79K93j0l22J7Q02m45m14Q49l64n75N45L99n64j8M93l07
$$ -46 438 -276 -87 64 -215 78 68 -254 -237 565 120 -294 555 191 -384 161 560 -4 -22 471 164
3699A64k70N51k86j89M51k72n31R75j04r84J248J4p87L22Q49j183K29K19k45j51
$$ 164 -106 445 159 -30 421 149 -382 593 489 -495 753 767 -20 302 1151 -32 197 416 171 20
3719B0K55M3k98R03r50k62Q32J47j127O66M18r18L21O11l61n84P25o7p15L48J37
$$ 20 275 318 20 923 -27 -289 543 690 -437 229 647 -271 50 661 300 -284 441 374 -341 7 144
3740A44k43L34L0r24P58M74j188J93R99o12m00O60l41o36N47L06l06M1j86K6K22
$$ 144 -99 235 265 -659 99 573 -615 -422 577 -35 -435 225 -116 -752 -205 101 -205 -164 -350 -324 -102
3761a02M25q75M31P04j280j3J094n18q14P89M15q09N26p6j44l6L48o95O04j15
$$ -102 323 -552 -121 583 -697 -710 384 -134 -948 -159 256 -553 -27 -103 -247 -283 65 -630 -26 -141
3781a41q68L75P69p17j96Q88J4q05L81P42p12j78O68n87L48k4q6p4L03m86j48
$$ -141 -1009 -634 135 -582 -778 110 124 -681 -300 442 -270 -448 220 -367 -19 -43 -129 -203 100 -386 -534
3802e34J249m72q54Q76J87p35nN03j93n50Q81k55j54K59j08j45N53l18p47J280
$$ -534 715 243 -611 265 452 -283 -288 215 22 -528 353 98 -56 203 95 -50 503 185 -562 718
3822G18l37p55N34M88o07m14R37k41m07J15O3J72K86n29L0O06l85p34R59M26j233
$$ 718 381 -374 160 648 41 -373 564 323 -84 31 94 266 552 23 53 659 274 -460 499 925 -308
3843c08K95R07l92o51N95K43p48J53R9k02L22j41Q3j8J66q96N72N80j023k21J114
$$ -308 -13 894 502 -149 446 689 -59 94 193 -9 313 172 255 237 403 -493 79 659 -364 -585 529
3864E29l31r34O07M38l91l0R3j85J97pp25N91N40r65JJ261p50l80O97K36j082
$$ 529 198 -736 -129 309 -82 -112 -19 -204 -7 -14 -739 -148 392 -573 -572 689 -61 -441 256 492 -590
3885e90M7R64n46k36J01k28N55j93o86O27M69l94n45R04j99j261J058M72q70j17
$$ -590 -543 421 -125 -361 -260 -488 67 -126 -812 -185 284 -110 -655 249 50 -1211 -153 319 -551 -668
3905f68P46k66l1j3J37k50O52p95l9Q52m06q01J337R8j069L7R09m57m96O50n2
$$ -668 78 -188 -219 -232 -95 -345 307 -488 -527 325 -81 -882 455 553 -516 -479 430 -27 -523 127 75
3926G5l26K74J58l23P84q47J0N98o1p26L51P71j089J9J119n42q04N35K45m38P61
$$ 75 -251 23 181 -142 642 -205 -195 403 342 -384 -33 738 -351 -332 787 245 -559 -24 221 -217 544
3947E44l16l15M28n2l03K29N20j112L80Q85j209j18J041l22m08M14J85m95K15
$$ 544 228 -87 341 289 -14 215 735 -377 3 888 -321 -439 602 280 -128 286 471 -24 191
3966A91n8o6K02l8j31L71J13r22J52J184q03m28M63K60r11M95M77q22K21J39j94
$$ 191 133 67 269 231 100 471 584 -338 -186 998 195 -233 230 490 -421 74 551 -271 -50 89 -105
3987a05L09M56j068K61O99n08p60R18K66j073L45O98p93N7M89m08L64k37n10K79
$$ -105 204 660 -408 -147 552 44 -716 202 468 -605 -260 438 -355 -298 191 -217 147 -90 -600 -321
4007c21N15p09k9Q78m47o42M78M97r48M07N41o42k91P20j69k88L15l23K00M70
$$ -321 194 -515 -544 334 -113 -755 -277 220 -728 -321 220 -422 -713 7 -162 -450 -135 -458 -258 212
4027B12o57k80Q00Q3q34M04O37p75J76M18m94r9L20j13l2j20J62J76L50J02j081
$$ 212 -445 -725 75 158 -676 -272 365 -410 -234 184 -310 -409 -89 -202 -234 -354 -192 -16 334 436 -645
4048f45R15j06k84n6R20o54k85N01K04n68N7J83j29QJ28m54M53K5m66L24O40m83
$$ -645 270 164 -120 -176 744 90 -195 306 510 -58 -1 182 53 61 189 -265 188 213 -253 71 711 228
4070B28o43J071l64m77O21R3m23Q5J8j63o0K67j12K21j11n65J6R87p22j42O28
$$ 228 -415 656 292 -185 436 529 106 191 209 46 -14 253 141 362 251 -314 -298 689 -33 -175 453
4091D53N0n23K11M39l66j4M0k55R0L26m80J47M03n88j46O94j02n59K7M09j92j55
$$ 453 503 -20 191 630 264 250 290 35 125 451 -29 118 521 -67 -213 481 379 -180 -153 256 64 -91
4113i1M89n49J90j4l04M20L1k58m3L09j43o75P35J49o94K7P93p33j83N57l08J1
$$ -91 398 -151 39 25 -279 141 172 -86 -129 180 37 -638 97 246 -448 -421 372 -361 -544 13 -295 -284
4135b84L44m52K80J82l57k59P12R7q75M25N91p28l04P90k28m20L40L49m79J74
$$ -284 60 -392 -112 70 -287 -546 166 263 -612 -187 404 -324 -628 162 -66 -486 -146 203 -276 -102
4155a02J13k47L37j42n34O65K95q00J43O65m62m24N17j14l10P76l85n5K18k23
$$ -102 11 -236 101 -41 -575 90 385 -415 -272 393 -69 -493 24 -90 -400 376 -9 -64 154 -69
4175f9m89M09M77n80J72O94o46m29Q83k65n57O22L35n94N05j07l91L58l13J07
$$ -69 -558 -149 328 -252 -80 614 -32 -461 422 157 -400 222 557 -37 468 361 -30 328 15 122
4195A22L14k42l29K29N58l00m15L76J87o96o0N70k43K2j2j31K57K21l68J67L91
$$ 122 436 194 -135 94 652 352 -63 313 500 -196 -256 314 71 93 81 -50 207 428 60 227 618
4216F18n44j13M24Rp59N29K57l97K78J68n72Q0K11j40l08M60l67p4R27n83m33
$$ 618 74 -39 385 394 -365 164 421 24 302 470 -102 -22 189 49 -259 201 -166 -240 687 104 -329
4237c29M67M7o20O50k9j26o27O26k0o92P75j35k60K40N9n79Q55n35m93L03P80
$$ -329 138 185 -435 215 186 60 -567 59 39 -653 122 -13 -273 -33 26 -553 302 -233 -726 -423 357
4258C57o59n0N37l29j9J19n8o5P6O1l77M79k10m36O63k1n95M9N66l35m68O61j41
$$ 357 -302 -352 185 -144 -163 -44 -102 -167 -91 -30 -407 72 -138 -574 89 68 -527 -478 88 -247 -715 -54 -195
4281a95l26K68K22k27J28J30m86J58K15m81M21P31j094K97L67j9l96M69j31l13
$$ -195 -521 -253 -31 -258 -130 0 -486 -328 -113 -594 -173 558 -536 -239 128 109 -287 182 51 -262
4301b62K06L59m78L2n3K50j03M71m41j8O59p14k41K91M00r03M62O00p81K59N30
$$ -262 -56 303 -175 -143 -196 54 -49 422 -19 -37 622 -92 -333 -42 358 -545 -83 517 -264 -5 525
4322E25Kn46L70l09J07L6n04K37R53p31k74O55j7m63l1Q24q56j93M89j38j94M10
$$ 525 527 -19 351 42 149 185 -319 -82 871 140 -134 521 504 41 10 834 -22 -215 274 136 -58 352
4344C52m18r1N71m88j17M93R3q01O42M15q29k87R39n45j26L92j42k14K59j10q0
$$ 352 -66 -157 414 -74 -191 302 395 -406 236 651 -178 -465 474 -71 -197 195 53 -161 98 -12 -92
4365i2K43l04k43O05J47r86K05P88m86l53L99K77n41O4M51n29J95K39l38J55J86
$$ -92 151 -153 -396 209 356 -630 -425 363 -123 -476 -77 200 -341 -277 174 -355 -160 79 -259 -104 82
4386H2m76L33K10o53j17O87j4o29R16l69m96K87K96l13J90O3k05M25K3n42K00
$$ 82 -394 -61 149 -504 -621 66 52 -577 339 -30 -526 -239 57 -256 -66 -3 -208 217 240 -302 -102
4407a02R4J66n37M55P9j035P21M06m22j87M62J61k11J72l16K22K0l84J32Q95o21
$$ -102 -8 158 -379 76 155 -880 -159 247 -175 -362 100 261 50 222 -94 128 148 -236 -104 791 170
4428A70m65J27P70q03L39N04n61PM13k52j40L36m06l56N81j2o23M29J26n70M37
$$ 170 -295 -168 602 -201 138 642 81 88 501 249 109 445 39 -317 264 252 -371 58 184 -386 51
4449E1P91r94L12L80n35k83L58J4k29J44K36n62O66k5o36P70J78r83L03P65n24
$$ 51 842 -152 160 540 5 -278 80 94 -135 9 245 -317 349 324 -312 458 636 -347 -44 721 197
4470A97m30O73l18k85M69j40k28K81N5l25N0L88p18K18L41o05nO54k64k20K35
$$ 197 -233 440 122 -163 306 166 -62 219 274 -51 -1 387 -331 -113 228 -377 -382 272 8 -212 23
4491B3K96l46j49L78n69L36J73n21N86J35o47pK86N8n77M89K40r69P13R1l73J55
$$ 23 319 -27 -176 202 -367 -31 142 -379 207 342 -305 -312 -26 32 -545 -56 184 -785 -72 19 -354 -199
4513a99j27R7L47j00j89l40Q22p25o5K92q9m11O99M90q66P1M78o25M5N68l15k38
$$ -199 -326 -229 118 18 -171 -511 311 -414 -479 -187 -276 -687 12 502 -364 -293 185 -440 -395 173 -142 -380
4535c80N60j56m39Q27k91n09P24j31m50M1N97m86k65L98j25J57K10m27O0N40j
$$ -380 180 24 -415 412 121 -388 336 205 -245 -204 393 -93 -358 40 -85 72 282 -145 -85 455 454
4556D54q23N20K21o33K14O82o69j41M56p9k48J05J36l98L82j07L25k01K34o97
$$ 454 -369 151 372 -261 -47 635 -34 -175 281 202 -46 59 195 -203 179 72 397 196 430 -267
4576b67O62R7p88K75O18o16l1L37j08k46J88j91K04L73l90l84L38J05k62L61L9
$$ -267 395 492 -296 -21 597 -19 -50 287 179 -67 121 -70 134 507 117 -267 71 176 -86 275 314
4597C14n55qQ19j43p52P5M50m44Q5O30l09l61L5l8M79j47m69K3O18m28L6J07N7
$$ 314 -241 -249 570 427 -325 -250 200 -244 -159 471 162 -199 -164 -202 277 130 -339 -316 302 -126 -90 17 74
4620G4j74n6M99n79j67N45k60l4L60m05j08K91l92j83Q46o6q47O31J3m96M07K40
$$ 74 -100 -156 343 -236 -403 142 -118 -152 208 -197 -305 -14 -406 -589 257 191 -656 -25 -12 -508 -101 139
4642A39n18j11J21O93m65K68l46l07O20j09k24M24L12r22J23O69l95k99M94n8
$$ 139 -379 -490 -369 324 -141 127 -219 -526 94 -15 -239 185 497 -425 -302 367 -28 -327 167 109
4662A09j62J96m10p7M15k25r0L28q0m7L09L66j012L3P90m62l46P37k74j82l4J77
$$ 109 -53 143 -267 -344 71 -154 -244 84 4 -43 266 632 -380 -347 443 -19 -365 372 98 -84 -118 59
4684E9j9J24j34o0M69j43m50j24Q22q07R5P35M5n79J59Nq2m29N13k37K90K68o27
$$ 59 40 164 30 -30 439 296 -154 -278 544 -263 -168 567 612 33 192 197 115 -314 199 -38 252 520 -107
4707a07N7K90j54kM53n62o3K06K08l01L31k75k48k41Q27r3l15M07n67N8L77j7
$$ -107 -50 240 86 84 537 -25 -88 118 326 25 356 81 -167 -408 419 326 11 418 -149 -91 286 269
4729B69m92N80k45n65N53L4m16R0K53l43Q8M31p00O13o2l18n7J17K70p59P14K11
$$ 269 -223 357 112 -453 100 134 -282 -192 61 -282 -194 237 -463 150 88 -230 -287 -170 100 -659 55 266
4751B66o45k39O34K77o99O33l37l31P04k24j49nj81p5N25j23n68M37R1j03k32
$$ 266 -379 -618 16 293 -406 227 -110 -441 263 39 -110 -115 -296 -371 154 31 -537 -100 -9 -112 -344
4772c44L94o8j37K74j38m5r1O8J05J91n1l33Q7M60o85p3M97q0m03M97m5j27J69
$$ -344 50 -18 -155 119 -19 -64 -155 -87 18 209 158 -175 -88 372 -313 -386 111 31 -372 125 80 -47 122
4795A22j40m60L94j06k73N98m0j93J90M97m12M6J23o3m02K33J97j85o8K83m96
$$ 122 -18 -478 -84 -190 -463 135 95 -98 92 589 177 223 346 283 -119 114 311 126 58 341 -155
$$ [...]
8191B93
##END NTUPLES=NMR FID
##END=
