##TITLE=31Pdec_ANY-949-p
 CD3CN, 24 sc
 12.3.2019
##JCAMPDX= 6.0         $$ Bruker NMR JCAMP-DX V2.0
##DATA TYPE= NMR SPECTRUM
##DATA CLASS= NTUPLES
##ORIGIN= UXNMR, Bruker Analytische Messtechnik GmbH
##OWNER= root
$$ XWIN-NMR		Version 3.5
$$ Tue Mar 12 16:18:21 2019 Russian Standard Time (UT+4h)  she@DPX200
##.OBSERVE FREQUENCY= 81.013821
##.OBSERVE NUCLEUS= ^31P
##.ACQUISITION MODE= SIMULTANEOUS
##.ACQUISITION SCHEME= undefined
##.AVERAGES= 24
##.DIGITISER RES= 17
##SPECTROMETER/DATA SYSTEM= spect
##.PULSE SEQUENCE= zgpg30
##.SOLVENT NAME= CD3CN
##.SHIFT REFERENCE= (INTERNAL, CD3CN, 0, 182.463)
##AUDIT TRAIL= $$ (NUMBER, WHEN, WHO, WHERE, WHAT)
$$ ##TITLE= Audit trail, XWIN-NMR		Version 3.5
$$ ##JCAMPDX= 5.01
$$ ##ORIGIN= Bruker BioSpin GmbH
$$ ##OWNER= she
$$ F:/spectra/data/she/nmr/P31/1/pdata/1/auditp.txt
$$ ##AUDIT TRAIL=  $$ (NUMBER, WHEN, WHO, WHERE, WHAT)
(   1,<2019-03-12 16:17:18.04 +0400>,<she>,<DPX200>,
      <created by zg, POWCHK disabled, PULCHK disabled
       configuration hash MD5:
       00 E9 B6 7A A2 85 ED C7 34 08 36 98 17 FE 4E 26
       data hash MD5: 32K
       15 E8 9E 83 D9 97 06 22 86 43 16 A1 60 5E B7 18>)
(   2,<2019-03-12 16:17:28.39 +0400>,<she>,<DPX200>,
      <Start of raw data processing
       efp BC_mod = 2 LB = 1 FT_mod = 6 PKNL = 1 PHC0 = -1970.73 PHC1 = 491.199 SI = 64K 
       data hash MD5: 64K
       B3 39 63 B5 E6 23 7F AE 36 CB 60 C3 EF 79 40 90>)
(   3,<2019-03-12 16:17:46.67 +0400>,<she>,<DPX200>,
      <pk PHC0 = 111.549 PHC1 = -346.6 
       data hash MD5: 64K
       A4 E4 3A 90 C4 11 30 66 74 BB 15 34 FA 29 D2 3D>)
(   4,<2019-03-12 16:17:52.35 +0400>,<she>,<DPX200>,
      <abs ABSG = 5 
       data hash MD5: 64K
       F0 2F 87 F9 1A 4D 0D 1E 8F 1E A0 58 83 0F FC 31>)
$$ ##END=
$$ 
$$ hash MD5
$$ 24 6E B4 A9 86 69 B4 2D A8 B8 1A DC 76 90 9F F2
##$RELAX= 
##$RELAX= 
##$RELAX= 
##$RELAX= 
##$RELAX= 
##$RELAX= 
##$RELAX= 
##$RELAX= 
$$ Bruker specific parameters
$$ --------------------------
##$DU= <F:/spectra>
##$EXPNO= 1
##$NAME= <P31>
##$PROCNO= 1
##$TYPE= <nmr>
##$USER= <she>
##$AMP= (0..31)
100 100 100 100 100 100 100 100 100 100 100 100 100 100 100 100 100 100 
100 100 100 100 100 100 100 100 100 100 100 100 100 100 
##$AQSEQ= 0
##$AQ_mod= 1
##$AUNM= <au_zg>
##$AUTOPOS= <>
##$BF1= 81.014009
##$BF2= 200.13
##$BF3= 200.13
##$BF4= 200.13
##$BF5= 200.13
##$BF6= 200.13
##$BF7= 200.13
##$BF8= 200.13
##$BYTORDA= 1
##$CFDGTYP= 0
##$CFRGTYP= 5
##$CHEMSTR= <none>
##$CNST= (0..31)
1 1 145 1 1 1 1 1 1 1 1 1 1 1 1 1 1 1 1 1 1 1 1 1 1 1 1 1 1 1 1 1 
##$CPDPRG= <waltz16>
##$CPDPRG1= <>
##$CPDPRG2= <waltz16>
##$CPDPRG3= <>
##$CPDPRG4= <mlev>
##$CPDPRG5= <mlev>
##$CPDPRG6= <mlev>
##$CPDPRG7= <mlev>
##$CPDPRG8= <mlev>
##$CPDPRGB= <>
##$CPDPRGT= <>
##$D= (0..31)
0 1 0 0 0 0 0 0 0 0 0 0.03 2e-05 3e-06 0 0 0 0 0 0 0 0 0 0 0 0 0 0 0 0 
0 0 
##$DATE= 1552393037
##$DBL= (0..7)
120 120 120 11 120 120 24 19 
##$DBP= (0..7)
150 150 150 150 150 150 150 150 
##$DBP07= 0
##$DBPNAM0= <>
##$DBPNAM1= <>
##$DBPNAM2= <>
$$ [...]
##$SUBNAM3= <"">
##$SUBNAM4= <"">
##$SUBNAM5= <"">
##$SUBNAM6= <"">
##$SUBNAM7= <"">
##$SUBNAM8= <"">
##$SUBNAM9= <"">
##$SW= 369.568048894756
##$SWIBOX= (0..15)
0 1 3 0 0 0 0 0 0 0 0 0 0 0 0 0 
##$SW_h= 29940.119760479
##$TD= 32768
##$TD0= 1
##$TE= 0
##$TE2= 300
##$TE3= 300
##$TEG= 300
##$TL= (0..7)
0 120 53 12 22 120 120 120 
##$TP= (0..7)
150 150 150 150 150 150 150 150 
##$TP07= 0
##$TPNAME0= <>
##$TPNAME1= <>
##$TPNAME2= <>
##$TPNAME3= <>
##$TPNAME4= <>
##$TPNAME5= <>
##$TPNAME6= <>
##$TPNAME7= <>
##$TPOAL= (0..7)
0.5 0.5 0.5 0.5 0.5 0.5 0.5 0.5 
##$TPOFFS= (0..7)
0 0 0 0 0 0 0 0 
##$TUNHIN= 0
##$TUNHOUT= 0
##$TUNXOUT= 0
##$USERA1= <user>
##$USERA2= <user>
##$USERA3= <user>
##$USERA4= <user>
##$USERA5= <user>
##$V9= 5
##$VALIST= <valist>
##$VCLIST= <CCCCCCCCCCCCCCC>
##$VD= 0
##$VDLIST= <DDDDDDDDDDDDDDD>
##$VPLIST= <PPPPPPPPPPPPPPP>
##$VTLIST= <TTTTTTTTTTTTTTT>
##$WBST= 1024
##$WBSW= 4
##$XGAIN= (0..3)
0 0 0 0 
##$XL= 0
##$YL= 0
##$YMAX_a= 17997
##$YMIN_a= -18174
##$ZGOPTNS= <>
##$ZL1= 120
##$ZL2= 120
##$ZL3= 120
##$ZL4= 120
##$ABSF1= 182.463
##$ABSF2= -187.1042
##$ABSG= 5
##$ABSL= 3
##$ALPHA= 0
##$AQORDER= 0
##$ASSFAC= 0
##$ASSFACI= 0
##$ASSFACX= 0
##$ASSWID= 0
##$AUNMP= <proc_1d>
##$AZFE= 0.1
##$AZFW= 0.5
##$BCFW= 0
##$BC_mod= 2
##$BYTORDP= 0
##$COROFFS= 0
##$CY= -3
##$DATMOD= 1
##$DC= 0
##$DFILT= <>
##$DTYPP= 0
##$F1P= 0
##$F2P= 0
##$FCOR= 1
##$FTSIZE= 65536
##$FT_mod= 6
##$GAMMA= 0
##$GB= 0
##$INTBC= 1
##$INTSCL= 5.30512e-09
##$ISEN= 30
##$LB= 1
##$LEV0= 0
##$LPBIN= 0
##$MAXI= 10000
##$MC2= 0
##$MEAN= 0
##$ME_mod= 0
##$MI= 50
##$NCOEF= 0
##$NC_proc= -4
##$NLEV= 6
##$NOISF1= 182.463
##$NOISF2= 159.3651
##$NSP= 0
##$NTH_PI= 0
##$NZP= 0
##$OFFSET= 182.463
##$PC= 4
##$PHC0= -1859.181
##$PHC1= 144.599
##$PH_mod= 1
##$PKNL= yes
##$PPARMOD= 0
##$PSCAL= 0
##$PSIGN= 0
##$REVERSE= no
##$SF= 81.0140089999434
##$SI= 65536
##$SIGF1= 159.3651
##$SIGF2= -187.1042
##$SINO= 113.3802
##$SIOLD= 16384
##$SREGLST= <1H.CDCl3>
##$SSB= 0
##$STSI= 65536
##$STSR= 0
##$SW_p= 29940.119760479
##$SYMM= 0
##$S_DEV= 0
##$TDeff= 32768
##$TDoff= 0
##$TI= <>
##$TILT= no
##$TM1= 0
##$TM2= 0
##$TOPLEV= 0
##$USERP1= <user>
##$USERP2= <user>
##$USERP3= <user>
##$USERP4= <user>
##$USERP5= <user>
##$WDW= 1
##$XDIM= 65536
##$YMAX_p= 405053990
##$YMIN_p= -25873956
$$ End of Bruker specific parameters
$$ ---------------------------------
##NTUPLES= NMR SPECTRUM
##VAR_NAME=  FREQUENCY,     SPECTRUM/REAL,   SPECTRUM/IMAG
##SYMBOL=    X,             R,               I
##VAR_TYPE=  INDEPENDENT,   DEPENDENT,       DEPENDENT
##VAR_FORM=  AFFN,          ASDF,            ASDF
##VAR_DIM=   65536,         65536,           65536
##UNITS=     HZ,            ARBITRARY UNITS, ARBITRARY UNITS
##FACTOR=    0.456856943014862, 1,           1
##FIRST=     14782.0589164792, 0,            0
##LAST=      -15158.0608439998, 0,           0
##MIN=       -15158.0608439998, -25873956,   0
##MAX=       14782.0589164792, 405053990,    0
$$ Real data points
##PAGE= N=1
##DATA TABLE= (X++(R..R)), XYDATA
$$ [...]
41139G1709j27343j75717j73208p6591k7160p7077o3842N1512L3151j86199k43914
41128i94679J16037N37938N13787J32907q2375M8937K08249J28742j01804k71287
41118B36452k54338m1974J75508R3304k59033l82570O128M28362K81971k24018
41108E9792l97539j45364R004p7643J8477L66279M14526m7342m24215k39709J32329
41097c31405J54535m0355o4332j3964j58627k87642n1622L15146K96233m4630
41087b26663j61685Q4383K64332J19835j09608j75513j32198o2733N7352J30002
41077b12496p147k11937j57106J07048J81881J5433K9226L47101M67771O5299
41067F25073l95123l28644P5064J84395j14911l73404l39115j86811l6619J94727
$$ y = [71709, -55634, -231351, -404559, -481150, -508310, -585387, -649229, -597717, -564566, -750765, -994679, -878642, -340704, 173083, 305990, 223615, 272552, 480801, 609543, 507739, 236452, -17886, -59860, 115648, 208952, -50081, -432651, -426523, 1839, 283810, 59792, -337747, -483111, -474107, -551750, -533273, -166994, 247532, 200190, -224025, -463734, -331405, -176870, -217225, -281557, -295521, -454148, -741790, -793412, -478266, -182033, -226663, -388348, -303965, -39633, 80202, -29406, -204919, -337117, -399850, -342498, -212496, -219643, -431580, -588686, -481638, -299757, -284324, -255098, 92003, 559774, 625073, 229950, -98694, -23630, 160765, 45854, -327550, -666665, -853476, -890095, -695368]
41057f95368M15311L51969M4459j17305m366M1119j94006m00948k25021K07149
41047e77007N11906N09761K28796k20642n16797k65329L72923N93876k9604q06274
41037a98391q06265j70158K08638J04984J42747N22502N81710j0742n36593l19536
41027d81104J97004K19660j14467j09708K11477J94107k01330k43950L06526O91351
41017F69566L04855l72293n32863k04371k5152j83826k48296J9678K70556J32604
41007a69542k31292l73757j67499Q1515R0213k3145O5194L74289N15464K21729
40997C83169k09813k86319l4996M1336k30583l88421p0978L57268L38206j1256
40987a12387r7281K02113L71741J14300j95388j67388k6878j72135m35936l14943
$$ y = [-695368, -280057, 71912, 116371, -934, -5300, 35819, -158187, -559135, -784156, -577007, -65101, 444660, 673456, 452814, -63983, -329312, 43611, 637487, 607883, -198391, -1004656, -1174814, -966176, -861192, -718445, -195943, 385767, 375025, -161568, -481104, -284100, -64440, -178907, -288615, -77138, 116969, -84361, -328311, -21785, 669566, 974421, 602128, 69265, -135106, -160258, -344084, -592380, -572702, -302146, -169542, -400834, -774591, -942090, -860575, -770362, -793507, -728313, -354024, 161440, 383169, 173356, -112963, -147959, -106623, -337206, -725627, -796605, -439337, -101131, -112387, -209668, -7555, 364186, 478486, 283098, 115710, 88832, -83303, -519239, -834182]
40977h34182J89281M93947K68639j11985j51137Q6750J70331l7150k39696j72080
40967c37282O1902J50427o4778m05894m91581j30797L70295M71446Q6570k27375
40957e17067m149M55250N19145J57322p4353O2943J89829M1186r0415M7117J45288
40946I32096j31172m88217m22774m0965J15477p7207k23470j34747q2115k17322
40936g70416k60652Q183L48740M19069K49843R9943N0843n61p4582n9121J10566
40925A21855L45207M55874L00887m5827l05963l08280k24793k94133l91907j95070
40915e42150K39189M49566K20260j35312k97920l37211l40240r5699M32924P03370
40905B96777K55709m34538m48076K39837O26257J13511n92560n04048K22817N70356
$$ y = [-834182, -644901, -150954, 117685, 5700, -145437, -58687, 111644, 74494, -165202, -337282, -275380, -124953, -189731, -595625, -1087206, -1218003, -847708, -376262, -289692, -517067, -521216, -65966, 453179, 610501, 536148, 599091, 788920, 830106, 739691, 786808, 932096, 800924, 312707, -110067, -151032, -35555, -112762, -336232, -470979, -553094, -770416, -1031068, -1022885, -674145, -255076, -5233, 94710, 145553, 144992, 70410, 11289, 121855, 467062, 922936, 1223823, 1177996, 872033, 563753, 338960, 44827, -347080, -542150, -302961, 146605, 366865, 231553, -66367, -403578, -743818, -839517, -406593, 296777, 552486, 117948, -330128, -90291, 535966, 649477, 56917, -447131, -224314, 346042]
40895C46042J54246l25800k25589J54916J90041r6919k24250j01853o4747j65417
40885c59330p1884K52331L71156J00193j38773j7725J44230k5780k50489p4877
40875g0948K81503K29960j93673l64936r0536J32191P671j07674P5491K49145
40865A48194J04630p2891R2580L71127K80324j23434l43529j92096M7033J37353
40855D49291J32757J13285O1084K1701O6285P9743j12054l97330m68846k84588
40845c38672j24877j32613j17214O4679K31463J67569l2981j24213n3265N2792
40835d07332J26392J81682J76924O1330p8999j20683j24587k29113l16739r5619
40825h26744L56265M75982k7163n73533l89459L23385N48398p8004o65247l70245
$$ y = [346042, 500288, 174488, -51101, 103815, 293856, 196937, -27313, -129166, -193913, -359330, -431214, -178883, 192273, 292466, 153693, 135968, 280198, 254418, 3929, -70948, 210555, 440515, 246842, -118094, -208630, -76439, -68768, -176442, -100951, 148194, 252824, 179933, 272513, 643640, 923964, 800530, 457001, 264905, 311938, 449291, 582048, 695333, 756417, 778118, 844403, 924146, 812092, 414762, -54084, -338672, -463549, -596162, -713376, -648697, -417234, -249665, -282646, -406859, -460124, -407332, -280940, -99258, 77666, 138996, 59997, -60686, -185273, -414386, -731125, -826744, -470479, 5503, -21660, -595193, -984652, -661267, -112869, -190873, -856120, -1226365]
40815a226365L30393L91545j92538m45885L2863N25309L91562m8450k28996k07973
40805f78535k79742k86280M3271M36767M10312N3804r7204J24022L41184K49429
40795C17028k2880j82016q0733K19783M52669L05954j72667m91035l19425J9038
40785D5716K6479k05883j79230J84585M11336J87293k47309m93684m18618j21605
40775h10920J95351K79554M9031k16737j85291O7485K14615K10803K65860L44472
40765D14223J77828j86960l37804j13364J75839K65768K32904J36105j43166m90363
40755A31010m88475p0220K21292J3611k68762m8205M55920N06136n8589n82122
40745a88404m89224M7350M80787N61385M15480K07347J456j25566r1760J7101
$$ y = [-1226365, -895972, -504427, -696965, -1142850, -1109987, -584678, -193116, -241566, -470562, -678535, -958277, -1244557, -1201286, -764519, -354207, -300403, -397607, -273585, 67599, 317028, 294148, 112132, 31399, 251182, 703851, 1009805, 837138, 346103, 26678, 45716, 72195, -133688, -312918, -128333, 283003, 470296, 222987, -270697, -689315, -810920, -615569, -336015, -286984, -503721, -689012, -621527, -406912, -196109, 69751, 414223, 592051, 405091, 67287, -46077, 129762, 395530, 628434, 764539, 621373, 131010, -357465, -427685, -206393, -192782, -461544, -509749, -53829, 452307, 393718, -188404, -677628, -630278, -149491, 411894, 827374, 1034721, 1036177, 910611, 818851, 835952]
40735H35952m1618l45807o01557m64528m3956J83951M0163j01980O9619K80305
40725a89456J30745j98828k25140K2184P0301j41330j40613K12492M07828J24708
40715G2891k09831j15045J95186K43174N5550l6333m5922k02744l79763k38106
40705f60943J36002K80224M8202k17879k50925j68442j32371p8560P6158K42997
40695g25537L09597K77797J84719P3079O1159K26543L92715K61689j74720n50452
40685C36589n30099j58466K38737L79425K26006k8572j57230j32642j07187j28501
40675f1940o0192R7040O7739k49625m37093o1086O10196Q47315M02964k18867
40665I36451m80159l63575j07174J72698L75956L03805o3039m09156m48602k55184
$$ y = [835952, 794334, 448527, -153030, -617558, -661514, -477563, -437400, -539380, -469761, -189456, -58711, -257539, -482679, -460495, -390194, -531524, -672137, -459645, -51817, 72891, -136940, -251985, -56799, 186375, 241925, 205592, 159670, -43074, -422837, -660943, -524941, -244717, -196515, -414394, -665319, -833761, -966132, -1044692, -968534, -725537, -415940, -138143, 46576, 119655, 180814, 407357, 800072, 1061761, 887041, 336589, -193510, -351976, -113239, 266186, 492192, 463620, 306390, 173748, 66561, -61940, -122132, -25092, 42647, -206978, -644071, -705157, -94961, 752354, 1155318, 936451, 456292, 92717, -14457, 158241, 534197, 838002, 774963, 365807, -82795, -337979]
40655c37979m9809J13523K42957K23449K983j99529j35542J26550L06378K60762
40645E53743N2306j95819l29705k06898P8088J72049r1658l92979l52984q9988
40635h03845J0189n9891L6418L39608M84049L13202J20024Q7750l8562m15490
40625G3452o54473l48612K35236M75335K53891K0760O9344K33115L23165L81864
40615A063077L77479J08049l62199n74052k93326O4442q59l31129l59985L6245
40605b72258L96696L72879J32411l1320j08291j94083k00737j5928K13673K24995
40595E18037J1045j61568j12942L3894M3302j35190l33534l80597k69160j01872
40585h88585M8390J55851J76716R0578P73M7957J90822K32404J23888N2507J22958
$$ y = [-337979, -387788, -274265, -31308, 192141, 195124, -4405, -139947, -13397, 292981, 553743, 606049, 410230, 80525, -126373, -48285, 123764, 32106, -360873, -713857, -803845, -793656, -853547, -817129, -477521, 6528, 319730, 439754, 527504, 488942, 73452, -581021, -929633, -694397, -219062, 34829, 55589, 124933, 358048, 681213, 1063077, 1440556, 1548605, 1186406, 612354, 319028, 383470, 382611, 51482, -308503, -272258, 124438, 497317, 629728, 598408, 490117, 296034, 95297, 79369, 293042, 518037, 529082, 367514, 254572, 288466, 331768, 196578, -136956, -517553, -786713, -888585, -840195, -684344, -507628, -417050, -416277, -368320, -177498, 54906, 178794, 231301, 354259]
40574C54259J66468L4504j35775j73935j72769k41318j86530J58929M63127K53994
40564E20954l01147n19197j72596K01035J29677j68325k60503j41399m6298M244
40554g53555Q8316R6569n9693j78688n1775J88130L16968L84477M91535M62958
40544I85242J56166j29762k9363K65451K62008n4405k35179j34657r6009k82682
40534G06810l67715j01865K55469L39706J72335p233j05786j13136N8415L73104
40524A210104N06679J99406l26049n81488m12481j44823j24794l12655m00177
40515c86278k09106J18124K93531J92785k9447j20573N741J99200K36670M6303
40505C46950j93776j95849J13176M28501L79967J2568k60244k27702j14815j18935
$$ y = [354259, 520727, 555231, 419456, 245521, 72752, -168566, -355096, -196167, 266960, 520954, 219807, -299390, -471986, -270951, -141274, -309599, -570102, -711501, -757799, -753555, -665239, -568670, -628363, -807051, -858826, -670696, -353728, 30749, 522284, 985242, 1141408, 1011646, 982283, 1247734, 1509742, 1455337, 1220158, 1085501, 989492, 706810, 339095, 237230, 492699, 832405, 1004740, 997507, 891721, 778585, 837000, 1210104, 1716783, 1916189, 1590140, 1008652, 596171, 451348, 326554, 13899, -386278, -595384, -477260, -183729, 9056, -20391, -140964, -135223, 63977, 300647, 346950, 153174, -42675, 70501, 499002, 878969, 891537, 631293, 403591, 288776, 169841]
40495A69841p8778J15523J51053k13396n58038k96283L68502O30344K48599j45009
40485C92358q2988P2910j24522l97169k37850J86454K74054n8013k88555j39122
40475d02443O8411K2244j03154k7975J39495J15804o1758r6332P5192J66107j8132
40464a22541k69697k70568l8145J39625J49307J72152L15931L96202K49997M3304
40454G65567Q224K9943j71865n07557n40249j23741L19573L40949L2718j73364
40444a9802r6401O5479J12554Q5321R8776J33023R6920P823j4669O4492J16064
40433F49580K5648j14626j26043l0080k2097j15409n7919K38018M20813J32750
40423A000635m29494p06242m68433k0597K63572L03075J85803j4702j98066k26856
$$ y = [169841, 91063, 206586, 357639, 144243, -413795, -710078, -341576, 288768, 537367, 392358, 309370, 382280, 257758, -139411, -377261, -190807, 83247, 25234, -263321, -402443, -334032, -311788, -414942, -442917, -303422, -187618, -249376, -345708, -270516, -104409, -122541, -392238, -662806, -700951, -561326, -412019, -239867, 76064, 472266, 722263, 765567, 773791, 803734, 631869, 124312, -415937, -539678, -220105, 120844, 153562, -19802, -116203, -50724, 61830, 147151, 245927, 378950, 475870, 483693, 469024, 533516, 649580, 675228, 560602, 434559, 404479, 382382, 266973, 209054, 447072, 867885, 1000635, 571141, -135101, -603534, -624131, -360559, -57484, 128319, 113617, -84449, -311305]
40413c11305o4392J80375L47658K86783m8145m06970l61377J10586L98350K7047
40403A58610n66292n72033J6068M26830K96762Q3732J47569J86923o6696k90370
40393a78897j76497j0356j10024j99727O4724L71965K10961k50901m01094j04524
40383g84370K14306K83893K17355J22199K754j6003J51538K52288K8389k63031
40373B09318j82388J46055K06063l8901q9415K06289L59935M2926l85360m46302
40363B8220j98043j0174k1067j13260j70913j13387J11641L63351L39497l3961
40353A81904m13658m09778k4970L86266M85742K29854r7554j31564J56597L59660
40343G22499J49710k34725l31138j62837j60263l95541m26226m5777L16518K28856
$$ y = [-311305, -375697, -195322, 152336, 439119, 390974, -15996, -377373, -266787, 131563, 158610, -407682, -979715, -963647, -536817, -240055, -156323, -8754, 178169, 111473, -178897, -355394, -365750, -475774, -675501, -610777, -238812, -27851, -278752, -679846, -784370, -570064, -286171, -68816, 53383, 56137, 40134, 191672, 443960, 472349, 209318, 26930, 172985, 379048, 340147, 250732, 457021, 816956, 859882, 474522, 28220, -169823, -179997, -201064, -314324, -485237, -598624, -486983, -123632, 215865, 181904, -231754, -641532, -666502, -280236, 205506, 435360, 337806, 206242, 362839, 722499, 872209, 637484, 306346, 143509, -16754, -412295, -838521, -884298, -567780, -338924]
40333c38924j13370k41646j02841q135o3762l7015K18715M86117M33215L9726
40323B72080l25568l10177k7342P5441j41191k80076l9105K58802J77419p7763
40313d17480M012L25827L12652p1660k09322J23043L61987J16840j93441q6540
40303B65918K25005L06214J88308Q3807q4972l49018l65879L878K46906o4206
40293D55961n03473m23331K8907K36381J13874K0187l7340k78563m47175j23911
40283i58483L69134L02694k26522l46392J85167N76582K82766j95602k05106J24126
40273i1636L04874K30484L0655k65058n01769l52972J13883L46260J40785j9097
40263f3591J43074J50840l16131o53651k41003M36315M69144m8488k36619J22377
$$ y = [-338924, -452294, -693940, -796781, -804916, -868678, -905693, -686978, -200861, 232354, 272080, -53488, -363665, -391007, -315566, -456757, -736833, -775938, -517136, -339717, -417480, -413468, -87641, 225011, 153351, -55971, 67072, 429059, 545899, 352458, 265918, 490923, 797137, 985445, 1069252, 984280, 635262, 269383, 273261, 520167, 455961, -47512, -470843, -441936, -205555, -91681, -71494, -108834, -387397, -834572, -958483, -589349, -286655, -513177, -859569, -674402, -97820, 184946, -10656, -215762, -91636, 213238, 443722, 474377, 209319, -292450, -645422, -531539, -185279, -44494, -63591, 79483, 230323, -85808, -739459, -980462, -544147, -75003, -123491, -360110, -237733]
40253b37733L42228N9333k33485j03159J62041J55201J787J1202J24016R8539
40243C79970m5805j05701l2775M7256L6988n4794j42490j16191L3699J61092J48279
40232C09528N6947l9260j84875k96125o9386M96044P78250K77446n27142p15146
40222H6281k12476J89076R4639l7820J20891J88419j30812m15860k41949P7963
40212b81648N4280j64994j49126M8900R8347L7935J06965J99003Q4389n7608O6181
40201D2624K48580R5544k22932k14362N4199M0059l10370m15103j2890M04183
40191b90468L57739K2295j84956j88409j32870n4158M2993O0800j2856l6421L2074
40180c84237O4135L6063Q2263J87779J54613k4131j01301m475L3069q1485r1351
$$ y = [-237733, 104495, 163828, -69657, -172816, -10775, 144426, 146213, 157415, 281431, 379970, 334165, 228464, 195689, 242945, 279933, 225139, 82649, -33542, 157, 161249, 309528, 366475, 327215, 142340, -153785, -223171, 272873, 1051123, 1328569, 801427, 86281, -126195, 62881, 157520, 119700, 240591, 429010, 298198, -117662, -359611, -281648, -227368, -392362, -541488, -492588, -394241, -356306, -249341, -50338, 34051, -23557, 42624, 291204, 386748, 163816, -50546, 3653, 43712, -266658, -681761, -694651, -290468, 67271, 89566, -95390, -283799, -416669, -470827, -427834, -367034, -379890, -416311, -384237, -320102, -284039, -201776, -13997, 140616, 116485, 15184, 10709, 43778, -37707, -129058]
40169a29058J67092M28661L34050j20663o10413p55180l52247L59512O95356K27491
40159B44601m97624n05223K49113P34786L12688l68781m06060P6501L12523P8382
40149B30906k18585l22827l04900j47860J86156L94683J51404k86576l60750m9026
40139g27375J49438M7625j0012J63602K70638Q3874j48767j10464J22121K66863
40129A07543K35503J33933L7868n9579j65079k38317j95827j08K02626J73309
40119B31872p4765k14256o3094J29395R9614J990Q0387J72950p49k58813j93305
40108h8774J16372J82772j01047k94027j13852J77562K42920J17017J8447K8562
40098B85952R1579R7416p7688l84710n06595k27496K01678L92290L60170L33413
$$ y = [-129058, 38034, 466695, 800745, 680082, 69669, -685511, -1037758, -678246, 17110, 244601, -253023, -758246, -509133, 225653, 538341, 169560, -236500, -159999, 152524, 230906, 12321, -310506, -615406, -763266, -577110, -182427, -31023, -317599, -678349, -727375, -577937, -530312, -540324, -376722, -106084, -22210, -170977, -281441, -159320, 107543, 343046, 476979, 514847, 455268, 290189, 51872, -143955, -144063, 58563, 231872, 157107, -57149, -120243, 9152, 108766, 110756, 191143, 364093, 363344, 104531, -88774, 27598, 210370, 109323, -184704, -298556, -120994, 121926, 238943, 257390, 285952, 377531, 474947, 397259, 12549, -494046, -721542, -519864, -127574, 232596, 566009]
40088E66009K15762k01149o23617n20459L139K67729K6398k52314k13993m6612
40078g79107P6602K76220M72566L31989k2309Q493M64881N61369q0502p11163
40068E99039n76429m7889J01505p1933k4706J82574O4073l01373l57953l2100
40058d65192J94985J25109L0869K4970p1762k06656q6548K34938L48593J54346
40048B83652j0043J0525j9246j91361k38107l0109J68213J43122L7109J4469k2301
40037A45923j75048l06967k57205p0317J34965L17574M25638L58997J15494j89557
40027D99497m77276o94047o77657l06645K00717M30729K91609J25366K09438L86899
40017a1370L26771j9012l57173l80315q9733J90084J56527j02864k30544j19645
$$ y = [566009, 781771, 580622, -42995, -563454, -560315, -292586, -266188, -518502, -732495, -779107, -702505, -426285, 46281, 378270, 355961, 364454, 829335, 1390704, 1310202, 599039, 22610, -25279, 76226, 4293, -20413, 162161, 226234, -75139, -433092, -465192, -270207, -145098, -114229, -89259, -161021, -367677, -454225, -219287, 129306, 283652, 273609, 284134, 264888, 73527, -164580, -194689, -26476, 116646, 153755, 168224, 145923, -29125, -336092, -593297, -663614, -528649, -211075, 214563, 573560, 689054, 499497, 22221, -671826, -1349483, -1656128, -1455411, -1024682, -733073, -607707, -398269, -11370, 315401, 296389, -60784, -441099, -530832, -340748, -184221, -287085, -517629, -637274]
40007f37274m6004j50239j49356J38727L45401Q9476l08795k25269K99441O00172
39997d3720L74964K8398n2504J1183k942l4270K076n294r0122q1981L1457j9704
39985A17541l11114m72232k02363K36634L51268O0337k59994k69538m773K20391
39975e33843J58512q9735j79686p864Q1070j62843l63380j6051N97665O44486
39965A28331k1260n38324k54954L58988M72692O2335k48049j71433J9505Q6894
39955a05275R1452R5675M5664l3733n6895p7801j83669k38368m4076K68512L35252
39944I6738P1088k07743k38238j16651l6989L9240K52084N00497M63756K1046
39934H44828m88434n74123j51121L64304N60962M41792K08440r8068m45083n26177
$$ y = [-637274, -683278, -833517, -982873, -844146, -498745, -409269, -718064, -943333, -643892, -43720, 331244, 359642, 307138, 318321, 315379, 281109, 283185, 277891, 187769, 105788, 137245, 117541, -193573, -665805, -868168, -631534, -280266, -219929, -479923, -749461, -754234, -533843, -375331, -465066, -644752, -652616, -571546, -734389, -1097769, -1113820, -516155, 128331, 107071, -431253, -686207, -327219, 145473, 207808, -40241, -211674, -192169, -105275, -13823, 81852, 127516, 93783, 36888, -40913, -224582, -462950, -507026, -238514, 96738, 167826, -39917, -278155, -394806, -431795, -392555, -140471, 360026, 823782, 844828, 356394, -217729, -368850, -4546, 556416, 998208, 1206648, 1108580, 663497, 137320]
39924A37320j06875M26034M10615j25090m16677q2450L03582J33427k85338k67713
39914A26835J48566L21092M5507k08582j27547k208j65458m64041n52386l78098
39904a256320j15477J41391L64959M42975K93286N1976n7763j1103L1815N766
39894a08495K3352J30100J56775l3202k64690k46605k0689O4231r9881j83810
39884e82914J6743J61652r7547m26110k13031M25934O99235K95857j54169n6860
39874F8790K93787K78706r6228l49106l07319j87355p7487J17182K96271K30153
39864B67394l361q3863L2606O5009p7179j24943R0930L44333L34061O6196k12951
39853F98232k96648j55610N3126Q7184j16081k91167j57327J46421J96183j23712
$$ y = [137320, 30445, 456479, 867094, 742004, 325327, 242877, 546459, 679886, 394548, 126835, 275401, 596493, 642000, 433418, 305871, 303663, 138205, -325836, -878222, -1256320, -1371797, -1230406, -865447, -422472, -129186, -77210, -134973, -146076, -114261, -108495, -85143, 44957, 201732, 168530, -96160, -342765, -363454, -299223, -399104, -582914, -566171, -404519, -502066, -928176, -1141207, -715273, -16038, 279819, 125650, 68790, 362577, 641283, 545055, 195949, -111370, -298725, -376212, -259030, 37241, 267394, 264033, 180170, 212776, 277785, 200606, 75663, 166593, 510926, 844987, 911183, 698232, 401584, 245974, 299100, 386284, 270203, -20964, -178291, -31870, 164313, 40601]
39843D0601m44674m26518j79283k551P6355K45470M84565M86695Q9857l99524
39833b9007n08180j79537J62529K05783J58068L31442N36721L18528k64021o07013
39823A25313m30769j54568j42498j11624K57526N93574L62142j76085k77667J13382
39813A58726K76081j15758m79309k71874J92723L30511J93811K20129L79682K16819
39803A101541l06841o03630k80044K57128L27772j21571n01668l98276l5678J80037
39793c81230K33467L24014L60925Q4464l57156m45841m5623L26108K22469j30117
39783A91480k66408j57696n9605L84J16473J32653j06231l08948r4109L17997
39773b34010L46274n7426l44949k30397j7053K6753J7969J9250j54846m41196
$$ y = [40601, -404073, -830591, -1009874, -1012425, -936070, -690600, -206035, 280660, 370517, -29007, -537187, -716724, -554195, -348412, -190344, 141098, 677819, 996347, 732326, 125313, -305456, -460024, -602522, -714146, -456620, 136954, 499096, 323011, 45344, 158726, 434807, 319049, -160260, -432134, -239411, 91100, 284911, 505040, 884722, 1101541, 794700, 191070, -88974, 168154, 495926, 374355, -127313, -525589, -561267, -381230, -147763, 176251, 537176, 621640, 264484, -181357, -226980, 99128, 321597, 191480, -74928, -232624, -292229, -291845, -175372, -42719, -148950, -457898, -552007, -234010, 112264, 54838, -290111, -520508, -537561, -510808, -492839, -473589, -628435, -1069631]
39763a069631l99587R6002N40415N23673K98241K35399J98339n2282k52094l1717
39753H6758L57591L37300j13240m32516k94373M9566K51530K54111J55782N6290
39743G08799P3366K13510K45061j122k73714j98508J27534K44690J3741k37685
39733I15672k74712k14381j56710k1015J21298K0559k55673k72961O7893K58610
39723A88580k9570l47968j51661K94670L03429j56899m25262j53374K69868L96177
39713A87990K76739J53334M2751j21876k67646l22534l20684k31176J8735K46609
39703c37758J37155j77805j37276L67315O36118J42108n83168o58258j23752K08855
39693e26466J3469k16862j08480P9785P3137L8292J24900J22060p2480j37805
$$ y = [-1069631, -1469218, -1373216, -832801, -309128, -10887, 224512, 422851, 370569, 118475, 86758, 444349, 781649, 668409, 235893, -58480, -8914, 242616, 496727, 652509, 708799, 782165, 995675, 1240736, 1239614, 965900, 767392, 894926, 1139616, 1153357, 915672, 640960, 426579, 269869, 248854, 370152, 390711, 135038, -137923, -70030, 188580, 159010, -188958, -340619, -45949, 257480, 100581, -324681, -478055, -208187, 187990, 464729, 618063, 660814, 538938, 271292, -51242, -371926, -603102, -584367, -337758, -200603, -378408, -515684, -148369, 487749, 629857, 46689, -611569, -735321, -526466, -512997, -729859, -838339, -758554, -685417, -647125, -522225, -400165, -472645, -610450]
39683f10450J19261L36965J65138j17361n0516K31181K20540j22637l04515o3821
39673a96215K67694K82079L4706r5637Q9047L76419L98892J00441j27118O5133
39663A195441M21619L43716k40429o94671n55196j45765Q590n1265n4Q3119j05090
39652B60015m20954l88643M8671M08676L35885k0261l11139l22622k5098L76328
39642e9142M95398J93737j44413j10762J12795O2039k53636m17933l13892j93839
39632f29648j03604J50510M44717L76162m5161l33767k71111j24772k3993K18716
39622c41951M88266L03083l08150n81041j19083M32710L70240j4014l7953K04456
39612C96563J01835l42496m99502j75010J16400M9058m7353J28156K91971R6513
$$ y = [-610450, -491189, -154224, 10914, -106447, -156963, 74218, 294758, 172121, -132394, -196215, 71479, 353558, 388264, 292627, 381674, 758093, 1156985, 1257426, 1130308, 1195441, 1617060, 1960776, 1720347, 1025676, 470480, 324715, 333305, 282040, 281986, 365105, 260015, -160939, -549582, -500911, -92235, 243650, 223389, -87750, -410372, -435470, -59142, 436256, 629993, 485580, 374818, 487613, 549652, 296016, -121917, -435809, -629648, -733252, -582742, -138025, 238137, 192976, -140791, -411902, -536674, -560667, -341951, 146315, 449398, 141248, -439793, -558876, -126166, 244074, 230060, 192107, 396563, 498398, 155902, -343600, -518610, -402210, -353152, -400505, -272349, 19622, 116135]
39602A16135k15232j54463K24409L62174J2566m00187l94508p4147J23620R9993
39592b99640J11178J89720N1402k92393l49593Q9234M63321K26554k41284j66835
39582b18336L84741N77104R6466m03350l41776J6541J68411J37098J81226K11917
39572H10042N898l00455l89542k49903j18892q6942o5625k9459l5384q4257j24105
39561f68624j01073M8280K88351L72030J12757k27076j82136K35266N13594L85326
39551G76695J31286R510j10970l22967l90051j83134L5477P1154J15563L02123
39541D34686L83619J91575j7050l3326p8882l19291m35146j43178K39910K49835
39531D72752k3862j64264p9264K6203Q4679J49170J54451N1572l9273p8298k03036
$$ y = [116135, -99097, -253560, -29151, 333023, 345589, -54598, -449106, -523253, -399633, -299640, -188462, 1258, 52660, -239733, -589326, -500092, -36771, 189783, -51501, -218336, 166405, 743509, 839975, 436625, 94849, 111390, 279801, 416899, 598125, 810042, 815940, 515485, 125943, -123960, -242852, -329794, -395419, -424878, -460262, -544519, -668624, -769697, -721417, -433066, -61036, 51721, -175355, -357491, -122225, 391369, 776695, 907981, 917491, 806521, 483554, 93503, -89631, -54154, 17000, 132563, 434686, 818305, 1009880, 992830, 959504, 880622, 561331, 126185, -16993, 222917, 472752, 448890, 284626, 205362, 231565, 316244, 465414, 619865, 671437, 632164, 553866, 350830]
39520C50830l47922k01410J83793K73157r4417l29118l1955L22401K31267M1326
39510C97952K38738M66228J46815l89737l96836l5L2858l66836m86129p6474K75476
39499a57980J48222j56761k32022p6187J53532L46767L25392J0525l10321l30013
39489b78846j99440j88957j36918J79190M34181K30070j13476l8537K56144J77045
39479C20456j57602j50052J24238N4404l10601l11418Q2410K16777Q389Q7003
39469c5996N17521N71317N1014l30919k52351k83892o46922o60293k9260M30426
39459f69355Q8130m54783l76551J56774N27708O20362N36350J38845m18569m80826
39449c31915Q7067M52963J04949k66788J1274L84500P7719m83476m10745J07283
$$ y = [350830, 2908, -198502, -14709, 258448, 164031, -165087, -197042, 125359, 356626, 397952, 636690, 1102918, 1249733, 859996, 463160, 463125, 495983, 129147, -356982, -433456, -157980, -9758, -166519, -398541, -474728, -321196, 25571, 350963, 361488, 51167, -278846, -478286, -667243, -804161, -624971, -190790, 39280, -74196, -112733, 143411, 320456, 162854, 12802, 137040, 191444, -119157, -430575, -348165, -131388, -122999, -35996, 481525, 1052842, 1103856, 772937, 520586, 236694, -410228, -1070521, -1099781, -669355, -581225, -1036008, -1412559, -1255785, -728077, -107715, 428635, 567480, 148911, -331915, -244848, 208115, 313064, 46276, 57550, 442050, 519769, 36293, -374452, -267169]
39439b67169K08218j46512k72652o2948l2591k41154k49302n3427n5683j66935
39429a340155P9391N34377N23783K847k95663k1542L20858K72947M6523j6346
39419A07020K2512j1251o5267n1186j2523K8477Q7833P3647o9246j54183l3668
39408g7835P6907m1217j42146R9874M51230M35486J12718o9940n6660j50157l08872
39397C29388j92336J12657J32314j66655k80870j9194K09098J20372m5552o1019
39387A38203p7133k07255k37799k3783K19427K51600J23218M191k3112O8408K08347
39376D44312J70490j20960l14108o8365L33599L17525j02982l42364j38355J46490
39366C25282J70795n46k28490m65028n17913k11239J60473J29772j53061j01190
$$ y = [-267169, -58951, -205463, -478115, -541063, -573654, -814808, -1064110, -1117537, -1173220, -1340155, -1260764, -726387, -202604, -199757, -495420, -516962, -196104, 76843, 123366, 107020, 129532, 118281, 53014, 1828, -10695, 17782, 105615, 179262, 110016, -44167, -77835, -928, -42145, -184291, -84417, 366813, 802299, 915017, 845077, 788417, 638260, 329388, 137052, 249709, 382023, 215368, -65502, -84696, 124402, 244774, 199222, 138203, 61070, -146185, -383984, -407767, -188340, 63260, 186478, 190669, 167557, 235965, 444312, 614802, 493842, 179734, 111369, 444968, 762493, 659511, 317147, 178792, 325282, 496077, 495531, 267041, -197987, -715900, -927139, -766666, -636894, -789955, -891145]
39356h91145K75610L18031j17080l13163J08048M97111K42659k26494j99764J67037
39346a39150K45598K9534J2304K42428L00265J03482P008J04444P9911j67621
39336H18203l24570k26059j22848j91052j99860O6059L70652L32921m499k30825
39326B88122j49746j3702q3830k00808m5919K82045L15635o9825l70575j50990
39316a99593K91648L70974R2964l3648J30682J76682q9850k97227j47252J00059
39306C95439R1037p5590j00315L6555J60537K06779J69744J0577j50804n7911
39296F86048K19316K10906k33409n42082k04117L73933L78438k26836o59238m48682
39286d45723q523P6167j61457k55960K8778M79789P08829M92738k2130l78766
$$ y = [-891145, -615535, -297504, -414584, -727747, -619699, -122588, 120071, -106423, -306187, -139150, 106448, 135982, 148286, 390714, 690979, 794461, 801469, 905913, 985824, 818203, 493633, 267574, 144726, -46326, -246186, -180127, 190525, 523446, 518947, 288122, 138376, 124674, 40844, -159964, -205883, 76162, 391797, 321972, -48603, -199593, 92055, 463029, 555993, 522345, 653027, 829709, 739859, 442632, 295380, 395439, 486476, 410886, 310571, 347126, 507663, 714442, 884186, 894763, 743959, 686048, 905364, 1116270, 882861, 340779, 136662, 510595, 889033, 662197, 2959, -445723, -454246, -378079, -539536, -795496, -766718, -286929, 421900, 914638, 892508, 513742]
39276E13742k37296K04209M12757J90729j08127j28418J5618K5904q2381q2487
39266G24250K4033K7435q5793j15993o4492j77561m42708m35029M5489N02545
39256B176L27164l21915o82423l92377J22637L23360J83192j0592r5195n2029
39246e96002J02658K23488R6789k08757l29916j35293O3733N6092R8458L97579
39236b31171O02105K88206l11064n78955l59811l7318J14860J56765J16261q6007
39226c26129l09274k43764J20756M35469M64446L04542J17238l9984j03538l6428
39216C83334K3394o6381j72806q3510Q7392M1363k07348l43473k31303l3560J10919
39205d91979J86363J43714l164k3843K09038L83225J63067k12262k54789j1356
$$ y = [513742, 276446, 480655, 893412, 1084141, 976014, 847596, 863214, 889118, 806737, 724250, 748283, 775718, 689925, 573932, 509440, 331879, -110829, -545858, -500369, 2176, 329340, 7425, -674998, -1067375, -944738, -621378, -438186, -448778, -543973, -596002, -493344, -269856, -173067, -381824, -711740, -847033, -783300, -727208, -628750, -231171, 370934, 659140, 348076, -230879, -590690, -628008, -513148, -356383, -240122, -326129, -635403, -879167, -758411, -322942, 141504, 446046, 563284, 523300, 419762, 383334, 406728, 340347, 167541, 84031, 171423, 212786, 5438, -338035, -569338, -602898, -491979, -305616, -161902, -165066, -188909, 20129, 403354, 566421, 354159, 99370, 88014]
39195H8014O0065j02231j28904K9321n004l13264m89297k99875K9196K81559M50209
39184d00211M24639Q7227k31964n5220M22197N08382R3243j99425n3514J49233
39174G44587J44972J43612J49168j73628o56297n95690L9884L41868j04972n03772
39164d70268j79136L44274L53906J21310J79720K59576p0207m06812j93657K02531
39154A41237J38444j19762O0699M25846K76233k00032k24475J72163K33776j47163
39144G56966l01692l4870J09920o1546r3162J55767K21599m8301j88941J215R8400
39133F15355j32789l20200j84906J7948M1200L322k6886j76681k99503k3985N00739
39122A3614N95349O7065m34434l99495j40432j16280k04748r9933J01453J85609
$$ y = [88014, 148079, 45848, -83056, -53735, -58739, -372003, -861300, -1161175, -1131979, -850420, -400211, 24428, 111655, -120309, -175529, 246668, 755050, 848293, 648868, 595354, 744587, 889559, 1033171, 1182339, 1008711, 352414, -243276, -203392, 138476, 33504, -470268, -649404, -305130, 48776, 170086, 349806, 609382, 539175, 132363, -61294, 141237, 279681, 159919, 220618, 646464, 922697, 722665, 498190, 670353, 904129, 756966, 455274, 420404, 530324, 468778, 375616, 531383, 752982, 704681, 515740, 516955, 615355, 482566, 162366, -22540, -4592, 36608, 39930, 13044, -163637, -463140, -487125, 13614, 608963, 676028, 241594, -157901, -298333, -414613, -619361, -719294, -617841, -432232]
39112d32232K51223M09826M41060J57836k20835m11891m43248l88716j35276K46327
39102e25926L36520p354k67825L060M30259L56906j25335l18833J2894L51435
39092B45801K69066J5005K3619K40136K79213N6281j02913J2905J71979O6899
39082A277991j90788k43049q8080j17617m36306n61192j18011M95944N95134J50221
39072G64247k41798k27471k3485J12028K09142K83358J70668j47855m06926m10075
39062H1833k44334m4166J66895L17362K75944Q8997m9214j08986k02007k38397
39052D3927m185L49709L33580j90404p17303p08666j97884L78018O59827N31907
39042D78526J14542k36417j95926J11613K22340k7931k87271k42727m6024J1557
$$ y = [-432232, -181009, 228817, 669877, 827713, 606878, 194987, -248261, -636977, -772253, -525926, -189406, -196760, -464585, -461525, -31266, 325640, 200305, -118528, -105634, 245801, 514867, 529872, 553491, 793627, 1072840, 1129121, 1026208, 1039113, 1211092, 1277991, 1087203, 844154, 756074, 638457, 202151, -359041, -477052, 18892, 614026, 764247, 522449, 294978, 271493, 383521, 592663, 876021, 1046689, 898834, 491908, 81833, -162501, -206667, -39772, 277590, 553534, 642531, 593317, 484331, 282324, 43927, 39742, 389451, 723031, 532627, -184676, -893342, -1091226, -713208, -53381, 478526, 593068, 356651, 160725, 272338, 494678, 466747, 179476, -63251, -109275, -97718]
39032i7718o9338j26282j33240j30083o4665Q5009K06396K25969K03230J39383
39022B38661p1668l67920m52195j83181J79880L06146J94843R5547J76401L86407
39012E02921N16510L53247o4869l60636k29685R4087J17440j76477l04398p5717
39002C72423R3750j03473l20064j18851K76694K91973j21413m17527k56508O0585
38992b42411R5263j05556j45393R9187K94000J60156q0731k9453K58041L40350
38982F43453J04524m2320J31254K68364M7397k15859o9721L11219M17415K00304
38972A796030m976j40398l78092n64982l85256p062R6086n9477j3920K96263M22101
38961A056317J71798j56295l55801m78433m07000K5425M65680L62866q7821j56655
$$ y = [-97718, -167056, -293338, -426578, -556661, -621326, -536317, -329921, -103952, 99278, 238661, 166993, -200927, -653122, -836303, -656423, -350277, -155434, -59887, 116514, 502921, 1019431, 1372678, 1307809, 947173, 717488, 811575, 929015, 752538, 448140, 372423, 466173, 362700, 42636, -76215, 200479, 492452, 371039, -46488, -302996, -242411, -147148, -252704, -398097, -298910, -4910, 155246, 74515, 45062, 303103, 643453, 747977, 705657, 836911, 1105275, 1152672, 936813, 867092, 1178311, 1595726, 1796030, 1791054, 1650656, 1272564, 707582, 322326, 315264, 411350, 351873, 337953, 634216, 1056317, 1228115, 1071820, 716019, 237586, -169414, -143989, 321691, 684557, 596736, 440081]
38951D40081J90928K17384k67437n41968k48852J7116j34284j82633K35327N35815
38941B61477K19652j87435o1995K36185J07645j65089r809L06837J59261k72647
38931E94082l24481q580J10551l2653j92K49940L07818P3305j59502k78356l57402
38920A74530k58503J06059L20036k1325n38365n38755q1955J79943O6037j8570
38910f10868P1481O3961p0173n9598O0725Q823q4459J84265O62717P06283J68989
38899A102146l65580m59162k66949j2694L02172N16312L07311k05331m46050j97710
38889B74465R8974O0737j37914j92099j19215o1361l5264n6240j62624k25979
38879e56520r8109L6855j14904l84480k88577K11089O09626N85149L17677L0612
$$ y = [440081, 631009, 848393, 580956, 38988, -209864, -192748, -327032, -509665, -274338, 261477, 481129, 293694, 231699, 467884, 575529, 410440, 400631, 707468, 866729, 594082, 269601, 261021, 371572, 338919, 338727, 588667, 896485, 969790, 810288, 531932, 174530, -83973, 22086, 342122, 320797, -217568, -756323, -838278, -658335, -592298, -610868, -539387, -475426, -545599, -605197, -544472, -535649, -620108, -435843, 226874, 933157, 1102146, 736566, 277404, 10455, -2239, 299933, 816245, 1123556, 918225, 472175, 274465, 373439, 434176, 296262, 104163, -15052, -76413, -111677, -167917, -330541, -556520, -654629, -617774, -732678, -1117158, -1405735, -1194646, -585020, 129, 317806, 348418]
38869C48418k42576l59682j17387K68118K86400j07159l95532l01438j08548k5562
38859g54948J35185L96865L76742l6552l32049j15954K80771L55145J61725N0977
38849E17907M9621l7098j73939j70045k6483J07733J56725P5962j72769m09283
38839h1669l00858J35828M26330K80433r379r3099r5533k45654l44539r6711K81057
38828a43794L08348l1855l00917k71328j25919j2202J40311K94814K34047l1862
38818E9643j50324O0669K77126J23755k44414l46294o7480K05789J81925N2438
38808A52833J12574K68427K08470q6706l23125l22479j69004M7379L09473M71971
38798F69813L26533m3017k81231k31521q8269j9813P590k4589j84467k56602N5689
$$ y = [348418, 105842, -253840, -371227, -103109, 183291, 76132, -319400, -620838, -729386, -754948, -619763, -222898, 153844, 117292, -214757, -330711, -49940, 305205, 466930, 517907, 567528, 530430, 356491, 186446, 159963, 267696, 424421, 500383, 327614, -81669, -382527, -246699, 179631, 460064, 450685, 357586, 262053, 16399, -328140, -424851, -143794, 164554, 132699, -168218, -439546, -565465, -577667, -437356, -142542, 91505, 59643, -90681, -30012, 247114, 370869, 126455, -219839, -287319, -81530, 100395, 152833, 265407, 533834, 742304, 655598, 332473, 9994, -159010, -111631, 197842, 669813, 996346, 953329, 672098, 440577, 352308, 332495, 340085, 315496, 131029, -125573, -69884]
38787f9884M58429K51410n33156r00362k81414N45283N72553j9610l54029k33787
38777e64567j15833q8136J42770M46715M07687J66672K19532M43497K52496k94329
38767A016504n05599k44569j10883k74621j58969L91731O36261J37116m43465
38758D43506l66011J01533K88936J94962K24410L23718J48160j83269k27651p33
38748I47561K9208k51187l75003n1150L15827K15462j11018Q9402Q94580J284468
38738B988150M06119j043820j484575n24217N16712M65348k47436n88283m66019
38729B1979l69354k28704K29846N52502K02684k73845j1005N82043L91761m46347
38719F51560p10035j79376Q2745k65995k77606L79972O39405p6133p20339l49388
$$ y = [-69884, 388545, 639955, 106799, -793563, -1074977, -529694, 42859, 23249, -330780, -564567, -680400, -768536, -625766, -179051, 228636, 395308, 614840, 1058337, 1310833, 1016504, 510905, 266336, 155453, -119168, -278137, 113594, 749855, 886971, 443506, 77495, 179028, 467964, 662926, 887336, 1211054, 1359214, 1175945, 948294, 947561, 976769, 725582, 350579, 299429, 615256, 830718, 719700, 809102, 1703682, 2988150, 3394269, 2350449, 865874, 341657, 858369, 1323717, 1076281, 487998, 21979, -347375, -576079, -346233, 206269, 408953, 135108, 124103, 706146, 1097907, 651560, -58475, -237851, -155106, -421101, -698707, -318735, 320670, 244537, -475802, -825190]
38709h25190L65603M23613J07650J59372L53064J00554l29618l50649j34107r6446
38699b26154J4566M76325P08723J46665n87006n12191J79789N21883K81450Q173
38689A012223o7703j46875j70905J0897Q0548k37639m64879q7409M27503L32964
38679F88725j09363j45074P4905j39342n46458k55191N91181Q17687Q4738n52496
38669E09312l10911K57077L56615J10315L0376R7314k2625l41365n98291n99916
38659e12099k63107L14154P01459M91071r6567m06087j98631J56003L34509L60251
38649H80956K35690j15706m58991m02848o2864K3122k25230k62457J56497M98940
38639B67109K46383l26757n56730k42531K42693M66887L05320n4132k95402k58572
$$ y = [-825190, -459587, -35974, 71676, 231048, 584112, 684666, 355048, 4399, -129708, -226154, -211588, 264737, 973460, 1120125, 533119, 20928, 200717, 722600, 1004050, 1012223, 944520, 797645, 626740, 637637, 718185, 480546, 15667, -71742, 355761, 688725, 579362, 434288, 509193, 369851, -176607, -431798, 159383, 977070, 1061808, 509312, 198401, 455478, 812093, 922408, 952784, 1050098, 1027473, 686108, 87817, -512099, -775206, -461052, 240407, 731478, 634911, 228824, 30193, 186196, 520705, 880956, 1116646, 1000940, 541949, 139101, 76237, 99359, -125871, -388328, -231831, 267109, 513492, 186735, -369995, -612526, -369833, 97054, 402374, 348242, 52840, -205732]
38629b05732r1384j8536k9438K5211J33012J62421J15412Q8408P9525P0335J52022
38618D81256L12307K88279n7409m08901l91633j09206P0988P2486O3715M9018
38608C70900p4122k00308j64496p1300j03444j55744k6173J93892K74685K11664
38598B55554J07121p8575l24177l75008j29837J03179R4083P4758K53127L66899
38588C47124J68763r0118j48723k19075m43246m25763L6567L35151m7284n50129
38578a036733l54260K85696N26033L51257M02635O54952M40519k60121o61561
38569C48417m02193K7873J98155K14311J84968J2372j94516k08891j86336l81661
38559c87501m85719m4373N90733O29545R8923j95270M5798K97803K28649J07720
$$ y = [-205732, -297116, -315652, -345090, -319879, -186867, -24446, 90966, 179374, 258899, 329234, 481256, 793563, 1081842, 1024433, 615532, 223899, 114693, 185681, 258167, 321882, 370900, 296778, 96470, -68026, -139326, -242770, -398514, -424687, -230795, 43890, 255554, 362675, 284100, -40077, -415085, -544922, -441743, -347660, -272902, -19775, 347124, 515887, 425769, 277046, 57971, -385275, -811038, -774471, -439320, -486604, -1036733, -1390993, -1105297, -579264, -228007, 174628, 829580, 1270099, 1009978, 348417, -53776, -25903, 172252, 386563, 571531, 583903, 389387, 180496, -5840, -387501, -873220, -917593, -326860, 302685, 401608, 206338, 252136, 549939, 778588, 886308]
38549H86308R2611l1356k70283l53437l13518m05364m80123k08484J77029J98676
38539g07941L9356K12339N10014L23469j45981j45984K48338K44554j92705k69412
38529A16047J51784L09445l5293k35672m2743L9018r1966L9696K66790j57017
38519C60089r42552p96961L97376J059248L34463n27414k27928N83774N88926
38510H29021j04534m56014k08303J25732L30070M53594K72355k68429n90877k79913
38500A02702J87482K22966L6531O9913J68668M6824n0868J25839K49179L9434
38490A198670j41820J1244J02674k30544n74581m28744m4184R3449M2690N2696
38480H1550K3107j09111o0279J99239K12615j06839j66336K45961M63845R2784
$$ y = [886308, 978919, 947563, 677280, 323843, 10325, -395039, -875162, -1083646, -906617, -707941, -668585, -456246, 53768, 377237, 231256, 85272, 333610, 578164, 385459, 116047, 267831, 577276, 541983, 306311, 263568, 302586, 210620, 250316, 517106, 360089, -582463, -1379424, -982048, 77200, 411663, -115751, -343679, 240095, 829021, 724487, 268473, 60170, 185902, 515972, 969566, 1241921, 973492, 382615, 102702, 290184, 513150, 549681, 619594, 788262, 835086, 784218, 910057, 1159236, 1198670, 1056850, 1068094, 1170768, 940224, 365643, -63101, -107285, -13836, 28854, 81550, 104657, -4454, -64733, 134506, 347121, 240282, 73946, 319907, 783752, 876536]
38470H76536k66876j13531Q7601j20284k95745j9720K22688j7132k24183J07154
38460B36508M25436O1290n61439o67052l59070j33069J05016N37075O82342J83128
38450E10165l41402k35490Q4979m0823l14243j48561J75309J13219o9065R1379
38440a74533K67380N4858p0171L46537O49255J24030o12258n90135j32832j29912
38430b67781l55841k1772N75505N29996N599j16853J05022o9214m74725l08502
38420c98566K35616K11354l03591k76490M05358O79713J08004m88997m59291j33987
38410d20877O0018J97634L12007K02732l2693o8764M1708N2846R8508L08327K62570
38399A014016k59907n25005P3728P61289M87902k93523m16752j9233r6839m77742
$$ y = [876536, 609660, 496129, 583730, 463446, 167701, 147981, 370669, 353537, 129354, 236508, 661944, 723234, 161795, -505257, -864327, -997396, -892380, -355305, 327037, 510165, 168763, -66727, 18252, -22571, -336814, -485375, -310066, -196847, -265912, -174533, 92847, 147705, 77534, 424071, 1073326, 1197356, 585098, -5037, -137869, -267781, -623622, -645394, -69889, 460107, 465706, 348853, 453875, 384661, -90064, -398566, -162950, 48404, -255187, -531677, -126319, 553394, 661398, 172401, -286890, -420877, -360859, -163225, 148782, 351514, 318821, 250057, 291765, 344611, 443119, 751446, 1014016, 754109, 229104, 302832, 1064121, 1552023, 1258500, 841748, 822515, 725676, 247934]
38389B47934j26899P21192P20852k17593o82541j70120J80627k49047n10007O9100
38379a6502O46079L67152k78498n02441m37801m68353l70872N9667L96799K96448
38369c08322O5144k3210j96630m99102m46533J39111O86765P05106L85310N6195
38359E63834k57320m52275k51924K20679M34793K26722m1367j68734k72409k64561
38349b62562M2264L30083J18171l24519l05375J04580J84571j55376k47320J20525
38339c94958L91217K62980O7859J4970n0979q7814Q3072K05032m0081k53805R8117
38328B95610N67133L35406k54734q0409R06371J505122J025352K9988p46237j104107
38318B479495r91705m91987j63913l93619o12289j82822L70046K31550j59548
$$ y = [247934, 121035, 842227, 1563079, 1345486, 662945, 492825, 673452, 424405, -85602, -16502, 629577, 996729, 718231, 215790, -222011, -690364, -1061236, -1001569, -604770, -308322, -243178, -266388, -463018, -962120, -1408653, -1269542, -582777, 122329, 507639, 563834, 306514, -145761, -397685, -177006, 257787, 484509, 443142, 274408, 1999, -262562, -220298, 109785, 227956, -96563, -401938, -297358, -112787, -268163, -515483, -394958, -3741, 259239, 327098, 342068, 291089, 203275, 286347, 491379, 451298, 197493, 295610, 862743, 1198149, 943415, 863006, 1769377, 3274499, 4299851, 4329839, 3583602, 2479495, 1487790, 995803, 831890, 438271, -174018, -356840, 13206, 244756, 85208]
38309H5208R1365N51433J81220o28569o21642O7218K10226k01106m0589O72178
38299C66942P50872J22639o4063K90383J01272n92134n06986L87884O13339j53499
38289A316649n16728J5096K44912k38103k48978N12256O03338n13857j272287
38280i7702n95662M23122N89236L46487L31370J34866l71752l32789M06936O97709
38270A531821R0785l72321j72702j45918n27647l05399O15197Q21373p4425n72270
38260H88494M0653M75660k2657l18587K48295N42642l3225k63381M92683R95395
38250C045972N27063J83296M57437J04081j161682j514212j84934Q90885L30754
38241B678660m57054j18434K70559l33147p61829n5516M89162j51229o39884J19850
$$ y = [85208, 176573, 728006, 909226, 280657, -340985, -273767, -63541, -264647, -305236, 366942, 1117814, 1240453, 1176390, 1466773, 1568045, 975911, 468925, 856809, 1470148, 1316649, 799921, 815017, 1059929, 821826, 572848, 1085104, 1688442, 1174585, -97702, -693364, -270242, 318994, 665481, 996851, 1131717, 759965, 427176, 834112, 1531821, 1622606, 1250285, 1077583, 931665, 404018, 98619, 713816, 1535189, 1460764, 888494, 929147, 1404807, 1382150, 1063563, 1311858, 1854500, 1821275, 1557894, 2050577, 3045972, 3573035, 3756331, 4213768, 4317849, 3156167, 1641955, 1457021, 2347906, 2678660, 2221606, 2103172, 2373731, 2040584, 1278755, 1223239, 1712401, 1561172, 921288, 1041138]
38231A041138P89999J78520m90790p2002K88817l62302p06806J92540Q40999J97512
38221A897625j88551P20633J167102o3108j060608k62350N79037k32381j098578
38212A458821k99274O87129J80746m65842J70533N58202n58016j190656J73692
38203G15335J278572J31055j163188l85419O05731l04511j209023j4148J226874
38194H81278L16777o21976O07147J611263K880j538741j71757J454453J84614
38185B725938j446308j50661J544420K76469j272471M24174K411984P41378j563342
38176C691581j41381K106095P50582j114336R96766L411511J340762n17420L672045
38167A4196205P943862L575433m416398m874760L38808J197257j077482K280385
$$ y = [1041138, 1831137, 2009657, 1518867, 1446865, 1735682, 1373380, 666574, 859114, 1700113, 1897625, 1709074, 2429707, 3596809, 3533701, 2473093, 2210743, 2789780, 2557399, 1458821, 1159547, 1846676, 2027422, 1561580, 1732113, 2290315, 1732299, 541643, 715335, 1993907, 2124962, 961774, 576355, 1182086, 877575, -331448, -345596, 881278, 1198055, 576079, 1183226, 2794489, 2797369, 1258628, 1086871, 2541324, 2725938, 1279630, 1128969, 2673389, 2949858, 1677387, 2101561, 4513545, 5254923, 3691581, 3550200, 5656295, 6406877, 5292541, 6289307, 9700818, 11041580, 10524160, 14196205, 22140067, 25715500, 21299102, 16424342, 16763150, 17960407, 16882925, 19163310]
38159A9163310Q282513O715127J087578L179126R130583N717029j386035N222347
38151E7111578J9530203K0062495J7362114M8115473J03329818J10891075K8651234
38144D05053990q1691447j22840157q1607443k9196442j5482555k0214736j1975265
38137D2045945P90112r70236q812476o326511M84923j793802p974049n974880
38129A1469026L02954J19057l831784k513214J669244P56696k969478k160902
38121B841599J253268O47709k150288j039345K109168J328358j758909j352492
38113A879068J336531R18222j596910j159652J319403R41890j648274j737871
38105B52407M95749R13157n12225m18904Q40286K57052j290185o23742J192277
$$ y = [19163310, 27445823, 34160950, 35248528, 38427654, 47558237, 53275266, 51889231, 57111578, 76641781, 96704276, 114066390, 162181863, 265511681, 376402756, 405053990, 323362543, 200522386, 118914943, 89718501, 74235946, 54021210, 42045945, 42836057, 41865821, 33053345, 26726834, 27211757, 25417955, 17443906, 11469026, 11771980, 11891037, 8059253, 5546039, 7215283, 7971979, 5002501, 2841599, 4094867, 4742576, 2592288, 1552943, 3662111, 4990469, 3231560, 1879068, 3215599, 4133821, 2536911, 1377259, 2696662, 3638552, 1990278, 252407, 748156, 1661313, 1149088, 730184, 1570470, 1827522, 537337, -86405, 1105872]
38096A105872O89225j215553q95099J053448J076604n42835n72760P45782M52538
38087A897222j040505p51885Q89955Q21570p01094p05952O60087N69667q26145
38078H12920p41271P23904Q22685m57569n28554O07338M73055q23319p32762O86522
38068H42949Q43152l64717m91522N61305M65466p12653m84994J108064J337089
38059C104139j32227p16014J53058K56589p62264o76895P12368Q76560o23160
38050B192154j103964L46272J247403K61953p17448l59674P4353j50677K05634
38041A996006J296876J223648m29840j440667p16172J7268l77666n86216J99948
38032A183185O03511j41587o49612j23989J57658m80611o92472K10951Q07473
$$ y = [1105872, 1795097, 579544, -315555, 737893, 1814497, 1271662, 698902, 1444684, 1897222, 856717, 104832, 994787, 1816357, 1115263, 409311, 1069398, 1639065, 812920, 71649, 795553, 1618238, 1160669, 632115, 1239453, 1712508, 889189, 156427, 842949, 1686101, 1321384, 829862, 1391167, 1856633, 1143980, 658986, 1767050, 3104139, 2971912, 2255898, 2408956, 2665545, 1903281, 1226386, 1938754, 2815314, 2192154, 1088190, 1434462, 2681865, 2943818, 2226370, 1866696, 1941049, 1790372, 1996006, 3292882, 4516530, 4086690, 2646023, 1929851, 1947119, 1569453, 983237, 1183185, 1786696, 1645109, 995497, 871508, 1029166, 548555, -143917, 67034, 874507]
38023H74507K04206m05117j65793l7284n30921m85752N27080J015806J81026o07054
38013E70704k92007J78706m7257j93753K67470M11191j81575m17495J29960K31140
38003F57084n88496r03911L6048Q34360M35429r9230K44050O11203J36808l81779
37993I81566j67512P4430k11555k34176L53819M27246m62001r10523r6161O35212
37983C90345J63197m52470q9231L51310j83456p81202k73987N75501N37862P6648
37973C14517J61609L52142n6967l48857K48342P95034J80799p43947n43849L24536
37963F83359L84536l54942o77465k96492M3585R3759J76082J93333r8049l15710
37953a68004r3784J20369o0933r6391M22539P49130J78672o16748o38751j15477
$$ y = [874507, 1078713, 673596, 507803, 470519, -60402, -546154, -19074, 996732, 1177758, 570704, 278697, 457403, 410146, 216393, 483863, 895054, 713479, 295984, 425944, 657084, 68588, -835323, -799275, 35085, 470514, 371284, 615334, 1226537, 1363345, 981566, 814054, 888484, 676929, 442753, 796572, 1223818, 761817, -148706, -244867, 390345, 553542, 101072, 11841, 363151, 179695, -601507, -875494, -299993, 237869, 314517, 476126, 828268, 771301, 422444, 670786, 1465820, 1646619, 902672, 358823, 683359, 1067895, 712953, 35488, -261004, -217419, -123660, 52422, 245755, 147706, -168004, -261788, -141419, -202352, -298743, 123796, 872926, 1051598, 434850, -203901, -319378]
37943c19378J41649J08740J70448J84855l1953j00464J33857J24246k64751k92020
37933a44771K15087L06627k92862l96774N16300J076299L03020n97468l37323
37924F48135K51035k1284l96288K26786R37536N04820M9247J246198K868739K175961
37914H490885o81394k650830k213827j010168o47935n71902M3129N68188K67174
37905A593320l10637l95366k09220k20115k26842M0285K63163J18173j70096k99652
37895A83013l00142j97422J08438M33222L78379m2071l75534l79745k03977J8581
37885c77258K54016L47251J90823l0179j29773j72998j38561J65072N11385K98277
37875I18055l70505n32521Q9557M18191k50417r29793m91860M65370O53049J56658
$$ y = [-319378, -177729, -68989, 101459, 286314, 254361, 153897, 287754, 412000, 147249, -144771, 70316, 376943, 84081, -312693, 203607, 1279906, 1582926, 985458, 648135, 899170, 877886, 481598, 708384, 1645920, 2150740, 2199987, 3446185, 6314924, 8490885, 7809491, 5158661, 2944834, 1934666, 1286731, 714829, 757958, 1326146, 1593320, 1282683, 887317, 678097, 457982, 231140, 271425, 534588, 652761, 482665, 183013, -117129, -314551, -206113, 227109, 605488, 563417, 187883, -191862, -395839, -377258, -123242, 224009, 414832, 384653, 254880, 81882, -56679, 108393, 619778, 918055, 547550, 15029, 104586, 522777, 272360, -657433, -1149293, -683923, -30874, 125784]
37865A25784j6580K08644J25294k22543j78269J69247J75058r1537q0805O2849
37855B77142j31197l06619J21580O13268K41180n49736n08130L07814O08387O605
37845F80294n24345l98684j08929j8482J27538L02415J02150l04124l27716r1167
37835e61050j88124l98107K159P11229O67421j17926n01193j04958K41698J44575
37825a04276J73998M70102L74809j42232k01492L56669N19386j60032p67300n97364
37815g7732j95045j50247j10842K55361M53103R1355l54580m03213k87651k36042
37805a015533L6441N51832P20906L36939J0720Q3283M3671m11899o91118l12169
37795f46927K56966L96645K11313N2897r1563k38624j64309M5115n8933m24384
$$ y = [125784, 109204, 317848, 443142, 220599, 42330, 211577, 386635, 295098, 214293, 277142, 145945, -160674, -39094, 574174, 815354, 265618, -242512, 65302, 673689, 680294, 155949, -242735, -351664, -370146, -242608, 59807, 161957, -142167, -469883, -561050, -749174, -1147281, -1145122, -433893, 233528, 115602, -385591, -490549, -248851, -104276, 69722, 539824, 914633, 772401, 570909, 927578, 1446964, 1286932, 519632, -77732, -272777, -423024, -533866, -278505, 174598, 265953, -88627, -491840, -779491, -1015533, -979092, -427260, 293646, 630585, 641305, 724588, 768259, 356360, -334758, -646927, -389961, 6684, 217997, 270894, 179331, -59293, -223602, -178487, -237420, -661804]
37785f61804l94418J80384N89883L92394R994j56942k71204l54969n5688M69434
37775b52936M82137n8254k30653L01742O12410M2997o77499o27471l7347L57236
37765h7638M27379L47847K0342m50080m98460k1228K40195j22469m88092l32358
37755i64562r5958j99001j82030L16261O76682L36533j61765j21299J38764M6959
37745b09416j00692J63193M15546Q7694l82741k62646J83289K13455p9581o7281
37735c9180K35746L35936K27996K21705J73126j81111n07514l93475j58936k54801
37725c40508l37543P6932N24670K52027m24709n48309l6311L35025K63026J59970
37715g5730J89497Q9662r6484m4617J44343R9570o4570L8492K62734J73112r5334
$$ y = [-661804, -1056222, -875838, -285955, 106439, 116433, -40509, -311713, -666682, -722370, -252936, 229201, 170947, -59706, 242036, 854446, 897443, 219944, -407527, -444874, -87638, 339741, 687588, 707930, 257850, -240610, -261838, -21643, -144112, -632204, -964562, -1060520, -1259521, -1441551, -1125290, -448608, -112075, -273840, -395139, -256375, -209416, -310108, -146915, 268631, 356325, -26416, -289062, -105773, 107682, 28101, -39180, 196566, 532502, 760498, 982203, 1155329, 974218, 466704, 73229, -85707, -340508, -678051, -601119, -76449, 175578, -249131, -797440, -833751, -498726, -235700, -75730, 113767, 203429, 106945, 62328, 206671, 306241, 241671, 280163, 542897, 716009, 620675]
37704F20675r3781K2953k31475o44368n30370P8898M38468K81733Q6823J27648
37694A57204J57253R8727J90247L54601K33462p5467j01190J30231J08472k18179
37684A035361l35991j10830k7048l12383n77783n18518k88373k6890L04068M86413
37674c71974J68227m11281n32154m4810L69946K36764p9426q2471J09438J05796
37664e31945j19567k93900k52178l9460J72586J78221k9647j45286O5073L78345
37654f17758M40252K96994K04807J33022o1211k00921q8915L011k25959m21483
37644e38161o2537N57618O49344J23070l55457m48476m31003m02765j21852K75046
37634g55173K72594j20991k92814l1832J95226J62689K23754M67745M09904r8970
$$ y = [620675, 526894, 549847, 318372, -325996, -856366, -777468, -339000, -57267, 29556, 157204, 314457, 413184, 603431, 958032, 1191494, 1116027, 1014837, 1145068, 1253540, 1035361, 699370, 588540, 561492, 249109, -328674, -847192, -1135565, -1162455, -858387, -371974, -203747, -615028, -1147182, -1191992, -822046, -585282, -664708, -747179, -637741, -531945, -651512, -945412, -1197590, -1237050, -1064464, -886243, -915890, -1061176, -996103, -617758, -177506, 119488, 324295, 457317, 396106, 195185, 106270, 109281, -116678, -538161, -600698, -43080, 606264, 729334, 373877, -74599, -505602, -908367, -1030219, -755173, -482579, -603570, -896384, -928216, -732990, -570301, -346547, 121198, 531102, 432132]
37624D32132m53693k31709J52284J78906k2384r6127n9786n2079l285O5754q0273
37613a70260l91793m42004j34314P1358n2883j09304J76119M50233L88603K21926
37603G681J59716o1597n25458o70903j29721N13102N04661M1307j26912J19893
37593a68231K38645j251k28945j54554L6506O6620m4127p6089R3792L13789K39647
37582C15802k48855p17578n89353O8624N90841O31399N06492M61416K43660k53558
37572A008890n61501l40707K7958Q4974J2564J35871K11830r0913m25751k56364
37562a93149J90874K58329o3124j96108j1778K6444k18832k99254p071K50920
37552b62749J66782J1699Q6500K00948O5353j89045k54959j38915o4052p7886
$$ y = [432132, -21561, -253270, -100986, 77920, 55536, -40591, -100377, -152456, -155741, -89987, -170260, -562053, -1004057, -1138371, -1067013, -1119896, -1229200, -1053081, -602848, -214245, 7681, 167397, 105800, -419658, -1090561, -1220282, -707180, -202519, -161212, -288124, -168231, 70414, 69163, -159782, -314336, -277830, -211210, -255337, -331426, -237634, 76155, 315802, 66947, -650631, -1239984, -1171360, -580519, 50880, 557372, 1018788, 1262448, 1008890, 447389, 106682, 134640, 219614, 232178, 368049, 579879, 488966, 63215, -193149, -2275, 256054, 192930, -3178, -14956, 11488, -207344, -506598, -513669, -262749, -95967, -84268, 2232, 203180, 268533, 79488, -175471, -314386, -378438, -456324]
37542d56324o6342k8634n5306r8109j2118J73700K33995N6956j64593j59757O7350
37531e09182K39575J68473k1115r9512k9492P8937J77559K40401J37338j63685
37521B19297l47552q0286M03147M63762o2761n70441m93580l5970K20052J21209
37511a63123j8543J6830J32723J90895J62845M2264j46348k65291j84229K3970
37501b08007J44634O3971j26414k25708j00401J53191K50644O6472j35031n3512
37491a70161J58342J23886r7628p2606K37746L39454K1423k71908j84235M378
37481H8691k4914l2972K56165N20549L43456l0467j01137K8172j00246m09204
37471E38093l94049k9855J62528j5262j76388n0143J59345K44703K71218K36248
$$ y = [-456324, -522666, -551300, -606606, -704715, -716833, -543133, -309138, -252182, -416775, -576532, -509182, -269607, -101134, -122249, -221761, -251253, -172316, 5243, 245644, 382982, 219297, -128255, -208541, 194606, 658368, 595607, 25166, -468414, -504384, -284332, -163123, -181666, -164836, -32113, 158782, 321627, 363891, 217543, -47748, -231977, -208007, -63373, 598, -125816, -351524, -451925, -298734, -48090, 18382, -116649, -170161, -11819, 112067, 14439, -58167, 179579, 519033, 540456, 268548, 84313, 88691, 63777, 30805, 286970, 807519, 1150975, 1120508, 1019371, 1047543, 947297, 538093, 144044, 114189, 276717, 261455, 85067, 34924, 194269, 438972, 710190, 946438]
37461I46438k1672m01956n18471k80446m3424j5107J1479J41694J16067j48263
37451b13661k49675P1274M13588K91328q3690j17495K32494L70469o8272o84753
37441c8393q06690k76864L95790N80335J43901m45137o21817l09081Q1046K05520
37431a091390J58177J93686K83848J72953j80038m37099k55402K53960N68551
37422c32754L26976k05569m17865j29923J67581L4030k49634j27158L06935M08709
37412b18672L3456j73747J88638N69600L01731l24580n04247j57160O2935o1116
37402b83162J0882M99366P24221J36990o73015p26566o8752L42518N5965l47063
37392c28616k73894M5514Q9420j36556k68131k11027j30914l6572J79738M03793
$$ y = [946438, 924766, 522810, 4339, -276107, -319531, -334638, -323159, -181465, -65398, -213661, -463336, -392062, 21526, 312854, 229164, 111669, 344163, 714632, 646360, -38393, -845083, -1121947, -726157, -145822, -1921, -447058, -1068875, -1377956, -1296910, -1091390, -933213, -739527, -455679, -282726, -462764, -899863, -1155265, -901305, -332754, -5778, -211347, -629212, -759135, -591554, -557524, -807158, -934316, -627381, -218672, -185216, -358963, -170325, 399275, 701006, 376426, -127821, -284981, -222046, -283162, -272280, 227086, 951307, 1088297, 415282, -311284, -380036, -37518, 18447, -328616, -602510, -556996, -467576, -604132, -872263, -1083290, -1214204, -1250776, -1071038, -667245]
37382f67245L97891J85504J6023J068O6733J72656K76538J94709j50085m39459
37372E4333l12769N5254J58501r0742k86073k19822j35385j76413j08824J86627
37362h75313M11377L21695J15938O4317R8634M9885l1469o3743j23813j98968
37352b31460j00851J20434R4588k23822l04680J31157N18964K65612k64187l00917
37342b95162Q6224J34645l22605n79075j95626L50782M45278J49602r9357j21826
37332d47120J2272K26268L49321J32741l27150m99152r5833M26869M31280k9569
37322A79927l07934n7975L46686L53604q3736m93069m26955Q7051O04013P08175
37312I09787L76566q7496l93245m51699l15159j04775J4132l0787p8972Q6886
$$ y = [-667245, -269354, -83850, -67827, -66759, -26, 172630, 449168, 643877, 493792, 54333, -258436, -203182, -44681, -135423, -421496, -641318, -776703, -953116, -1061940, -875313, -463936, -142241, -26303, 38014, 136648, 186533, 155064, 91321, -32492, -231460, -332311, -211877, -117289, -341111, -645791, -514634, 4330, 269942, 5755, -295162, -208938, -74293, -396898, -975973, -1171599, -820817, -375539, -225937, -325294, -447120, -434848, -208580, 140741, 273482, -53668, -552820, -648653, -221784, 209496, 179927, -128007, -185982, 160704, 514308, 430572, -62497, -489452, -402401, 201612, 909787, 1286353, 1198857, 805612, 353913, 38754, -66021, -51889, -82676, -161648, -74762]
37302g4762L87671M79108K20970j04240j93282j38282k07623l58490k90883J9524
37292b60289J79090p4450m27954l68560J08801M79656L91503P7902n9302N919
37282E2316M4644J4226L8375P0336m4728k07935j54152Q0173J79156J00424J59895
37271C32730M21884M85372J43386k01903j54000N0092j9248k47983k12735P4201
37261F71796K10809P8245o6234j16437k19452l43364k40691P9699K80986J95989
37251E31346J2590j14292k44481l52659k49482M2199J87884N916k53347k63155
37241f97481k1498K29258K70412K7881l35374m21833R76N61751O01724K1886n50208
37230c12506n69225j82442J25085J24531j08264l69299l37954K00150Q84899R53044
$$ y = [-74762, 312909, 792017, 1012987, 908747, 715465, 577183, 369560, 11070, -279813, -260289, -81199, -155649, -583603, -952163, -843362, -363706, 27797, 105699, 46397, 52316, 96960, 111186, 149561, 219897, 175169, -32766, -186918, -106745, 72411, 172835, 332730, 754614, 1239986, 1383372, 1181469, 1027469, 1077561, 1058313, 810330, 597595, 671796, 882605, 960850, 894616, 778179, 558727, 215363, -25328, 54371, 335357, 531346, 543936, 429644, 185163, -167496, -416978, -374779, -186895, -180979, -434326, -697481, -718979, -489721, -219309, -191428, -526802, -948635, -947659, -385908, 215816, 237702, -312506, -881731, -1064173, -939088, -814557, -922821, -1292120, -1630074, -1429924, -545025, 408019]
37220D08019K22882n04423m74715k1349J8990l65448l85660K39538P99111O56000
37210E92945J29973j08953k7198n8844k62292k79750p0675o6404m25530o41524
37200a218252k35832M86623P92359M72228K2068r1669O6746K14726K76326K87565
37190A072888J72854j03576l33563k79891j1661J82491J50434k2853j94849k81564
37180C50710k54340j57119p3418k220J17422K07458R2348j54503j84175J11837
37170E4000L48202J84218j59045k62470j34758o2278n2512Q0775K14289L9285
37160B49706l31489m01453q052M40960N39816L03341n1854l47728l93779j00991
37150a01523K53098K60269k2614j14875J49381L67742K18966q2114k18593k44730
$$ y = [408019, 630901, 126478, -348237, -369586, -350596, -716044, -1101704, -862166, -63055, 592945, 722918, 613965, 586767, 527923, 265631, -14119, -84794, -151198, -576728, -1218252, -1454084, -967461, -175102, 297126, 319194, 227525, 294271, 508997, 785323, 1072888, 1245742, 1142166, 808603, 528712, 517051, 699542, 849976, 827123, 632274, 350710, 96370, -60749, -134167, -136387, -18965, 188493, 280841, 126338, -57837, 54000, 402202, 586420, 427375, 164905, 30147, -32131, -84643, -3868, 210421, 249706, -81783, -483236, -491288, -50328, 489488, 792829, 740975, 393247, -532, -101523, 151575, 411844, 389230, 274355, 423736, 791478, 1010444, 928330, 709737, 465007]
37140D65007l18090l12877o7814K21908K23006n5872k91592k71110o6989J45378
37130c29045K67388L04501L16559L18248K22600l6157l52565n42355n35655l52609
37120g19090j0714L46336L97783L4776l32715k28006K23914M73131L13166M2616
37110E41197q6583j14996q2129M1119J14498k3971j89320r8184Q5643N943j82584
37099A0633m4913K58874J39828l31674m08450P3573L65030P1033k03029L0403
37089c8692K86408J9172m09196m05612j23744k0316j8150J50201K94278J83075
37079h2576R9641K71426K85737j75670n77507l40724J29628J46864m1209K14398
37069f9992O37487M10560l41772o48921k40618J26657j7506k55408j82140J4850
$$ y = [465007, 146917, -165960, -233774, -11866, 211140, 155268, -136324, -407434, -474423, -329045, -61657, 242844, 559403, 877651, 1100251, 1064094, 711529, 169174, -366481, -719090, -729804, -383468, 14315, 49091, -283624, -511630, -287716, 185415, 498581, 541197, 454614, 339618, 257489, 298608, 413106, 389135, 199815, 101631, 187274, 193217, 10633, -34280, 224594, 364422, 32748, -375702, -302129, 62901, 133934, -69095, -38692, 247716, 266888, -142308, -547920, -671664, -691980, -710130, -559929, -265651, -82576, 17065, 288491, 574228, 398558, -178949, -519673, -390045, -243181, -284390, -69992, 567495, 978055, 636283, -12638, -253256, -126599, -144105, -399513, -581653, -566803]
37059e66803J17749K27332L32543K28503R185k2836R806k58840o04413l92069
37049i19843L15511O92732L74793q6300k00967j44356j23674K4075K77328K54892
37039D64191n8797j53633J13547K21968p8669l22747j99433o4260j47691q2308
37029c07832K68443L55242o3272l01337J36031N95742L16375k55696k05583L03040
37019H41153L25975k85110o94840m42552j8671O0906l9846M7038K84904L67663
37009D46620J29016l16176o30486n02052m5982K17625M1394j72516j5467K58197
36999e89827J96557l7336N4037M12171M91635J55875j41695j06328M3150N2413
36989E30652l1672j01256j50431j33038j3844M7514q0965j82975n428K41227J90364
$$ y = [-566803, -449054, -221722, 110821, 339324, 348509, 325673, 335479, 76639, -527774, -919843, -604332, 88400, 463193, 376893, 175926, 31570, -92104, -68029, 209299, 464191, 405394, 251761, 365308, 587276, 508607, 185860, -13573, -77833, -225524, -307832, -39389, 315853, 252581, -48756, 87275, 683017, 999392, 743696, 538113, 841153, 1167128, 882018, 187178, -255374, -274045, -213139, -252985, -205947, 78957, 446620, 575636, 259460, -371026, -873078, -919060, -701435, -660041, -832557, -848024, -589827, -393270, -430606, -376569, 35602, 527237, 683112, 541417, 435089, 478239, 530652, 498980, 397724, 247293, 114255, 100411, 147925, 66960, -116015, -121443, 119784, 310148]
36978C10148j3843M0317K27653M9183m00465m40593O3679M10072K08721n902K08586
36967F57556L65079q3721o79533o08643k244L01373P1143j30837k2888K4505j68542
36956b76752k05239J02058K72966l3935l26293l803N99858O05496j08306o79621
36946e3571m54606J72745M03207R6167k20655j86803J91L4724m0617p545J29256
36935a27507J63715L9134n2338K9040J40110N6486j80700k88879j25954J08206
36925b38687J38119l2818j60917q7984J10316K63681K50256L1580k80723m01685
36915d08862j31014L19155M77583J88473j89146k81259j50510n0981J5515J86022
36905b5024L54128K84831N7468R696J92708K45975k1441k04577K69347J348460
$$ y = [310148, 296305, 336622, 564275, 613458, 212993, -227600, -163921, 246151, 454872, 448970, 657556, 1022635, 938914, 259381, -349262, -351506, -50133, 21010, -109827, -132715, -108210, -276752, -481991, -379933, -106967, -140902, -467195, -470998, 128860, 734356, 626050, -53571, -508177, -335432, 67775, 163942, -56713, -243516, -243325, -208601, -249218, -256763, -127507, 36208, 75342, 23004, 52044, 192154, 248640, 67940, -220939, -346893, -238687, -100568, -133386, -294303, -382287, -271971, -8290, 241966, 273546, -7177, -408862, -539876, -220721, 256862, 445335, 256189, -25070, -175580, -226561, -211046, -25024, 329104, 613935, 671403, 681099, 873807, 1119782, 1098341, 893764, 1163111, 2511571]
36895B511571K188122J880088L89126j273489j956064j496137p64876n20396n62617
36886C95328l09781J59481K29815k05062m91454j74230L45704M22695M1962k71784
36876A42674j78906J64401L88286K67934j08920l94340l12980q797J27118J9035
36866A05505K019K35683L79230J19186k75979l05782J8037J79601r2508m28973
36856f3981l10698K35855O31610M32966j20244l99490j94565M4930q9308l39779
36846a72704k12255K08356L80730J57518n8017m9597q3940k89402l25314L897
36836d40728L03024J62110k04008l05136o3784K30807L90074L79019J50043k06591
36826C94830l57433j13848K62877M27523L84940K84061Q3890k32391m13106k95884
$$ y = [2511571, 4699693, 6579781, 6968907, 5695418, 3739354, 2243217, 1478341, 957945, 395328, 85547, 245028, 474843, 269781, -221673, -395903, -50199, 372496, 414458, 142674, -36232, 128169, 516455, 784389, 675469, 281129, -31851, -40648, 86470, 105505, 107524, 343207, 722437, 841623, 565644, 259862, 277899, 457500, 364992, -63981, -374679, -138824, 492786, 925752, 805508, 406018, 211453, 256383, 167075, -172704, -384959, -176603, 204127, 361645, 303628, 254031, 170091, -119311, -444625, -440728, -137704, 24406, -179602, -484738, -548522, -317715, 72359, 451378, 601421, 394830, 37397, -76451, 186426, 613949, 998889, 1282950, 1366840, 1134449, 721343, 425459]
36816D25459j32894j71280k11692j3960J83164O0540j60910q0382J50700R6091
36806A44836j52779j25192J66715K35627j1628j34405J8753N6961j89374l26233
36796c16719j14790P4521q2559k66984m9922L48363L57225o8651l57234j05652
36786e82402L93632N34303J33301l66423m39633j07006J55495J13588O4922K73801
36776A73578M76652L13996l0060j12259K2087n8732l74962m34354k4157M25528
36766C77317M48533Q6769l31502n59681m32756Q7751O75140Q14518M25445o866
36756A584668p7926R9351K55214L75391N33023O51465O74597O89060O91514N47632
36746F023989L53015M56889Q97459J215125J135777J051622J434864K132108K732047
$$ y = [425459, 292565, 121285, -90407, -104367, 78797, 139337, -21573, -101955, 48745, 144836, -7943, -133135, 33580, 269207, 257579, 123174, 141927, 198888, 9514, -316719, -431509, -356988, -439547, -706531, -756453, -408090, -50865, -119516, -476750, -582402, -188770, 345533, 478834, 112411, -327222, -434228, -278733, -165145, -100223, 173578, 650230, 964226, 934166, 821907, 843994, 785262, 410300, -24054, -48211, 377317, 825850, 912619, 581117, 21436, -411320, -323569, 351571, 1166089, 1591534, 1584668, 1506742, 1606093, 1861307, 2236698, 2769721, 3421186, 4095783, 4784843, 5476357, 6023989, 6377004, 6833893, 7731352, 8946477, 10082254, 11133876, 12568740, 14700848, 17432895]
36737A7432895L340977M333049N352455N215451L130091k75030l414580n120917
36729B9994391n384276m868269m049691l036741k012962j374898j236727j164616
36721F866211p81656l98105n57036j084163j188947n82141R0872J59837k29829
36712B295043n02277m54599k85655j29947K5377J34637J48381J56579K22778K17840
36702A828157M7969j21051j11935m1614j15066k55373k19297N453J76799J35147
36692A329189l4878j56106j35329k3631K1118r4755k35937j86733J1717Q8127
36682E82782l6356j17503j311J07246k1020k68061l52028k14259k9221M2504k8648
36671c35875j43968j21530R2961K38929K4339l77625m67473j36810J68082J59595
$$ y = [17432895, 20773872, 25106921, 30459376, 35674827, 38804918, 38529888, 35115308, 29994391, 24610115, 19741846, 15692155, 12655414, 10642452, 9267554, 8030827, 6866211, 6084555, 5686450, 5129414, 4045251, 2856304, 2274163, 2365035, 2524872, 2295043, 1792766, 1338167, 1052512, 922565, 947942, 1082579, 1230960, 1387539, 1610317, 1828157, 1876126, 1755075, 1643140, 1601526, 1486460, 1231087, 1011790, 1017243, 1194042, 1329189, 1294311, 1138205, 1002876, 979245, 1000363, 905608, 669671, 482938, 494655, 582782, 546426, 428923, 427612, 534858, 513838, 245777, -106251, -320510, -349731, -307227, -335875, -479843, -601373, -508412, -269483, -245144, -622769, -1090242, -1227052, -1058970, -899375]
36661h99375J26537L59479N92650M14463q1892m55063m87059k61327Q3010L43936
36651b64641K65490r2110k42697J00745N40995N23992J09245k05726k17079j27953
36641C90261r6062j02593j51847k17320j20593J88026M11216L21677J54226J77695
36631I54686J74613j34257m37965k58565J72643J92909k13271l73836k0680L27021
36621C83298K49045L708n1252j0692o3848j00667k9633m9577k48896l19353l6295
36610b74162L00895K75664n5791l18127l38332j98595K8656K76619L69263K18418
36600B84508L2186N7124J94924J30369k02011n06054m85078j55130K19157L95794
36590c4211L41065J95384Q2136p707j07489j48600p0061K7046J7353j5597R2623
$$ y = [-899375, -772838, -413359, 179291, 593754, 511862, 56799, -430260, -691587, -608577, -264641, 849, -91261, -333958, -233213, 307782, 831774, 941019, 735293, 518214, 390261, 294199, 191606, 39759, -177561, -298154, -110128, 301088, 622765, 776991, 954686, 1129299, 995042, 557077, 298512, 471155, 664064, 450793, 76957, 56277, 383298, 632343, 636051, 584799, 574107, 510259, 409592, 379959, 330382, 81486, -237867, -274162, 26733, 302397, 246606, -71521, -409853, -608448, -579792, -303173, 66090, 284508, 316694, 373818, 568742, 699111, 497100, -8954, -494032, -649162, -430005, -34211, 306854, 502238, 584374, 576667, 469178, 320578, 250517, 277563, 294916, 279319, 371942]
36579C71942K59194K20820m6181k45690j84747l0958k9976j74255k87552k73181
36569d20584j44848O2094K84848M15655L76301J78991q6286k74937k66325j22317
36559B592p2042j95646k52553l3594K56119K58398N633j40945m9634N5934L6167
36548a29571J9645Q1225R3062k093q5500j15844j72821j84142K8574L39575L55125
36537B27235J1662k62848j82770O019K6174M4425K81276M88206K70051k65734
36527F43696o14277n29484k02667J42661M54747O38390M89373o494n00879n73476
36517e8410j69082L16046M13444O9197k95782k84761K355J57288L1365j55176
36507B6484k33758k64773k38453P553L93834M90240Q6959m01695m28598k3577
$$ y = [371942, 631136, 851956, 805775, 560085, 375338, 344380, 314404, 140149, -147403, -420584, -565432, -503338, -218490, 197165, 573466, 752457, 666171, 391234, 124909, 2592, -69450, -265096, -517649, -551243, -295124, -36726, -31093, -172038, -221672, -165738, -129571, -109926, -28701, 64361, 62268, -23232, -139076, -311897, -496039, -467465, -127890, 227235, 238897, -23951, -206721, -200702, -174528, -130103, 151173, 639379, 909430, 643696, 29419, -500065, -702732, -560071, -105324, 533066, 1022439, 1015945, 515066, -58410, -227492, 88554, 501998, 571195, 275413, -9348, -6993, 150295, 181660, 26484, -207274, -472047, -710500, -702947, -309113, 181127, 268086, -133609, -562207, -585784]
36497e85784L03803K49436q13j22624l0461J17893J39620K2893n7872K9680J60929
36486B26700J24238k7864o0355L825j14779m06260m41651l0246L79429L07855
36476c9108n4470j68602N0823K07211Q5083j01181j25992n2591l8444r1792j01249
36465d30312K5165K52312L74884J95926j47516k31858R5821M21742K92373j46242
36455G02295l63196j79519N8264J0363k58733m44360l44686j8078K68104K89805
36445b79741J52509J73053L76540L86525K2143l33016l08805j68265l49843o33235
36435i62135l93759L71242R11393P25326J44125k56794l36421k56128j08943L2640
36425a29454L1623q1849o5670J27195J88680n2315k71014r3899L17553M70499
$$ y = [-585784, -281981, -32545, -33358, -155982, -186443, -68550, 71070, 93963, 36091, 65771, 226700, 350938, 323074, 262719, 266544, 151765, -254495, -696146, -726392, -346963, -39108, -93578, -262180, -211357, -4146, 80937, -20244, -146236, -198827, -237271, -329063, -430312, -405147, -152835, 222049, 417975, 270459, 38601, 134422, 556164, 848537, 702295, 339099, 159580, 217844, 228207, -30526, -474886, -819572, -837650, -569546, -279741, -127232, 45821, 422361, 808886, 831029, 498013, 189208, 20943, -328900, -962135, -1355894, -984652, -73259, 652067, 796192, 539398, 202977, -53151, -162094, -129454, -97831, -179680, -245350, -118155, 70525, 18210, -252804, -346703, -29150, 441349]
36415D41349J94986k16540m37183l81498j04071K82757N59970N16435K06319n6805
36405A005719m4819J42752K36982J09236j47275l71612m64131l82434j38881J33367
36395G8904K14014K2774k33926k83363j21570L8001J11076J89941K38913P5394
36385C30158k32340l10042l8991J84957O4112q6967J27249M55274L67081o0874
36375G99617k80392j97546k44426m74703l57941K61229P09583M32493j69275l67477
36365A11162j29644M9115M814j5039N7526L4636o8777k7732J22977P9251j96832
36354B1457l39903j06089K88135M83747L79176J00111k02429m04632m35678l51665
36344e67770k66899j89523o3480N2439M8350n851P0739K53632L17990K00250Q0504
$$ y = [441349, 636335, 419795, -17388, -398886, -502957, -220200, 339770, 856205, 1062524, 1005719, 960900, 1103652, 1340634, 1449870, 1302595, 930983, 466852, 84418, -54463, 78904, 292918, 315692, 81766, -201597, -323167, -285166, -174090, 15851, 254764, 330158, 97818, -212224, -251215, -66258, -2146, -89113, 38136, 493410, 860491, 799617, 519225, 321679, 77253, -397450, -755391, -494162, 215421, 647914, 478639, 111162, -18482, 30633, 35447, 20408, 77934, 112570, 43793, 16061, 139038, 218289, 21457, -318446, -424535, -136400, 347347, 726523, 826634, 624205, 219573, -216105, -567770, -834669, -1024192, -1087672, -1035233, -986883, -992734, -921995, -668363, -350373, -150123, -69619]
36333f9619L3372r1722k98759k79630J21580N35682M91577O4855k30209j26939
36323A50188J33599K16797P0187j55104k96038k23531P1646L59992L49921N8579
36313G36236k01661k64574k73628l10202j93334J30740L23485J21512j78963j23257
36303b33646J85044K48491k0596j94203o6284N8995j5660k2866K06126L18248
36293D63649J0169l76491l43059j8533J05812J2200R5257L54392L26433q9306
36283E40523l78362k09657O6715L1906j63787j54883K8235J21946J13715J36486
36273A32837J05396j00110k61668r1222K25748K28369j04455l06619j39128J07862
36263b02990J49128J00831J38314J50641J4572j04597l5007P5582L2300m0779
$$ y = [-69619, -36247, -127969, -426728, -706358, -584778, -49096, 442481, 507336, 277127, 150188, 283787, 500584, 570771, 415667, 119629, -103902, -32256, 327736, 677657, 736236, 534575, 270001, -3627, -313829, -507163, -376423, -52938, 68574, -110389, -233646, -48602, 199889, 179293, -14910, -81194, -22199, -37859, -60725, 145401, 463649, 473818, 97327, -245732, -264265, -158453, -146253, -50996, 303396, 629829, 540523, 162161, -47496, 19219, 51125, -112662, -267545, -239310, -117364, -3649, 132837, 238233, 138123, -123545, -214767, 10981, 239350, 134895, -171724, -310852, -202990, -53862, 46969, 185283, 335924, 350496, 245899, 210892, 286474, 318774, 277995]
36253B77995M1370J09553r8512m05693l94353q1243R9915R812k8413J14989J13808
36242b40772j67001l07241j7716K86013J22934k26187j71382J73728J80933j79419
36232e46110k22878L08823P49826M99714j00537l36939j13152J14792P6631j15068
36222C15102l05610m25095m08085k92089k31638j79603J55253P33279R47848M29476
36212G38838k60869l46391J9818M9813l69373n02639q781M78913L61048m2351
36202A18026j16806P5428M9475k21376l04091m3247K48829L22178K56196J54888
36192E39500l0730k66253l37020j51363P2109Q2500p6375j62436o5855J00702
36182b95221J99676K14440J77992Q0036o5741j34321q469K09282K47729N077k76921
$$ y = [277995, 319365, 428918, 330406, -75287, -469640, -550883, -450968, -441156, -469569, -354580, -240772, -407773, -715014, -732730, -446717, -323783, -549970, -721352, -547624, -366691, -546110, -768988, -460165, 289661, 789375, 688838, 351899, 238747, 353539, 430170, 315102, 9492, -415603, -823688, -1115777, -1347415, -1527018, -1371765, -638486, 309362, 738838, 477969, 131578, 151396, 201209, -168164, -670803, -679584, -200671, 160377, 118026, 1220, 76648, 126123, -95253, -399344, -442591, -193762, 128416, 384612, 539500, 508770, 242517, -94503, -245866, -173757, -91257, -167632, -330068, -395923, -295221, -95545, 118895, 296887, 376923, 311182, 176861, 168392, 377674, 625403, 630480, 353559]
36171C53559k86468j1840K75931L46502J93899n2358k63236l65986l63297k98536
36161d71830j72971K9237K06931J88240o65r5076M0962K06313K07447J80729K94834
36150F14151L55441R6699k72823k74058J05415L25304M2720m24682n44707k10902
36140a87442K14212L23197M8766k60855j88013K07384L61627l2475m92398l88305
36130c94302J12185L18135R6716j8562J94101L23625J52212L6232J44674N1065
36120A016081m57273q19132n13348J08089L96807L41371K90310J82395k11397
36111C33903n93428m66113J1176K20347M4325o8435O0931J55016J34652K31366
36101F3740L54780R2432m48094n35757P5570O01786L18295l35076l97304J96003
$$ y = [353559, 67091, 55251, 331182, 677684, 871583, 819225, 555989, 190003, -173294, -471830, -644801, -615564, -408633, -220393, -221058, -316134, -275172, -68859, 138588, 319317, 614151, 969592, 1066291, 793468, 519410, 624825, 950129, 992849, 568167, 23460, -187442, 26770, 349967, 398733, 137878, -50135, 157249, 518876, 486401, -5997, -394302, -282117, 36018, 132734, 114172, 308273, 631898, 784110, 820342, 965016, 1016081, 558808, -260324, -773672, -665583, -268776, 72595, 362905, 545300, 333903, -259525, -725638, -714462, -494115, -449790, -518225, -457294, -302278, -167626, 63740, 418520, 510952, 62858, -472899, -397329, 204457, 522752, 187676, -209628, -13625]
36091a3625N76762K58014k34217k53781J3723n7008m83655n80543L9892Q25573
36081I1135R35222K86976m01868n35295k17796J24867L10253L82547L31632J25786
36071A433459j19998k58708l13667l80659m13434k80488K1053L28910M35718K10163
36061F62349k51896n67705l98709P6043K94349L7859k92571k92966q4749K0072
36051g97924J4515K9983J0338p7394k4374K25468K89194p4202m11390j69975M01957
36040e83804N82814K42011q5720j08508o6476q9927L8610L30298M13951J35850
36030H09099j75356k54738k46301k99971k76189q3792Q8853J07128R9884J51189
36020h0194J38493L9156J9435N9786r6586m37631n61835k91818L2123J38651K42535
$$ y = [-13625, 563137, 821151, 586934, 333153, 346876, 289868, -193787, -774330, -734438, 91135, 1026357, 1313333, 911465, 376170, 158374, 283241, 593494, 976041, 1307673, 1433459, 1313461, 1054753, 741086, 360427, -53007, -333495, -312442, 16468, 452186, 662349, 410453, -157252, -555961, -479918, -185569, -147710, -440281, -733247, -817996, -797924, -783409, -753426, -743088, -820482, -844856, -619388, -330194, -404396, -815786, -985761, -583804, -990, 241021, 155301, 46793, -19683, -109610, -71000, 259298, 673249, 809099, 633743, 379005, 132704, -167267, -443456, -527248, -438395, -331267, -231383, -80194, 58299, 97455, 116890, 176676, 80090, -357541, -919376, -1211194, -1179071, -1040420, -797885]
36009g97885N23287O40548K54266l06791m38761j30408R2818L603p2123J10810
35999a20636K90110J18645k71387m04671q6538L33708L94717Q7455j81287j59958
35989A58m1351p9179j89801j79584j27212j85744j87345J14126N02460M87924
35979A14452M4623l05808k15230J04424K83673J89289j20789m23775l21730L03978
35969c46893Q39425N40507l57906q16518m16096J42226K15069P7647J57349J96843
35959B31653j52991n20694l47529J86116M70575L77114K11179N8582j72950l08591
35949C2464j30165J56477K35750K19096L16979K95654q9318m36348k35424J92647
35939E57812J40774k69892k55330K74850N07534M6072m84386m80258j91138q4526
$$ y = [-797885, -274598, 365950, 620216, 313425, -125336, -255744, -162926, -159323, -231446, -120636, 169474, 288119, 16732, -387939, -474477, -140769, 253948, 341403, 160116, 158, -41193, -120372, -310173, -489757, -616969, -802713, -990058, -875932, -373472, 114452, 159075, -146733, -361963, -257539, 26134, 215423, 94634, -329141, -650871, -346893, 492532, 1033039, 675133, -141385, -557481, -415255, -200186, -122539, 34810, 231653, 78662, -442032, -789561, -603445, -132870, 244244, 455423, 514005, 341055, 32464, -97701, 58776, 294526, 513622, 830601, 1126255, 1036937, 600589, 365165, 557812, 698586, 428694, 173364, 448214, 955748, 1001820, 517434, 37176, -153962, -238488]
35929b38488r4218o769l09k35217l67382m9028M08463M27994J7550k77028j55884
35918e70316J47748L31082L80356M00900L70393J97795q3473k86624k58422p9570
35908E49869Q362o3528p2540J23959K68591M4527l78179n06743k09623J46777
35898h8528K65746K20039J17489r0406l04002k07360K37973N82234M59827Q4909
35888A277921j16028j02600j21249k14200j92988n961J85224K60915K26685P7939
35878A275658j81334l89221l16263L6251L71163L96831J24127j76377k70212j71050
35868F99573n7148k2119R160J06168J99228J98042J21511O035j71966l49439l38439
35857D00606j28458j3233j46397k13229O7103L49286J19936l90938m36619P4287
$$ y = [-238488, -332706, -339475, -339784, -575001, -942383, -991411, -582948, -154954, -137404, -414432, -570316, -422568, -91486, 288870, 689770, 1060163, 1257958, 1174485, 887861, 629439, 549869, 558231, 494703, 422163, 546122, 814713, 859240, 481061, -25682, -235305, -88528, 177218, 397257, 514746, 424340, 120338, -87022, 150951, 733185, 1193012, 1277921, 1161893, 1059293, 938044, 723844, 530856, 524895, 710119, 971034, 1197719, 1275658, 1094324, 705103, 388840, 425091, 796254, 1193085, 1317212, 1140835, 870623, 699573, 642425, 620306, 629466, 735634, 934862, 1132904, 1254415, 1260450, 1088484, 739045, 400606, 272148, 258915, 112518, -100711, -33608, 315678, 435614, 44676, -391943, -317656]
35847c17656L71146K1669l82407j83627L08060L50783p9633l54627j96583L4379
35837d28496K3730q0611k1199J99280M04043M30580K01412j65164l47087j67712
35827D8776J00899N9201k45982l78754j31448K36873M09778L46664J39345j52444
35817D32908l95669l89877j51164K5951l0805j00193R2449M17854M89070K05446
35807E95970j15848j86816r3090p7140j60147j67035l2953J27089K34126L17491
35797D41647L41549J89500q2822k04682o3815R1804L9501m7877Q1210K57843J15138
35786A158996k83496m92944l67456k21167k19046j04388K48585M72539K40843
35777D32466j83794l19325j39844k123o9210j77984j85780j20283k6988P2029
$$ y = [-317656, 53490, 75159, -307248, -490875, -182815, 167968, 88335, -266292, -462875, -428496, -404766, -485377, -506576, -307296, 96747, 527327, 728739, 563575, 216488, 48776, 149675, 208876, -37106, -415860, -547308, -310435, 99343, 446007, 585352, 432908, 37239, -352638, -503802, -477851, -508656, -608849, -516400, -98546, 390524, 595970, 480122, 293306, 200216, 123076, -37071, -204106, -237059, -109970, 124156, 441647, 783196, 972696, 889874, 685192, 621377, 713181, 752682, 704805, 786015, 1043858, 1158996, 875500, 382556, 15100, -206067, -425113, -529501, -280916, 191623, 432466, 248672, -70653, -210497, -212620, -281830, -459814, -645594, -765877, -792865, -720836]
35767g20836J04051L4160l1880Q17O2223O9924R0099J72717J98193Q6582k5892
35756D0158l1425n7220j84962k12592n460J66541K4768k08157j31766J81469L36537
35745h2109K69810K33805K39551Q4909j18190o4684R1981j11677n55275n31354
35735e43233J19771O21713M17409O691N9902L20276J37611l54139m56007q6188
35725B43806J18378j23109l45971j71655J51131K72949K36154J63811l5995l35315
35715A74184m02248j10610J50653N6832j20615K970K30957J08777k65538l45897
35705e20535O220L46417L76704K95300K68681R2622l31609o28634m39739K6158
35695e08415L10370L29068K96635K40348L9611j72660j23188R7212R2387k03673
$$ y = [-720836, -616785, -582625, -614505, -613688, -551465, -481541, -391442, -218725, -20532, 66050, 40158, 8733, -48487, -233449, -446041, -451501, -284960, -260192, -468349, -600115, -418646, -82109, 187701, 421506, 661057, 745966, 627776, 563092, 655073, 543396, -11879, -543233, -423462, 198251, 615660, 622351, 682253, 1002529, 1140140, 786001, 329994, 243806, 362184, 239075, -106896, -278551, -127420, 145529, 381683, 545494, 509499, 174184, -228064, -338674, -188021, -131189, -251804, -248834, -17877, 90900, -174638, -520535, -514315, -167898, 208806, 504106, 772787, 865409, 533800, -94834, -534573, -508415, -198045, 131023, 427658, 668006, 707617, 534957, 411769, 508981, 601368, 397695]
35685C97695l68880j23717K42098K92435K0687k31273k36569n3216J28197J35060
35675B02517o4455k59700j68715J65475L36247R4919k81183l59306j25845P5699
35665c84347P5047M3117J35670K41198J75449m1960k14935k03718n6258Q2257
35655a48480J54745K34534L44065L28172P1164k16755j92150J04225K23513n9992
35645H43041l91384l39776k896J92604R9697p7057j81944k18179j27165J68309
35635c4750M83337M70082P9458l34422m53257l32037k36131l16403m86102m83406
35625a643631q9530N47655Q96883O02805j2134l14183j69200l428o1662q6313
35615c32738J17593K76654J13897j51276j42878R1039K22769J84377J69040K12358
$$ y = [397695, 28815, -94902, 147196, 439631, 460318, 229045, -7524, -60740, 67457, 202517, 138062, -121638, -290353, -124878, 211369, 306288, 25105, -334201, -460046, -384347, -309300, -266183, -130513, 110685, 286134, 244174, 29239, -174479, -230737, -148480, 6265, 240799, 584864, 913036, 984200, 767445, 575295, 679520, 903033, 843041, 451657, 111881, 108985, 301589, 401286, 324229, 142285, -75894, -203059, -34750, 448587, 918669, 998127, 663705, 210448, -121589, -357720, -674123, -1160225, -1643631, -1733161, -1185506, -288623, 314182, 302048, -12135, -181335, -184763, -246425, -332738, -215145, 61509, 175406, 24130, -118748, -27709, 195060, 379437, 548477, 760835]
35605G60835J72152P6817J00031J76443L4037l09023m65689k68304q0547k49883
35595e3131n34132m44815j403K81638J55307k7805J18423M45873N30644K86697
35585G57296J6197o7965p6281j75077l13910l13235j11685J31705J48743j64993
35575a69205n20442m29895J85470P43571O51921Q7783k62292j72166p1094k05635
35565a61984k10789J88619N89871M90246N7385j92073j81103j91105k32055j05563
35555E1449M0762j29148m49681l72661J33791M41252K19356n6000J22623N13370
35545E15113N41585J46981k23711k66498q0793J08145J81041J25965O965j05532
35535I49261k42694m41431n19922k26119K89551M91667J62426k42558k34030K5326
$$ y = [760835, 932987, 1009804, 1109835, 1286278, 1320315, 1011292, 545603, 277299, 196752, -53131, -587263, -1032078, -1033481, -751843, -596536, -624341, -505918, -60045, 470599, 757296, 773493, 705528, 629247, 454170, 140260, -172975, -284660, -152955, -4212, -169205, -689647, -1119542, -934072, -190501, 461420, 549203, 286911, 114745, 43651, -161984, -372773, -184154, 405717, 895963, 953348, 761275, 580172, 389067, 157012, 51449, 92211, -36937, -486618, -859279, -725488, -284236, -64880, -120880, 1743, 515113, 1056698, 1203679, 979968, 713470, 632677, 740822, 921863, 1047828, 1054793, 949261, 706567, 265136, -254786, -480905, -191354, 300313, 462739, 220181, -13849, 11477]
35525A1477O7808r6991n7305K31602L03016o8548m22433k12065M07774P32741
35515H97076L90434k13981m25831j32775J69181O5391k61167l40654o8854K04255
35505B83075J88491j3737j37805q9904M7188J62801J68980L6942j37531k13996
35495B94504j81827j33001q3571r94L3016o0903j10069J13593M25025L52209j44647
35484E03335m89204k59168K16053L32648J0241l17967l20844o5851J76252J76856
35474c7649j00173m21976m81208k66668m9768M9583J66321K77969J32801k11126
35464i41894k72417J03086L82988J80811n3137K37632P25326O61924N0095m15216
35454F59198m19075k75896j75534M1212L03921K49697j16125l46826k87968k58407
$$ y = [11477, 79285, -17706, -75011, 156591, 459607, 391059, -31374, -243439, 164335, 897076, 1287510, 1073529, 647698, 514923, 684104, 749495, 488328, 147674, 78820, 283075, 471566, 457829, 320024, 230120, 277308, 440109, 609089, 646031, 508500, 294504, 112677, -20324, -103895, -104889, -71873, -132776, -242845, -129252, 295773, 647982, 503335, 14131, -245037, -28984, 303664, 313905, -4062, -324906, -390757, -214505, -37649, -137822, -559798, -1041006, -1307674, -1357442, -1307859, -1141538, -863569, -730768, -941894, -1214311, -1111225, -728237, -547426, -600563, -362931, 362395, 1024319, 1074414, 659198, 240123, -35773, -211307, -170095, 133826, 383523, 267398, -79428, -367396, -625803]
35444f25803l57759k57813J05923K97341J15457n6385N1082J57502M4251j7041
35434e43245J40085J67734j17113k43416J28919M89204K50754k19819j63565L10114
35424A99652M15892o502k95915j16639O6740j07950k78727l0215L76348L93607
35414F16291l9158m92986n91228k78816K42462O14423N46051J40066j68970j52566
35404D35569n7170j70901l61210k95725M2436L34356L45513J38933r4307k26875
35394I0619k24184j25777j1464P8941J50601J41022o4383l91729n05024j86033
35384a047411K93602M36989J65915n9240J39837N48023O51374K93820j87380m16204
35374H19325l32916r7254J18132J61323m4337l34670l81892j18315R2436n7124
$$ y = [-625803, -983562, -1241375, -1135452, -838111, -722654, -779039, -727957, -570455, -526204, -543245, -403160, -235426, -352539, -595955, -467036, 22168, 272922, 53103, -110462, 199652, 615544, 609042, 313127, 196488, 263228, 155278, -123449, -153664, 222684, 616291, 577133, 84147, -507081, -785897, -543435, 70988, 617039, 757105, 588135, 435569, 378399, 207498, -153712, -449437, -407001, -72645, 272868, 411801, 317494, 90619, -133565, -259342, -270806, -191865, -41264, 99758, 35375, -356354, -861378, -1047411, -753809, -316820, -150905, -210145, -70308, 477715, 1129089, 1422909, 1235529, 819325, 486409, 389155, 507287, 668610, 624273, 289603, -92289, -210604, -118168, -175292]
35364a75292l24987k47515J31972K81400k9750l87124l53304n2606J30762J22511
35354i03933R6727Q6085J7896k3409O9933J50265K1739j71869j28558J24153L01600
35343c59371L43601L94330L62216K3280m04989l78865J16601M12373J37070k20895
35333D25351j41845Q5467o7073l99947l15465J37626L30610J03118k8973J83925
35323C12794L10360K8873l09960k94159r9169q3464j59338n8753R4526K970k22511
35312d77831k11206N6276K63339L01255L19276K77771l1168m68855n72070k40018
35302g83231O8553L3470p3869Q2119L29879L27326J49782R9726J44906J5889k46384
35291A48166l09735j07517N5013L788r1056r5512j13747j65384n2045K28348L05843
$$ y = [-175292, -500279, -747794, -615822, -334422, -364172, -751296, -1104600, -1157206, -1026444, -903933, -807206, -721121, -703225, -726634, -656701, -506436, -484697, -656566, -785124, -660971, -359371, -15770, 378560, 740776, 764056, 359067, -19798, 96803, 509176, 646246, 425351, 283506, 368973, 301900, -98047, -413512, -275886, 54724, 157842, 128869, 312794, 623154, 652027, 342067, 47908, -51261, -134725, -294063, -352816, -258290, -255320, -477831, -689037, -632761, -369422, -68167, 251109, 528880, 497712, 28857, -543213, -783231, -714678, -681208, -755077, -672958, -343079, -15753, 134029, 233755, 378661, 394550, 148166, -161569, -269086, -214073, -210285, -301341, -396853, -510600, -675984, -728029, -499681, -193838]
35280a93838k063k78397p6756L33732L13459j54970l98273o2512L71595L50782
35270B02759M9132j0286K00189K49440k9274l42974m33273l27726q5981K71493
35260b56501N22885L85579K5493l6085K76893L82122n6711n17860m05421j3908
35250C06486n2862m86046o07647j92518K16787K59914K20427K94886J53258l41489
35240b28804o29609k49310L61457M93398K10658P8003J35908n9381m79234n35047
35230i01961o5544L35697K50872M6129J61215L48598J50354k55836l05888K8496
35220b07868J84136q8388l12372j9621M89980N11048q1870o02611m08642K80557
35210b55651O66012L68169j63184l14195q7870M1917j18481k63169j45451K3347
$$ y = [-193838, -195901, -474298, -551054, -217322, 96137, -58833, -457106, -519618, -148023, 202759, 251891, 241605, 441794, 691234, 661960, 318986, -114287, -442013, -527994, -256501, 266384, 651963, 677456, 641371, 918264, 1300386, 1243675, 725815, 320394, 306486, 253624, -232422, -840069, -1032587, -815800, -555886, -335459, -40573, 112685, -228804, -858413, -1107723, -746266, -252868, -42210, 35793, 171701, 112320, -366914, -901961, -967505, -631808, -380936, -334807, -173592, 175006, 325360, 69524, -236364, -207868, -23732, -112120, -424492, -444113, 45867, 556915, 475045, -127566, -536208, -255651, 410361, 778530, 615346, 301151, 213281, 255198, 136717, -126452, -271903, -248556]
35200b48556m9478k26338j37889K01839L43631N5001k81993j67113K98187N14859
35190C02150J95870k67706l78358j58227M8637J36883K23517K35194j3064l48445
35180b3549l45919O209K38040J55647J33590L72895M37817Q056m09528j77989
35170C95269M00282M66902q7168m76985k27311K03676K07251j70808m88705n03992
35160b81589k30490K18741N85041N77125K46992l0506j00141k07500m77722o06069
35150c06118l30778J07699K71141O1825k69151m44290l20663M4627L48246L01795
$$ y = [-248556, -298034, -524372, -662261, -460422, -116791, -61790, -343783, -510896, -212709, 302150, 498020, 230314, -148044, -306271, -257634, -120751, 102766, 337960, 324896, -23549, -369468, -363259, -125219, 30428, 164018, 536913, 974730, 982786, 573258, 395269, 795551, 1262453, 1175285, 698300, 470989, 674665, 881916, 711108, 222403, -281589, -512079, -293338, 291703, 868828, 1115820, 1085314, 985173, 777673, 299951, -306118, -636896, -529197, -258056, -196231, -465382, -909672, -1230335, -1185708, -837462, -535667]
$$ [...]
##END NTUPLES=NMR SPECTRUM
##END=
