##TITLE=31Pdec_ANY-785
 CD3CN, 24 sc
 12.3.2019
##JCAMPDX= 6.0         $$ Bruker NMR JCAMP-DX V2.0
##DATA TYPE= NMR SPECTRUM
##DATA CLASS= NTUPLES
##ORIGIN= UXNMR, Bruker Analytische Messtechnik GmbH
##OWNER= root
$$ XWIN-NMR		Version 3.5
$$ Tue Mar 12 16:30:07 2019 Russian Standard Time (UT+4h)  she@DPX200
##.OBSERVE FREQUENCY= 81.013821
##.OBSERVE NUCLEUS= ^31P
##.ACQUISITION MODE= SIMULTANEOUS
##.ACQUISITION SCHEME= undefined
##.AVERAGES= 24
##.DIGITISER RES= 17
##SPECTROMETER/DATA SYSTEM= spect
##.PULSE SEQUENCE= zgpg30
##.SOLVENT NAME= CD3CN
##.SHIFT REFERENCE= (INTERNAL, CD3CN, 0, 182.463)
##AUDIT TRAIL= $$ (NUMBER, WHEN, WHO, WHERE, WHAT)
$$ ##TITLE= Audit trail, XWIN-NMR		Version 3.5
$$ ##JCAMPDX= 5.01
$$ ##ORIGIN= Bruker BioSpin GmbH
$$ ##OWNER= she
$$ F:/spectra/data/she/nmr/P31/1/pdata/1/auditp.txt
$$ ##AUDIT TRAIL=  $$ (NUMBER, WHEN, WHO, WHERE, WHAT)
(   1,<2019-03-12 16:27:28.62 +0400>,<she>,<DPX200>,
      <created by zg, POWCHK disabled, PULCHK disabled
       configuration hash MD5:
       00 E9 B6 7A A2 85 ED C7 34 08 36 98 17 FE 4E 26
       data hash MD5: 32K
       A2 76 78 10 CA 90 97 38 56 B1 5F DF 31 A8 4C FF>)
(   2,<2019-03-12 16:29:19.25 +0400>,<she>,<DPX200>,
      <Start of raw data processing
       efp BC_mod = 2 LB = 1 FT_mod = 6 PKNL = 1 PHC0 = -1859.181 PHC1 = 144.599 SI = 64K 
       data hash MD5: 64K
       BA 00 74 35 2C 04 17 82 19 36 09 0D 15 C5 AD 41>)
(   3,<2019-03-12 16:29:36.79 +0400>,<she>,<DPX200>,
      <pk PHC0 = 3.549182 PHC1 = 0 
       data hash MD5: 64K
       F0 57 E7 EC 03 41 03 77 8B 50 88 3F 0F 00 9E A2>)
(   4,<2019-03-12 16:29:39.93 +0400>,<she>,<DPX200>,
      <abs ABSG = 5 
       data hash MD5: 64K
       A6 14 C7 F5 D3 9E EC 4A B4 73 D0 60 FB 4F E8 E0>)
$$ ##END=
$$ 
$$ hash MD5
$$ 64 CF 2A 17 36 C0 32 5A 2E 71 39 75 44 04 3A C3
##$RELAX= 
##$RELAX= 
##$RELAX= 
##$RELAX= 
##$RELAX= 
##$RELAX= 
##$RELAX= 
##$RELAX= 
$$ Bruker specific parameters
$$ --------------------------
##$DU= <F:/spectra>
##$EXPNO= 1
##$NAME= <P31>
##$PROCNO= 1
##$TYPE= <nmr>
##$USER= <she>
##$AMP= (0..31)
100 100 100 100 100 100 100 100 100 100 100 100 100 100 100 100 100 100 
100 100 100 100 100 100 100 100 100 100 100 100 100 100 
##$AQSEQ= 0
##$AQ_mod= 1
##$AUNM= <au_zg>
##$AUTOPOS= <>
##$BF1= 81.014009
##$BF2= 200.13
##$BF3= 200.13
##$BF4= 200.13
##$BF5= 200.13
##$BF6= 200.13
##$BF7= 200.13
##$BF8= 200.13
##$BYTORDA= 1
##$CFDGTYP= 0
##$CFRGTYP= 5
##$CHEMSTR= <none>
##$CNST= (0..31)
1 1 145 1 1 1 1 1 1 1 1 1 1 1 1 1 1 1 1 1 1 1 1 1 1 1 1 1 1 1 1 1 
##$CPDPRG= <waltz16>
##$CPDPRG1= <>
##$CPDPRG2= <waltz16>
##$CPDPRG3= <>
##$CPDPRG4= <mlev>
##$CPDPRG5= <mlev>
##$CPDPRG6= <mlev>
##$CPDPRG7= <mlev>
##$CPDPRG8= <mlev>
##$CPDPRGB= <>
##$CPDPRGT= <>
##$D= (0..31)
0 1 0 0 0 0 0 0 0 0 0 0.03 2e-05 3e-06 0 0 0 0 0 0 0 0 0 0 0 0 0 0 0 0 
0 0 
##$DATE= 1552393648
##$DBL= (0..7)
120 120 120 11 120 120 24 19 
##$DBP= (0..7)
150 150 150 150 150 150 150 150 
##$DBP07= 0
##$DBPNAM0= <>
##$DBPNAM1= <>
##$DBPNAM2= <>
$$ [...]
##$SUBNAM3= <"">
##$SUBNAM4= <"">
##$SUBNAM5= <"">
##$SUBNAM6= <"">
##$SUBNAM7= <"">
##$SUBNAM8= <"">
##$SUBNAM9= <"">
##$SW= 369.568048894756
##$SWIBOX= (0..15)
0 1 3 0 0 0 0 0 0 0 0 0 0 0 0 0 
##$SW_h= 29940.119760479
##$TD= 32768
##$TD0= 1
##$TE= 0
##$TE2= 300
##$TE3= 300
##$TEG= 300
##$TL= (0..7)
0 120 53 12 22 120 120 120 
##$TP= (0..7)
150 150 150 150 150 150 150 150 
##$TP07= 0
##$TPNAME0= <>
##$TPNAME1= <>
##$TPNAME2= <>
##$TPNAME3= <>
##$TPNAME4= <>
##$TPNAME5= <>
##$TPNAME6= <>
##$TPNAME7= <>
##$TPOAL= (0..7)
0.5 0.5 0.5 0.5 0.5 0.5 0.5 0.5 
##$TPOFFS= (0..7)
0 0 0 0 0 0 0 0 
##$TUNHIN= 0
##$TUNHOUT= 0
##$TUNXOUT= 0
##$USERA1= <user>
##$USERA2= <user>
##$USERA3= <user>
##$USERA4= <user>
##$USERA5= <user>
##$V9= 5
##$VALIST= <valist>
##$VCLIST= <CCCCCCCCCCCCCCC>
##$VD= 0
##$VDLIST= <DDDDDDDDDDDDDDD>
##$VPLIST= <PPPPPPPPPPPPPPP>
##$VTLIST= <TTTTTTTTTTTTTTT>
##$WBST= 1024
##$WBSW= 4
##$XGAIN= (0..3)
0 0 0 0 
##$XL= 0
##$YL= 0
##$YMAX_a= 24228
##$YMIN_a= -27755
##$ZGOPTNS= <>
##$ZL1= 120
##$ZL2= 120
##$ZL3= 120
##$ZL4= 120
##$ABSF1= 182.463
##$ABSF2= -187.1042
##$ABSG= 5
##$ABSL= 3
##$ALPHA= 0
##$AQORDER= 0
##$ASSFAC= 0
##$ASSFACI= 0
##$ASSFACX= 0
##$ASSWID= 0
##$AUNMP= <proc_1d>
##$AZFE= 0.1
##$AZFW= 0.5
##$BCFW= 0
##$BC_mod= 2
##$BYTORDP= 0
##$COROFFS= 0
##$CY= -3
##$DATMOD= 1
##$DC= 0
##$DFILT= <>
##$DTYPP= 0
##$F1P= 0
##$F2P= 0
##$FCOR= 1
##$FTSIZE= 65536
##$FT_mod= 6
##$GAMMA= 0
##$GB= 0
##$INTBC= 1
##$INTSCL= 5.30512e-09
##$ISEN= 30
##$LB= 1
##$LEV0= 0
##$LPBIN= 0
##$MAXI= 10000
##$MC2= 0
##$MEAN= 0
##$ME_mod= 0
##$MI= 50
##$NCOEF= 0
##$NC_proc= -3
##$NLEV= 6
##$NOISF1= 182.463
##$NOISF2= 159.3651
##$NSP= 0
##$NTH_PI= 0
##$NZP= 0
##$OFFSET= 182.463
##$PC= 4
##$PHC0= -1855.632
##$PHC1= 144.599
##$PH_mod= 1
##$PKNL= yes
##$PPARMOD= 0
##$PSCAL= 0
##$PSIGN= 0
##$REVERSE= no
##$SF= 81.0140089999434
##$SI= 65536
##$SIGF1= 159.3651
##$SIGF2= -187.1042
##$SINO= 113.3802
##$SIOLD= 16384
##$SREGLST= <1H.CDCl3>
##$SSB= 0
##$STSI= 65536
##$STSR= 0
##$SW_p= 29940.119760479
##$SYMM= 0
##$S_DEV= 0
##$TDeff= 32768
##$TDoff= 0
##$TI= <>
##$TILT= no
##$TM1= 0
##$TM2= 0
##$TOPLEV= 0
##$USERP1= <user>
##$USERP2= <user>
##$USERP3= <user>
##$USERP4= <user>
##$USERP5= <user>
##$WDW= 1
##$XDIM= 65536
##$YMAX_p= 348102481
##$YMIN_p= -6742069
$$ End of Bruker specific parameters
$$ ---------------------------------
##NTUPLES= NMR SPECTRUM
##VAR_NAME=  FREQUENCY,     SPECTRUM/REAL,   SPECTRUM/IMAG
##SYMBOL=    X,             R,               I
##VAR_TYPE=  INDEPENDENT,   DEPENDENT,       DEPENDENT
##VAR_FORM=  AFFN,          ASDF,            ASDF
##VAR_DIM=   65536,         65536,           65536
##UNITS=     HZ,            ARBITRARY UNITS, ARBITRARY UNITS
##FACTOR=    0.456856943014862, 1,           1
##FIRST=     14782.0589164792, 0,            0
##LAST=      -15158.0608439998, 0,           0
##MIN=       -15158.0608439998, -6742069,    0
##MAX=       14782.0589164792, 348102481,    0
$$ Real data points
##PAGE= N=1
##DATA TABLE= (X++(R..R)), XYDATA
$$ [...]
##PAGE= N=2
##DATA TABLE= (X++(I..I)), XYDATA
44175I9973M3388N4807n6097p3966O1791J32930j6364k17641k08557L79J61037
$$ 99973 143361 198168 142071 68105 129896 262826 246462 28821 -179736 -179357 -18320
44164a8320J31932J5174n0309o3961o8951k7498Q2440J40109K2325j56132j32206
$$ -18320 113612 128786 78477 14516 -54435 -81933 507 140616 162941 6809 -125397
44153a25397J29795L33847K34797k7427j39834m8952K9199k0217o8514p138N8740
$$ -125397 4398 338245 573042 545615 405781 356829 386028 365811 297297 290159 348899
44142C48899j4169j77533k52369j45996O8637K35627K37255R2458m7101o5346
$$ 348899 334730 157197 -95172 -241168 -172531 63096 300351 392809 345708 280362
44132B80362k9314o4622j21596m2497J39231J93958N5354n4286J3315Q1012m1462
$$ 280362 251048 186426 64830 22333 161564 355522 410876 356590 369905 450917 409455
44121D09455j99480j22819J16368J86376K635j49403m9489J52042J76396j1723
$$ 409455 209975 87156 203524 389900 392535 243132 193643 345685 522081 510358
44111E10358k01769k07126l7238J45502J81925O4786n1789l0435Q3706J41620
$$ 510358 308589 101463 64225 209727 391652 456438 404649 374214 457920 599540
44101E99540R3974J0227p0639j64097k17951j31419N7980J57106O3851r1304j31925
$$ 599540 693514 703741 633102 469005 251054 119635 177615 334721 398572 307268 175343
44090A75343n0170N5737J42810J98655J51657l4459k20549k11260k1490J20637
$$ 175343 125173 180910 323720 522375 674032 639573 419024 207764 186274 306911
44080C06911P4054m1778m3889N2179P9472k5100j36127j17970Q842J20344J42533
$$ 306911 380965 339187 295298 347477 426949 401849 265722 147752 156594 276938 419471
44069D19471R3490R600r3992j78141j60867o508J77880K09373M2149j32910r1661
$$ 419471 512961 522561 428569 250428 89561 83053 260933 470306 512455 379545 287884
44058B87884J26558K45402J21646n2611m3570O2893J8042j44492j28509J18394
$$ 287884 414442 659844 781490 728879 685309 748202 766244 621752 493243 611637
44048F11637K55110O9907j61929j19098L4134o1691l18428l11613J4567K40427
$$ 611637 866747 936654 774725 655627 689761 628070 309642 -1971 12596 253023
44038B53023J44699J5202J02391J97779M9861j57219j10895R4860J23852o0692
$$ 253023 397722 412924 515315 713094 762955 605736 494841 589701 713553 652861
44028F52861j99852j89416j57098j34579j6114J43223J35070k6922n1980J89788
$$ 652861 453009 263593 106495 -28084 -44198 99025 234095 207173 155193 344981
44018C44981M37333L95556J19142j12811j52512p1229m542l4596j51468k47753
$$ 344981 782314 1177870 1297012 1184201 1031689 960460 955918 921322 769854 522101
44008E22101k16796r6120k3881l3593k1105N2431Q4089K4565j1577O3267J52758
$$ 522101 305305 209185 185304 151711 130606 183037 267126 291691 280114 343381 496139
43997D96139J38530P1977N4925L7899q1840k29765k22215n4509O8108K2786p6123
$$ 496139 634669 706646 761571 799470 717630 487865 265650 211141 279249 302035 225912
43986B25912q6216n0465q0800j35455p2939J08813K47249K44821J75828J14033
$$ 225912 139696 89231 8431 -127024 -199963 -91150 156099 400920 576748 690781
43976F90781Q568j58580k35271j02627P6520M6452j31090j25265J48488L42519
$$ 690781 699349 540769 305498 202871 279391 325843 194753 69488 217976 560495
43966E60495J66282j75178k67866n4905J48018J15820o8905k28543k72856j63035
$$ 560495 726777 551599 283733 228828 376846 492666 423761 195218 -77638 -240673
43956b40673P6698K71898K24331j6253j76912j11074L8743Q2187K0308l4480l3382
$$ -240673 -163975 107923 332254 316001 139089 28015 66758 148945 169253 134773 101391
43945A01391O801O8415J18057J08846N1561R606K413K678K4144Q6354R9618m6793
$$ 101391 108192 176607 294664 403510 455071 464677 467090 469768 493912 580266 679884 633091
43933F33091k60596k99712j07487R3398J25079Q1088J10947J60989R4338o5492
$$ 633091 372495 72783 -34704 58694 183773 264861 375808 536797 631135 565643
43923E65643j81265j96948j35980L961J98050L09452K18633L67j58047j77272
$$ 565643 384378 187430 51450 55411 253461 562913 781546 781913 623866 446594
43913D46594j13207k1916P0109J01188J9078j15611j77901j25363j6341Q8979
$$ 446594 333387 311471 381580 482768 501846 386235 208334 82971 66630 155609
43903A55609J55519J32764p723j94831k95370k34706m5093J71739K92883K45127
$$ 155609 311128 443892 436169 241338 -54032 -288738 -333831 -162092 130791 375918
43893C75918Q3513n4837j12350j41901j45164k9249J83184K70463J08078r2370
$$ 375918 459431 404594 292244 150343 5179 -24070 159114 429577 537655 445285
43883D45285o0832J18257J37973l4741j05455N7813J89898M0007k24642k55380
$$ 445285 384453 502710 640683 605942 500487 558300 748198 788205 563563 308183
43873C08183k0611J78081J42038P17l4526L9990P8211K5750k6174n792L4479J8139
$$ 308183 287572 465653 607691 608408 573882 613872 692083 717833 691659 685867 720346 738485
43861G38485l0200l7873k0244n9565j47439j64271o0536N2161O8452M1833N8379
$$ 738485 708285 670412 650168 590603 443164 278893 218357 270518 338970 380803 439182
43850D39182N8441n2066j77589j27457O7795J52943J9526j30363j04843o584j8144
$$ 439182 497623 445557 267968 140511 208306 361249 380775 250412 145569 138985 120841
43839A20841p2274J0445J52235R4661j46349k21540K9972K84527J89107j00951
$$ 120841 48567 59012 211247 305908 159559 -61981 -32009 252518 441625 340674
43829C40674j53326Q1873K11146K1116k00126j27908J06274J47360m2418j73485
$$ 340674 187348 269221 480367 501483 301357 173449 279723 427083 384665 211180
43819B11180q5874O7728J08037O0247L3681M7651O0629N6680L8476J0789o215
$$ 211180 125306 193034 301071 361318 394999 442650 503279 559959 598435 609224 603009
43808F03009j5009o6839j56156j49841K7196J95815J22667j09965j88291m1967
$$ 603009 588000 521161 365005 215164 242360 438175 560842 450877 262586 220619
43798B20619N3421o1742j70050n9328J03166M1515j71010k18547j0767K25777
$$ 220619 274040 212298 42248 -17080 86086 127601 -43409 -261956 -272723 -46946
43788d6946K83024J66444k1004j74726j73730K6618K64028L04271J37678q769
$$ -46946 236078 402522 381518 206792 33062 59680 323708 627979 765657 756888
43778G56888J4458R8257O0650j04432k38100k14862p4601K8449k997r6153j06729
$$ 756888 771346 869603 930253 825821 587721 372859 298258 326707 323710 227557 120828
43767A20828k2734K6223j5902m1729K8382J12137J26047J29635J69502J31897
$$ 120828 98094 124317 108415 66686 95068 207205 333252 462887 632389 764286
43757G64286o0266k30487j54782R4530K36901J65460K3460o2403j01182j02132
$$ 764286 704020 473533 318751 413281 650182 815642 839102 776699 675517 573385
43747E73385l4761N9332Q8100M4278k3428j21216k26153j86244O5464K85652J94006
$$ 573385 538624 597956 686056 730334 706906 585690 359537 173293 238757 524409 718415
43736G18415q8378j95223p5641k7639j51339j82613J2512J79282J06228l6117
$$ 718415 630037 434814 359173 331534 180195 -2418 10094 189376 295604 259487
43726B59487k5014N5425M5523K1253Q6744J03230n8303k00221p2874J90328K56945
$$ 259487 234473 289898 335421 356674 443418 546648 488345 288124 215250 405578 662523
43715F62523J02979n887L3848P2789L8433K2308K5601p0312k33658k68297j36994
$$ 662523 765502 759615 793463 866252 904685 926993 952594 882282 648624 380327 243333
43704B43333l4875n6766m7539R6081K10155J20021o1489q4208Q4727K25713J56399
$$ 243333 208458 151692 104153 200234 410389 530410 468921 384713 469440 695153 851552
43693H51552o0353k00835j17551J08570K45574J58592m5394j64054j36884n2045
$$ 851552 791199 590364 472813 581383 826957 985549 940155 776101 639217 587172
43683E87172K0192O7568N1103n6171j55817j21145j5329k5775j52917j76558o338
$$ 587172 607364 674932 726035 669864 514047 392902 377573 351798 198881 22323 15985
43672A5985J53728J20182O760N563O2203K02j39901j42180L6885J99576K03617
$$ 15985 169713 289895 296655 302218 364421 364623 224722 82542 119427 319003 522620
43661E22620J20370N3685n901p0001o7998J5776N5663l7354j52070j28017p25
$$ 522620 642990 696675 690774 620773 552775 568551 624214 586860 434790 306773 306048
43650C06048N0145l0326r7221j7409J52931K42698J52321n9349k24894j98520
$$ 306048 356193 325867 228646 211237 364168 606866 759187 699838 474944 276424
43640B76424N413J94793J76731l8761k60263l27458k32212m9506J35414K16216
$$ 276424 281837 476630 653361 614600 354337 26879 -205333 -254839 -119425 96791
43630I6791J19924n9904j03464O4855K43432K03291j0360j56109j14337J8437
$$ 96791 216715 156811 53347 118202 361634 564925 554565 398456 284119 302556
43620C02556J18182J59173J46854P2234k5801o3160k0068L1522L3171m164n8261
$$ 302556 420738 579911 726765 798999 773198 710038 689970 721492 754663 750499 692238
43609F92238j21485j56776j18766l5351J5418J6587J4668J8447k708l3157m2561
$$ 692238 570753 413977 295211 259860 275278 291865 306533 324980 322272 289115 246554
43598B46554p9244j79213k07365m60L14849L97008J63765o5456l9843P0457L888
$$ 246554 167310 -11903 -219268 -219728 95121 492129 655894 590438 550595 621052 624940
43587F24940j51766j46036k0189j9738j34866j07634Q6302J40422p5838k46353
$$ 624940 473174 327138 306949 287211 152345 44711 131013 271435 195597 -50756
43577e0756o6078K73907L43669R1291r7505M1545K92371K74544m2105l13856k77657
$$ -50756 -116834 157073 500742 592033 494528 536073 828444 1102988 1060883 747027 469370
43566D69370o0691L6625m9240j06506K165J34236R6387o3832j44434q8444k8774
$$ 469370 408679 445304 396064 289558 291723 425959 522346 458514 314080 225636 196862
43555A96862n4588r2725m8740N7505J36989J25990J7958j17433j49926k1706J41498
$$ 196862 142274 49549 809 58314 195303 321293 339251 221818 71892 50186 191684
43544A91684J66728P1765K2658N3136J7737j20844j69966o803J80051J40292o9034
$$ 191684 358412 430177 452835 505971 523708 402864 232898 226095 406146 546438 477404
43533D77404j79082j03177p615n796j3482M2232P5692P495p6726n5338M4516J06631
$$ 477404 298322 195145 187530 181734 168252 210484 286176 293671 216945 161607 206123 312754
43521C12754R4579N6218K4594J4872N6367J19433P5767j33145l35231k97181m6072
$$ 312754 407333 463551 488145 503017 559384 678817 754584 621439 286208 -10973 -57045
43510e7045J45013J16499j386k8709J8007K5144j6301m6609p0651j10790j05381
$$ -57045 87968 204467 203081 174372 192379 217523 201222 154613 83962 -26828 -132209
43499a32209q59J16523J29148P5687P4753J07033N1944p6279j17226p785J32037
$$ -132209 -133068 -16545 112603 188290 263043 370076 422020 345741 228515 220730 352767
43488C52767J83719J42348K8050j34586k21127r9384J19664J42124r3289k79462
$$ 352767 536486 678834 706884 572298 351171 251787 371451 513575 420286 140824
43478A40824j69811O7518J26926J7014j9931P6314J28525M6596m8776m7489J4595
$$ 140824 -28987 38531 165457 182471 162540 238854 367379 413975 365199 317710 332305
43467C32305Q0001J51691K03784J63923M1519m8037l5072K8045O8215O7962K5771
$$ 332305 412306 563997 767781 931704 973223 925186 890114 918159 986374 1054336 1080107
43456A080107m7212p3768K2680J68197J85009L8333r1839o2581K4350k4474k12956
$$ 1080107 1032895 959127 981807 1150004 1335013 1373346 1281507 1218926 1243276 1218802 1005846
43445A005846l51288l02417j22126M9337J40018J56203J11735J6479q5790j34772
$$ 1005846 654558 352141 230015 279352 419370 575573 687308 703787 617997 483225
43435D83225j21512q5895l0548Q5776K18762K03046k8976k65890k41111k1588
$$ 483225 361713 275818 245270 331046 549808 752854 723878 457988 216877 195289
43425A95289N0655j41356k88966j02241K52483L78375J80822o5294j20576k4722
$$ 195289 245944 104588 -184378 -286619 -34136 344239 525061 459767 339191 314469
43415C14469O2227O8601K3397j0465J2941O1050L5830p7672j45729p1954M1800
$$ 314469 376696 445297 468694 458229 471170 532220 568050 490378 344649 272695 314495
43404C14495N7828K8165P9976J59936J09371m9287j24324m5122O3722R7950O9183
$$ 314495 372323 400488 480464 640400 749771 700484 576160 531038 594760 692710 761893
43393G61893p762j19441j50147O957K21545K31027K639k24242k82439k34262j53495
$$ 761893 754131 634690 484543 491500 713045 944072 946711 722469 440030 205768 52273
43382E2273p529J68275K23485J22852J5433q027j5316k8218L3502J24230O5605
$$ 52273 44744 213019 436504 559356 574789 566762 551446 523228 556730 680960 746565
43371G46565j21408j72748j7092N9421j10036k48235o7362K50245L42907K21230
$$ 746565 625157 452409 435317 494738 384702 136467 69105 319350 662257 883487
43361H83487J55968J73811O7316j65641k84630k13557j40805j67863j59309j7583
$$ 883487 1039455 1213266 1280582 1114941 830311 616754 475949 308086 148777 131194
43351A31194J46231K01695J55936N6519p4900j57684q8034P3032J15698m0458
$$ 131194 277425 479120 635056 691575 616675 458991 370957 443989 559687 519229
43341E19229k24825k36938o7814J46399K71541K35005N8108j22953j65140p8407
$$ 519229 294404 57466 -10348 136051 407592 642597 700705 577752 412612 334205
43331C34205O223K3696K0913K5243O25n2617p8950o3467l4896J9237J13124J59141
$$ 334205 340428 364124 385037 410280 410905 358288 279338 215871 180975 200212 313336 472477
43319D72477O3618q2529r2618K3622N7462o8773j80372j33414r644P4888J45582
$$ 472477 536095 453566 360948 384570 442032 373259 192887 59473 49829 124717 270299
43308B70299K14410J59098m7062j65818m713K28333J70321j48652l11022j07023
$$ 270299 484709 643807 596745 430927 426214 654547 824868 676216 365194 258171
43298B58171J67322J45933j02302k15313n4708J56020J87741Q8658M3854R6155
$$ 258171 425493 571426 469124 253811 199103 355123 542864 631522 675376 771531
43288G71531J21869K7341j33121k34375k10926r7061K2753Q3939Q0574N0197K4059
$$ 771531 893400 920741 787620 553245 342319 245258 268011 351950 432524 482721 506780
43277E06780J554k6361n3249o8850o7847l3525M7680J31486J29247K4290p6435
$$ 506780 508334 481973 428724 359874 292027 258502 306182 437668 566915 591205 514770
43266E14770p2993p262J5466n390J3281P0084N8438o6339k03126k21133r0492
$$ 514770 441777 434515 449981 444591 457872 527956 586394 520055 316929 95796 5304
43255E304J08436K38784J95221K6826p1440k253P1706k3121j47483m0287K05268
$$ 5304 113740 352524 547745 574571 503131 500878 572584 549463 401980 361693 566961
43244E66961K08002q9038k55158j8044K79260J78842k04151l76145j85368N4448
$$ 566961 774963 685925 430767 412723 691983 870825 666674 290529 105161 159609
43234A59609R9888N1934O4231J09166J24471J38361J51689R4381j9535o4742k985
$$ 159609 259497 311431 375662 484828 609299 747660 899349 993730 974195 909453 906468
43223I06468M2490k5976j46581j98943j32256K3024J65412J60317n394j37878
$$ 906468 948958 922982 776401 577458 445202 468226 633638 793955 788561 650683
43213F50683n6929J34489J80961M3370p4684o0483j6002j8782l976L7588k6958
$$ 650683 593754 728243 909204 952574 877890 817407 801405 782623 778647 816235 789277
43202G89277k37083l96604l03594l698K84782L94777K94069O3209j40732j95373
$$ 789277 552194 155590 -148004 -151702 133080 527857 821926 885135 744403 549030
43192E49030j32007o1789l381Q1485J22587J7404j34946j16247O2552J48173L9986
$$ 549030 417023 355234 351853 433338 555925 573329 438383 322136 384688 532861 572847
43181E72847o9489m2065Q01m0055l9996P1404R7806j01265k94006j81761J28183
$$ 572847 503358 461293 462094 422039 382043 453447 551253 449988 155982 -25779 102404
43170A02404K62728J12493p1970q7023j3121j4351j03160j60982p7068J46766
$$ 102404 365132 477625 405655 318632 305511 291160 188000 27018 -50050 96716
43160I6716L52245L29526N5821k38463l37648k80387k16552j47482J4636K14778
$$ 96716 448961 778487 834308 595845 258197 -22190 -238742 -386224 -371588 -156810
43150a56810K83384J71201p73j01804p8153O3588K25829K41817P5119p8105m6447
$$ -156810 126574 297775 297002 195198 117045 180633 406462 648279 723398 645293 598846
43139E98846M5143l9363k59816l33987j43379J21587K43264K01921Q3741m8546
$$ 598846 643989 604626 344810 10823 -132556 -10969 232295 434216 517957 469411
43129D69411j32828j06778J955Q2251O6024k4159j25831j46130M240K52930L40030
$$ 469411 336583 229805 231760 314011 380035 355876 230045 83915 88155 341085 681115
43118F81115J40110q9482l4301J83786J64362j38415l21824j61265N1434o619
$$ 681115 821225 731743 697442 881228 1045590 907175 585351 424086 475520 468901
43108D68901j94197j74651N5436K11676J55582L644j12293j51597r1885L9166
$$ 468901 274704 100053 155489 367165 522747 526391 414098 262501 170616 209782
43098B09782J07867K8882q9096j14231j00105j27452p6042J65025L65990J98780
$$ 209782 317649 346531 257435 143204 43099 -84353 -160395 4630 370620 569400
43088E69400k01941l15764K6918L65459K67552o5922j53556N3003J78628L6810
$$ 569400 367459 51695 78613 444072 711624 645702 492146 545149 723777 760587
43078G60587j43626j26433Q413N6540r677o2799j9839Q0775J32081M5133j45163
$$ 760587 616961 490528 498941 555481 545804 483005 463166 543941 676022 721155 575992
43067E75992k56537j47067P3041J53119L8191p0539k9284O6086R7251J19143J88352
$$ 575992 319455 172388 245429 398548 436739 366200 336916 403002 500253 619396 807748
43056H07748J80951n445k02014j69374K9141J15050K4140k7351O7925J34018K7128
$$ 807748 988699 983254 781240 611866 641007 756057 780197 752846 820771 954789 981917
43045I81917j24339j51552j12550j34693j51801l1105J37074J32434l5795j13461
$$ 981917 857578 706026 593476 458783 306982 275877 412951 545385 509590 396129
43035C96129N978J05859j0032j83602j16315J73537L45178K07789k1532m9228
$$ 396129 402107 507966 497934 314332 198017 371554 716732 924521 902989 853761
43025H53761P8788R3317n6715j32485K966J63809J26518n5870j85427k18847k42879
$$ 853761 932549 1025866 969151 836666 839632 1003441 1129959 1074089 888662 669815 426936
43014D26936k49998j52033K0423J25314J11650O0151L5906M3765R6832J73593
$$ 426936 176938 24905 45328 170642 282292 342443 378349 422114 518946 692539
43004F92539J52106l3058k14952j82645m310P3758J3609j1393J5268p3633k35758
$$ 692539 844645 811587 596635 413990 409680 483438 497047 485654 500922 427289 191531
42993A91531j78475J41719L44486J76902q5477p2769J22680J57788p764j32346
$$ 191531 13056 154775 499261 676163 590686 517917 640597 798385 790621 658275
42983F58275j26782j09080j04145k5345Q0868P7421L335J2851O8090j0270j78619
$$ 658275 531493 422413 318268 292923 373791 451212 454547 467398 535488 525218 346599
42972C46599j66416R8463L40586L21314J40451K7139J6818j7780j32296k37900
$$ 346599 180183 278646 619232 940546 1080997 1108136 1124954 1107174 974878 736978
42962G36978k17880n8751J11745J35770K1776m0003N6420J60214J00182l0909
$$ 736978 519098 460347 572092 707862 729638 689635 746055 906269 1006451 975542
42952I75542m1837J4096n9101k11490j84621M2582J73354M8241j21043j10375
$$ 975542 933705 947801 888700 677210 492589 535171 708525 756766 635723 525348
42942E25348o502L126o3617q5059o4349n9767k8507P3630J54837J22242M5941
$$ 525348 518846 521972 458355 373296 308947 249180 220673 294303 449140 571382 617323
42931F17323K5547Q986p3472j04908O5376L23076L75230J41565j39153k32096
$$ 617323 642870 651856 578384 473476 538852 861928 1237158 1378723 1239570 1007474
42921A007474j65948j06882j16336j31121r7145k4483N4439J10342J17750Q1592
$$ 1007474 841526 734644 618308 487187 390042 365559 419998 530340 648090 729682
42911G29682N1290O1926O8062q137j47184k10994j04276Q2708J68514J00559q007
$$ 729682 780972 842898 910960 902823 755639 544645 440369 523077 691591 792150 784143
42900G84143n9395p5176q7548n5975K6598O0003j3119p3896J4236J71912J84661
$$ 784143 724748 649572 562024 506049 532647 592650 579531 505635 519871 691783 876444
42889H76444J622j90883k11662q3770M2986Q3567Q5114J33997K21214K27099Q5896
$$ 876444 878066 687183 475521 391751 434737 518304 603418 737415 958629 1185728 1271624
42878A271624p4050q1306q94o5022k76242l31221q2101J84994J64357q515j4606
$$ 1271624 1197574 1116268 1115374 1050352 774110 442889 360788 545782 710139 701624 687018
42867F87018J22546J39834L4305L8129J39188O8561j87805k93129j00938R3418
$$ 687018 809564 949398 983703 1021832 1161020 1229581 1041776 748647 647709 741127
42857G41127K3378j58959j77215l8135Q1372J27857J29621N0723r6665j48386
$$ 741127 764505 605546 428331 390196 471568 599425 729046 779769 683104 534718
42847E34718k262J82812J80619m696j77608j96576o8022J07012J88987J04369
$$ 534718 532456 715268 895887 891191 713583 517007 448985 555997 744984 849353
42837H49353m4210q8360l5701l2838p9315k2121J15932R6710j24102k47122p5363
$$ 849353 805143 716783 681082 648244 568929 546808 662740 759450 635348 388226 312863
42826C12863J60885J57998j2605p1202L3598J21642R3055O443o8183q9694k9274
$$ 312863 473748 631746 619141 547939 581537 703179 796234 802677 734494 644800 615526
42815F15526M7005N625j22961j17252R1262K58591J88189K4055k7248l2448j29998
$$ 615526 662531 668156 545195 427943 519205 777796 965985 990040 962792 930344 800346
42804H00346k13499j19881M6156Q9059O6264J34455J99917P1832j48076j90962
$$ 800346 586847 466966 513122 602181 668445 802900 1002817 1074649 926573 735611
42794G35611o3055p985p6079q3843J7984Q0883O5661Q3373J14894J5527j67787
$$ 735611 672556 664571 588492 504649 522633 603516 669177 752550 867444 882971 715184
42783G15184k04628o1762L1179l1471p6254J9883J19794O9733p3891j75820j88063
$$ 715184 510556 448794 479973 448502 372248 392131 511925 581658 507767 331947 143884
42772A43884j01121P9032K32918K00914K5069p2202j0331N2200O824m2065k729
$$ 143884 42763 121795 354713 555627 580696 508494 498163 550363 557187 515122 512393
42761E12393K7850m9456j42617j07892L6957J62485J98752J59139P1766k9835
$$ 512393 540243 490787 348170 240278 277235 439720 638472 797611 869377 839542
42751H39542j00832j20993j01343n3325J703K3734J6217L8979Q9519P1865j7349
$$ 839542 738710 617717 516374 463049 464752 488486 504703 543682 633201 705066 687717
42740F87717j6372J29343J86603l5491l14259k75103N4820K77782J83140m4513
$$ 687717 671345 800688 987291 951800 637541 362438 417258 695040 878180 833667
42730H33667j77284j87141j05570N2074J64595Q9511p6555r1923M3877R1537j1128
$$ 833667 656383 469242 363672 415746 580341 669852 593297 501374 545251 636788 625660
42719F25660o5028N86R448r4373j20938p313M5162l0951l50K35557L85753K19971
$$ 625660 560632 561218 570666 476293 355355 348042 393204 362253 361903 597460 983213 1203184
42707A203184m2356q6076K8704N5990j0878k2570L986m4472j28904j48884j41901
$$ 1203184 1160828 1074752 1103456 1159446 1148568 1125998 1129984 1085512 956608 807724 665823
42696F65823j51436o5861J55414K79245J15659j28574j32159M5773R4189l3599
$$ 665823 514387 448526 603940 883185 998844 870270 738111 783884 878073 844474
42686H44474r5197Q73Q8159P6095O0179O3881k4780j93834k55849j40277k595
$$ 844474 749277 750150 838309 914404 974583 1038464 1013684 819850 564001 423724 421129
42675D21129M4946R0349K01250K47847R9128j35357k21310j07885P234o3363k42594
$$ 421129 466075 556424 757674 1005521 1104649 969292 747982 640097 647331 583968 341374
42664C41374k58195J5399L53273M22780J96534m1794j12845j35815k19437k20303
$$ 341374 83179 98578 451851 874631 1071165 1029371 916526 780711 561274 340971
42654C40971j8109J81190J06932j34669j87581L1347K30600J79771j5248j33524
$$ 340971 322862 504052 610984 476315 288734 320081 550681 730452 715204 581680
42644E81680j20421n9953j9939r592j278M4304J13556J23831M8766n505L8348
$$ 581680 461259 401306 381367 371775 370497 414801 528357 652188 700954 695449 733797
42633G33797P6564j1628j31779j03355M0643J08781P1187P3877J29188O2976j59718
$$ 733797 810361 798733 666954 563599 604242 713023 784210 858087 987275 1050251 890533
42622H90533l07885k07069J1760J23932J06734P5737O1656J8125k9722m046Q7077
$$ 890533 582648 375579 387339 511271 618005 693742 755398 773523 743801 739755 826832
42611H26832J50539J41424J08631J03830J06947O2150l5974j16586j16252q2436
$$ 826832 977371 1118795 1227426 1331256 1438203 1500353 1464379 1347793 1231541 1149105
42601A149105j26285k36743k38616l8415J75529J47042p0566j55642L2199K52538
$$ 1149105 1022820 786077 547461 509046 684575 831617 761051 605409 637608 890146
42591H90146K37026N8279k6545J9619j2181k13922l80334k74567N6276L42734
$$ 890146 1127172 1185451 1158906 1178525 1166344 952422 572088 297521 353797 696531
42581F96531M01310K67899O1816j39899k63716k19943l2239J02147K5027j46144
$$ 696531 1097841 1365740 1427556 1287657 1023941 803998 771759 873906 898933 752789
42571G52789j46438O8337K40720J52371r4112k25469j30499N6499J43521O8127
$$ 752789 606351 674688 915408 1067779 973667 748198 617699 674198 817719 885846
42561H85846o8019j03917O306J17850O6700r4833j61123p8824j4036n7924o5070
$$ 885846 817827 713910 720216 838066 904766 809933 648810 569986 555950 498026 432956
42550D32956Q7228K56084K29292L9801j04853j20808q9775o2652n919P6703J23114
$$ 432956 520184 776268 1005560 1045361 940508 819700 729925 667273 661354 738057 861171
42539H61171J09485N9467j3125p4784m6507P7256J49113M0427j60926k57016j95907
$$ 861171 970656 1030123 1016998 942214 895707 972963 1122076 1162503 1001577 744561 548654
42528E48654q8904j7277L9667J08482J73217K05868J64585J5543j66999k16156
$$ 548654 459750 442473 482140 590622 763839 969707 1134292 1149835 982836 766680
42518G66680q9947L5445J5577m0324M0707J95716K13811N2764j24172j84567j37140
$$ 766680 676733 712178 727755 687431 728138 923854 1137665 1190429 1066257 881690 744550
42507G44550n2852j4744p8082j59518q2029J37766K22701M4013j11999L9921L01188
$$ 744550 691698 676954 598872 439354 357325 495091 717792 761805 649806 689727 990915
42496I90915K81094J9657j04399q135J7175j28955j84395k1250J19366N7227m2333
$$ 990915 1272009 1291666 1187267 1179132 1196307 1067352 882957 861707 981073 1038300 995967
42485I95967j1158L3873l4484r4544k8562L2497l4767q3394M6316K07725J63034
$$ 995967 984809 1018682 984198 889654 861092 893589 858822 775428 821744 1029469 1192503
42474A192503l5078j46117j13301p6274r0113p4012p603K7142q51k6717O26O2221
$$ 1192503 1157425 1011308 898007 821733 731620 657608 650005 677147 676296 649579 650205 712426
42462G12426J05051P6410k3582q8562p169J43115J51115j1119j06397J4509J62424
$$ 712426 817477 893887 870305 781743 774574 917689 1068804 1057685 951288 965797 1128221
42451A128221Q9635j30561k20411r9540N2031R1724O5958N4552M0724q351m6299
$$ 1128221 1217856 1087295 866884 767344 819375 911099 977057 1031609 1072333 1063982 1017683
42440A017683l634J01736J53832N3494j45929k53057j49336M7744J26784N2737
$$ 1017683 1014049 1115785 1269617 1323111 1177182 924125 774789 822533 949317 1002054
42430A002054l9202q7152j47322j88901q0303J42927K29695O6829j22322r4195
$$ 1002054 962852 875700 728378 539477 459174 602101 831796 898625 776303 682108
42420F82108P9985J76596J54447J18250P7024l2080j57284j84129j27339q5397
$$ 682108 762093 938689 1093136 1211386 1288410 1256330 1099046 914917 787578 702181
42410G02181n2761L6342J20160O7159q7696j57534p5499K1060J9809j0301L4874
$$ 702181 649420 685762 805922 873081 785385 627851 552352 573412 593221 582920 617794
42399F17794J13408J02412j1546r5730k8413J50959K78720K51734J30922K5010
$$ 617794 731202 833614 822068 726338 697925 848884 1127604 1379338 1510260 1535270
42389A535270o4114j76696k25447o9281K15932L34827J44844j31422k08516j17647
$$ 1535270 1471156 1294460 1069013 999732 1215664 1550491 1695335 1563913 1355397 1237750
42379A237750j01878k19826k68081j02321J40424K09382M2116j64456j67760N4328
$$ 1237750 1135872 916046 647965 545644 686068 895450 937566 773110 605350 659678
42369F59678K67300K43663L8725q5608r985J02332O2654q7666j80901j66387j16199
$$ 659678 926978 1170641 1209366 1123758 1113773 1216105 1278759 1191093 1010192 843805 727606
42358G27606o2599K5625J31085J76431J33143O0512K7211M4780P6773P8265L4760
$$ 727606 665007 690632 821717 998148 1131291 1191803 1219014 1263794 1340567 1418832 1453592
42347A453592j7768k8310N713L5194J7744m7405j23543j42993n3864Q9002J42168
$$ 1453592 1435824 1407514 1413227 1448421 1466165 1418760 1295217 1152224 1098360 1187362 1329530
42336A329530N1769o7856j18852j64260k56543k68174r7605R1617J00586M4541
$$ 1329530 1381299 1313443 1194591 1030331 773788 505614 408009 499626 600212 644753
42326F44753J51063L05788J97394j17802k47307j02141k3501j46489j46853J40619
$$ 644753 795816 1101604 1298998 1181196 933889 831748 808247 661758 514905 655524
42316F55524L42555J33123k20044l02140j85894j69558j85704J2495K80326K38624
$$ 655524 998079 1131202 911158 609018 423124 253566 67862 80357 360683 599307
42306E99307q4604k68079j36348O2335J31670J55435J89070J18127n7348j24677
$$ 599307 514703 246624 110276 172611 304281 459716 648786 766913 709565 584888
42296E84888J4010J69188J45333n532j10368q6518M4259K04063K74733J96593
$$ 584888 598898 768086 913419 907887 797519 711001 755260 959323 1234056 1430649
42286A430649O5772J1499Q188m3803j09397q2520j0752l7206j39914j55448o2363
$$ 1430649 1496421 1507920 1516108 1472305 1362908 1280388 1269636 1232430 1092516 937068 874705
42275H74705j2606n6978o5527K2842P8388n238j37740j67997p8368L6860J07013
$$ 874705 862099 805121 739594 762436 840824 835586 697846 529849 451481 488341 595354
42264E95354J33035J39517J19613L9515p8776j12865J8248J80035J52505m1577
$$ 595354 728389 867906 987519 1027034 948258 835393 853641 1033676 1186181 1144604
42254A144604j38633k2444J20953J27986P5943M7358l4967j62858j43195L6549
$$ 1144604 1005971 983527 1104480 1232466 1308409 1355767 1320800 1157942 1014747 1051296
42244A051296P7494j22253j95457R5360L63138J80234j74411j39292J98098K51610
$$ 1051296 1128790 1006537 811080 906440 1269578 1449812 1275401 1136109 1334207 1585817
42234A585817j01726l84362l30088j78415r1719Q5110L35299L36002L0721j85990
$$ 1585817 1484091 1099729 769641 591226 499507 584617 919916 1255918 1286639 1100649
42224A100649r0194M3406k3026r3172L6915J75828R0491p6772p0715O3083J14563
$$ 1100649 1010455 1053861 1030835 937663 974578 1150406 1240897 1164125 1093410 1156493 1271056
42213A271056M0837p1931j76591k15091j10814N3652Q7719J9227P4898K39274
$$ 1271056 1311893 1239962 1063371 848280 737466 791118 878837 898064 972962 1212236
42203A212236J99159j17901l38401j95590P7134J53873P0087J082p1434j67646
$$ 1212236 1411395 1293494 955093 759503 836637 990510 1060597 1061679 990245 822599
42193H22599j03679J84980L89288K42427m5723j07943M3701J42066J27262J25909
$$ 822599 718920 903900 1293188 1535615 1489892 1381949 1425650 1567716 1694978 1820887
42183A820887J20984q45j65265j86332o3903M5530P7692O2352k1517j77550k78239
$$ 1820887 1941871 1941026 1775761 1589429 1525526 1571056 1648748 1711100 1689583 1512033 1233794
42172A233794k14897o4373M6472J07447J21206K0621j53635k03703p3916L0884
$$ 1233794 1018897 954524 1000996 1108443 1229649 1250270 1096635 892932 819016 849900
42162H49900J857K1777J83607K28208l1881l16950k71929j0056J21582J02823
$$ 849900 851757 873534 1057141 1285349 1253468 936518 664589 654533 776115 878938
42152H78938J44241K07819Q8617j20638j07896J33204K71569J51848l2628j17040
$$ 878938 1023179 1230998 1319615 1198977 1091081 1224285 1495854 1647702 1615074 1498034
42142A498034j65890k25251j83279J1568K17323K76981J79839J2932j20126j46474
$$ 1498034 1332144 1106893 923614 935182 1152505 1429486 1609325 1622257 1502131 1355657
42132A355657j05449j22028j95932j52085N8104J94121P4718j05185p3024Q5807
$$ 1355657 1250208 1128180 932248 780163 838267 1032388 1107106 1001921 928897 1014704
42122A014704J04478n237k0118P2981Q2907j9795q4508q4441j14924j35138l4571
$$ 1014704 1119182 1113945 1093827 1166808 1249715 1229920 1145412 1060971 946047 810909 776338
42111G76338R4485Q1171R422O9946J50847k550k51575j72755K32659M31332J35289
$$ 776338 870823 951994 961416 1031362 1182209 1179659 928084 755329 987988 1419320 1554609
42100A554609k58056k63392K1412J62689M7095o2664l774P3641j9022k20725k83081
$$ 1554609 1296553 1033161 1054573 1217262 1264357 1201693 1197919 1271560 1252538 1031813 748732
42089G48732p4091K24667K88619N4202j64634q5536J48166J91208J0968j00820
$$ 748732 674641 899308 1187927 1242129 1077495 991959 1140125 1331333 1342301 1241481
42079A241481j1J22641P1296r4637k08298j99377q2491Q3448J76428J10202k6431
$$ 1241481 1241470 1364111 1435407 1340770 1132472 933095 850604 934052 1110480 1220682 1194251
42068A194251p8880n4255o3507q4497j1019R3731N4611j00821j47380q119J53793
$$ 1194251 1115371 1061116 997609 913112 902093 995824 1050435 949614 802234 794115 947908
42057I47908K11743J92315J00761r2260k59097k06024j0030L7778j04427j45703
$$ 947908 1159651 1351966 1452727 1360467 1101370 895346 885316 923094 818667 672964
42047F72964N1710K40448K06225R6352J11551J53529M5060j19811j28251R84Q2465
$$ 672964 724674 965122 1171347 1267699 1379250 1532779 1577839 1458028 1329777 1330761 1413226
42036A413226O8023M2343J014j24559k60978k37720n0713R8631O9928m1483n3454
$$ 1413226 1481249 1523592 1524606 1400047 1139069 901349 850636 949267 1019195 977712 924258
42025I24258O4923J75092J57818M7809m9239j13329j87081k19087r3880J25928
$$ 924258 989181 1164273 1322091 1369900 1320661 1207332 1020251 801164 707284 833212
42015H33212J78479l0242k11501o3915K71930L93707J96382l4973p0099J6915
$$ 833212 1011691 981449 769948 706033 977963 1371670 1568052 1533079 1462980 1479895
42005A479895P5548Q9989Q5564L7908m3483j01644j39244j85759j66899L6J91437
$$ 1479895 1555443 1645432 1730996 1768904 1725421 1623777 1484533 1298774 1131875 1131911 1323348
41994A323348J83889j1681j51937j20527m8411l8348j7223O4750J13858O3438
$$ 1323348 1507237 1495556 1343619 1223092 1174681 1136333 1119110 1183860 1297718 1361156
41984A361156j8109n9146o2489j7272R6255J97657J77745P5389N743m1002j15944
$$ 1361156 1343047 1283901 1221412 1204140 1300395 1498052 1675797 1751186 1756929 1715927 1599983
41973A599983j10239P7577K50007J38562j18613j29981J14320K07791j900j80572
$$ 1599983 1489744 1567321 1817328 1955890 1837277 1707296 1821616 2029407 2027507 1846935
41963A846935r7653J9344m6208j11396K0879J60162O1537j33992j48242k5979
$$ 1846935 1749282 1768626 1722418 1611022 1631901 1792063 1853600 1719608 1571366 1545387
41953A545387l914r8654j45442j09555p3481l3005M1184N7598m5000j21228k1250
$$ 1545387 1541473 1442819 1297377 1187822 1114341 1081336 1122520 1180118 1135118 1013890 992640
41942I92640J47478J80458Q2994N57m0549r3384r2530N6708K43677K38146R016
$$ 992640 1140118 1320576 1403570 1404127 1363578 1270194 1177664 1234372 1478049 1716195 1725211
41931A725211k20960k54758j27493j2998o297l3205K5942J35038J15764o6277
$$ 1725211 1504251 1249493 1122000 1109002 1102705 1069500 1095442 1230480 1346244 1279967
41921A279967j72385k8980J49767O2336j69662j70093N9676J29403p0870j77990
$$ 1279967 1107582 1078602 1228369 1290705 1121043 950950 1010626 1140029 1069159 891169
41911H91169J1461J95266J06866l4809N3050K17111J65869k6359r9192n9943p9735
$$ 891169 902630 1097896 1204762 1169953 1223003 1440114 1605983 1579624 1480432 1420489 1340754
41900A340754j16641j2169J59472J76467K9080q3432n5742M0483J05045P5982
$$ 1340754 1224113 1211944 1371416 1547883 1576963 1493531 1437789 1478272 1583317 1659299
41890A659299n1405j51473o6325J25624J56836j1109j00833J1572P9703o0591
$$ 1659299 1607894 1456421 1390096 1515720 1672556 1661447 1560614 1572186 1651889 1591298
41880A591298j85061r6575J0557p1275j54345M024K48419K98548K03883J39210
$$ 1591298 1406237 1309662 1320219 1248944 1094599 1098623 1347042 1645590 1849473 1988683
41870A988683K7592k12016l20734p7836K20301J64445r3154j00822J33105K16358
$$ 1988683 2016275 1804259 1483525 1405689 1625990 1790435 1697281 1596459 1729564 1945922
41860A945922Q9559O2540J70393J00235j81382k96450q3346J43344J28982L2078
$$ 1945922 2035481 2098021 2268414 2368649 2187267 1890817 1807471 1950815 2079797 2111875
41850B111875M6417O0290p4906k40251k48463j36688o6211p5491p8793k0474N4957
$$ 2111875 2158292 2218582 2143676 1903425 1654962 1518274 1452063 1376572 1297779 1277305 1332262
41839A332262M8993o3791j31507K8770L15853L85645J43315p0279O46J21564k006
$$ 1332262 1381255 1317464 1185957 1214727 1530580 1916225 2059540 1989261 1989907 2111471 2109465
41828B109465j92052j19001R4056Q2339j18009j56992J0536J14022J00446J48618
$$ 2109465 1917413 1798412 1892468 1974807 1856798 1699806 1710342 1824364 1924810 2073428
41818B073428J95360J426l02567k98877K3922K06713N2285j12041m2273P7178
$$ 2073428 2268788 2270214 1967647 1668770 1692692 1899405 1951690 1839649 1797376 1874554
41808A874554P6336Q1120J34299K0464k72901l76144j15583J45775P1542j21626
$$ 1874554 1950890 2032010 2166309 2186773 1913872 1537728 1422145 1567920 1639462 1517836
41798A517836o2855J68817K33974R2774j3867M678K6439L182J3324O3834O8655
$$ 1517836 1454981 1623798 1857772 1950546 1936679 1941357 1967796 1970978 1984302 2048136 2116791
41787B116791J2620k7165j4103J765m3016j56039k58099k22302k1294J86434K25391
$$ 2116791 2129411 2102246 2088143 2089908 2046892 1890853 1632754 1410452 1389158 1575592 1800983
41776A800983J21822K5198k3873p2879p4519N0186K02164J92015K6374j08382
$$ 1800983 1922805 1948003 1924130 1851251 1776732 1826918 2029082 2221097 2247471 2139089
41766B139089j25326q9994m3596J571l8975j78856k09259K2209K84000K45165
$$ 2139089 2013763 1923769 1880173 1881744 1842769 1663913 1454654 1476863 1760863 2006028
41756B006028j2728j46364j14890j45960k03109j5292L28539L67880K063k75659
$$ 2006028 1993300 1846936 1732046 1586086 1382977 1367685 1696224 2064104 2066167 1790508
41746A790508j00671K44365K96035L3516k32104l03114j89624R439J33333O8709
$$ 1790508 1689837 1934202 2230237 2263753 2031649 1728535 1538911 1548350 1681683 1750392
41736A750392n8631k3472J21859J04830r1124j68259j7118J09097N4655R144J19260
$$ 1750392 1691761 1668289 1790148 1894978 1803854 1635595 1618477 1727574 1782229 1791373 1910633
41725A910633K15074J29734k3243q8320r9599j08898o2076J1833k7714j54959
$$ 1910633 2125707 2255441 2232198 2143878 2044279 1935381 1873305 1885138 1857424 1702465
41715A702465j69108n2166k433l6654N1938K43254K34169k1754j63699l59J96853
$$ 1702465 1533357 1481191 1478758 1442104 1494042 1737296 1971465 1949711 1786012 1785653 1982506
41704A982506J81842Q0199K7402r2187k89725k96761l3317J65171P8849n1205
$$ 1982506 2164348 2244547 2271949 2179762 1890037 1593276 1559959 1725130 1803979 1752774
41694A752774R68O0579l2868o9571R4773J72518o4202l10761j99184R8202J90774
$$ 1752774 1753742 1814321 1781453 1711882 1806655 1979173 1914971 1604210 1405026 1503228 1694002
41683A694002R4316P3591J24629P6019r670K3901O7985o0596k30326j71894R5211
$$ 1694002 1788318 1861909 1986538 2062557 2052887 2076788 2144773 2084177 1853851 1681957 1777168
41672A777168L26933L85061K45414r0516m24394l91430K5253L16690J31461j86639
$$ 1777168 2104101 2489162 2734576 2644060 2219666 1828236 1853489 2170179 2301640 2115001
41662B115001j43039J50538K37899O7585l9619R445K0674n4795q2740o6237j10481
$$ 2115001 1971962 2122500 2360399 2427984 2388365 2397810 2418484 2363689 2280949 2214712 2104231
41651B104231j45850l7392J24128J60621J11118R2916K6070j72496k98046j24869
$$ 2104231 1958381 1920989 2045117 2205738 2316856 2409772 2435842 2263346 1965300 1840431
41641A840431J83501K84014J42362j1308o5827n5499K9056J45746J02229j39271
$$ 1840431 2023932 2307946 2450308 2439000 2373173 2317674 2346730 2492476 2594705 2455434
41631B455434k74361r7909J15625L9780j57636j22631O7564P3484r5715j32604
$$ 2455434 2181073 2083164 2198789 2238569 2080933 1958302 2025866 2099350 2003635 1871031
41621A871031J1906Q5179n264q7708n0538N4590J67975K12000O3397k03643k54946
$$ 1871031 1882937 1968116 1962852 1875144 1824606 1879196 2047171 2259171 2322568 2118925 1863979
41610A863979K8493K68511J31691j24534o7275K05989K54362k565k42562k64796
$$ 1863979 1892472 2160983 2292674 2168140 2100865 2306854 2561216 2558651 2316089 2051293
41600B051293j24397J18063L70489L80275L6374l39548l72038j32164Q0174K09794
$$ 2051293 1926896 2044959 2415448 2795723 2832097 2492549 2120511 1988347 2068521 2278315
41590B278315L22488K89046L4547j57845m5777J28494M1194j58522j66615o8454
$$ 2278315 2600803 2889849 2924396 2766551 2720774 2849268 2890462 2731940 2565325 2496871
41580B496871n5700L6355L31977M40450M7516l80999k36259K12268K48878j04371
$$ 2496871 2441171 2477526 2809503 3249953 3297469 2916470 2680211 2892479 3141357 3036986
41570C036986k23442j4224L2102j61722j52038J04763J40333j09396j49843J45229
$$ 3036986 2813544 2799320 2831422 2669700 2517662 2622425 2762758 2653362 2503519 2648748
41560B648748K84473N3127j28565k472J02217n7248j96594o4444J22451J13896
$$ 2648748 2933221 2986348 2857783 2855311 2957528 2900280 2703686 2639242 2761693 2875589
41550B875589J4887j8946m8724j17307j31791j00336j18359r6136R7691K74176
$$ 2875589 2890476 2871530 2822806 2705499 2573708 2473372 2355013 2258877 2356568 2630744
41540B630744J68207n5647o3314L1559p8184j98010P2647M85250M19546m1187
$$ 2630744 2798951 2743304 2679990 2711549 2633365 2435355 2508002 2993252 3412798 3371611
41530C371611k03497N6616J48604j06671j90389P2809J69387j01007k23188N2236
$$ 3371611 3168114 3224730 3373334 3266663 3076274 3149083 3318470 3217463 2994275 3046511
41520C046511K25647j3611k21337n9198Q8902j00939k48990M342L06290K27045
$$ 3046511 3272158 3258547 3037210 2978012 3066914 2965975 2716985 2721327 3027617 3254662
41510C254662l813J2273J39941O7048r6458j05491n2565q6196n8856J23131K05162
$$ 3254662 3250849 3263122 3403063 3470111 3373653 3268162 3215597 3129401 3070545 3193676 3398838
41499C398838L0999j24986l2577J06076P5750J4724M2758j1165j85590j72365
$$ 3398838 3429837 3304851 3272274 3378350 3454100 3468824 3511582 3500417 3314827 3142462
41489C142462J36714L62754K35904J4556j1046L5646k0594p0116m0617q8497k07551
$$ 3142462 3279176 3641930 3877834 3892390 3881344 3916990 3896396 3826280 3785663 3697166 3489615
41478C489615j37854J07541J65001j9536n5683J46274J68793j07645k15208M9362
$$ 3489615 3351761 3459302 3624303 3604767 3549084 3695358 3864151 3756506 3541298 3590660
41468C590660K19813Q301j71435J0719J96481L2255j82907p7243J47844J61356
$$ 3590660 3810473 3818774 3647339 3658058 3854539 3886794 3703887 3626644 3774488 3935844
41458C935844N6931J3641o3989j77153p4122J93296J86040j25880j99513J11821
$$ 3935844 3992775 4006416 3942427 3765274 3691152 3884448 4070488 3944608 3745095 3856916
41448C856916K35306p6587k57769K3086K35391l562j99099O3567L15111J06495
$$ 3856916 4092222 4015635 3757866 3780952 4016343 4012781 3813682 3877249 4192360 4298855
41438D298855j26572Q3039L11345M1667l36797k18215J72417K78278J57081J17741
$$ 4298855 4172283 4255322 4566667 4608334 4271537 4053322 4225739 4504017 4661098 4778839
41428D778839J9272k72771l48547M1206L72723K03631m2380Q9028K25766j7956
$$ 4778839 4798111 4525340 4176793 4217999 4590722 4794353 4751973 4841001 5066767 5048811
41418E048811j84170J40327L94371K5338m01052j85640J90198m8748m94304k83546
$$ 5048811 4864641 5004968 5399339 5424677 5023625 4837985 5028183 4979435 4485131 4201585
41408D201585L09471L84489K1068j2310K43244J21204k78547k50171J51880K09692
$$ 4201585 4511056 4895545 4916613 4904303 5147547 5268751 4990204 4740033 4891913 5101605
41398E101605j15981j73605J27785K18542k7697j63031p9215o2201m9896K08345
$$ 5101605 4985624 4812019 4939804 5158346 5130649 4967618 4888403 4826202 4776306 4984651
41388D984651M25663J67033k48954j95696J64781K00158o3692j25891j1731p4985
$$ 4984651 5410314 5577347 5328393 5132697 5297478 5497636 5433944 5308053 5296322 5221337
41378E221337j34393J50965M07896J29701k63466p7059L62197K70329j49025j14541
$$ 5221337 5086944 5237909 5645805 5775506 5512040 5434981 5797178 6067507 5918482 5803941
41368E803941K53405K15865j40273j22370J75047R1680k28213r7429L07284K33830
$$ 5803941 6057346 6273211 6132938 6010568 6185615 6277295 6049082 5951653 6258937 6492767
41358F492767j59983p8403L45574K71502k10025k16943K37357K73246j69998k53392
$$ 6492767 6332784 6254381 6599955 6871457 6661432 6444489 6681846 6955092 6785094 6531702
41348F531702J38000K44728n1663r7075J18530m0025m11936j83346M83391N75568
$$ 6531702 6669702 6914430 6862767 6765692 6884222 6844197 6432261 6248915 6732306 7307874
41338G307874M6797j31694J97659J95074k24660k08116K97875L85045l0373l7769
$$ 7307874 7354671 7222977 7420636 7615710 7391050 7182934 7480809 7865854 7835481 7797712
41328G797712M26878L99410j81214k41328L81000N67616K1652j88797L07031N02390
$$ 7797712 8224590 8624000 8442786 8201458 8582458 9150074 9171726 8982929 9289960 9792350
41318I792350j8864l32988l4300L6497l98182l92131L33097O86506J90962j42333
$$ 9792350 9773486 9440498 9406198 9442695 9044513 8652382 8985479 9671985 9862947 9720614
41308I720614K60461N26659J08268j87441J82176N19234L51635K16901K47921
$$ 9720614 9981075 10507734 10616002 10428561 10610737 11129971 11481606 11698507 11946428
41299A1946428k73782j218759j303308k74926M57027J79832n8421M13878P02234
$$ 11946428 11672646 10453887 9150579 8875653 9332680 9512512 9454091 9867969 10570203
41290A0570203K60234p383L94543N39273j1670k30392L70950O98969J22223l86043
$$ 10570203 10830437 10823054 11217597 11756870 11745200 11514808 11885758 12584727 12706950 12320907
41280A2320907j89785q1726m20434k70916N50630P51175l9325l87716L30549P94274
$$ 12320907 12131122 12049396 11628962 11358046 11908676 12659851 12620526 12232810 12563359 13357633
41270A3357633L33655J60007P81598Q29663j70244n71584L54989R30471K10527
$$ 13357633 13691288 13851295 14632893 15462556 15292312 14720728 15075717 16006188 16216715
41261A6216715k37546N73257J110958L57189j77016N36586R94233J98208k84637
$$ 16216715 15979169 16552426 17663384 18020573 17843557 18380143 19374376 19572584 19287947
41252A9287947N58052J112610L70406q680R03537J282734K62817k6205J370900
$$ 19287947 19845999 20958609 21329015 21320335 22223872 23506606 23769423 23743218 25114118
41243B5114118J987237N84650j79802J252946K190180Q70658K2701J510393K473919
$$ 25114118 27101355 27686005 27506203 28759149 30949329 31819987 31842688 33353081 35827000
41234C5827000R79391J82833K202604L496876J579873L40130K760983M727952
$$ 35827000 36806391 36989224 39191828 42688704 44268577 44608707 47369690 52097642
41226E2097642K790254J270154L963998O086397L412112J587851N782765R410153
$$ 52097642 54887896 56158050 60122048 66208445 69620557 71208408 76991173 86401326
41218H6401326N771977K125195O881751J2235463Q860178P866199K0931690K4743194
$$ 86401326 92173303 94298498 101180249 113415712 122275890 130142089 151073779 175816973
41210A75816973j7901787r4278383j36352137j00351002k3377814K5231572K6190021
$$ 175816973 157915186 63636803 -72715334 -173066336 -196444150 -171212578 -145022557
41203a45022557J3426381J2647736J5102272R484010L879351O465081R812934
$$ -145022557 -131596176 -118948440 -103846168 -94362158 -90482807 -84017726 -74204792
41196g4204792O397923K040687L352105N790051L779194J135220K563205M511543
$$ -74204792 -67806869 -65766182 -62414077 -56624026 -52844832 -51709612 -49146407 -44634864
41188d4634864K666251K41203J289889L031501J791440Q4018J239343K828495
$$ -44634864 -41968613 -41727410 -40437521 -37406020 -35614580 -35530562 -34291219 -31462724
41180c1462724J643815n9858Q15196K198322J106684n21427K83458J827280J231771
$$ -31462724 -29818909 -29878767 -29063571 -26865249 -25758565 -26279992 -25996534 -24169254 -22937483
41171b2937483o9303N43386J597676M45155j473238j184593M97411Q39339J48649
$$ -22937483 -23006786 -22463400 -20865724 -20420569 -21893807 -23078400 -22580989 -21741650 -21593001
41162b1593001M75918J341656R50740l2226J85722R69421O20703k18912P2293
$$ -21593001 -21117083 -19775427 -18824687 -18856913 -18671191 -17701770 -17081067 -17299979 -17227686
41153a7227686Q35860N04130k39704J46558R43210N56430l47390j54428N70198
$$ -17227686 -16391826 -15887696 -16127400 -15980842 -15037632 -14481202 -14828592 -14983020 -14412822
41144a4412822K94804l99600J9414R44206P19724j69128J2258R88178R99135l6676
$$ -14412822 -14118018 -14517618 -14498204 -13553998 -12834274 -13003402 -12991144 -12002966 -11003831 -11040507
41134a1040507o04742l34529j57516j95844J84394O68450M71838J0606J49629
$$ -11040507 -11645249 -11979778 -12137294 -12333138 -12148744 -11480294 -11008456 -10997850 -10848221
41125a0848221M66111J49770k26890K09859P49487L40438l05516k4403M32490
$$ -10848221 -10382110 -10232340 -10459230 -10249371 -9499884 -9159446 -9464962 -9489365 -9056875
41116i056875k97748j470021j324803j36649L72818M5893J43613O74108M75126
$$ -9056875 -9354623 -10824644 -12149447 -12286096 -11913278 -11867385 -11723772 -11049664 -10574538
41107a0574538k98691l08848M39990O07623L0672r2255M28893M85046j09803k78879
$$ -10574538 -10873229 -11182077 -10742087 -10134464 -10103792 -10196047 -9767154 -9282108 -9391911 -9670790
41097i670790K14927L87595P643k5924M37471M53182j52322l83944Q7645M00851
$$ -9670790 -9455863 -9068268 -9060625 -9086549 -8649078 -8195896 -8348218 -8732162 -8644517 -8243666
41087h243666J67325L6379K60488K59159o7064q8459K14345J35649l02608k72395
$$ -8243666 -8076341 -8039962 -7779474 -7520315 -7587379 -7675838 -7461493 -7325844 -7628452 -7900847
41077g900847K64762L95167o3609k33505J73981L80262O1315j12761J48914K41627
$$ -7900847 -7636085 -7240918 -7304527 -7538032 -7364051 -6983789 -6922474 -7035235 -6886321 -6644694
41067f644694p1140k07392L0364Q7828j50055q2646L49794M24253J327j60593
$$ -6644694 -6715834 -6923226 -6892862 -6805034 -6955089 -7037735 -6687941 -6263688 -6262361 -6422954
41057f422954J77177L06211m2467j96486J21609K50423j10166l08619r49K07302
$$ -6422954 -6245777 -5939566 -5982033 -6178519 -6056910 -5806487 -5916653 -6225272 -6226221 -6018919
41047f018919l9586j69409J75082M13802J02641k73859k15357J3178Q2800J77171
$$ -6018919 -6058505 -6227914 -6052832 -5639030 -5536389 -5810248 -6025605 -6012427 -5929627 -5752456
41037e752456L42712J82789k76832l43728J83373N33033J96201k62203k17992
$$ -5752456 -5409744 -5226955 -5503787 -5847515 -5664142 -5131109 -4934908 -5197111 -5415103
41028e415103N6641P8626r726P1209J30866r077p0454J17343K30898P7851l2406
$$ -5415103 -5358462 -5279836 -5289562 -5218353 -5087487 -5096564 -5167018 -5049675 -4818777 -4740926 -4773332
41017d773332O4527N3175j82019k66273q3319m5838k52052j98580K50163M65737
$$ -4773332 -4708805 -4655630 -4837649 -5103922 -5187241 -5233079 -5485131 -5683711 -5433548 -4967811
41007d967811J16883k19275n3797K18937J14392j16540p4154P1605M9927L0453
$$ -4967811 -4850928 -5070203 -5124000 -4905063 -4790671 -4907211 -4981365 -4909760 -4859833 -4829380
40997d829380J46512J28754p4553j4119M02865N33801O5590l30576r0416K73361
$$ -4829380 -4682868 -4554114 -4628667 -4642786 -4239921 -3706120 -3640530 -3971106 -4061522 -3788161
40987c788161Q4284l23850k44140J65076K22360j00521k45108m3398J67704K12326
$$ -3788161 -3703877 -4027727 -4271867 -4106791 -3884431 -3984952 -4230060 -4273458 -4105754 -3893428
40977c893428J74846K8323k31144k96070L5467L83037K75119j13851k56627p6065
$$ -3893428 -3718582 -3690259 -3921403 -4217473 -4182006 -3798969 -3523850 -3637701 -3894328 -3970393
40967c970393Q2777Q1070N8322L4534p1607j50065m6259J20417J38809N4597K3495
$$ -3970393 -3887616 -3806546 -3748224 -3713690 -3785297 -3935362 -3981621 -3861204 -3722395 -3667798 -3644303
40956c644303Q234p3815j10825L7J20515J06094M4244L0954j7550j13743p8218
$$ -3644303 -3636069 -3709884 -3820709 -3820672 -3700157 -3594063 -3549819 -3518865 -3536415 -3650158 -3728376
40945c728376J03558J53232l0264j44225J3243J96097J49320J4068M996N6027
$$ -3728376 -3624818 -3471586 -3501850 -3646075 -3632832 -3436735 -3287415 -3273347 -3268351 -3212324
40935c212324O4599J07057J54421o013l09142l42460k1621J77425n815j55797
$$ -3212324 -3147725 -3040668 -2886247 -2892260 -3201402 -3543862 -3565483 -3388058 -3393873 -3549670
40925c549670Q9649L88132K72902q7448k46792j94721j71670j26345R4914L02401
$$ -3549670 -3460021 -3071889 -2798987 -2886435 -3133227 -3327948 -3499618 -3625963 -3531049 -3228648
40915c228648K22650k1121j25172p3868j5355O5669J91088J93447K3549n2923
$$ -3228648 -3005998 -3027119 -3152291 -3226159 -3241514 -3175845 -2984757 -2791310 -2767761 -2820684
40905b820684J06644K32515J17999l694Q7379J73332R014k42293l58974m25163
$$ -2820684 -2714040 -2481525 -2363526 -2367220 -2279841 -2106509 -2097495 -2339788 -2698762 -3123925
40895c123925m76382k64881K01688M04796Q9130k20800k2872L51166L35120N7003
$$ -3123925 -3600307 -3865188 -3663500 -3258704 -3169574 -3390374 -3413246 -3062080 -2726960 -2669957
40885b669957q473J02725M5400j19838j14340m7401j56598k28998L6929L62846
$$ -2669957 -2678430 -2575705 -2530305 -2650143 -2764483 -2811884 -2968482 -3197480 -3160551 -2797705
40875b797705K78991o2025j56592j0846j9264j75615j32030Q6900J31028q393
$$ -2797705 -2518714 -2580739 -2737331 -2748177 -2767441 -2943056 -3075086 -2988186 -2857158 -2865551
40865b865551l4470M7710q144j25419k8711J74540J57916J166K0569J15455l7749
$$ -2865551 -2900021 -2852311 -2860455 -2985874 -3014585 -2840045 -2682129 -2680963 -2660394 -2544939 -2582688
40854b582688k67985j24020K62949K99187p7360k81635m6496K21899K01346R0503
$$ -2582688 -2850673 -2974693 -2711744 -2412557 -2489917 -2771552 -2818048 -2596149 -2394803 -2304300
40844b304300Q9667N3327j02821j64176j8272J28057J08552R253q0456j72937
$$ -2304300 -2214633 -2161306 -2264127 -2428303 -2446575 -2318518 -2209966 -2200713 -2281169 -2454106
40834b454106j96810p0224M6625m5540j84004p4566J56334J35285r0267j01189
$$ -2454106 -2650916 -2721140 -2674515 -2720055 -2904059 -2978625 -2822291 -2687006 -2777273 -2878462
40824b878462J80112L70726K60988N0770r4383k22677k83651j26458J35401K13870
$$ -2878462 -2698350 -2327624 -2066636 -2015866 -2110249 -2332926 -2616577 -2743035 -2607634 -2393764
40814b393764J17474Q1721P5505j04422k99776j48727K21586K88134k3941k21064
$$ -2393764 -2276290 -2194569 -2119064 -2223486 -2523262 -2671989 -2450403 -2162269 -2186210 -2407274
40804b407274p0243Q0117k9593j74960j28150m206O7634J37180J53706j9368k05135
$$ -2407274 -2477517 -2397400 -2426993 -2601953 -2730103 -2734309 -2666675 -2529495 -2375789 -2395157 -2600292
40793b600292n9242K83337K91183r7047l09691m6936K72185K32792O054r8700
$$ -2600292 -2659534 -2376197 -2085014 -2182061 -2491752 -2538688 -2266503 -2033711 -2027657 -2126357
40783b126357j18401j43795m3996J79932K23221j6570j89158m9035J55475J40030
$$ -2126357 -2244758 -2388553 -2432549 -2252617 -2029396 -2045966 -2235124 -2284159 -2128684 -1988654
40773a988654J4451l2262o9088j61220j63388l9265K13r0930n9586J50098K26629
$$ -1988654 -1974203 -2006465 -2075553 -2236773 -2400161 -2439426 -2439213 -2530143 -2589729 -2439631 -2213002
40762b213002N5165l9475J15426K12702L8051j37049p4637K0223l2966k6966J40215
$$ -2213002 -2157837 -2197312 -2081886 -1869184 -1831133 -1968182 -2042819 -2022596 -2055562 -2082528 -1942313
40751a942313J39998j74564l58559q3717K47504J60804r0780j6885K39624K14079
$$ -1942313 -1802315 -1976879 -2335438 -2419155 -2171651 -2010847 -2101627 -2118512 -1878888 -1664809
40741a664809k6889o1804R0579O3467j27202j35898J9854j0384k17427k14425
$$ -1664809 -1691698 -1753502 -1662923 -1599456 -1726658 -1862556 -1842702 -1853086 -2070513 -2284938
40731b284938N5494J99950N7961n5835O8960K07948J35844k3639q1894q3066j23632
$$ -2284938 -2229444 -2029494 -1971533 -2027368 -1958408 -1750460 -1614616 -1638255 -1720149 -1803215 -1926847
40720a926847j40770n6685O1736J15173R2040J3366r1802j34126n1206N1308K3819
$$ -1926847 -2067617 -2124302 -2062566 -1947393 -1855353 -1841987 -1933789 -2067915 -2119121 -2067813 -2043994
40709b043994p0475k4739J74898K94371J89148J2592q705J13457J52232l3870
$$ -2043994 -2114469 -2139208 -1964310 -1669939 -1480791 -1468199 -1476904 -1363447 -1211215 -1245085
40699a245085l03256l79839j93413K0090L7397m6197n386J23447J16834j3171
$$ -1245085 -1548341 -1928180 -2121593 -2101503 -2064106 -2110303 -2115689 -1992242 -1875408 -1888579
40689a888579j7651J33160J70845J2411p0858N4200J16752p8834k78222j96931
$$ -1888579 -1906230 -1773070 -1602225 -1589814 -1660672 -1606472 -1489720 -1568554 -1846776 -2043707
40679b043707R063M3400m0207k0516N8538K7782k8700P3693K38876K33966Q8883
$$ -2043707 -2034644 -1991244 -2031451 -2051967 -1993429 -1965647 -1994347 -1920654 -1681778 -1447812 -1358929
40668a358929M504j2371q0638j42541q0957j2093r7515j88335m9520J67415J10385
$$ -1358929 -1354425 -1366796 -1447434 -1589975 -1670932 -1683025 -1780540 -1968875 -2018395 -1850980 -1740595
40657a740595j65804k32113M5368K99477K26898j4472j20121m8670N0358R5072
$$ -1740595 -1906399 -2138512 -2093144 -1793667 -1566769 -1581241 -1701362 -1750032 -1699674 -1604602
40647a604602R7358P3541M2431K3260p804p5705j28640j00731k3865K5092M3554
$$ -1604602 -1507244 -1433703 -1391272 -1368012 -1375816 -1451521 -1580161 -1680892 -1704757 -1679665 -1636111
40636a636111P0392R5957R6124P4841L114j53695k79345j73443J17306K68402
$$ -1636111 -1565719 -1469762 -1373638 -1298797 -1295683 -1449378 -1728723 -1902166 -1784860 -1516458
40626a516458J29362n4064o2038m7128j86379k85125r3565K15823K87778J25397
$$ -1516458 -1387096 -1441160 -1503198 -1550326 -1736705 -2021830 -2115395 -1899572 -1611794 -1486397
40616a486397k787l6410r2523j06395N1828K05748P8765j91466k08202M7898K10311
$$ -1486397 -1489184 -1525594 -1618117 -1724512 -1672684 -1466936 -1388171 -1579637 -1787839 -1739941 -1529630
40605a529630J51931J22434K04695J40050j57871l73384k77872o4293K1036L8605
$$ -1529630 -1377699 -1255265 -1050570 -910520 -1068391 -1441775 -1719647 -1783940 -1762904 -1724299
40595a724299J16969J54137J8990j66088j89517n6882N7295O2710K2411M2537
$$ -1724299 -1607330 -1453193 -1434203 -1600291 -1789808 -1846690 -1789395 -1726685 -1704274 -1661737
40585a661737J60165K71450J88649j07692l34448k22129Q6653K03910L3293j45810
$$ -1661737 -1501572 -1230122 -1041473 -1149165 -1483613 -1705742 -1619089 -1415179 -1381886 -1527696
40575a527696j39844p3643r0548j16314m6876O2710J18574J12667M9149p1509
$$ -1527696 -1667540 -1741183 -1831731 -1948045 -1994921 -1932211 -1813637 -1700970 -1651821 -1723330
40565a723330j46695n0119J43342K21401J52269J06141J30761P5953r1130j72790
$$ -1723330 -1870025 -1920144 -1776802 -1555401 -1403132 -1296991 -1166230 -1090277 -1181407 -1354197
40555a354197n7802Q9518Q4728l4568j32113j51473q0135P8650K16937J88015
$$ -1354197 -1411999 -1322481 -1237753 -1272321 -1404434 -1555907 -1636042 -1557392 -1340455 -1152440
40545a152440K6878p9493q0114r9760j54822r2442J07509K35166J68201L9346
$$ -1152440 -1125562 -1205055 -1285169 -1384929 -1539751 -1632193 -1524684 -1289518 -1121317 -1081971
40535a081971l3004j28466k88300l36290j29483J89901L67844L20456J13616j66890
$$ -1081971 -1114975 -1243441 -1531741 -1868031 -1997514 -1807613 -1439769 -1119313 -1005697 -1172587
40525a172587l78338l27010K283L33483L78249J53564r2946j88225j54160r4825
$$ -1172587 -1550925 -1877935 -1875652 -1542169 -1163920 -1010356 -1103302 -1291527 -1445687 -1540512
40515a540512o7818m5181L3592J45881J60602P546j84962k39147j51621l4123
$$ -1540512 -1608330 -1653511 -1619919 -1474038 -1313436 -1305890 -1490852 -1729999 -1881620 -1915743
40505a915743P6032J68791J35996o7049k26228j12183J48938K42996J39925O9170
$$ -1915743 -1839711 -1670920 -1534924 -1601973 -1828201 -1940384 -1791446 -1548450 -1408525 -1339355
40495a339355Q2913K4289r0062o8411N2764K7980j22559r9578J26501K11945J6911
$$ -1339355 -1256442 -1232153 -1322215 -1390626 -1337862 -1309882 -1432441 -1532019 -1405518 -1193573 -1176662
40484a176662j69923j43556n8069j1584J49596L81704L17118j02967l73528j75030
$$ -1176662 -1346585 -1490141 -1548210 -1559794 -1410198 -1028494 -711376 -814343 -1187871 -1362901
40474a362901J07957M4063j51514r9512J3559j79750m51877k92329J95124M07917
$$ -1362901 -1254944 -1210881 -1362395 -1461907 -1448348 -1628098 -2079975 -2372304 -2177180 -1769263
40464a769263J92630J5264J47348K93980J74975l8412p6073K4961P1519L791j14769
$$ -1769263 -1576633 -1561369 -1414021 -1120041 -945066 -983478 -1059551 -1034590 -963071 -959280 -1074049
40453a074049k01777j78246n1203L3127j3850n8726J1893L5924j38026k72410
$$ -1074049 -1275826 -1454072 -1505275 -1472148 -1485998 -1544724 -1532831 -1496907 -1634933 -1907343
40443a907343n3987L23158L63758L8602j58959O140J79722M3377j89404j70065
$$ -1907343 -1961330 -1638172 -1274414 -1235812 -1394771 -1388631 -1208909 -1165532 -1354936 -1525001
40433a525001M9655J76714J18160o302j07860j59398j28059m7634k2448m5241
$$ -1525001 -1475346 -1298632 -1180472 -1186774 -1294634 -1454032 -1582091 -1629725 -1652173 -1697414
40423a697414J7427J62873J95032N2020m8503M4987J58200P5041j24674k27033
$$ -1697414 -1679987 -1517114 -1322082 -1270062 -1318565 -1273578 -1115378 -1040337 -1165011 -1392044
40413a392044k02584j40156k9535J46541K42229J27463o1298r2407K1262Q9756
$$ -1392044 -1594628 -1734784 -1764319 -1617778 -1375549 -1248086 -1309384 -1401791 -1380529 -1290773
40403a290773O9932O4312O0344m2203j60569q3920J60464K79915J42272l4711
$$ -1290773 -1220841 -1156529 -1096185 -1138388 -1298957 -1382877 -1222413 -942498 -800226 -834937
40393h34937m5330K499o9977j79350j29175M2718J19913M7197k4407j5291j3487
$$ -834937 -880267 -877768 -947745 -1127095 -1256270 -1213552 -1093639 -1046442 -1070849 -1086140 -1099627
40382a099627o8707j00020p1470p5037j50584j84454r2892L4756R0966J12822
$$ -1099627 -1168334 -1268354 -1339824 -1414861 -1565445 -1749899 -1842791 -1808035 -1717069 -1604247
40372a604247J55456J36198j6227j56951q1563J54139K77830J64215l1979j26042
$$ -1604247 -1448791 -1312593 -1328820 -1485771 -1567334 -1413195 -1135365 -971150 -1003129 -1129171
40362a129171j09286o3747l0981k4166m1124k0392R1706K03256J52627m1240j68405
$$ -1129171 -1238457 -1302204 -1333185 -1357351 -1398475 -1418867 -1327161 -1123905 -971278 -1012518 -1180923
40351a180923j25762m9938o3609p1369M7103J90216J69148Q053p6429K2354J70823
$$ -1180923 -1306685 -1356623 -1420232 -1491601 -1444498 -1254282 -1085134 -1077081 -1153510 -1131156 -960333
40340i60333J90474P9513r428K5504R6019K3409k10727l81668k74985K6631K36868
$$ -960333 -769859 -690346 -699774 -674270 -578251 -554842 -765569 -1147237 -1422222 -1395591 -1158723
40329a158723K22671J15230O0926L7148k8127j07053j25952o4880M8115J47818
$$ -1158723 -936052 -820822 -759896 -722748 -750875 -857928 -983880 -1048760 -1000645 -852827
40319h52827J28459m1740k04446j72582q586N3454k9101o1243L4528R1144J6572
$$ -852827 -724368 -766108 -970554 -1143136 -1151722 -1098268 -1127369 -1188612 -1154084 -1062940 -1046368
40308a046368l9946K0142N9179j4523m2633Q9213J96558Q7777r6892j10534P412
$$ -1046368 -1086314 -1066172 -1006993 -1021516 -1064149 -974936 -778378 -690601 -787493 -898027 -890615
40297h90615M3056k7170o6092n9614r1442j16518k9715R6195R3985j7228o7100
$$ -890615 -847559 -874729 -940821 -1000435 -1091877 -1208395 -1238110 -1141915 -1047930 -1065158 -1132258
40286a132258j6590J2459l2631p2410m7806K3228J08439J51040P1471q9886j41763
$$ -1132258 -1148848 -1136389 -1169020 -1241430 -1289236 -1266008 -1157569 -1006529 -935058 -1024944 -1166707
40275a166707k183J42458J07076j4153l6479R444q587n8796m8654m6410j26624
$$ -1166707 -1168890 -1026432 -919356 -933509 -969988 -960544 -969131 -1027927 -1076581 -1122991 -1249615
40264a249615j44368L0889K00865J07623j02202p5779J53569J98547n0649k47692
$$ -1249615 -1393983 -1363094 -1162229 -1054606 -1156808 -1232587 -1079018 -880471 -931120 -1178812
40254a178812j31092J22365K18091J21542k1363j04875q5623K4669J05755L3272
$$ -1178812 -1309904 -1187539 -969448 -847906 -869269 -974144 -1059767 -1035098 -929343 -896071
40244h96071j26736j93310j35308o9472j9885R1202K22317K24857R1303k7605
$$ -896071 -1022807 -1216117 -1351425 -1420897 -1440782 -1349580 -1127263 -902406 -811103 -838708
40234h38708o0321o5855o6122l2626m219j7071R560J07379J09625p0523j81739
$$ -838708 -899029 -964884 -1031006 -1063632 -1067851 -1084922 -1075362 -967983 -858358 -928881 -1110620
40223a110620L369K42388J66242q3171p1542J68253J84796q8110k07663o561J27492
$$ -1110620 -1107251 -864863 -698621 -781792 -853334 -685081 -500285 -588395 -796058 -802619 -675127
40212f75127l9987j98208q9360M7577k7176j02232N5218K34569J50208o8033j37014
$$ -675127 -715114 -913322 -1002682 -955105 -982281 -1084513 -1029295 -794726 -644518 -712551 -849565
40201h49565p5356m1161L597J23603J70216L9679q0191k3765N6622j510o1628
$$ -849565 -924921 -966082 -962485 -838882 -668666 -628987 -709178 -732943 -676321 -677831 -739459
40190g39459P199L4418j01895j55812O8097K92594J95176l3782l1262R8794J41
$$ -739459 -732260 -697842 -799737 -955549 -887452 -594858 -399682 -433464 -464726 -365932 -365791
40179c65791k80125l81526k44989j25428q2326M2783J97200J50942n8307j58073
$$ -365791 -645916 -1027442 -1272431 -1397859 -1480185 -1437402 -1240202 -1089260 -1147567 -1305640
40169a305640j01328p1653o4983Q8497L02753K95258Q2405l4261p34o2892k34425
$$ -1305640 -1406968 -1478621 -1543604 -1455107 -1152354 -857096 -774691 -808952 -809686 -872578 -1107003
40158a107003k05514R0634K87319J45773j03525j83040j56183j69530j44872J7665
$$ -1107003 -1312517 -1221883 -934564 -788791 -892316 -1075356 -1231539 -1401069 -1545941 -1528276
40148a528276J90656K05429Q6925n9848j88808k15835l3825K38082K83982K8830
$$ -1528276 -1337620 -1132191 -1045266 -1105114 -1293922 -1509757 -1543582 -1305500 -1021518 -992688
40138i92688k10920j80752k5932J8695J1595J28824L14572L68453K43500M6320
$$ -992688 -1203608 -1384360 -1410292 -1391597 -1380002 -1251178 -936606 -568153 -324653 -278333
40128b78333j33315k24205j56354l444K5756j04719j60391k0713Q6826k0214j12648
$$ -278333 -411648 -635853 -792207 -795651 -769895 -874614 -1035005 -1055718 -968892 -989106 -1101754
40117a101754P9538L38305K29477j97091m35239k58370J4156Q2337P3286J82522
$$ -1101754 -1022216 -683911 -454434 -651525 -1086764 -1345134 -1330978 -1248641 -1175355 -992833
40107i92833K72645J30244j23261k03800j03343m5461q5427o4040N7586J18025
$$ -992833 -720188 -589944 -713205 -917005 -1020348 -1065809 -1151236 -1215276 -1157690 -1039665
40097a039665N8541L3861J22593J71543O9316m2855j6591L5896n0871j66209p8119
$$ -1039665 -981124 -947263 -824670 -653127 -583811 -626666 -643257 -607361 -658232 -824441 -902560
40086i02560J55761K25827K6803j91148j88710l0168P3560L1922r5752j88312
$$ -902560 -746799 -520972 -494169 -685317 -874027 -904195 -830635 -798713 -894465 -1082777
40076a082777j32173N1309J45818j550j84137p1905K49001L27515K7185k42831
$$ -1082777 -1214950 -1163641 -1017823 -1019373 -1203510 -1275415 -1026414 -698899 -671714 -914545
40066i14545j64938K2120j1533j32780n0390J32470J31815K6909R7328K64195
$$ -914545 -1079483 -1057363 -1068896 -1201676 -1252066 -1119596 -987781 -960872 -863544 -599349
40056e99349K07650l5316j15052R56k1717k41059k86456j2102K04654P2334j45511
$$ -599349 -391699 -427015 -542067 -541111 -562828 -803887 -1090343 -1102445 -897791 -825457 -970968
40045i70968q5266J51582K40072J60759J14545R9910m8124k84421l52647j57609
$$ -970968 -1056234 -904652 -664580 -503821 -389276 -289366 -337490 -621911 -974558 -1132167
40035a132167J00234J82226M6380j69322k77409j76286N0472K01959J84278R7757
$$ -1132167 -1031933 -849707 -803327 -972649 -1250058 -1426344 -1375872 -1173913 -989635 -891878
40025h91878N5867L5706j5199n5007m0996l2718q0291j06565k5308J01963J47213
$$ -891878 -836011 -800305 -815504 -870511 -911507 -944225 -1024516 -1131081 -1156389 -1054426 -907213
40014i07213R2865K3438o755p972k617p231k4752j9968L3988P3432J0320j06681
$$ -907213 -814348 -790910 -797665 -805637 -808254 -815485 -840237 -860205 -826217 -752785 -742465 -849146
40002h49146j31933m9437J239k8995j4293J01384J71979R0032k1584j7983K7670
$$ -849146 -981079 -1030516 -1029277 -1058272 -1072565 -971181 -799202 -709170 -730754 -748737 -721067
39991g21067k2521j08724o9288Q6224J96370J88227J24334M7925n7065j69296
$$ -721067 -743588 -852312 -921600 -835376 -639006 -450779 -326445 -278520 -335585 -504881
39981e04881k24585j92077o6826J52844L78958M15035J71755j61312l12696k48919
$$ -504881 -729466 -921543 -988369 -835525 -456567 -41532 130223 -31089 -343785 -592704
39971e92704j45952r5860l0372P4967J17064L5585q1280j24283q8810k2856N1923
$$ -592704 -738656 -834516 -864888 -789921 -672857 -637272 -718552 -842835 -931645 -954501 -902578
39960i02578J08791Q6563l5898j74874k07626r4437Q6031K10785K10689J07571
$$ -902578 -793787 -707224 -743122 -917996 -1125622 -1220059 -1134028 -923243 -712554 -604983
39950f04983k6630j25587j37720l0827J45308K30167R4936j65145k84561j24862
$$ -604983 -631613 -757200 -894920 -925747 -780439 -550272 -455336 -620481 -905042 -1029904
39940a029904J63901L27879K72770R0995p9689j46792q9957J5112M9092j2867
$$ -1029904 -866003 -538124 -265354 -174359 -254048 -400840 -490797 -475685 -426593 -439460
39930d39460p3099o5548m5140n7055k9239R2630J95492J26767p6946k23502k04353
$$ -439460 -512559 -578107 -623247 -680302 -709541 -616911 -421419 -294652 -371598 -595100 -799453
39919g99453q5566J7310M1872k6512j43442j86054n8178J60536K64341J56272
$$ -799453 -885019 -867709 -825837 -852349 -995791 -1181845 -1240023 -1079487 -815146 -658874
39909f58874l5506j09311o261J51355J96477P0640j26253k23794j44805J0714
$$ -658874 -694380 -803691 -809952 -658597 -462120 -391480 -517733 -741527 -886332 -875618
39899h75618P1752q675r9582n2878J13799K39726K18729J10837K4383m1150j40287
$$ -875618 -803866 -812541 -912123 -965001 -851202 -611476 -392747 -281910 -257527 -298677 -438964
39888d38964k15576j40592M8765J35841K2488j12527q3790K5592L6321j9145P891
$$ -438964 -654540 -795132 -746367 -610526 -588038 -700565 -784355 -758763 -722442 -741587 -733696
39877g33696Q1705M7579n8537n8283K5889j2029j68203j80082L4087K02772J17167
$$ -733696 -651991 -604412 -662949 -721232 -695343 -707372 -875575 -1055657 -1021570 -818798 -701631
39866g01631o6893j23516q7146p4079j7052J62129L03849K14118o288r5039o514
$$ -701631 -768524 -892040 -979186 -1053265 -1070317 -908188 -604339 -390221 -396509 -491548 -498062
39855d98062P6464M8518j2259j0800N9430J45679J54808J3996j89878k48453j14600
$$ -498062 -421598 -373080 -385339 -396139 -336709 -191030 -36222 -22226 -212104 -460557 -575157
39844e75157R230j0781l6312N1248Q8005p7785k34447r4588J97976K26494q0678
$$ -575157 -565927 -576708 -613020 -561772 -473767 -551552 -785999 -880587 -682611 -456117 -536795
39833e36795l54336l19114q7164J31920K93803L90751L39249J42556l0918n9996
$$ -536795 -891131 -1210245 -1297409 -1165489 -871686 -480935 -141686 870 -30048 -90044
39823i0044j7713k1499p3772j19282j31005q3873L4624J46799J36289P027j18378
$$ -90044 -107757 -129256 -203028 -322310 -453315 -537188 -502564 -355765 -219476 -212449 -330827
39812c30827j62542j38041n1285Q5479J62838P2181r8562j44432l3357O5047O1303
$$ -330827 -493369 -631410 -682695 -597216 -434378 -362197 -460759 -605191 -638548 -573501 -512198
39801e12198N7696J25541J65030P6875q1897k02666k54558k31698j00835J06202
$$ -512198 -454502 -328961 -163931 -87056 -168953 -371619 -626177 -857875 -958710 -852508
39791h52508K49480K23047P9130m7165q3742n7509l5202n2181p3615m1860K0064
$$ -852508 -603028 -379981 -300851 -348016 -431758 -489267 -524469 -576650 -650265 -692125 -672061
39780f72061K3301k9564k0820O8168P1610r3276k33881j51681M4223J26907J14284
$$ -672061 -648760 -678324 -699144 -630976 -559366 -652642 -886523 -1038204 -993981 -867074 -752790
39769g52790J62611K21324J24356n5775j00211m0197q6610j94587j17520R1589
$$ -752790 -590179 -368855 -244499 -300274 -400485 -440682 -527292 -721879 -839399 -747810
39759g47810R4231j35211k04249M5373K56842J62692O937N3529J08614p1198k67860
$$ -747810 -653579 -788790 -993039 -947666 -690824 -528132 -521195 -467666 -359052 -430250 -698110
39748f98110j64211O9005M9781j47272j18298J72364L29137J59261q4848j57498
$$ -698110 -862321 -793316 -743535 -890807 -1009105 -836741 -507604 -348343 -433191 -590689
39738e90689j16217p1625O664J05562Q6679o6931j62232q8016J5950J2469n901
$$ -590689 -706906 -778531 -771867 -666305 -579626 -646557 -808789 -896805 -880855 -868386 -874287
39727h74287J00403K55625K58914O7058j42798j76230k5602J21546P6389j28110
$$ -874287 -773884 -518259 -259345 -192287 -335085 -511315 -536917 -415371 -338982 -467092
39717d67092k56260j63577J6350Q0741M4084M5496O6072j9499j45366q8867J50196
$$ -467092 -723352 -886929 -870579 -789838 -745754 -700258 -634186 -653685 -799051 -887918 -737722
39706g37722K71555R2593j73278k04548K6016K80004L48953J91075r4151k91651
$$ -737722 -466167 -373574 -546852 -751400 -725384 -445380 -96427 94648 497 -291154
39696b91154k00640J10563K99906J60572r3932j46366m2793p1563k54250k96398
$$ -291154 -491794 -381231 -81325 79247 -14685 -161051 -203844 -275407 -529657 -826055
39686h26055q0540J32941J36796R8966K21074L33021J60014j60691k21622K2126
$$ -826055 -906595 -773654 -636858 -537892 -316818 16203 176217 15526 -206096 -183970
39676a83970J60517l5439k60472j73063O6844P9142j25685k03195o0840J8167
$$ -183970 -23453 -58892 -319364 -492427 -425583 -346441 -472126 -675321 -736161 -717994
39666g17994j12967k05371l8219J97689J91499j0986j07129r749P4155K3218k1518
$$ -717994 -830961 -1036332 -1074551 -876862 -685363 -696349 -803478 -813227 -739072 -715854 -737372
39655g37372O2459J57196J13020J0340J8680R3793M1926j33314j90516l0476J09333
$$ -737372 -674913 -517717 -404697 -394357 -375677 -281884 -239958 -373272 -563788 -594264 -484931
39644d84931P364j72610j14250J43823K35969J8629k14839j82049p46O1479N603
$$ -484931 -477567 -650177 -764427 -620604 -384635 -366006 -580845 -762894 -763640 -702161 -696558
39633f96558J8266J15444J41181N6986j4069j0109J1456K1824L8702K1749o3907
$$ -696558 -678292 -562848 -421667 -364681 -378750 -388859 -377403 -355579 -316877 -295128 -359035
39622c59035j15433k3166J05457P4494q1992j57273j22156j30094j68754m4718
$$ -359035 -474468 -497634 -392177 -317683 -399675 -556948 -679104 -809198 -977952 -1022670
39612a022670K04958K41177n7212l13456j51661K52807M15874K01642n7931n8798
$$ -1022670 -817712 -576535 -633747 -947203 -1098864 -846057 -430183 -228541 -286472 -345270
39602c45270J15987J79111J5406k10910k74919j55782l7922l9310m7437O0653
$$ -345270 -229283 -50172 -34766 -245676 -520595 -676377 -714299 -753609 -801046 -740393
39592g40393J54696L5957j76915j51338J38021L12820J32996j64145k41709j11702
$$ -740393 -585697 -549740 -726655 -877993 -739972 -427152 -294156 -458301 -700010 -811712
39582h11712J2461P8550J49925J70210M9253j15451j45028m5461K8299J4306k4143
$$ -811712 -799251 -720701 -570776 -400566 -351313 -466764 -611792 -657253 -628954 -614648 -638791
39571f38791n0094p7159q6852n0394Q812N8460R4091Q1815j7360j19544p8535
$$ -638791 -688885 -766044 -852896 -903290 -894478 -836018 -741927 -660112 -677472 -797016 -875551
39560h75551O6775J07212Q15m8044M5306Q5343l0068p6175J15933L16159K29663
$$ -875551 -808776 -701564 -700749 -748793 -703487 -618144 -648212 -724387 -608454 -292295 -62632
39549f2632m6629k02820j59002l5345J24778K86309K64439k1506k91052k40609
$$ -62632 -109261 -312081 -471083 -506428 -381650 -95341 169098 147592 -143460 -384069
39539c84069M369J08952L8715j3572m4446j66326k49517q7138J63176J52676r1579
$$ -384069 -379700 -270748 -232033 -245605 -290051 -456377 -705894 -793032 -629856 -477180 -568759
39528e68759k15899j18335k3103L75J11351K72390K36918K0319q6780l8761q2501
$$ -568759 -784658 -902993 -926096 -925721 -814370 -541980 -305062 -284743 -371523 -410284 -492785
39517d92785k12258j12959K14285L25847N5991j70580l3237J80439J10207r8428
$$ -492785 -705043 -818002 -603717 -277870 -221879 -392459 -425696 -245257 -135050 -233478
39507b33478j48487j16334j85007k01816K6039K68006J83701r9911j88787m6996
$$ -233478 -381965 -498299 -683306 -885122 -859083 -591077 -407376 -507287 -696074 -743070
39497g43070L4474j2881K1403J64546J77190j7032j80246j30350J5784O2974o197
$$ -743070 -708596 -721477 -700074 -535528 -358338 -375370 -555616 -685966 -670182 -607208 -613405
39486f13405p3108l5533J15970K67166K50196N1809j17378q8728K6264K1502q6206
$$ -613405 -686513 -722046 -606076 -338910 -88714 -36905 -154283 -243011 -216747 -195245 -281451
39475b81451j20004l6897N1262Q6999Q9831K7136j21099k13890r6948J17272J50354
$$ -281451 -401455 -438352 -387090 -300091 -210260 -183124 -304223 -518113 -615061 -497789 -347435
39464c47435m2946j99740j28495L8009O7378m6861j13928k8793R2947P7698o9194
$$ -347435 -390381 -590121 -718616 -680607 -613229 -660090 -774018 -802811 -709864 -632166 -701360
39453g01360j60260q3276L0317J0550n9472K6668K03280J68080j10560k60241
$$ -701360 -861620 -944896 -914579 -904029 -963501 -936833 -733553 -565473 -676033 -936274
39443i36274o8886J51824O9304j04577K7161L34060L24464m0341k43067j0834
$$ -936274 -1005160 -853336 -784032 -888609 -861448 -527388 -202924 -243265 -486332 -497166
39433d97166K84542K35938j9893j30390r0588j12741j70622p7079J04137J22324
$$ -497166 -212624 23314 3421 -126969 -217557 -330298 -500920 -577999 -473862 -351538
39423c51538p594N044K19976L03567L7882l00726l21897q0514M1307r1958k33592
$$ -351538 -359132 -354088 -134112 169455 207337 -93389 -415286 -495800 -454493 -546451 -780043
39412g80043j89565p2482k4467L3239J92222L09975J99836n9906k22860j90856
$$ -780043 -969608 -1042090 -1066557 -1033318 -841096 -531121 -331285 -391191 -614051 -804907
39402h04907l9669J67372L64990L78383J04552k37086l12619j25478J6989q338
$$ -804907 -844576 -677204 -312214 66169 170721 -66365 -378984 -504462 -487473 -495811
39392d95811j905J50973K64412J80276K6167k3810m757q086L016M8823J4082j39967
$$ -495811 -497716 -346743 -82331 97945 124112 100302 95545 87459 90475 139298 153380 13413
39380A3413k36929j46187j277K9299Q073O5352J42215J12090J2240n3712j05589
$$ 13413 -223516 -369703 -370980 -341681 -333608 -268256 -126041 -13951 -1711 -55423 -161012
39369a61012j77291j60953K2430K20107K30425Q5965l6719p9562r2151p7286k9636
$$ -161012 -338303 -499256 -476826 -256719 -26294 59671 22952 -56610 -148761 -226047 -255683
39358b55683j1927l0185K7039J71590K20118R0574j8156M7713J23595L1524q4141
$$ -255683 -267610 -297795 -270756 -99166 120952 211526 193370 241083 364678 396202 312061
39347C12061l2705M3542p1095k24019j19102J55299K40182O6348r0668o0640P5475
$$ 312061 279356 322898 251803 27784 -91318 63981 304163 370511 279843 219203 294678
39336B94678K25939L30605K51679k4689j92671j2062K55724K27815M1681Q9775
$$ 294678 520617 851222 1102901 1078212 885541 873479 1129203 1357018 1398699 1488474
39326A488474K80265K16624R134J07130K78365l13843j679182k527001j841233
$$ 1488474 1768739 1985363 1994497 2101627 2379992 2066149 386967 -2140034 -3981267
39317c981267k82339O90770O34097K94458K76305L77396K57398L8306q561Q4400
$$ -3981267 -4263606 -3572836 -2938739 -2644281 -2367976 -1990580 -1733182 -1694876 -1703437 -1619037
39307a619037J14612M2041k1705j6054K2874N1450O7391Q7280J03994Q4089L3822
$$ -1619037 -1504425 -1462384 -1484089 -1500143 -1477269 -1425819 -1358428 -1271148 -1167154 -1083065 -1049243
39296a049243K4573P2140N7235q6847j84128m1297J93050J97599n879p5076O3269
$$ -1049243 -1024670 -952530 -895295 -982142 -1166270 -1207567 -1014517 -816918 -822797 -897873 -834604
39285h34604P6398j66406k97782m4275K86775K80744M9848k3675P5328O8615o9179
$$ -834604 -758206 -924612 -1222394 -1266669 -979894 -699150 -649302 -672977 -597649 -529034 -598213
39274e98213r3937N1818J74008J86072J71436J15785o8469k58426k13903J5490
$$ -598213 -692150 -640332 -466324 -280252 -108816 6969 -61500 -319926 -533829 -518339
39264e18339J05969o0225k34294k00732n7366J3317J1859K9001O5860P0291L1343
$$ -518339 -412370 -472595 -706889 -907621 -964987 -951670 -939811 -910810 -844950 -774659 -743316
39253g43316l9547j19728j36893l5496J05092J45849Q5676M4345M7293r239j47291
$$ -743316 -782863 -902591 -1039484 -1074980 -969888 -824039 -738363 -694018 -646725 -655964 -803255
39242h03255k20004j04991J21657K66422K12682J4542j51869j42474P13R1723
$$ -803255 -1023259 -1128250 -1006593 -740171 -527489 -512947 -664816 -807290 -806577 -714854
39232g14854M3700j9367K9276J20712J26621P2404M7672J3476j02915k10811j74928
$$ -714854 -671154 -690521 -661245 -540533 -413912 -341508 -293836 -280360 -383275 -594086 -769014
39221g69014o4757m9968r5363j6695J75831K59906J53688K5440p237l6164j27642
$$ -769014 -833771 -883739 -979102 -995797 -819966 -560060 -406372 -380932 -388169 -424333 -551975
39210e51975j63211n2113Q0894P1049m9908j24315q4836L654M9143P938q3900
$$ -551975 -715186 -767299 -686405 -615356 -665264 -789579 -874415 -870761 -821618 -813680 -897580
39199h97580j18382k6374J09421J45159P4418J5341Q169j6880n6142k33J55922
$$ -897580 -1015962 -1042336 -932915 -787756 -713338 -697997 -689828 -706708 -762850 -763083 -607161
39188f07161K42666J47558j8483p8543j861J14442J66129Q4563j20583l01442
$$ -607161 -364495 -216937 -235420 -313963 -315824 -201382 -35253 49310 -71273 -372715
39178c72715k83489r7642L9998M0359N6893J92063K86009J65536n9605j57800
$$ -372715 -656204 -753846 -713848 -673489 -616596 -424533 -138524 27012 -32593 -190393
39168a90393j15480r0733j09707o1381L1237J084j52407j86326L3631K93858L04488
$$ -190393 -305873 -396606 -506313 -567694 -536457 -535373 -687780 -874106 -840475 -546617 -242129
39157b42129Q2050j11651j32144o7424j9534K9673Q7114N7142j01720k39484j78035
$$ -242129 -160079 -271730 -403874 -471298 -490832 -461159 -374045 -316903 -418623 -658107 -836142
39146h36142L4239J67359J04157l2935p3392p938M7792K2824m0938n7355M998
$$ -836142 -801903 -634544 -530387 -563322 -636714 -644652 -596860 -574036 -614974 -672329 -667331
39135f67331P8635N8658n7676j29142m3594J06300J36968L8960k4865J0771K8714
$$ -667331 -588696 -530038 -587714 -716856 -760450 -654150 -517182 -478222 -503087 -492316 -463602
39124d63602l8930q8637m7409j0641n2992p8202j0156L7019l4393q8677K7464
$$ -463602 -502532 -591169 -638578 -649219 -702211 -780413 -790569 -753550 -787943 -876620 -849156
39113h49156J83465J41924m6939j06693M1989J92418J93429J18406N2116m4146
$$ -849156 -665691 -523767 -570706 -677399 -635410 -442992 -249563 -131157 -79041 -123187
39103a23187j75831k34738j69733o9587j141P2645J49960J42579N1285J2177O8775
$$ -123187 -299018 -533756 -703489 -773076 -774217 -701572 -551612 -409033 -357748 -345571 -276796
39092b76796P0754p6311k23289j96381o9568l4916r3618p9197M8458J39554J14094
$$ -276796 -206042 -282353 -505642 -702023 -771591 -806507 -900125 -979322 -930864 -791310 -677216
39081f77216R8884K07513L19683K33440k0968j94870j67830j01158j46843j76230
$$ -677216 -578332 -370819 -51136 182304 161336 -33534 -201364 -302522 -449365 -625595
39071f25595n7K54375K66661R444j90414j41207k7492k9116k3278J03162J46346
$$ -625595 -625652 -371277 -104616 -95172 -285586 -426793 -454285 -483401 -506679 -403517 -257171
39060b57171p8289l20720k09311J55630L23933J50839o1227o9181L8172J12525
$$ -257171 -335460 -656180 -865491 -709861 -385928 -235089 -296316 -365497 -327325 -214800
39050b14800J41510J02357o2615k43740k26713l1984Q4628K5470m6447m6154q0095
$$ -214800 -73290 29067 -33548 -277288 -504001 -535985 -451357 -425887 -472334 -518488 -598583
39039e98583j47959q3440R3209J20159n8232j44125K5405J90677R9883r5658j36614
$$ -598583 -746542 -829982 -736773 -616614 -674846 -818971 -793566 -602889 -503006 -598664 -735278
39028g35278n6926j8839q710L1024J3291q3055o5619J33806K40721O4278j30660
$$ -735278 -792204 -811043 -819753 -788729 -775438 -858493 -924112 -790306 -549585 -485307 -615967
39017f15967l4913J78640J51532n5070j08372K707Q761r6487n1583J46785J93331
$$ -615967 -650880 -472240 -320708 -375778 -484150 -481443 -472682 -569169 -620752 -473967 -280636
39006b80636M566j38519p4627R099m2262j02645m7554K8801L3889L7417O7659
$$ -280636 -276070 -414589 -489216 -480117 -522379 -625024 -672578 -643777 -609888 -572471 -504812
38995e04812J3651j20537j25086P9088K51836J78263j606k1930J07179J50019
$$ -504812 -491161 -611698 -736784 -657696 -405860 -227597 -229203 -251133 -143954 6065
38985F065L316j97571k91189k52174j46887l5914N6893J17666J08037j00j26156
$$ 6065 9381 -188190 -479379 -731553 -878440 -914354 -857461 -739795 -631758 -631858 -758014
38974g58014j04540R5777K65388K13019M1319k4378N698m7743j62969j25892P3193
$$ -758014 -862554 -766777 -501389 -288370 -247051 -271429 -265731 -313474 -476443 -602335 -529142
38963e29142J77867Q4955Q106Q5321J29221l2300k33640k34708r8060m2202p4369
$$ -529142 -351275 -266320 -258214 -172893 -43672 -75972 -309612 -544320 -642380 -684582 -758951
38952g58951l4319R8346J87899J73365J08662K4906o6986r8029m0065j4748j24220
$$ -758951 -793270 -694924 -507025 -333660 -224998 -200092 -267078 -365107 -405172 -419920 -544140
38941e44140k42078j67724O5702K37768K53176K03713J50675O5723j6548j2060
$$ -544140 -786218 -953942 -888240 -650472 -397296 -193583 -42908 22815 6267 -5793
38931e793K2512o7658k55903l16643j66804j1299k7786r8386j9711J65059K34516
$$ -5793 16719 -50939 -306842 -623485 -790289 -801588 -829374 -927760 -947471 -782412 -547896
38920e47896J11864n2547r0443K1826J82948K45863J19287j08508k02819n4893
$$ -547896 -436032 -488579 -579022 -557196 -374248 -128385 -9098 -117606 -320425 -375318
38910c75318J43085J39302k6825j08875n0289m4230j58835j81129K3135K38856
$$ -375318 -232233 -92931 -119756 -228631 -278920 -323150 -481985 -663114 -639979 -401123
38900d01123K09058K3841o2696n9742j60444l09826k30624P7723K44081Q1541
$$ -401123 -192065 -168224 -230920 -290662 -451106 -760932 -991556 -913833 -669752 -588211
38890e88211r9564K4380K74446K61921P434j12424L0429J45816J1047k04607k40479
$$ -588211 -687775 -663395 -388949 -127028 -119594 -232018 -201589 -55773 -44726 -249333 -489812
38879d89812j20303m2184n3485l1608Q1151J87257J74422M8816q3492j25028p5480
$$ -489812 -610115 -652299 -705784 -737392 -656241 -468984 -294562 -245746 -329238 -454266 -529746
38868e29746j9652j3125p441N5808J13583N2893q6261j10893O5162K66634K50166
$$ -529746 -549398 -562523 -569964 -514156 -400573 -347680 -433941 -544834 -479672 -213038 37128
38857C7128n645k82417l63045k27361k3364J00722J17995R2246N9712j870p2482
$$ 37128 31483 -250934 -613979 -841340 -864704 -763982 -645987 -553741 -494029 -495899 -568381
38846e68381n2502Q4036J74166M9068j96459k87342j40851K1590O096q1744k9426
$$ -568381 -620883 -536847 -362681 -313613 -510072 -797414 -938265 -916675 -910579 -992323 -1021749
38835a021749J46677K35094J43069R13n4887n3346q6103j35296r3641P3833K55611
$$ -1021749 -875072 -639978 -496909 -495996 -550883 -604229 -690332 -825628 -919269 -845436 -589825
38824e89825K94772J45037p8424j98301j32216L4680J32064P2807n6924r5833
$$ -589825 -295053 -150016 -228440 -426741 -558957 -524277 -392213 -319406 -376330 -472163
38814d72163l019Q8643N4364m2209m4898M7424O8173n4928j75160j46775l6069
$$ -472163 -475182 -386539 -332175 -374384 -419282 -371858 -303685 -358613 -533773 -680548 -716617
38803g16617O882k3872l4374j3169q013J0635Q8265J41109O3622n0836o602J76536
$$ -716617 -709735 -733607 -767981 -781150 -789163 -778528 -690263 -549154 -485532 -536368 -542970 -366434
38791c66434K59253J30960n0952j30364j46290j63239j18218J8196J01468Q263
$$ -366434 -107181 23779 -27173 -157537 -303827 -467066 -585284 -567088 -465620 -457357
38781d57357j48620j69422m3620P9160J20104J15848Q6683K0280l4882m363Q0941
$$ -457357 -605977 -775399 -819019 -739859 -619755 -503907 -417224 -396944 -431826 -436189 -355248
38770c55248J04644K4628q1452j33600j25678q1909k3078J1505j3651o1360l8260
$$ -355248 -250604 -225976 -307428 -441028 -566706 -648615 -671693 -660188 -673839 -735199 -773459
38759g73459Q5839K14827K17503P0150j09833j74397r0025L0728N3794k8387r9296
$$ -773459 -687620 -472793 -255290 -185140 -294973 -469370 -559395 -528667 -474873 -503260 -602556
38748f02556o4509M2543J10997P6278k1485q1921m0267O6998J38457J20765N7759
$$ -602556 -667065 -624522 -513525 -437247 -458732 -540653 -580920 -513922 -375465 -254700 -196941
38737a96941O970m0133j02398j27931n5137P2046J37751R3441r739j07936j64020
$$ -196941 -189971 -230104 -332502 -460433 -515570 -443524 -305773 -212332 -222071 -330007 -494027
38726d94027j42426l6480Q6262J43411J27577P3712j1368r8978r0995M6216J61793
$$ -494027 -636453 -672933 -586671 -443260 -315683 -241971 -253339 -352317 -443312 -397096 -235303
38715b35303R4323p5770j22926k61J21240J29478Q8734O5542L5540k95R115L6956
$$ -235303 -140980 -216750 -339676 -339937 -218697 -89219 -485 65057 100597 100302 109417 146373
38703A46373J124o5886o0069k5508j03721k44778k32022m5674Q0447M4130J2661
$$ 146373 147497 81611 21542 -3966 -107687 -352465 -584487 -630161 -549714 -505584 -492923
38692d92923O2551J6870j74643k30653K0084K85570K22298l4585j09293K3429
$$ -492923 -430372 -413502 -588145 -818798 -798714 -513144 -290846 -325431 -434724 -411295
38682d11295P0894n2739j23016j9534R4906O0604p4794j90387k20848j22027R6061
$$ -411295 -340401 -393140 -516156 -535690 -440784 -380180 -454974 -645361 -866209 -988236 -892175
38671h92175K77748K50389P2897j7764O2488J38098M7723j26121j80466n0780
$$ -892175 -614427 -364038 -291141 -308905 -246417 -108319 -60596 -186717 -367183 -417963
38661d17963J28483J87228J01213l531l5306o8419j95309l04556j98682O3664
$$ -417963 -289480 -102252 -1039 -4570 -39876 -108295 -303604 -608160 -806842 -743178
38651g43178J85618O2990o0678P073J24316J10925N7835R6796J06370n5965k26958
$$ -743178 -557560 -494570 -555248 -548175 -423859 -312934 -255099 -158303 -51933 -107898 -334856
38640c34856j64833M4803J28248N1919M862N3116J04510J26053J25358K8418j57538
$$ -334856 -499689 -454886 -326638 -274719 -269857 -216741 -112231 13822 139180 167598 10060
38629A0060k11837k5915J22967k7859k48688j59185J31023K11430O3683K1096
$$ 10060 -201777 -227692 -104725 -132584 -381272 -540457 -409434 -198004 -134321 -113225
38619a13225J16867O7915r7432k8125K45114K32990j92701n06158l27570L1414
$$ -113225 3642 71557 -25875 -54000 191114 424104 231403 -274755 -602325 -570911
38609e70911J43953Q6035J03882J12291m5835j92941j01713Q2390R4232p094p097
$$ -570911 -426958 -340923 -237041 -124750 -170585 -363526 -465239 -382849 -288617 -295711 -302808
38598c02808O4731M6409l7083p9506j28244k20886j95560L4843K33563J79991
$$ -302808 -238077 -191668 -228751 -308257 -436501 -657387 -852947 -818104 -584541 -404550
38588d04550M3242Q1564J86533J06099o7269n4143R3273O6738j54726k53489q5675
$$ -404550 -361308 -279744 -93211 12888 -54381 -108524 -15251 51487 -103239 -356728 -442403
38577d42403J16256J19674j8128j16995j16463p6551o7282q5951k9637J73715
$$ -442403 -326147 -206473 -224601 -341596 -458059 -534610 -601892 -687843 -717480 -543765
38567e43765L63618K65198q9729l12350j97944k4436o2423j13355R2054L26228
$$ -543765 -180147 85051 -4678 -317028 -514972 -539408 -601831 -715186 -623132 -296904
38557b96904J84617k04466l16429j6598K85885K78846Q7250p2545j57372j42670
$$ -296904 -112287 -316753 -633182 -649780 -363895 -85049 2201 -70344 -227716 -370386
38547c70386J3043J65816R4455j25202j94211p7124l6864j31718j03886J11934
$$ -370386 -357343 -191527 -97072 -222274 -416485 -493609 -530473 -662191 -766077 -654143
38537f54143K04301P503j87718r9695J05734J23260k6187j28348j42957j44229
$$ -654143 -449842 -442339 -630057 -729752 -624018 -500758 -526945 -655293 -798250 -942479
38527i42479p8650J21974L10804K82549Q4286n7421n8204k1715j2756J9542R5973
$$ -942479 -1021129 -899155 -588351 -305802 -221516 -278937 -337141 -358856 -371612 -352070 -256097
38516b56097J37669P1770p1840j85138j79885p7125R217J5985Q949M1533K6918
$$ -256097 -118428 -46658 -118498 -303636 -483521 -560646 -551429 -535444 -526495 -484962 -458044
38505d58044r9789j87954o4616J45219J70879M0493M3655K22069K68176M5341
$$ -458044 -557833 -745787 -810403 -665184 -494305 -453812 -410157 -188088 80088 125429
38495A25429j62325j12870K3191P331o0727R320J01929N236j66841j41164L3705
$$ 125429 -36896 -149766 -126575 -119244 -179971 -170651 -68722 -63486 -230327 -371491 -337786
38484c37786N2601j32206k21888m1162K09370K68501J45508J9229k1663j6946
$$ -337786 -285185 -417391 -639279 -680441 -471071 -202570 -57062 -37833 -59496 -76442
38474g6442j8904l6028m4016q928O6764J22454J09004N8233K7125O042m7864j16274
$$ -76442 -95346 -131374 -175390 -184318 -117554 4900 113904 172137 199262 205304 157440 41166
38462D1166j34797q5776j4121L4338M4666K4240m663k7718o0361j02141q9068
$$ 41166 -93631 -179407 -193528 -159190 -114524 -90284 -94947 -122665 -183026 -285167 -374235
38451c74235J8033J17481P5109n1917p2035L3721P0111l6573r6751J2123J08357
$$ -374235 -356202 -238721 -163612 -215529 -287564 -253843 -183732 -220305 -317056 -304933 -196576
38440a96576Q107j35106o2753J50313J88617k6574k38741k42377j12830j919P1847
$$ -196576 -188469 -323575 -386328 -236015 -47398 -73972 -312713 -555090 -667920 -669839 -597992
38429e97992J38590J56613R3141K1316L2463J01779J15527J7432j12740j39199
$$ -597992 -459402 -302789 -209648 -188332 -155869 -54090 61437 78869 -33871 -173070
38419a73070l0572Q4150O5177n5964j27587r4685m0218o696O1323J56117J66221
$$ -173070 -203642 -119492 -54315 -110279 -237866 -332551 -372769 -379465 -318142 -162025 4196
38408D196O9735j1892l5681j06013k14725j58891J08242K93013J66374p0824j09149
$$ 4196 73931 62039 26358 -79655 -294380 -453271 -345029 -52016 114358 43534 -65615
38397f5615j2255m3336j77480j69900q943R2441J03067J74655K59963J47271r5392
$$ -65615 -77870 -121206 -298686 -468586 -477529 -385088 -282021 -107366 152597 299868 204476
38386B04476j38136O0252J40101p5470k89220k25980m5362J57j2873R0283J97561
$$ 204476 66340 126592 266693 191223 -97997 -323977 -369339 -369182 -382055 -291772 -94211
38375i4211J00737j11161j82047r0952j6998R217J15586K84850L21578J48599
$$ -94211 6526 -104635 -286682 -377634 -394632 -385415 -269829 15021 336599 485198
38365D85198p6649j79998j49420p4338l1163m2745o3574j9962O9783P6317n7089
$$ 485198 408549 228551 79131 4793 -26370 -69115 -132689 -152651 -82868 -6551 -63640
38354f3640j93083j69503j5980J07643J15491L5439o5873r1753L8904K30883K33252
$$ -63640 -256723 -426226 -442206 -334563 -219072 -183633 -249506 -341259 -302355 -71472 161780
38343A61780j7730k25530j22298J08236Q8809j55267k11602Q5476L87886L31046
$$ 161780 144050 -81480 -203778 -95542 -6733 -162000 -373602 -288126 99760 430806
38333D30806J3541k05469j78175l4988P1546Q3832j0133j57223k19926j31668
$$ 430806 444347 238878 60703 25715 97261 181093 170960 13737 -206189 -337857
38323c37857k9772q4092k25636k13634J5890K35104K27418P3676J6985J14110
$$ -337857 -367629 -451721 -677357 -890991 -875101 -639997 -412579 -338903 -321918 -207808
38313b07808J71019M0704j46921j49600N3432K17449J38470j00736k50575j87282
$$ -207808 -36789 3915 -143006 -292606 -239174 -21725 116745 16009 -234566 -421848
38303d21848p241J22243J15514m323j36277j57599l3786J13356J23675J801p8970
$$ -421848 -429089 -306846 -191332 -195655 -331932 -489531 -523317 -409961 -286286 -284485 -363455
38292c63455p584J17271J35399M8214q217J5027O235j17038k39602j72014Q2628
$$ -363455 -371039 -253768 -118369 -70155 -78372 -63345 -57110 -174148 -413750 -585764 -503136
38281e03136K95331K79440J00880m8170j00512j20697j19548l5198R1511J09553
$$ -503136 -207805 71635 172515 124345 23833 -96864 -216412 -251610 -160099 -50546
38271e0546r98n4927N0078J36109J5388j74875j46361R5634K42405J27497o5813
$$ -50546 -51544 -106471 -56393 79716 95104 -79771 -226132 -130498 111907 239404 173591
38260A73591j08716j7053O7463R4467P1442k6301j62914j90613m8693R5161O7494
$$ 173591 64875 47822 115285 209752 281194 254893 91979 -98634 -147327 -52166 15328
38249A5328m1989j9613J32549K03051R7693m3349p9207l6786O781M7499Q2761
$$ 15328 -26661 -46274 86275 289326 387019 343670 264463 227677 234458 281957 364718
38238C64718N4446l8486p8503J0896J22860R8316m8582j48936j06737m759L1177
$$ 364718 419164 380678 302175 313071 435931 534247 485665 336729 229992 225233 256410
$$ [...]
##END NTUPLES=NMR SPECTRUM
##END=
