##TITLE=31Pdec_ANY-168k
 DMFA-d7, 24 sc
 2.7.2019
##JCAMPDX= 6.0         $$ Bruker NMR JCAMP-DX V2.0
##DATA TYPE= NMR SPECTRUM
##DATA CLASS= NTUPLES
##ORIGIN= UXNMR, Bruker Analytische Messtechnik GmbH
##OWNER= root
$$ XWIN-NMR		Version 3.5
$$ Tue Jul  2 14:13:44 2019 Russian Standard Time (UT+4h)  she@DPX200
##.OBSERVE FREQUENCY= 81.013821
##.OBSERVE NUCLEUS= ^31P
##.ACQUISITION MODE= SIMULTANEOUS
##.ACQUISITION SCHEME= undefined
##.AVERAGES= 24
##.DIGITISER RES= 17
##SPECTROMETER/DATA SYSTEM= spect
##.PULSE SEQUENCE= zgpg30
##.SOLVENT NAME= DMF
##.SHIFT REFERENCE= (INTERNAL, DMF, 0, 182.463)
##AUDIT TRAIL= $$ (NUMBER, WHEN, WHO, WHERE, WHAT)
$$ ##TITLE= Audit trail, XWIN-NMR		Version 3.5
$$ ##JCAMPDX= 5.01
$$ ##ORIGIN= Bruker BioSpin GmbH
$$ ##OWNER= she
$$ F:/spectra/data/she/nmr/P31/1/pdata/1/auditp.txt
$$ ##AUDIT TRAIL=  $$ (NUMBER, WHEN, WHO, WHERE, WHAT)
(   1,<2019-07-02 14:12:42.93 +0400>,<she>,<DPX200>,
      <created by zg, POWCHK disabled, PULCHK disabled
       configuration hash MD5:
       00 E9 B6 7A A2 85 ED C7 34 08 36 98 17 FE 4E 26
       data hash MD5: 32K
       A8 91 40 A5 5F 5D 62 E4 D3 2E D1 FA EB E2 76 3B>)
(   2,<2019-07-02 14:12:45.32 +0400>,<she>,<DPX200>,
      <Start of raw data processing
       efp BC_mod = 2 LB = 1 FT_mod = 6 PKNL = 1 PHC0 = -2905.225 PHC1 = 473.5991 SI = 64K 
       data hash MD5: 64K
       B3 9A 99 2B 20 35 FB AD 22 3B 81 F2 42 0E 1E AF>)
(   3,<2019-07-02 14:13:05.40 +0400>,<she>,<DPX200>,
      <pk PHC0 = 422.9426 PHC1 = -565.0002 
       data hash MD5: 64K
       BB 29 87 45 83 33 03 65 AD E5 01 85 1B E0 57 2F>)
(   4,<2019-07-02 14:13:08.62 +0400>,<she>,<DPX200>,
      <abs ABSG = 5 
       data hash MD5: 64K
       58 7F 58 40 CB 2A FB B5 DA EB A5 EC AB 33 08 D1>)
$$ ##END=
$$ 
$$ hash MD5
$$ 82 A7 8B B6 1A 9C 35 23 27 B7 EC 7C 09 C4 5E 4D
##$RELAX= 
##$RELAX= 
##$RELAX= 
##$RELAX= 
##$RELAX= 
##$RELAX= 
##$RELAX= 
##$RELAX= 
$$ Bruker specific parameters
$$ --------------------------
##$DU= <F:/spectra>
##$EXPNO= 1
##$NAME= <P31>
##$PROCNO= 1
##$TYPE= <nmr>
##$USER= <she>
##$AMP= (0..31)
100 100 100 100 100 100 100 100 100 100 100 100 100 100 100 100 100 100 
100 100 100 100 100 100 100 100 100 100 100 100 100 100 
##$AQSEQ= 0
##$AQ_mod= 1
##$AUNM= <au_zg>
##$AUTOPOS= <>
##$BF1= 81.014009
##$BF2= 200.13
##$BF3= 200.13
##$BF4= 200.13
##$BF5= 200.13
##$BF6= 200.13
##$BF7= 200.13
##$BF8= 200.13
##$BYTORDA= 1
##$CFDGTYP= 0
##$CFRGTYP= 5
##$CHEMSTR= <none>
##$CNST= (0..31)
1 1 145 1 1 1 1 1 1 1 1 1 1 1 1 1 1 1 1 1 1 1 1 1 1 1 1 1 1 1 1 1 
##$CPDPRG= <waltz16>
##$CPDPRG1= <>
##$CPDPRG2= <waltz16>
##$CPDPRG3= <>
##$CPDPRG4= <mlev>
##$CPDPRG5= <mlev>
##$CPDPRG6= <mlev>
##$CPDPRG7= <mlev>
##$CPDPRG8= <mlev>
##$CPDPRGB= <>
##$CPDPRGT= <>
##$D= (0..31)
0 1 0 0 0 0 0 0 0 0 0 0.03 2e-05 3e-06 0 0 0 0 0 0 0 0 0 0 0 0 0 0 0 0 
0 0 
##$DATE= 1562062362
##$DBL= (0..7)
120 120 120 11 120 120 24 19 
##$DBP= (0..7)
150 150 150 150 150 150 150 150 
##$DBP07= 0
##$DBPNAM0= <>
##$DBPNAM1= <>
##$DBPNAM2= <>
$$ [...]
##$SUBNAM3= <"">
##$SUBNAM4= <"">
##$SUBNAM5= <"">
##$SUBNAM6= <"">
##$SUBNAM7= <"">
##$SUBNAM8= <"">
##$SUBNAM9= <"">
##$SW= 369.568048894756
##$SWIBOX= (0..15)
0 1 3 0 0 0 0 0 0 0 0 0 0 0 0 0 
##$SW_h= 29940.119760479
##$TD= 32768
##$TD0= 1
##$TE= 0
##$TE2= 300
##$TE3= 300
##$TEG= 300
##$TL= (0..7)
0 120 53 12 22 120 120 120 
##$TP= (0..7)
150 150 150 150 150 150 150 150 
##$TP07= 0
##$TPNAME0= <>
##$TPNAME1= <>
##$TPNAME2= <>
##$TPNAME3= <>
##$TPNAME4= <>
##$TPNAME5= <>
##$TPNAME6= <>
##$TPNAME7= <>
##$TPOAL= (0..7)
0.5 0.5 0.5 0.5 0.5 0.5 0.5 0.5 
##$TPOFFS= (0..7)
0 0 0 0 0 0 0 0 
##$TUNHIN= 0
##$TUNHOUT= 0
##$TUNXOUT= 0
##$USERA1= <user>
##$USERA2= <user>
##$USERA3= <user>
##$USERA4= <user>
##$USERA5= <user>
##$V9= 5
##$VALIST= <valist>
##$VCLIST= <CCCCCCCCCCCCCCC>
##$VD= 0
##$VDLIST= <DDDDDDDDDDDDDDD>
##$VPLIST= <PPPPPPPPPPPPPPP>
##$VTLIST= <TTTTTTTTTTTTTTT>
##$WBST= 1024
##$WBSW= 4
##$XGAIN= (0..3)
0 0 0 0 
##$XL= 0
##$YL= 0
##$YMAX_a= 9850
##$YMIN_a= -6565
##$ZGOPTNS= <>
##$ZL1= 120
##$ZL2= 120
##$ZL3= 120
##$ZL4= 120
##$ABSF1= 182.463
##$ABSF2= -187.1042
##$ABSG= 5
##$ABSL= 3
##$ALPHA= 0
##$AQORDER= 0
##$ASSFAC= 0
##$ASSFACI= 0
##$ASSFACX= 0
##$ASSWID= 0
##$AUNMP= <proc_1d>
##$AZFE= 0.1
##$AZFW= 0.5
##$BCFW= 0
##$BC_mod= 2
##$BYTORDP= 0
##$COROFFS= 0
##$CY= -3
##$DATMOD= 1
##$DC= 0
##$DFILT= <>
##$DTYPP= 0
##$F1P= 0
##$F2P= 0
##$FCOR= 1
##$FTSIZE= 65536
##$FT_mod= 6
##$GAMMA= 0
##$GB= 0
##$INTBC= 1
##$INTSCL= 5.30512e-09
##$ISEN= 30
##$LB= 1
##$LEV0= 0
##$LPBIN= 0
##$MAXI= 10000
##$MC2= 0
##$MEAN= 0
##$ME_mod= 0
##$MI= 50
##$NCOEF= 0
##$NC_proc= -6
##$NLEV= 6
##$NOISF1= 182.463
##$NOISF2= 159.3651
##$NSP= 0
##$NTH_PI= 0
##$NZP= 0
##$OFFSET= 182.463
##$PC= 4
##$PHC0= -2482.282
##$PHC1= -91.40109
##$PH_mod= 1
##$PKNL= yes
##$PPARMOD= 0
##$PSCAL= 0
##$PSIGN= 0
##$REVERSE= no
##$SF= 81.0140089999434
##$SI= 65536
##$SIGF1= 159.3651
##$SIGF2= -187.1042
##$SINO= 113.3802
##$SIOLD= 16384
##$SREGLST= <1H.CDCl3>
##$SSB= 0
##$STSI= 65536
##$STSR= 0
##$SW_p= 29940.119760479
##$SYMM= 0
##$S_DEV= 0
##$TDeff= 32768
##$TDoff= 0
##$TI= <>
##$TILT= no
##$TM1= 0
##$TM2= 0
##$TOPLEV= 0
##$USERP1= <user>
##$USERP2= <user>
##$USERP3= <user>
##$USERP4= <user>
##$USERP5= <user>
##$WDW= 1
##$XDIM= 65536
##$YMAX_p= 371741055
##$YMIN_p= -31853311
$$ End of Bruker specific parameters
$$ ---------------------------------
##NTUPLES= NMR SPECTRUM
##VAR_NAME=  FREQUENCY,     SPECTRUM/REAL,   SPECTRUM/IMAG
##SYMBOL=    X,             R,               I
##VAR_TYPE=  INDEPENDENT,   DEPENDENT,       DEPENDENT
##VAR_FORM=  AFFN,          ASDF,            ASDF
##VAR_DIM=   65536,         65536,           65536
##UNITS=     HZ,            ARBITRARY UNITS, ARBITRARY UNITS
##FACTOR=    0.456856943014862, 1,           1
##FIRST=     14782.0589164792, 0,            0
##LAST=      -15158.0608439998, 0,           0
##MIN=       -15158.0608439998, -31853311,   0
##MAX=       14782.0589164792, 371741055,    0
$$ Real data points
##PAGE= N=1
##DATA TABLE= (X++(R..R)), XYDATA
$$ [...]
40709 1153597 -372936 -1241214 -886553 -575358 -1447263 -2657333 -2671943 -1577613 -723904
40700 -723904 -623324 -591913 -192525 201134 144205 -534825 -1845465 -3235340 -3629017 -2879803
40690 -2879803 -2464620 -3423539 -4368780 -3256402 -568800 1299099 1567836 1739901 2619952
40681 2619952 3060897 2341259 1557142 1606890 1747554 1336263 1179913 1821391 2236846 1792598
40671 1792598 1863922 3688348 5998258 6758755 6098933 5462560 4891082 3442547 1548963
40662 1548963 507360 32162 -1237346 -2977137 -3461915 -2696174 -2610546 -3615834 -3611524
40653 -3611524 -1463944 937020 1518713 884090 727093 1117394 1088269 519420 -267170
40644 -267170 -1533993 -3073553 -3403974 -1894606 -500827 -1238404 -2968712 -3174274 -2149341
40635 -2149341 -2474135 -4474878 -5430511 -4045990 -2669994 -3473712 -4911911 -4123638 -1099077
40626 -1099077 1839766 3525740 4551702 5073873 4451044 3094524 2539227 3185702 3655799
40617 3655799 2986429 1989985 1702561 1820765 1684654 1763810 2929178 4806088 6012368
40608 6012368 5844232 4806281 3561508 2235695 911543 107760 377078 1663376 3201892
40599 3201892 3950706 3272224 1524575 -84026 -594052 -271140 -196697 -921152 -1897598
40590 -1897598 -2290408 -1925515 -1243900 -660530 -303930 -222944 -458673 -809660 -779694 -42895
40580 -42895 1035592 1626495 1373243 847525 715215 712577 137984 -687983 -444970 1259751
40570 1259751 2941353 3074891 2119572 1564764 1551866 970934 -274966 -893929 -472536
40561 -472536 -356828 -1356337 -2127938 -1220369 477087 1026317 417077 380047 1499013
40552 1499013 2402153 2054431 1133236 528387 -47846 -1078636 -2026773 -2121671 -1578654
40543 -1578654 -1088699 -679988 61409 1151196 2385555 3814452 5140582 5186702 3147118
40534 3147118 183280 -1408409 -734609 969020 2242226 2886473 3138786 2549675 713974
40525 713974 -1485840 -2519410 -2085775 -1490475 -1898018 -2818937 -2768184 -1125721 1132321
40516 1132321 2555391 2698526 2288444 2179283 2565135 3214475 3921592 4344000 3852001
40507 3852001 2288072 771401 862468 2612723 4209681 4130361 3001276 2502472 2933399
40498 2933399 3056125 2291970 1712270 2281754 3249321 3293681 2535933 2176563 2453030 2312280
40488 2312280 1262076 262645 203374 551919 391957 7619 288473 954592 664495
40479 664495 -959394 -2491502 -2373776 -688193 1284515 2686707 3557743 4026869 3874642
40470 3874642 3018310 1833372 686064 -476845 -1685232 -2313194 -1444308 935204 3467528
40461 3467528 4546926 3843354 2393981 1266487 618454 170631 -34530 127845 263818
40452 263818 -187858 -1051485 -1480032 -1036897 -210068 312849 426951 453514 623551 1019090
40442 1019090 1696137 2500914 2953226 2653363 1750028 796203 201149 -35443 -144905
40433 -144905 -294036 -405611 -190772 545514 1556589 2216181 2034536 1109637 68011
40424 68011 -460085 -441091 -528027 -1271641 -2171733 -2034236 -609381 770970 894987 388162
40414 388162 609271 1260302 686160 -1323266 -2771285 -2221485 -763316 -82312 53086
40405 53086 831854 1988944 2262182 1723102 1636169 2051372 1576976 17658 -670235 907264
40395 907264 3349222 4243910 3268426 2181480 2223277 2796501 2670827 1492461 -99626
40386 -99626 -1201004 -1236126 -212008 1362135 2840700 3732436 3746174 2914045 1769610
40377 1769610 991981 647179 160145 -718982 -1364116 -1069447 -40956 833842 961495
40368 961495 442755 -218526 -450260 28939 772118 829614 -124978 -1182411 -1228996 -314180
40358 -314180 627838 1188936 1816580 2710543 3215481 2677300 1364034 113970 -617945
40349 -617945 -1008250 -1359461 -1647519 -1508340 -550439 1204032 3131584 4440027 4837746
40340 4837746 4547383 3654000 1896811 -608203 -2865014 -3826271 -3672599 -3679421 -4591202
40331 -4591202 -5591416 -5315734 -3625138 -1802469 -965295 -863741 -585236 -11313 58276
40322 58276 -790015 -1736381 -1529192 62723 1896115 2587873 1900933 919510 793008
40313 793008 1398658 1552886 662243 -288942 83134 1637679 2722546 2261363 1115376
40304 1115376 872457 1730278 2250681 1170049 -1059327 -2699549 -2436769 -495949 1799801
40295 1799801 3312800 3806058 3587973 2918720 1977305 1010474 81233 -1060159 -2385230
40286 -2385230 -3200813 -3041226 -2640645 -3003816 -3575093 -2625853 108798 2439474 2256843
40277 2256843 121621 -1739199 -2317943 -2453862 -2931492 -3303956 -2836451 -1710266 -918697
40268 -918697 -1372428 -3130925 -5133544 -5850863 -4688545 -2624500 -1128546 -826573 -1569290
40259 -1569290 -3010824 -4288111 -3983809 -1788211 303329 38670 -2048056 -3332089
40251 -3332089 -2817891 -2180710 -2652477 -3033423 -1985121 -403168 255819 603435 2133205
40242 2133205 4190886 4464548 2508388 676765 947708 2492819 3348548 3223502 3356023
40233 3356023 4214000 4671086 3580413 1293479 -823481 -2005390 -2715183 -3594646 -4214689
40224 -4214689 -3431105 -1087478 1188734 1429213 -582655 -3107654 -4277884 -3705916 -2308878
40215 -2308878 -1094275 -414461 -76664 266554 853915 1632628 2170203 1948988 1058596
40206 1058596 497043 1235163 2773989 3301654 1925250 165450 157726 1674972 2422076
40197 2422076 1529449 1062849 3002441 6048753 7051641 4988781 1893002 -437
40189 -437 -459994 -419897 -419471 -581512 -1160655 -2263285 -3431044 -4007472 -3637852 -2217481
40179 -2217481 148932 2823216 4715302 5079879 4052541 2331735 711366 -35303
40171 -35303 563677 2119842 3444004 3515623 2290044 523631 -900433 -1464682 -1260560
40162 -1260560 -873395 -757319 -792153 -814553 -1292303 -2680709 -4188031 -4226215 -2453135
40153 -2453135 -464476 124529 -443206 -784550 -355945 170606 269759 458866 1619558
40144 1619558 3746634 5552528 5472580 3345419 928087 129344 777563 1003292 -67528
40135 -67528 -1238434 -1455265 -1745147 -3570670 -6037126 -6461429 -3763685 52578 2134635
40126 2134635 1516463 -682674 -2848788 -4067972 -4291041 -3946531 -3377989 -2561971 -1462351
40117 -1462351 -433365 133994 398370 792804 1282911 1469658 1353178 1334067 1395986 942971
40107 942971 -315543 -1775834 -2451902 -1823343 -199166 1449469 2168720 1936947 1678803
40098 1678803 1926198 1924438 848243 -571242 -837425 62406 575408 -97126 -1031472
40089 -1031472 -1391858 -1775235 -2905885 -4192882 -4653301 -4382756 -4071911 -3828558 -3508282
40080 -3508282 -3473360 -3894044 -3950512 -2947216 -1658203 -1252759 -1371794 -778732 354933
40071 354933 507650 -716916 -1796222 -1478092 -425605 -35821 -720083 -2007519 -3354159
40062 -3354159 -4137218 -3748209 -2474667 -1520474 -1388608 -1050263 337190 1667985 1211567
40053 1211567 -580187 -1104549 1064351 3948222 4219037 1146905 -2442205 -3429155 -1910237
40044 -1910237 -642579 -1287031 -2509764 -2353131 -1145788 -615989 -955894 -779365 117308
40035 117308 165128 -1198347 -2248239 -1628303 -412568 58883 671951 2714242 4874408
40026 4874408 4729809 2650456 1440997 2051268 2430246 1292050 283379 1000960 2170610
40017 2170610 1784031 397318 70015 1014689 1555365 994272 378683 344220 104778
40008 104778 -933646 -2108952 -2742057 -3201543 -3897400 -4152445 -3058693 -964194 763965
39999 763965 1291536 1022885 846739 1160816 1663398 1795438 1324642 617313 319794 746132
39989 746132 1687286 2769602 3682869 3993256 3225492 1570035 222559 373313 1767533
39980 1767533 2833457 2562527 1780079 1954198 3049644 3503182 2515299 1347949 1541082
39971 1541082 2531868 2267418 65893 -2362944 -3059938 -1906967 -53476 1696686 3008961
39962 3008961 3323428 2296764 714546 -162032 -236066 -625319 -1873161 -2988895 -2751457
39953 -2751457 -1383749 -343722 -640028 -1726068 -2033656 -501335 2302652 4539309
39945 4539309 4760021 3271183 1734146 1475767 2375565 3285900 3212618 2102190 800366
39936 800366 292272 716631 1075603 162860 -2126751 -4547246 -5595201 -4788180 -2924215
39927 -2924215 -1187712 -17110 1038704 2232380 2798773 1936293 452148 290846 2010064
39918 2010064 3841907 4040572 3088048 2442188 2126346 1212870 37070 -111810 540174
39909 540174 165949 -1752293 -3266033 -2618362 -552732 1086419 1760649 2026340 1991772
39900 1991772 1413543 719680 637674 1112365 1579951 1955161 2434961 2746488 2579661 2411379
39890 2411379 2854757 3418494 2972827 1385020 -301240 -1370123 -2174854 -3128847 -3725342
39881 -3725342 -3028989 -864229 1718017 3141711 2657378 1136354 207530 460982 1024685
39872 1024685 1108700 1093111 1478573 1668609 860715 -437024 -993705 -703999 -674648 -1450072
39862 -1450072 -2174081 -1773298 -336654 880884 590504 -1166737 -2626155 -1986093 145985
39853 145985 1134336 -76249 -1227918 -154950 1582584 914090 -1843999 -3379631 -2547044
39844 -2547044 -1765321 -2453614 -2479629 -103449 2386115 1802393 -996001 -2368832 -1199757
39835 -1199757 75106 -389187 -1485773 -1565318 -909290 -647347 -798520 -705984 -467972
39826 -467972 -666662 -1076642 -704958 823205 2566892 3209137 2455761 1270715 723628
39817 723628 842454 870122 473172 119681 152404 136973 -479760 -1547858 -2423662 -2515712
39807 -2515712 -1321266 1305940 4282928 5491953 3947471 1393744 604550 2149446
39799 2149446 3866516 3629943 1661228 -201157 -673471 49062 983021 1375672 1155350
39790 1155350 693629 228681 -338873 -990589 -1288705 -955128 -508287 -737578 -1575454
39781 -1575454 -2038217 -1404424 -67718 894255 751644 -295511 -1383089 -1894337 -2169259
39772 -2169259 -2981340 -4196033 -4599174 -3526567 -1963393 -1215434 -1101373 -586717 215385
39763 215385 138558 -925662 -1553848 -932764 -113484 -316229 -1161837 -1667599 -2006309 -2837571
39753 -2837571 -3485626 -2476960 92313 2324825 3104857 3432464 4307583 4672414 3038961
39744 3038961 375534 -622873 813732 2536404 2746311 2361082 2821109 3236748 1858953
39735 1858953 -585955 -1605821 -850815 -682193 -2254014 -3603662 -2988663 -1829640 -2250460
39726 -2250460 -3366545 -2601525 94072 1925103 1129419 -1031882 -2520587 -2859937 -2563212
39717 -2563212 -1778168 -460679 1007850 2122638 2649105 2408396 1273843 -416239 -1984868
39708 -1984868 -2977552 -3117930 -2092130 -231851 1036503 626967 -615576 -1076085 -791147
39699 -791147 -1052150 -1760741 -1261359 799217 2529010 2545807 1785466 1487439 1195838
39690 1195838 212338 -526518 192801 1664176 2144828 1279909 202500 -179270 308923
39681 308923 1626437 3179901 3627607 2477462 1302078 1815407 3214359 3127260 986324
39672 986324 -1262444 -1877442 -1155823 -297279 108575 3047 -535383 -1062496 -985438 -349513
39662 -349513 260536 591554 622825 -236605 -2543689 -5207607 -5829314 -3299131 845431
39653 845431 4133837 5373682 4786554 3061437 1103003 -35715 83358 821142 1248757
39644 1248757 1084154 541592 -228409 -1070216 -1578588 -1398354 -588693 528401 1627095
39635 1627095 2403217 2747059 2985801 3482922 3892252 3347444 1564771 -727932 -2561095
39626 -2561095 -3401524 -3085897 -1849233 -568102 -177933 -604244 -1018228 -1252466 -1893986
39617 -1893986 -2698291 -2320791 -477982 928656 197016 -1588459 -1967512 -614356 320739
39608 320739 -577925 -2125610 -2455223 -1448904 -326786 294140 826356 1539024 1943020
39599 1943020 1503101 446731 -359548 -199978 822896 1800258 1799619 814610 -117712 89565
39589 89565 1467445 2991081 3684764 3606400 3629886 4265854 4876774 4296928 2232806 -270656
39579 -270656 -1963976 -2687166 -3106009 -3364937 -2754167 -1002404 769350 1123559 115795
39570 115795 -757739 -526728 98034 -48632 -840459 -1081180 -203616 1024571 1512824
39561 1512824 924445 -341333 -1591823 -2051200 -1270919 254657 1324760 1280545 685263
39552 685263 484947 913132 1509942 1701012 1001603 -700337 -2503642 -2805042 -1047476
39543 -1047476 1361713 2706430 2953517 3051872 2887197 1533070 -594919 -1619926 -740187
39534 -740187 598744 801578 88933 -547830 -1136874 -2191876 -3232676 -3289512 -2528072
39525 -2528072 -2075943 -2328646 -2547164 -2149906 -1378537 -583265 165867 547169 51058
39516 51058 -998541 -1342500 -327043 1068504 1401758 495102 -720562 -1714102 -2761512
39507 -2761512 -3847565 -4170153 -3293681 -2150934 -2072099 -3006222 -3543976 -2887919 -2048531
39498 -2048531 -2536578 -4336786 -5924984 -6183927 -5541538 -4985821 -4599828 -3652180 -1903681
39489 -1903681 -201761 417673 -112149 -933195 -1324391 -1321144 -1210643 -934204 -460729 -348372
39479 -348372 -1079622 -1888527 -1302487 746171 2363387 2029528 654318 246231 1172022
39470 1172022 2054023 2056928 1768809 1682563 1234604 -107797 -1876198 -3294655 -4094904
39461 -4094904 -4182060 -3385689 -2090879 -1251407 -1122275 -736415 692562 2554934 3695521
39452 3695521 3758671 2982866 1481706 -281087 -986160 311734 2696195 4237605 4239976
39443 4239976 3652109 3310483 2913009 2049617 1262666 1366482 2139132 2351257 1146327
39434 1146327 -890168 -2209234 -1881423 -591539 139501 -364132 -1372379 -1800196 -1277360
39425 -1277360 -117534 1060685 1385346 165629 -2137794 -3942922 -4186121 -3478425 -3005006
39416 -3005006 -2785649 -1904579 -223021 1078119 841369 -728788 -2257136 -2500233 -1479746
39407 -1479746 -448246 -557038 -1513548 -1943627 -1137761 172719 956434 1032847 706145
39398 706145 48656 -861283 -1630826 -2041957 -2269091 -2251548 -1707331 -1170385 -1819278 -3568147
39388 -3568147 -4678672 -4306060 -3960644 -4953974 -5881311 -4775520 -2658302 -2334650 -4109917
39379 -4109917 -5444466 -5018674 -4450556 -5205217 -6185668 -5669332 -3853895 -2140493 -1191591
39370 -1191591 -829940 -710208 -80672 1973033 4963981 6697948 5652286 2873581 551638
39361 551638 -465162 -741738 -709728 -323211 188108 392727 381960 608694 1066792 1208518
39351 1208518 647369 -343340 -911826 -223526 1593015 3158107 3135740 1755075 320487
39342 320487 -506943 -816347 -190473 1864967 4065368 3972621 1274151 -1426007 -2108759
39333 -2108759 -1731735 -1797244 -1580993 123986 2090192 2055305 208427 -1209653 -1380832
39324 -1380832 -1570972 -2394954 -2826429 -2355893 -2007319 -2446138 -2813054 -2307240 -1491295
39315 -1491295 -1134526 -1013804 -822020 -1174118 -2558152 -3994179 -3917185 -2173197 -252207
39306 -252207 462659 47003 -488650 -599029 -631450 -852915 -642449 601002 1925014
39297 1925014 1405151 -1218409 -3634547 -3685101 -2044547 -916753 -915966 -918648 -477466 -376903
39287 -376903 -780808 -819040 -446216 -859860 -2348148 -3428174 -3097311 -2401543 -2571682
39278 -2571682 -2971226 -2362651 -1160202 -783818 -1399119 -1876940 -1666557 -1235347 -775168
39269 -775168 114253 1318658 2009167 1842910 1390612 1094346 688666 -39095 -751470
39260 -751470 -1206050 -1667926 -2269335 -2601953 -2356223 -1768183 -1044291 -11249 1167858
39251 1167858 1655718 1070273 376227 741589 1884231 2518526 2180742 1531945 972954
39242 972954 228880 -505854 -366476 645577 1132073 170561 -1266964 -1718854 -1140132
39233 -1140132 -335383 547850 1539594 1682953 141557 -1965526 -2745273 -2366596 -2652916
39224 -2652916 -3784313 -3806201 -2092833 -841699 -1729598 -3203125 -2963593 -1457298 -720956
39215 -720956 -995033 -871434 -96029 199711 -132909 78095 1096810 1705088 1283502
39206 1283502 732392 785560 984394 971166 1302822 2085311 2083767 392186 -1764118 -2085193
39196 -2085193 107263 2987967 4101775 2799935 776162 239893 1615899 3325817
39188 3325817 3837884 3198550 2162273 819822 -898976 -2150811 -1977126 -805749 96219
39179 96219 326317 275057 -119652 -986230 -1364641 -366545 751488 -71813 -2146699 -2328372
39169 -2328372 396742 3127178 3192011 1807827 1697801 2887208 3230580 2056600 890652
39160 890652 888259 1578895 2196918 2617978 2770360 2435243 1914423 1891935 2392197 2637575
39150 2637575 2050803 762604 -821832 -2263807 -2941748 -2395127 -959120 415909 1020591
39141 1020591 745499 -200609 -1411703 -2226333 -2103781 -1206856 -366245 -357911 -1169311 -1833677
39131 -1833677 -1131962 1129183 3619620 4807454 4699881 4554359 4943300 5149164 4659776
39122 4659776 4024867 3610275 2628783 399506 -2155856 -3306921 -2492818 -800636 258544
39113 258544 -55429 -1416075 -2872649 -3735882 -4058662 -3939537 -2819520 -477193 1661701
39104 1661701 1787663 290347 -723040 -719543 -1347566 -3039419 -3545464 -1472420 962840
39095 962840 948845 -851182 -1708651 -1043584 -629091 -1403862 -2642852 -3802395 -4713442
39086 -4713442 -4278682 -1526529 2047286 3610113 2643550 1221677 523072 -468356 -2347159
39077 -2347159 -3917629 -4372427 -4597883 -5161718 -5020066 -3589209 -2348654 -2807436 -4199695
39068 -4199695 -4736073 -4098170 -3178564 -2142503 -345236 2058960 3691072 3339700 1264694
39059 1264694 -919542 -1595716 -697977 160810 -373200 -1658367 -2174024 -1934416 -2255558
39050 -2255558 -3207615 -3230257 -1790751 -507171 -642757 -1192820 -749481 212648 431183
39041 431183 29353 -66875 38621 -270239 -390778 841587 2917967 3807637 2609173
39032 2609173 700905 -121055 469990 1739239 3148216 4437497 5035606 4268273 2238556
39023 2238556 59686 -1062259 -933747 -387200 -165361 -90022 411237 1277313 1819542
39014 1819542 1586627 681247 -622514 -1920041 -2474853 -1815652 -585526 33203 -131385
39005 -131385 -98234 698017 1598336 1775858 1230182 337624 -767515 -1864623 -2373379
38996 -2373379 -1926998 -798636 476195 1433524 1626803 943909 32437 -328178 -244312
38987 -244312 -271288 -181398 629417 1605554 1394948 -37162 -1148015 -1035442 -449628 -207932
38977 -207932 -195051 -436232 -1430369 -2712383 -2858199 -1775158 -1155211 -1661933 -1664411 -61920
38967 -61920 1700426 2092625 1942410 2406322 2490525 1138693 95917 1599379 4233390
38958 4233390 4372247 1510877 -907618 -298594 2077239 3526231 3073853 1457353 -191620
38949 -191620 -865484 -236369 775571 1002726 563951 222155 -346323 -1919822 -3688143
38940 -3688143 -3897950 -2542053 -1312315 -733093 407159 2356321 3497624 3027237 2410448
38931 2410448 3010884 4033866 4018827 2888501 1437319 151452 -530990 -206865 357713
38922 357713 -381161 -2269117 -3058627 -1677185 -145581 -686901 -2533329 -3517673 -3528335
38913 -3528335 -4135682 -5508381 -5967762 -4558183 -2275351 -560809 128535 201480 484607
38904 484607 1823517 4110818 5859649 5744101 4356239 3395458 3361544 3248624 2418523
38895 2418523 1459579 965689 637001 45174 -617897 -1073999 -1550698 -2287649 -2905415
38886 -2905415 -2802110 -1984736 -1093570 -597244 -215721 678164 2085388 3060411 2657051
38877 2657051 1047668 -739352 -2091733 -3174255 -3983381 -3903793 -2634613 -877135 437719
38868 437719 1098501 1335191 1167567 622366 155486 242170 786552 1312067 1423816 872814
38858 872814 -295762 -1409235 -1667455 -1281408 -1303983 -1979372 -2293130 -1703519 -1109220
38849 -1109220 -1250945 -1433231 -1016815 -884716 -1812888 -2541854 -1543062 106014 50601
38840 50601 -1448693 -1614103 536948 2634834 2665116 1782738 1914524 2659949 2585163 2000827
38830 2000827 2082944 2193579 624657 -2194300 -3606638 -2265636 161937 1484959 1522427
38821 1522427 1267096 963797 259483 -675970 -1439762 -2239358 -3316944 -3964303 -3297357
38812 -3297357 -1851170 -1268073 -2285336 -3937832 -4876262 -4613621 -3341185 -1497500 102215
38803 102215 611676 195934 32375 739993 1499579 1316175 403704 -463730 -1270715 -2410022
38793 -2410022 -3509404 -3753707 -3155721 -2419416 -1662569 -417955 1048273 1611784 836942
38784 836942 -323746 -813132 -646137 -370727 -104499 343146 912081 1339869 1445112
38775 1445112 1127302 453014 -160954 -309211 -177522 -277121 -739323 -1516254 -2918600
38766 -2918600 -4820947 -5583633 -3468628 463915 2610042 1001743 -2108234 -3065756
38758 -3065756 -1136337 1379480 2512089 2471488 2399262 2741076 3101626 2855685 1720962
38749 1720962 161808 -919276 -1212469 -1283195 -1497671 -1442030 -990705 -1007016 -2038752
38740 -2038752 -3179106 -3382031 -3128562 -3418105 -3794099 -3054582 -1558544 -976042 -1683360
38731 -1683360 -2203979 -1642528 -975409 -1157339 -1436161 -702621 516813 754180 -159070
38722 -159070 -772836 -35413 1226058 1297546 -246025 -1851154 -1700519 142769 1833939
38713 1833939 1980730 1020123 43335 -836424 -2087371 -3372828 -3678318 -2638917 -861957
38704 -861957 904808 2159239 2508875 2052150 1650848 1933350 2339821 2128115 1897195
38695 1897195 2824821 4635925 5754919 5457767 4470297 3393002 2065073 735411 291216
38686 291216 804080 1224447 1028325 814435 803634 301495 -664802 -817083 277388 1136337
38676 1136337 604607 -299565 -218295 260493 -57516 -493956 482798 2364914 2959298
38667 2959298 1583494 -91238 -636921 -503479 -595123 -866599 -1046904 -1339461 -1542523
38658 -1542523 -715019 1235756 2642748 1991160 106314 -822905 -90662 867643 629420
38649 629420 -545975 -1460870 -1406836 -374100 1327171 2934037 3311203 2075183 419318
38640 419318 -31802 849932 1732375 1816732 1796519 2448209 3243139 3138600 2090108 923521
38630 923521 169128 -127363 145009 931512 1521419 1319218 930251 1394570 2437305
38621 2437305 2702451 1817553 919219 797540 848225 468165 217017 698815 1372209 1556708
38611 1556708 1742198 2640087 3543709 3031568 1104142 -683524 -1341324 -1585946 -2514260
38602 -2514260 -4000086 -4935546 -4559127 -3085748 -1348103 -238957 -300985 -1347960 -2359268
38593 -2359268 -2151061 -598300 906637 774941 -840492 -2076293 -1742904 -884352 -1059947
38584 -1059947 -1787436 -1185940 1043481 3012571 3374563 2978944 3041177 3267167 2992742
38575 2992742 2784962 3301457 3557947 2150266 -361156 -2096461 -2564440 -2832268 -3061208
38566 -3061208 -2044612 187441 1373735 -18505 -2326072 -2874620 -1726947 -1354175
38558 -1354175 -2813164 -4197840 -3481833 -1372668 -166055 -614416 -1304678 -945262 33785
38549 33785 504199 237595 -211032 -581488 -1061470 -1623233 -1898730 -1670982 -1068776 -430310
38539 -430310 -286724 -1051360 -2222742 -2465025 -1281510 -44029 -235402 -1124336 -696585
38530 -696585 1203419 2418862 1597916 76173 -224771 696698 1710882 2633593 3968442
38521 3968442 5226941 5062950 3062431 375672 -1471506 -1761461 -773809 565549 1341171
38512 1341171 1360628 1000360 261653 -1250397 -3072270 -3689846 -2472572 -930945 -949101
38503 -949101 -2365227 -3418067 -3153989 -2282418 -1920043 -2506423 -3789432 -4997242 -5167855
38494 -5167855 -4033003 -2363915 -906344 484282 1971585 2779511 2177318 840872
38486 840872 46470 -71747 -262249 -509923 36608 1543657 2996308 3289212 2121000
38477 2121000 90809 -1425287 -1136313 500328 1250830 -104766 -1836520 -1581820 329596
38468 329596 1747796 2074045 2368965 2510922 1058293 -1686430 -3180540 -2220481 -789207
38459 -789207 -1117271 -2804670 -4186115 -4863015 -5358519 -5566674 -5079528 -4183078 -3333119
38450 -3333119 -2453981 -1679992 -1765142 -2761891 -3385271 -2809604 -2033318 -2228923 -2763467 -2273971
38440 -2273971 -874716 206244 592448 908760 1391359 1701664 1814802 1868836 1448340
38431 1448340 204500 -1159069 -1747314 -1956608 -2736198 -3671740 -3422703 -2117421 -1630605
38422 -1630605 -2951643 -4680303 -4905897 -3494939 -1692725 -388504 221556 -86468 -1428408
38413 -1428408 -3098317 -3990166 -3917721 -3825286 -4445403 -5333432 -5613718 -5211932 -4765881 -4525088
38403 -4525088 -3999334 -2787145 -1202963 129393 835280 712691 -351714 -1981031 -3303235
38394 -3303235 -3824695 -3867836 -3706137 -2944879 -1482113 -310953 -198476 -154874 1239428
38385 1239428 3208306 3296696 869569 -1646372 -1874898 -384574 706985 866504 1354285
38376 1354285 2840418 4315631 4478097 3210189 1464490 324076 316289 1144979 1917983
38367 1917983 1946390 1431068 1155266 1462583 1787469 1393976 461666 28967 584667 1139784
38357 1139784 461736 -948283 -1289296 -125653 835683 442725 -20488 832819 1748583
38348 1748583 722039 -1288836 -1378356 686146 1834808 387509 -1424583 -1042502 657688
38339 657688 1095463 -190061 -1481495 -1619948 -955291 -161042 371584 328356 -173027
38330 -173027 -379851 88173 562043 402145 44047 181279 686882 1172443 1775038 2481715
38320 2481715 2536835 1552790 449556 251511 649095 774813 699933 1043904 1670964 1909026
38310 1909026 1695918 1526131 1517154 1306387 654865 -347479 -1320652 -1553320 -571690 939068
38300 939068 1586778 1004317 262991 244918 626390 832926 857877 682822 30643 -856767
38290 -856767 -1291386 -1230597 -1080430 -470481 1074480 2294758 1277731 -1267899 -2227266
38281 -2227266 -236654 2723883 4527070 5091736 4657803 2815518 363396 -784878
38273 -784878 -683682 -1285203 -2350675 -1231146 1953009 3365267 1729627 761939 2538418
38264 2538418 3516777 952559 -1747178 -824190 1317499 784175 -887875 -373748 857985
38255 857985 -16796 -870518 1414828 4205016 3625510 2332364 4856948 8715402 8976961
38246 8976961 8129637 11336725 15419800 14413982 12930226 19936198 31925556 40221628
38238 40221628 54780275 97123970 160763409 201373458 184308233 127218067 76812610
38231 76812610 54629431 46297511 36059926 26683115 23920312 23285291 20102387 17923991
38223 17923991 19260766 19005138 13876795 9159297 9590510 11375428 9393331 5569076
38215 5569076 4030660 3661541 1432705 -1349748 -1595283 230679 1842315 3123477
38207 3123477 4584607 4910446 3530395 2676790 3714838 4387000 2695275 495281 228372
38198 228372 1033045 1087626 924698 1406741 1232699 -419746 -1388311 211200 2604412
38189 2604412 3227786 2636706 2582447 2526313 1214381 -356200 -686447 -651382 -1644363 -2617524
38179 -2617524 -1880208 -128893 1127398 2336391 4207258 5193023 3890365 2199737
38171 2199737 2663257 4169009 3878990 2118515 1510593 2148394 1651840 -245120 -1070249
38162 -1070249 94919 1167836 597415 -590655 -1021250 -703058 116179 1469801 2410998
38153 2410998 1476162 -845837 -2112860 -1149451 524489 1166549 972849 953490 1182868
38144 1182868 1159154 874210 706897 841197 1145598 1187412 514201 -515136 -723072 207835
38134 207835 817761 -148170 -1658983 -1874060 -961795 -537360 -806096 -442310 821013
38125 821013 1705922 1709808 1804723 2359478 2324701 1151500 -203684 -885181 -1182470 -1323774
38115 -1323774 -791795 418380 1340106 1607862 2056065 2956454 3168149 2049220 752373
38106 752373 360598 42891 -1416499 -3286791 -3832024 -2989937 -2321865 -2422145 -2100629
38097 -2100629 -516262 1342498 2123220 2040620 2268306 2899558 2712241 1084160 -875157
38088 -875157 -1679242 -1275331 -744942 -676502 -825826 -1180302 -2170538 -3638812 -4699108
38079 -4699108 -4951023 -4738518 -3866077 -1474885 2050068 4529868 4571569 3445511 2983936
38070 2983936 2862183 1788968 302027 10796 575457 18878 -1831536 -2727881 -1504029
38061 -1504029 76299 113791 -666804 -418770 938719 1925591 1788097 1183105 1020757
38052 1020757 1704489 3159159 4692266 5132859 3948499 2053731 880760 851667 1278759
38043 1278759 1454921 1231406 725008 53636 -664994 -1419571 -2309055 -3178532 -3518384
38034 -3518384 -3137227 -2721224 -3158347 -4241637 -4548333 -2986047 -285063 1496780 1092804
38025 1092804 -728030 -2333422 -3156561 -3693954 -3906423 -2952028 -902602 587989 322645
38016 322645 -666000 -580431 568075 1205201 642507 -165751 -335368 -217358 -525484 -1256550
38006 -1256550 -1850233 -1819664 -1066928 -13161 712324 1130523 1994523 3424915 4233154
37997 4233154 3587626 2498384 2245274 2152975 827903 -939618 -872180 1116404 2337641
37988 2337641 1085226 -1103972 -1809664 -518607 1772986 3851936 4221652 1795238
37980 1795238 -1940947 -3341196 -909294 2395329 2990882 1288856 310221 989723 1513762
37971 1513762 753650 -323449 -793987 -1046881 -1462248 -1687147 -1747449 -2255244 -2966136
37962 -2966136 -2654902 -1090705 256417 285278 -155099 354723 1834590 3256918 4057305
37953 4057305 4273925 3752156 2293375 411869 -921014 -1292863 -1030721 -453551 447492
37944 447492 1552085 2405433 2692263 2568000 2307938 1880355 1099294 36127 -980353
37935 -980353 -1718404 -2159049 -2261316 -1885950 -1068015 -130594 657093 1345593 2030123 2520227
37925 2520227 2559100 2195463 1646895 1012745 495419 634894 1724776 3080994 3518865
37916 3518865 2629011 1070277 -395785 -1537476 -2261697 -2329445 -1790213 -1173123 -909500
37907 -909500 -899909 -770641 -136657 1385580 3752859 5918268 6416068 4926199 2740188
37898 2740188 1338988 970507 881497 422436 -404903 -1090416 -1099455 -575939 -504282 -1565102
37888 -1565102 -2936280 -3078327 -1670517 243016 1985544 3754009 5178676 5043442
37880 5043442 3241977 1528927 1203698 1279617 205207 -1695815 -2954495 -3270664 -3515620
37871 -3515620 -3907973 -3685988 -2453193 -706046 833860 1568514 1137339 76598 -218512
37862 -218512 789543 1746979 1242226 -21793 -267113 732864 1594960 1484027 773181
37853 773181 -143446 -1093557 -1363341 -289080 1440513 2498642 2685358 2450703 1182718
37844 1182718 -1892755 -5305297 -6334921 -4780895 -3307086 -3409626 -3611946 -2735512 -2272959
37835 -2272959 -3626263 -5175375 -4437534 -1665881 980425 2688138 4062058 4793514
37827 4793514 3791539 1469204 -315744 -774313 -830507 -1105365 -1010552 -177571 820904
37818 820904 1646675 2653538 3639521 3518833 1977213 314193 -174601 261394 653763
37809 653763 773962 838134 500313 -675552 -1998883 -2020726 -333848 1710433 2448196
37800 2448196 1699260 755710 698075 1130985 875969 -288286 -1222947 -1070309 -662922
37791 -662922 -1461683 -3314845 -4308500 -3148928 -871804 392305 -147215 -1326744 -1562006
37782 -1562006 -460206 1002262 1533967 771647 -390673 -853392 -672332 -889879 -1845054
37773 -1845054 -2365896 -1283982 730058 1713219 691495 -1312059 -2538051 -2100360 -371921
37764 -371921 1449724 2028859 948280 -605926 -916485 197409 1184378 1075101 1006286
37755 1006286 2487126 4870414 5849983 4303929 1474661 -758180 -1713435 -1752680 -1278118
37746 -1278118 -455847 632854 2005250 3552966 4615371 4320655 2599871 350876
37738 350876 -1571007 -2893083 -3309879 -2264998 62872 2286929 3101839 2656784 2056743
37729 2056743 1901623 1896053 1517289 481407 -1109994 -2551952 -2855524 -1842406 -524314
37720 -524314 134985 316754 608514 867298 743646 711014 1341950 1937021 1296681 -180330
37710 -180330 -659108 502322 1648347 1101176 -496055 -1103348 10159 1452956 1508428
37701 1508428 75622 -1359343 -1459673 -560666 -226407 -1165611 -2104205 -1420072 457700
37692 457700 1426185 624201 -285492 528970 2437320 3233429 2156775 712348 402683
37683 402683 858209 824239 105500 -501861 -834576 -1645677 -2929474 -3091826 -808860
37674 -808860 2800645 5017188 4520974 2576902 1137640 802682 963402 917284 265308
37665 265308 -916751 -1713671 -1051680 650561 1523198 735970 -138461 657948 2514237
37656 2514237 3486949 3039917 2169638 1424565 532250 -326517 -599167 -630185 -1253225 -2143113
37646 -2143113 -2132466 -1182614 -466798 -430673 -377852 -93109 -179904 -541065 -248782 693230
37636 693230 1139741 768602 541458 740316 374011 -795182 -1441651 -713383 594668
37627 594668 1654612 2632626 3371628 3069174 2215812 2624453 4231108 4246953 1335663
37618 1335663 -1657170 -1551651 527870 1184098 -59409 -783262 -117541 121391 -1170631
37609 -1170631 -2687282 -3019292 -2489971 -2030766 -1888904 -1918421 -1772275 -654011 1693188
37600 1693188 3763020 3667617 1805164 454966 581910 915323 609448 807791 2522391
37591 2522391 4527601 4775496 3123166 1481103 1534231 3054040 4401511 4351785 3340447
37582 3340447 2756243 3032129 3138274 2335805 1446987 1505203 2098897 2289254 2317023 2879728
37572 2879728 3416681 2871162 1696960 1255272 1490939 1109860 -75315 -949514 -1237027
37563 -1237027 -1810535 -2724205 -3012118 -2709433 -2916332 -3431590 -2606317 -248961 1630797
37554 1630797 1944043 2098184 3195383 3912275 2862684 1111217 367390 269105 -470890
37545 -470890 -1532802 -1796910 -1701800 -2531208 -3890616 -4050380 -2629701 -1024326 -147411
37536 -147411 490985 1223040 1352087 390818 -1012958 -1993395 -2492204 -2841417 -2940578 -2456359
37526 -2456359 -1628249 -1359229 -2244445 -3643502 -4243881 -3845548 -3883236 -5313526 -6681642
37517 -6681642 -5848814 -3355466 -2012897 -2791670 -3371807 -1874098 110865 11827 -1870814
37508 -1870814 -3195206 -3201335 -3205208 -3943293 -4557279 -4212108 -3026895 -1409132 45863
37499 45863 170239 -1588382 -3602073 -3438198 -1101258 714389 82130 -1970779 -3390991
37490 -3390991 -3729034 -3767590 -3644924 -2780563 -1301311 -292409 -420299 -1057096 -1148100
37481 -1148100 -547919 -30331 -86795 -291451 -117228 185842 156313 118718 668458 1400957
37471 1400957 1334961 574405 162701 94393 -871091 -2818453 -3875920 -2896765 -1311457
37462 -1311457 -887731 -1133309 -647954 271733 459300 319370 1125048 2391565 2276464
37453 2276464 531959 -1051822 -1309102 -912088 -687723 -512058 -275469 -367803 -758707
37444 -758707 -928565 -996380 -1610074 -2534588 -2728305 -2039443 -1449463 -1374888 -1060748 47572
37434 47572 1525381 2737741 3306612 2931768 1953008 1707855 2810224 3587490 2156990
37425 2156990 -456690 -1674749 -1445234 -1974387 -3290007 -2605695 843372 3800425 3690298
37416 3690298 2299253 2426937 3495435 3274334 1919498 1246685 1317343 652735 -958454
37407 -958454 -2396617 -3293130 -3905293 -3610985 -1811895 226469 654479 -289443 -915565
37398 -915565 -782812 -618814 -227253 1047195 2184678 1446994 -619846 -1715738 -1393937
37389 -1393937 -1492447 -2636606 -3056938 -1683491 150837 1213205 2231112 3856104 4842213
37380 4842213 3960810 2186419 1305623 1497056 1757970 1737235 1773536 1950079 2319560 3244119
37370 3244119 4380358 4231433 2004197 -827715 -2136856 -1725166 -984104 -503443 448466
37361 448466 2127995 3406164 3067955 1223060 -878439 -1953995 -1563449 -383502 312349
37352 312349 -185160 -1355574 -2178622 -2375769 -2566988 -3247003 -3967441 -3745550 -2297986
37343 -2297986 -694664 -365363 -1305470 -1896169 -1045096 205480 201676 -797002 -1066117
37334 -1066117 -128870 699318 627087 412574 510163 40736 -1346220 -2183516 -1101087
37325 -1101087 1172778 2983921 3805468 3891247 3109088 1608752 556320 587832 541645
37316 541645 -562960 -1393570 -296654 1459440 1017649 -1769952 -3969610 -3666880 -1978895
37307 -1978895 -545728 478951 1066512 354631 -1557703 -2827478 -2465722 -2080987 -3317707
37298 -3317707 -4964807 -4608959 -2228222 -57349 689534 948747 1623446 2098130 1504687
37289 1504687 172099 -948104 -1521093 -1791953 -1762525 -1090057 220994 1482479 1940125
37280 1940125 1607979 1153653 879345 303998 -851683 -1803515 -1604402 -544649 325825
37271 325825 823907 1550288 2225312 1599272 -566297 -2797923 -3786952 -3714390 -3129940
37262 -3129940 -1976476 -616565 -330199 -1495128 -2491971 -1824996 -279073 485845 460339
37253 460339 746099 1349809 1359714 814499 638274 1011276 1340564 1486867 1571772 1140538
37243 1140538 127314 -74065 1530188 3276236 2789929 767662 177941 1772990 3238498
37234 3238498 3121960 2604210 2570554 1985807 571687 213152 1767534 2954903 1674260
37225 1674260 -618642 -1187912 76188 1441328 2448288 3576685 4014487 2628869
37217 2628869 514092 -141808 579791 619333 -570489 -1344355 -837277 -241488 -611844
37208 -611844 -1417332 -1871675 -1979215 -1712801 -731401 557870 1103071 838791 854647 1561363
37198 1561363 2076968 1806638 1208987 598495 -312204 -1155226 -729382 1140248 2868120
37189 2868120 3075269 2243056 1702960 1960575 2640044 3148202 2861488 1573196 138706
37180 138706 -326377 -120510 -582545 -1831848 -2461926 -1926277 -1415961 -1563757 -1189248
37171 -1189248 405685 1664774 964530 -836852 -1820505 -1803628 -1826488 -1831302 -958640 423850
37161 423850 1091830 1124182 1703353 2747566 2636682 623316 -2057423 -3836065 -4212959
37152 -4212959 -3345182 -1744759 -673533 -1174489 -2111859 -859113 3040974 6414414 6125804
37143 6125804 3161017 1323911 2363637 4221357 4263937 2560892 1100994 915376 1240287
37134 1240287 1116369 586093 120290 -219559 -552776 -689565 -424081 21076 324880
37125 324880 537621 747180 659824 162163 -57065 682379 1813259 2094462 1411773 905231
37115 905231 1099865 1103379 220258 -708557 -455570 782723 1569815 842843 -1232435 -3597247
37105 -3597247 -5004329 -4861464 -3839950 -3187339 -3120398 -2581959 -990922 635781 997076
37096 997076 190920 -733841 -1320931 -1953116 -2933826 -4022144 -4637167 -4184780 -2678737
37087 -2678737 -1246559 -1181991 -2196668 -2690772 -2159844 -1934562 -2838516 -3767048 -3769006 -3838796
37077 -3838796 -4909690 -5547134 -3847377 -665399 1336344 1261189 409030 -333192 -1148232
37068 -1148232 -1574364 -633891 1089433 1738807 941561 274303 657094 1323676 1739511
37059 1739511 2384395 3091257 2806684 1741768 1570930 2576411 2814304 1303421 -142286
37050 -142286 217928 1340067 1332609 412218 -6119 209823 314256 458127 1086687 1423057
37040 1423057 482088 -1004690 -1432362 -588251 512592 1466916 2462582 2903269 1871300
37031 1871300 -170306 -1714001 -2180455 -2195056 -2106234 -1675927 -1099270 -850728 -552128
37022 -552128 549858 1947511 2203142 1127927 226247 591048 1585596 2067857 1876066
37013 1876066 1621763 1822636 2586433 3481677 3595735 2417162 623131 -763247 -1728539
37004 -1728539 -2745441 -3255179 -2194250 -31274 1425143 1643535 2106284 3717937 5109847
36995 5109847 4627203 2646007 643284 -853864 -1924976 -1907962 -270279 1651523 1711869
36986 1711869 -170588 -1889453 -2208235 -2271502 -3333478 -4527359 -4235426 -2712781 -1748351
36977 -1748351 -2018941 -2309803 -1573538 -414153 111499 103499 268036 447025 -129399 -1331303
36967 -1331303 -2004928 -1528937 -537202 279601 1223057 2769493 4294644 4493474 2995370
36958 2995370 910061 -397376 -713918 -951039 -1839582 -2888237 -2862194 -1307130 770797
36949 770797 2003044 2007289 1166012 -342825 -2246850 -3251647 -1980944 742638 2019515
36940 2019515 235419 -2761714 -3961641 -2832316 -1367038 -1060724 -1354869 -1106158 -277727
36931 -277727 331704 313852 122052 521312 1637607 2499146 1915903 77328 -1351519
36922 -1351519 -1271098 -581138 -739933 -1588036 -1832598 -1271090 -1023121 -1475986 -1484532 -213679
36912 -213679 1321093 1409495 -202979 -2021525 -2444184 -1259437 396497 1276420 1094707
36903 1094707 368686 -495841 -1358150 -1644054 -590852 1240621 1838080 264290 -1587102
36894 -1587102 -1290191 625508 1287328 -551107 -3056517 -4157204 -3971826 -3602855 -3162683
36885 -3162683 -2274901 -1424197 -1408941 -1995459 -2240079 -1795997 -969775 181821 1786953
36876 1786953 3216098 3130376 896080 -2388729 -4611017 -4433007 -2381771 -197275 808713
36867 808713 583500 -282951 -1288242 -1839094 -1230233 306495 1129375 -99696 -2520686
36858 -2520686 -4015050 -3807285 -2923620 -2279791 -1786524 -1379393 -1331753 -1234977 -266001 1045536
36848 1045536 979022 -708575 -1945746 -1239447 146282 238252 -814612 -1578515 -1856849
36839 -1856849 -2451287 -3074216 -2527312 -895448 178796 -312452 -1618928 -2615417 -3139751
36830 -3139751 -3485062 -3466493 -2622196 -961947 836073 1854324 1614822 548804 -379864
36821 -379864 -712020 -813410 -981291 -880057 -316937 147594 92359 92636 754029 1362819
36811 1362819 563756 -1777927 -4285090 -5557053 -5246196 -3875345 -2376749 -1660705 -1870465
36802 -1870465 -2126858 -1589101 -535469 161787 166439 -452377 -1858919 -3839964 -5012321
36793 -5012321 -4056103 -1714101 -244370 -684122 -1816854 -2087710 -1364846 -415007 207256
36784 207256 125928 -993665 -2717539 -3657940 -2857132 -992221 451223 906926 1016953
36775 1016953 1400730 1813472 1679558 1021794 467977 364991 284881 -237702 -749482 -384981
36765 -384981 614766 848886 -240551 -1228530 -535127 1264163 2168440 1455681 351525
36756 351525 7163 93173 -257909 -1162769 -2163108 -2978534 -3621971 -4191709 -4727787 -4889371
36746 -4889371 -3946554 -1819095 45799 -102742 -2043775 -3557917 -3045159 -1255513 30435
36737 30435 131244 -376389 -871160 -1196209 -1284306 -1001009 -362100 433858 1174263 1720784
36727 1720784 2004010 1902995 1100306 -566680 -2360746 -2893118 -1799783 -578220 -782592
36718 -782592 -1903206 -2285129 -1737657 -1610643 -2316054 -2553094 -1424596 296656 1636047
36709 1636047 2623290 3273619 2896345 1477441 437388 822461 1825445 2237813 2262948
36700 2262948 2598557 2771423 1934156 571276 -171220 -355539 -901783 -1673197 -1443658
36691 -1443658 214395 2270702 3555233 3750127 3120301 2223572 1836460 2258137 2727238
36682 2727238 2300218 1127393 100911 -414264 -599997 -337102 575173 1596700 1893812
36673 1893812 1407684 560834 -628366 -1984401 -2333126 -841167 1134933 1407718 183027
36664 183027 -79224 1536295 2772549 1386242 -1685074 -3658908 -3264105 -1463143 342843
36655 342843 1498825 1864756 1509705 709328 -176846 -743842 -539167 343393 736372
36646 736372 -500890 -2685473 -3794582 -3065056 -1774457 -960146 -2831 1540936 2353072
36637 2353072 1201041 -803520 -1576903 -956616 -499791 -912732 -1416879 -1397828 -1006295
36628 -1006295 -229897 978769 1599898 246404 -2680723 -4990352 -5306434 -4396452 -3484212
36619 -3484212 -2614242 -1418684 -338973 -126845 -830051 -1990235 -3239370 -4123324 -3984375
36610 -3984375 -2680746 -985538 204853 635068 390803 -473430 -1509639 -1713152 -488729
36601 -488729 1479759 2802861 2702963 1610969 730105 1037072 2323468 3292470 3083227
36592 3083227 2421649 2486735 3028707 2864122 2030990 1802897 2383290 2428435 1444666 753616
36582 753616 1135774 1463765 981308 918075 2011854 2406864 555922 -1360094 -72746
36573 -72746 3519467 5120915 3042555 119917 -972600 -1075515 -1821873 -2393783 -1148031
36564 -1148031 1339757 3000375 3039201 2350533 1941423 2198710 2975969 3426016 2609768
36555 2609768 1063494 594638 1649932 2340625 1295402 -42389 406639 2218654 3405428
36546 3405428 3401592 3014128 2231186 444374 -1494244 -1814726 -596904 76721 -864956
36537 -864956 -2125522 -2221153 -1400347 -711944 -495421 -551073 -833940 -1316480 -1750839 -1830000
36527 -1830000 -1140379 716426 3142783 4281334 3047162 923386 131094 490737 120637
36518 120637 -1072528 -1193951 77700 566188 -723890 -1663840 -357490 1856825 2716830
36509 2716830 2351511 2047811 1460509 -261698 -1786190 -998889 1376382 2379882 1098364
36500 1098364 -201167 382256 2017202 3025464 3121122 2846662 2433924 2185178 2581724
36491 2581724 3105413 2286857 -104630 -2189329 -2380748 -1491897 -1226394 -1671979 -1794053
36482 -1794053 -1561444 -1801650 -2335027 -2069332 -994054 -368695 -553473 -279307 1176690
36473 1176690 2543992 2402911 1316040 712604 486151 -565448 -2225022 -2671684 -1157680
36464 -1157680 797541 1642906 1782405 2252510 2665790 1976742 518624 -382544 -491648
36455 -491648 -731909 -1227608 -964062 268512 1196280 1021370 670919 1155412 1880680
36446 1880680 1807044 1407836 2044297 3760015 5029197 4739277 3387307 2105136 1330721
36437 1330721 843521 605732 1038593 2390878 3969580 4317157 2601769 -177223 -1952974
36428 -1952974 -1791157 -800100 -579823 -1390468 -2314193 -2628067 -2341166 -1737092 -1050841
36419 -1050841 -455997 62701 656602 1192591 1261267 858803 539771 581184 652439 704853
36409 704853 1286689 2227179 1953948 -593536 -3858732 -4922560 -2943633 -191059 654656
36400 654656 -662439 -2218045 -2271631 -828366 840601 1690908 1706459 1311990 459940
36391 459940 -1081863 -2666475 -2984099 -1783627 -541288 -714090 -1938652 -2683094 -2177894
36382 -2177894 -1000000 -193151 -434956 -1592104 -2553558 -2125432 -622330 257223 -268348
36373 -268348 -1008236 -888527 -695276 -1339399 -1756070 -513234 1484332 2182392 1647950
36364 1647950 1697014 2549592 2537173 1337939 733409 1382211 1506695 113535 -856933
36355 -856933 560179 3115161 4104759 3188510 2379248 2858361 3697018 3635212 2655088
36346 2655088 1583160 1013643 786904 193947 -1073732 -2093311 -1617457 -74247 519716
36337 519716 -651452 -1761532 -878955 1092426 1559524 -252974 -2540637 -3477432 -3025058
36328 -3025058 -2054706 -1060588 -297787 -203080 -903381 -1718539 -1728835 -761076 440798 988966
36318 988966 679716 40935 -372819 -519934 -556498 -314373 392027 1105946 1066060 261604
36308 261604 -491905 -614746 -240821 401507 1226692 1705509 985969 -916438 -2776690
36299 -2776690 -3463458 -2964219 -1826041 -397568 933352 1564796 1329796 721746 80041
36290 80041 -781781 -1850500 -2655334 -3054326 -3347864 -3319295 -2322358 -737680 14070 -452335
36280 -452335 -850629 -474731 -434257 -1427965 -2003592 -834771 687822 349200 -1356750
36271 -1356750 -1976665 -914088 -77424 -707037 -1863881 -2516627 -3046967 -3853076 -4146368
36262 -4146368 -3184650 -1541557 -247147 444228 707061 401611 -557902 -1666059 -2300286
36253 -2300286 -2400227 -2340327 -2470897 -2925040 -3469566 -3542186 -2941279 -2378520 -2682883 -3555643
36243 -3555643 -3920076 -3487670 -3089528 -3350523 -3931213 -4309350 -4472119 -4507468 -4215057 -3464201
36233 -3464201 -2422812 -1290709 -337024 -134826 -969958 -2019282 -2065453 -1153194 -461657
36224 -461657 -229869 928605 3822805 6812121 7389857 5296579 2923075 2480342 3586715
36215 3586715 4076492 2740582 643432 -351123 188109 1089835 1450247 1729789 2551157
36206 2551157 3276828 2772435 1179763 -181443 -668712 -1040267 -2030299 -3032299 -2748269
36197 -2748269 -775121 1837567 3481876 3360099 2126155 1142251 1005064 1051886 435835
36188 435835 -848260 -2327261 -3683689 -4350021 -3282478 -328584 2629839 3297056 1742210
36179 1742210 338072 768161 2264829 3136988 2876418 2098481 1296980 547161 56899
36170 56899 243384 1177963 2248241 2556081 1823511 899889 946111 1925510 2494428 1766639
36160 1766639 443806 -408802 -825381 -1255804 -1364321 -862620 -752629 -2014745 -3529162
36151 -3529162 -3245452 -1294992 118777 125239 292232 1673610 2928465 2633036 1644463
36142 1644463 1513396 1880443 1325016 37644 -259551 1061032 2566586 2723030 1684559
36133 1684559 626477 18276 -777888 -2346168 -4176072 -5096300 -4616415 -3372888 -2135716
36124 -2135716 -1028134 -160074 -228680 -1531441 -2921872 -2904354 -1485425 142201 1324802
36115 1324802 2002189 1535064 -568461 -2742327 -2383721 524326 2800744 2138957 16248
36106 16248 -809005 -79575 470922 216989 81903 311557 -105593 -1446110 -2258408 -1203995
36096 -1203995 913849 1835665 458434 -1773874 -2387675 -658800 1591012 2209342 1186750
36087 1186750 288159 613510 1429293 1343416 -189855 -2538574 -4343708 -4401485 -2836365
36078 -2836365 -1214195 -770213 -976481 -804496 -685455 -1686081 -3222419 -3489817 -2139676
36069 -2139676 -696678 -176593 -87466 31484 3066 249245 1601677 3342158 3451642
36060 3451642 1544698 -358165 -773055 -573321 -1002771 -1730452 -1878188 -1336749 -224115
36051 -224115 1361303 2505173 2250367 1558736 2217317 3472676 2670604 -112143 -1563442
36042 -1563442 -520923 -21544 -1906882 -3329637 -1657322 792866 741773 -430382 540664
36033 540664 2816215 3032844 1244790 408016 869403 227348 -1643338 -2217370 -1267315
36024 -1267315 -1619003 -4033114 -5457194 -3812957 -1060465 92736 -321529 -813203 -780431
36015 -780431 -284619 478953 604531 -651911 -1951467 -1105534 1355634 2436436 1096626
36006 1096626 -363717 -273030 -116024 -1674107 -4125480 -5671236 -6050082 -5848022 -5026885
35997 -5026885 -3617619 -2407284 -1691266 -718819 629805 1117794 69604 -1493492 -2532208
35988 -2532208 -3214479 -3551470 -2527445 209989 3229793 5046036 5750536 6016156 5807223
35979 5807223 5058907 4420195 4359448 4491938 4390163 4038744 3251398 2028604 1638426
35970 1638426 3492663 6505312 7549279 5289990 1745461 -653706 -1599411 -1741369
35962 -1741369 -1172298 -269617 -108055 -724440 -674304 529845 1362783 894616 487372
35953 487372 1330939 2148598 1273855 -449019 -860054 406442 1810692 2182901 1558365
35944 1558365 338603 -999952 -1745864 -1519741 -679003 353913 1502485 2448503 2667517
35935 2667517 2476944 2887778 3931078 4350302 3454660 2048956 1086822 651372 560205
35926 560205 623133 195381 -953229 -1444361 6720 1849254 1277771 -1297413 -2458586
35917 -2458586 -1109321 -145453 -1406369 -2465127 -775074 1973532 2555939 1081543
35909 1081543 123490 441599 508537 -415255 -1228498 -887967 286271 1161729 824735
35900 824735 -556950 -1609476 -1298870 -491770 -628915 -1234620 -807963 161971 -200500
35891 -200500 -1586006 -1665074 -103546 967864 1003310 1890489 3933037 4826862 3760708
35882 3760708 2668681 2239386 808417 -1478745 -1851941 180735 1719959 1859317 3141007
35873 3141007 5832636 6367875 3879100 2448414 4069558 5432155 4725064 5051242 7590107
35864 7590107 8457275 6413405 6138195 9330192 10880461 9077796 10260916 17043653
35856 17043653 22321563 22624418 25693392 35210387 41393319 39458311 42618015 60040253
35848 60040253 79005159 93691811 134371583 228478745 336440466 371741055 300276199
35841 300276199 184213089 106194850 80926260 68454685 46442865 29355603 27882701
35834 27882701 29707867 24790565 20384983 22494967 23661756 17789700 10800224 8637135
35826 8637135 7761705 4466350 2374693 4242456 5934009 4406431 3289482 5350146
35818 5350146 7096281 5647877 3835969 3974752 3338016 299352 -1392495 933738
35810 933738 3839927 3667984 2308660 2762864 3703394 2868777 1766556 2659636 4158318
35801 4158318 3637537 1320478 -1075449 -3038610 -4094618 -2864885 310959 2620287
35793 2620287 2679362 2309154 2802923 2813811 1692781 1239209 2094827 2100745 420827 -497558
35783 -497558 539517 913068 -1018191 -2442515 -770785 1696164 1532695 -269017 -409829
35774 -409829 1340945 2680459 2938954 3145845 3238483 2438466 1464113 1624179 2528366
35765 2528366 2906277 2683839 2356241 1659519 736426 1000486 2797283 3890059 2488578
35756 2488578 157875 -617323 -184111 -510123 -1598248 -1824813 -960505 -315443 -404000
35747 -404000 -594545 -611656 -614718 -399560 -107802 -892426 -3233361 -5463170 -5675753 -4344745
35737 -4344745 -3436917 -3652266 -4071194 -3853766 -2871252 -1278199 347557 1112956 973861
35728 973861 899458 1203430 1061041 411744 548311 1776878 2530284 2202707 2649331 4941228
35718 4941228 6749681 5438931 2149013 193053 553953 1459805 1509705 839288 -106431
35709 -106431 -781309 -170350 1824864 3382502 3006966 1852927 1857629 2617513 2356021
35700 2356021 1066331 277575 381747 594885 1008977 2222640 3299171 2550830 261567
35691 261567 -1585226 -2177417 -2324323 -2209276 -1023834 989203 2300695 2300851 1921920
35682 1921920 1739621 1128642 -379986 -2368876 -4321064 -5789936 -5895122 -4178392 -1871946
35673 -1871946 -732907 -684350 -205970 1070412 1961502 1979226 2099911 2896414 3541527
35664 3541527 3226789 2277955 1385080 780760 478036 376931 14008 -876011 -1556312
35655 -1556312 -951387 953505 3139182 4661252 4983601 3855389 1881036 550828
35647 550828 588073 937490 416122 -621969 -1414165 -2187073 -2830423 -1787155 1440817
35638 1440817 4073974 3171251 40851 -1484884 -562071 184105 -470857 -569514 1236936
35629 1236936 3282514 3503823 2047391 185823 -1300621 -1847008 -1241674 -740084 -2033871
35620 -2033871 -4536570 -5761140 -4841216 -3405050 -2525088 -1393599 286362 1317349
35612 1317349 1378148 1714142 2431850 1917146 184237 -200042 1816938 3766983 3697788
35603 3697788 3208871 4018313 4474375 2645168 386019 645998 2477353 2543318 483606
35594 483606 -1008410 -862369 -632440 -879072 -213342 1416377 1754434 -269240 -2690078
35585 -2690078 -3468393 -3161104 -3250217 -3554879 -2844574 -893369 1389894 3131222 3822672
35576 3822672 3153272 1372332 -622429 -2149827 -3290056 -4219390 -4610539 -4187138 -3368735
35567 -3368735 -2804235 -2550910 -2182817 -1550328 -1008238 -846448 -782128 -302358 441134 431714
35557 431714 -1051138 -3170752 -4059233 -2798172 -396246 1360081 1516770 322415 -1281227
35548 -1281227 -2204920 -1853109 -584768 838881 2197812 3494129 3947901 2665040 477621
35539 477621 -446010 576023 1821994 1846072 1429430 1731770 2203998 1978701 1830321
35530 1830321 2673465 3266922 1860635 -479276 -797825 1448080 3444635 2934553 980396
35521 980396 -66245 396209 1360240 2062648 2378492 2126251 1192167 81250 -507885
35512 -507885 -592976 -843035 -1586714 -2251366 -2011257 -1008723 -647538 -2132746 -4685996
35503 -4685996 -6024775 -5062755 -3309533 -2840171 -3661152 -4146467 -3472715 -2333472 -1551187
35494 -1551187 -1292774 -1575778 -2290728 -2643249 -1752619 -12553 1158685 1094693 442913
35485 442913 -122799 -594996 -759617 144025 2180216 3951847 3862447 1810036 -792362
35476 -792362 -2396190 -2513698 -1870937 -1531581 -1725808 -1762758 -1354224 -1402520 -2686643 -4296809
35466 -4296809 -4544063 -3219349 -1694876 -772536 206656 1740711 2910761 2512134 726713
35457 726713 -970334 -1231756 24199 1459772 1343914 -638997 -2718461 -2937230 -1514627
35448 -1514627 -322269 -250357 -506695 -616228 -1466453 -3663913 -6133806 -7232522 -6402476
35439 -6402476 -4152072 -1374428 694540 880835 -733735 -2768940 -4257203 -5470439
35431 -5470439 -6502286 -6306819 -4228338 -1507217 -4595 -12376 -381149 -274475 213640
35422 213640 694560 771235 111355 -954704 -1447586 -1106417 -949544 -1498192 -1412356 611632
35412 611632 3282888 3901540 1961654 -212487 -683536 -115956 -149681 -913615 -1154604
35403 -1154604 -149482 1374770 2087560 1523762 798667 1632337 4235279 6580824 6583559
35394 6583559 4623236 2812645 2061839 1363333 80812 -757881 -159455 1230312 2138585
35385 2138585 2169208 1395866 -382182 -2779011 -4209396 -3620386 -2239202 -2125358 -3369330
35376 -3369330 -4219524 -3733223 -2620940 -1396300 456530 2805763 4029349 3079352 1290263
35367 1290263 733260 1373653 1265703 -602784 -2977971 -4091028 -3678338 -2698260 -1759872
35358 -1759872 -658723 680678 1577284 1358585 484877 257918 1122646 1785900 728856
35349 728856 -1606330 -3023344 -2100902 328585 2487526 3480152 3320092 2208209 719172
35340 719172 -125034 -48721 -97055 -915025 -1328400 -205024 1052592 55182 -2734250
35331 -2734250 -4138313 -2685373 -493944 206000 53188 474002 766954 -439143 -2232594
35322 -2232594 -2453306 -1004267 183510 153309 -293422 -658188 -1324700 -1823027 -722169
35313 -722169 1942181 3874849 3165282 538838 -1794758 -2490861 -1668062 -272691 435231
35304 435231 -318017 -1892101 -2868125 -2934350 -3090772 -3643482 -3413040 -1732585 107734
35295 107734 570466 12818 -100423 683922 1740372 2755270 3776027 4209144 3204391
35286 3204391 1166102 -229544 116464 1526473 2457963 2177225 1327385 1030662 1500970
35277 1500970 1647005 401537 -1609470 -2428186 -1051594 1357957 2947161 3128674 2557993
35268 2557993 1927213 1516221 1384954 1325763 1063644 910461 1456321 2163760 1463014 -813145
35258 -813145 -2351734 -1208411 1264743 2216770 1379854 1128060 2511548 3604032 2564645
35249 2564645 345415 -972870 -1157112 -1579098 -2703914 -3321650 -2297672 -132748 1496530
35240 1496530 1397277 -32819 -1247682 -1124685 6608 1055316 1509024 1555695 1270246
35231 1270246 610039 86369 377528 1198889 1664730 1927911 3109070 5092223 5848319
35222 5848319 4007525 981224 -752420 -649752 -34844 277369 642779 1111276 1000836
35213 1000836 253240 -196924 61432 201207 -406943 -1099205 -1090592 -872718 -1396559 -2403366
35203 -2403366 -2691001 -1858757 -767850 -224544 -107927 12186 239617 696296 1740910
35194 1740910 3259480 4262857 3853740 2319060 721445 -298774 -719804 -485627 433001
35185 433001 1338890 1139752 -237611 -1473696 -1364719 -160299 1046642 1692481 1914149
35176 1914149 1845308 1502487 1111172 822535 268047 -918849 -2300062 -3100739 -3325336
35167 -3325336 -3489007 -3301451 -1855751 479046 1640877 331886 -1996659 -2835708 -1747659
35158 -1747659 -433353 62727 525885 1551760 2035783 913846 -665492 -547992 1362420
35149 1362420 2815706 2202038 463196 -519226 -243429 574217 1505461 2534621 3178376
35140 3178376 2763513 1548207 538191 111132 -275037 -931782 -1467750 -1689376 -2007206
35131 -2007206 -2538789 -2685459 -2129135 -1464219 -1228111 -1025610 -342993 375191 285000 -637852
35121 -637852 -1711655 -2548568 -3189717 -3510168 -3241203 -2441248 -1342925 31932 1495333
35112 1495333 2275910 1779686 559752 -295216 -608091 -1112771 -2086718 -2877135 -2856510
35103 -2856510 -2034134 -652702 961307 2027940 1764693 566488 -107601 515756 1585823
35094 1585823 1844493 1037019 -361977 -1971230 -3262384 -3234292 -1486068 627715 1064580
35085 1064580 -486374 -2140204 -2141857 -927429 -293318 -1045203 -2295253 -2963996 -3101054
35076 -3101054 -3373317 -3870106 -3994496 -3229513 -1496815 936131 3270919 4211687 3119633
35067 3119633 1095960 -107622 -383485 -1275254 -3295697 -4657462 -3694557 -1373986 20750
35058 20750 -79266 -392706 -211704 -219916 -871879 -1574876 -1894381 -2281853 -3052282 -3604093
35048 -3604093 -3181411 -1773412 -40275 1068505 784720 -507548 -1084609 54420 1215995
35039 1215995 -122187 -3389704 -5018187 -3202131 -422430 149856 -1144795 -1773671
35031 -1773671 -1066229 -565324 -1030532 -1499582 -1339631 -1145590 -1208294 -861228 22273 393322
35021 393322 -269236 -826352 -47162 1552306 2481443 2308384 1840505 1588589 1262568
35012 1262568 957008 1630765 3562805 5083332 4166166 1288184 -644489 145557 1999250
35003 1999250 2200234 698047 -247173 325901 948269 493643 -62136 322760 801557
34994 801557 255449 -513887 -8009 1450328 2264405 2092107 2015017 2435686 2569365 2036604
34984 2036604 1324512 541213 -672852 -1752957 -1444781 1324 516839 -980734 -2876506
34975 -2876506 -3111397 -1987616 -1315120 -1555956 -1438005 -185074 1406284 2403477 2994458
34966 2994458 3615021 3657563 2075112 -832623 -3072615 -2830200 -417781 2006284 2586859
34957 2586859 1362921 -178081 -677241 72256 1224577 1691006 1098048 162971 -92215
34948 -92215 455446 1046923 1315362 1785236 2713928 3274307 2681138 1504580 879199 801864
34938 801864 293170 -902294 -1861432 -1831007 -1110240 -376207 115251 437001 747494 1343159
34928 1343159 2405133 3545819 4084699 3841185 3233724 2680732 2368067 2373648 2415597 1787220
34918 1787220 314553 -961675 -1016408 -410060 -424555 -889978 -403644 1223751 2462138
34909 2462138 2510258 2564633 3676220 4748811 3968366 1323699 -1488254 -3011661 -2881846
34900 -2881846 -1438960 377583 1269607 829491 206161 554673 1218546 555720 -1631156
34891 -1631156 -3609992 -3778951 -2397123 -1099671 -1225315 -2670644 -4039932 -4052788 -3016844
34882 -3016844 -2417618 -2711628 -2395591 -154336 2817450 3957025 2502411 210632 -1041200
34873 -1041200 -1056620 -526708 234051 1122343 1751465 1861038 1708259 1572698 1336217 882560
34863 882560 352698 -350579 -1676894 -3537547 -4869830 -4761956 -3662772 -2807615 -2648351
34854 -2648351 -2520446 -1828281 -904714 -459251 -594568 -739599 -474718 -150207 -497928
34845 -497928 -1603446 -2485985 -2049816 -484172 706661 377740 -813281 -1036430 723616
34836 723616 3643998 5934907 6341697 4852167 2494521 667106 207916 752128 1242058
34827 1242058 1224842 1179634 1371407 1278628 927155 1823101 4945071 8178611 7856891 3438153
34817 3438153 -1289245 -2843777 -2155887 -2329833 -3837121 -4471258 -3412782 -2473245 -2911062
34808 -2911062 -3527193 -2940057 -1733701 -1058291 -734635 -203780 -30181 -838247 -1711356
34799 -1711356 -1340557 -221884 -117260 -1528214 -3070921 -3371183 -2480735 -1313695 -519425
34790 -519425 -50605 618529 1728873 2457361 1540906 -813682 -2498120 -1856636 288854
34781 288854 1961946 2554709 2749913 2704272 2020663 1205632 1362511 2280925 2365761 821308
34771 821308 -1322541 -2660080 -2799588 -2123828 -1261574 -962704 -1415262 -1586687 -395594
34762 -395594 1416371 1925506 707488 -562583 -533992 237534 599868 264952 -615348
34753 -615348 -1905361 -2816829 -2165034 -94223 1716848 2275465 2319080 2474388 2109765
34744 2109765 1052573 592315 1301215 1625552 456833 -604060 197296 1472782 735021
34735 735021 -1296559 -1587999 366843 1834470 1262795 276345 391384 675382 106781
34726 106781 -271931 612567 1677716 1456220 484203 80164 128513 -108833 -343754 -376112
34716 -376112 -1451173 -4141208 -6071653 -4626236 -1278164 -106336 -2019094 -3670033
34708 -3670033 -2728602 -977518 -767374 -1381446 -1081569 -340878 -383601 -302786 1368577
34699 1368577 3301479 2728401 -197881 -2428409 -2579165 -2509634 -3577715 -4160707 -2486757
34690 -2486757 274816 1747208 1691046 1594481 1885680 1616748 585243 -78064 325209
34681 325209 967288 551676 -1209986 -3366828 -4661833 -4803714 -4853904 -5763832 -6565804
34672 -6565804 -5326587 -2338889 -574535 -1663782 -3160488 -1918067 1115074 2194989
34664 2194989 275294 -1829526 -1994487 -1472103 -1977103 -2755080 -2312023 -1133747 -750572
34655 -750572 -1396388 -2362134 -3599801 -5183342 -6009516 -4944029 -2894777 -2009506 -2835214
34646 -2835214 -3696286 -2979315 -832077 1541002 3197588 3802495 3471432 2605025 1515878
34637 1515878 281082 -721897 -619519 872134 2502612 2543480 765420 -1335786 -2243924
34628 -2243924 -1743035 -639859 172374 328328 134292 138539 381596 347786 -165175 -675110
34618 -675110 -837855 -971265 -1306516 -1476125 -1310137 -1284302 -1504338 -1253823 -405336 -84207
34608 -84207 -736704 -835910 829544 2787051 2917421 1875353 1906646 2867866 2456730 452847
34598 452847 -517211 729726 2001082 1551495 939658 1948579 3141725 2247409 242021
34589 242021 -4888 1724025 2784338 1819559 411788 224862 823720 1110227 1087269
34580 1087269 1205922 1298592 1173556 1358150 2329247 3558181 4049602 3533265 2651565
34571 2651565 2139361 2056703 1749156 634811 -823531 -1295348 -149205 1593637 2515968
34562 2515968 2556888 2595997 2666350 1850932 15837 -1623679 -2108784 -1884728 -1767069 -1623548
34552 -1623548 -847390 401609 1211555 1003836 103413 -686856 -767645 -59642 1155618
34543 1155618 2584341 3857747 4065866 2079452 -1866568 -5397238 -6040996 -4060354
34535 -4060354 -2037647 -1496452 -1393999 -514833 310361 -266067 -1581639 -1804895 -799879
34526 -799879 -300320 -1178188 -2235806 -2186447 -1385527 -831759 -635695 -465446 -618628 -1494522
34516 -1494522 -2517254 -2732464 -2259991 -2096630 -2494226 -2529906 -1488576 162889 1480000
34507 1480000 2026815 1853848 1152977 328667 -136249 -258487 -484577 -761874 -382095
34498 -382095 813945 1880366 2076019 1913985 2023540 1822388 582893 -899849 -1353995
34489 -1353995 -1313501 -2344853 -3954841 -3591554 -579965 2105461 1571079 -1110657 -2641237
34480 -2641237 -1985142 -970404 -945648 -1080829 -262677 1078605 1700153 1045158 -451677
34471 -451677 -1832616 -2226243 -1628017 -986549 -900587 -728925 48131 338844 -1054041
34462 -1054041 -2918560 -2762427 -564145 866213 -99398 -1795537 -2283977 -2263285 -3170641
34453 -3170641 -4201819 -3569076 -1659692 -545158 -847056 -1356704 -1575389 -2300559 -3385666
34444 -3385666 -3186885 -1181012 672579 465164 -1050804 -1767694 -1262985 -1038359 -2083176
34435 -2083176 -3636218 -4538400 -4653425 -4391957 -3630679 -1986396 58096 1171170 599660
34426 599660 -989798 -2498932 -3664062 -4614115 -4646870 -2719780 676567 3405031 4075544
34417 4075544 3499990 2958696 2132683 81123 -2510769 -3761891 -3124592 -1935771 -1291122
34408 -1291122 -825749 -41091 519214 250855 -280549 3854 1278335 2684827 3286922
34399 3286922 2775723 1644027 959595 1478736 2688240 3224154 2473678 1165412 172679
34390 172679 -421675 -629847 111868 2031186 4050724 4725481 3896664 2613239 1645823
34381 1645823 916197 275418 -84418 -195962 -538174 -1271446 -1706505 -1016134 661963
34372 661963 2203218 2647024 2157897 1647355 1530210 1235267 158232 -1288569 -2101561
34363 -2101561 -1981717 -1570403 -1391535 -1246442 -848112 -388098 -97770 232668 861978
34354 861978 1586411 2001800 2019107 1847871 1693217 1626115 1534567 1218977 832320 979694
34344 979694 1801245 2302539 1564974 360626 211461 885759 587401 -949037 -1589417
34335 -1589417 -136393 1412550 722003 -1312115 -2075833 -1299495 -1125644 -2506314 -3970514
34326 -3970514 -4136789 -3306473 -2176995 -934608 -153863 -701874 -1954389 -1798124 611582
34317 611582 3496111 4797863 4565525 4010374 3513827 2899454 2680363 3479745 4579462
34308 4579462 4324489 2055033 -1007501 -2795426 -2128287 205340 1978389 1708494 333282
34299 333282 -72169 914853 1862303 2061060 2438962 3305433 3236869 1525924 -71185
34290 -71185 172601 1172979 833812 -493460 -748357 258673 565998 -596996 -1554297
34281 -1554297 -824140 930837 2335849 3040123 3134440 2205374 63229 -2413757 -4062264
34272 -4062264 -4601015 -4533607 -4363092 -4191302 -3648872 -2202859 -101323 1238969 735108
34263 735108 -670005 -1030379 -50825 698155 332033 -232994 -197402 -200390 -815471 -1262268
34253 -1262268 -832172 -309767 -566666 -784472 320524 2169228 2831312 1577826 -485290
34244 -485290 -2190095 -3401006 -4306023 -4778157 -4664858 -3933777 -2542941 -888251 -86425
34235 -86425 -761972 -1730900 -1162466 852714 2230698 1772885 763859 898650 1797751
34226 1797751 1845158 822653 247665 1120620 2612269 3389568 3237674 2680927 1794685
34217 1794685 481734 -417540 333701 2355560 3418862 2146311 22016 -582140 271798
34208 271798 493705 -449943 -521568 1517202 3714393 3542770 1541993 323922 666597
34199 666597 802362 -421258 -1747887 -1491936 256080 2202107 3470745 3894963 3617240
34190 3617240 3117516 2914207 2752399 1922525 787786 843568 2510528 4030203 3674767
34181 3674767 2116727 1266205 1464281 1409375 576045 55141 734509 1957520 2485857
34172 2485857 1910222 740825 -156473 6286 1247102 2298134 1637891 -599462 -2543499
34163 -2543499 -2781860 -1793085 -770113 -24471 669240 1045665 780822 429868 768632
34154 768632 1389171 1036445 -571984 -2143886 -2255338 -803065 1095515 2141492 1789025
34145 1789025 683535 159136 802681 1682489 1631286 974473 943872 1507801 1207112 -443520
34135 -443520 -1840508 -1546425 -509741 -663183 -1975602 -2445020 -944114 1296443 2353553
34126 2353553 1733041 404685 -494656 -507414 48575 400858 115911 -181192 632718
34117 632718 2588031 4139513 3822316 2046076 612096 571853 1201273 1210503 382975
34108 382975 -413943 -545768 -365435 -580470 -1332270 -2192655 -2727340 -2621440 -1517228
34099 -1517228 568573 2631669 3256598 2191955 768167 257040 322728 -245531 -1601851
34090 -1601851 -2432572 -1518840 786880 2741420 2693875 611102 -1620189 -1764566 509095
34081 509095 3270105 4502038 4038962 2903728 1643650 319414 -617606 -823317 -1020213
34072 -1020213 -1983109 -2805736 -1843608 576688 2209114 2070471 1738437 2650782 3862683
34063 3862683 3771060 2628014 1756235 1306333 537107 -271799 34647 1488795 2615376
34054 2615376 2305876 1077659 232545 464530 1404368 2002257 1392217 -192574 -1560829
34045 -1560829 -1975609 -1963044 -2232743 -2466690 -1972850 -927827 -2140 712511 1304632
34036 1304632 1084961 -578951 -2648462 -3089871 -1379314 872109 2082724 2362901 2584833
34027 2584833 2823772 2455355 1269070 -106539 -737801 -206891 912991 1542899 1341069
34018 1341069 1071864 1258566 1094354 -382829 -2524470 -3662262 -3204225 -1933793 -469932
34009 -469932 1111651 2176623 1774075 425875 92645 1568083 3193063 3056725 1406568
34000 1406568 -86379 -589894 -628276 -908614 -1509534 -1953359 -1606654 -378310 780810
33991 780810 711992 -465280 -1533303 -1929027 -2131717 -2069507 -743904 1739432 3315987
33982 3315987 2465375 436400 -439064 240594 1061987 1156052 850109 433027 -153437
33973 -153437 -570892 -410450 -156586 -592762 -1392885 -1535049 -961346 -531312 -443410 -109136
33963 -109136 415527 431736 260258 1247189 3454963 4834082 3708419 989976 -1126517
33954 -1126517 -1749374 -1413278 -433900 1288579 2991228 3138764 1352776 -758635 -1463060
33945 -1463060 -994872 -949562 -1922352 -2794777 -2542648 -1710972 -1354752 -1257390 -344152 1392904
33935 1392904 2643111 2632584 2078511 1865637 1848870 1584456 1216221 832643 -64152 -1441332
33925 -1441332 -2039659 -1091766 38043 -500206 -2217120 -2830633 -1555101 -81048 72102
33916 72102 -447823 -212341 880642 1797707 1800389 869288 -629159 -1961246 -2270470 -1535672
33906 -1535672 -906863 -1436279 -2703537 -3235397 -2198917 -329579 805832 371910 -823847
33897 -823847 -1074435 360726 2369302 3338804 3034959 2490457 2380342 2455818 2444104 2419764
33887 2419764 2193971 1426454 578898 668346 1709182 2464492 2196309 1583465 1343753
33878 1343753 1088595 363463 -202911 184513 1179486 1893376 2167468 2325254 2323248 2166857
33868 2166857 2525937 3735289 4665870 3934932 2038246 940282 1483257 2453369 2507299
33859 2507299 1890592 1662414 2016600 2106143 1247172 -199600 -1168874 -1022192 -303713
33850 -303713 -128023 -752615 -1300150 -1202337 -1127956 -1712406 -2144451 -1290387 217315 601149
33840 601149 -308444 -613954 776938 2351571 2153460 634649 -9619 1216926 3130080
33831 3130080 4092876 3550971 1867412 -232226 -1746318 -1849277 -773997 315031 705488
33822 705488 846041 1299682 1688799 1436176 1048228 1548858 2648863 2668313 830005
33813 830005 -1336623 -1837276 -832916 -177064 -564347 -670340 400946 1278618 167529
33804 167529 -2320927 -3718955 -2919221 -1407806 -1005527 -1664583 -2196872 -2175612 -2084840
33795 -2084840 -2130405 -1999523 -1681188 -1562891 -1569044 -1025192 256774 1394733 1484334 877323
33785 877323 817745 1866797 3196249 3599762 2865806 1865708 1409888 1347476 950642
33776 950642 5646 -838319 -951681 -643425 -756401 -1400011 -1668853 -944714 -21986 -334422
33766 -334422 -2194572 -4388408 -5543788 -5325422 -4172180 -2590762 -1184021 -754634 -1549381
33757 -1549381 -2607798 -2673056 -1762461 -1026447 -876844 -228926 1721263 3783572 4060890
33748 4060890 2721656 2074059 3441478 5291709 5539518 4668039 4847784 6328121 6798708
33739 6798708 4898574 2422448 1743186 2562096 2950600 2453142 1991517 1397125 -378518
33730 -378518 -2584726 -2885192 -1001761 293463 -933674 -3052283 -3572525 -2610289 -1751056
33721 -1751056 -1180738 -209390 680465 751679 976906 2534325 4082329 3265045 556451
33712 556451 -1191465 -954448 -431927 -571844 -270964 753848 848718 -554196 -1539219
33703 -1539219 -901572 -235191 -997155 -1784984 -733555 1225845 1811944 711498 -666783
33694 -666783 -1531047 -1838732 -1362560 -608260 -1311455 -3842561 -5489903 -3833118 -601754
33685 -601754 635107 -398094 -1024419 -386855 -257770 -1043877 -746146 1151977 2186821
33676 2186821 912030 -492980 362246 2345356 2738501 1247107 -209777 -612373 -552785
33667 -552785 -425266 98299 837681 873937 -194930 -1637927 -2348339 -1778276 -341377
33658 -341377 761745 534276 -688012 -1654536 -1969230 -2559978 -3949055 -5112615 -4879781
33649 -4879781 -3583474 -2344148 -1436136 -470153 318330 195031 -763175 -1503887 -1293338
33640 -1293338 -521437 -110702 -571117 -1655018 -2587417 -2643611 -1743496 -453785 631657
33631 631657 1296820 1536943 1443690 1317815 1386563 1352271 846287 369022 873831 2125548
33621 2125548 2503067 1107315 -813331 -1464527 -905747 -781526 -1951145 -3479142 -4096751
33612 -4096751 -3761720 -3289572 -2925847 -1965150 52996 2207892 2911263 1895291 774317
33603 774317 1012853 1918161 1631610 -199855 -1929315 -2109007 -1026481 171843 776424
33594 776424 580875 -286238 -1126968 -1191858 -810282 -1012981 -1681698 -1313088 728692 2933288
33584 2933288 3518550 2595975 1540192 1093060 1083784 1271390 1439247 1194176 510376 -34607
33574 -34607 -176542 -402728 -885231 -904728 -84684 788843 1044658 1188882 1701803 1845119
33564 1845119 839541 -752941 -2010099 -2951362 -3588284 -2958581 -826018 829848 142385
33555 142385 -1667826 -1943249 -617347 -52114 -1052405 -1768467 -969424 206166 692730
33546 692730 1363258 3081720 4715154 4683784 3263839 1866823 898249 -291159 -1853366
33537 -1853366 -3040711 -3187995 -2364423 -1213309 -537430 -704081 -1173682 -1038196 -202268
33528 -202268 504036 490422 9053 -505162 -892954 -919115 -371955 224115 -62705 -1167012
33518 -1167012 -1888806 -1600560 -1132794 -1375445 -1917703 -1850227 -1187660 -635830 -422114 -156497
33508 -156497 395857 1026671 1457578 1651584 1888893 2624228 3916654 4966668 4787160
33499 4787160 3501836 2389718 2388716 3079611 3392936 2827421 1739394 844114 566212
33490 566212 548271 -64382 -1385281 -2227785 -1630916 -535582 -669448 -1929768 -2444217
33481 -2444217 -1457890 -470302 -813843 -1688347 -1717841 -1186145 -1320355 -2145462 -2476764 -1737943
33471 -1737943 -636201 -81182 -235591 -641794 -790499 -608783 -574191 -1047002 -1441927
33462 -1441927 -740449 907176 1871499 872448 -1428463 -3130080 -2956202 -1179692 730046
33453 730046 1160219 -270011 -2132666 -2604897 -1512250 -198281 461912 677976 434284
33444 434284 -749913 -2343896 -2848635 -2094625 -1805836 -2863480 -3705593 -2792396 -1095460
33435 -1095460 -480964 -906507 -1033204 -616362 -414626 -438396 -92617 445934 640267 901712
33425 901712 1897788 3011967 3084756 2288234 1692346 1354945 463127 -927263 -1906615
33416 -1906615 -2244885 -2394071 -2249755 -1475497 -746163 -994245 -1685684 -1602701 -1101481 -1648622
33406 -1648622 -3152690 -3768963 -2569612 -524168 1406120 3205568 4486987 4260557
33398 4260557 2694630 1353522 1001763 782834 138786 -185512 271377 784900 819315
33389 819315 645044 12049 -1847519 -4136421 -4584407 -2765523 -1158961 -1443646 -1917985
33380 -1917985 -523517 1603335 2044810 983128 413950 508330 -338792 -2208266 -3170571
33371 -3170571 -2268909 -626592 759731 2143594 3418226 3494160 2233388 1295514 1904623
33362 1904623 3013450 2793837 1029370 -970654 -2095749 -2124063 -1265828 21800 1018646
33353 1018646 1284591 1138775 1163256 1419913 1546453 1403645 1184375 967495 540483 -258927
33343 -258927 -1166554 -1523744 -797034 756481 2051710 2176240 1485723 1287598 2192297
33334 2192297 3137758 2539841 370262 -1438089 -1057492 951480 2013500 456763 -2456332
33325 -2456332 -4049350 -3469674 -2412704 -2485037 -3047478 -2540154 -1076588 -321480 -939996
33316 -939996 -1580354 -901236 442211 737941 -382403 -1454085 -1066084 532373 1970457
33307 1970457 2382088 2088186 1891014 2085130 2192314 1518846 3705 -1442923 -1665477
33298 -1665477 -493017 1027773 1885919 2211743 2663059 3166904 3145622 2761000 2805365
33289 2805365 3274964 3254370 2493492 1763351 1184962 -161335 -2046454 -2355797 -196427
33280 -196427 1893317 1124261 -1363110 -2222817 -1030855 -469195 -1456779 -1656952 205502
33271 205502 1918822 1505419 521440 1229380 2674188 2335646 244028 -1294212 -1219876
33262 -1219876 -472988 200658 855057 1126708 624350 304710 1327159 2687699 2198240
33253 2198240 -85375 -1592009 -746511 1261086 2674309 3148003 2875310 1707824 172516
33244 172516 -272846 839661 2081227 2123980 1394633 772513 26053 -1154538 -1794198
33235 -1794198 -934772 491761 780889 45706 44768 1458418 2867338 2782197 1422356
33226 1422356 -92848 -1281619 -2197575 -2496113 -1683145 -195053 701752 407115 -254036
33217 -254036 -244555 217262 124609 -678869 -1312675 -1397656 -1699129 -2725450 -3676099 -3642567
33207 -3642567 -3066198 -2901768 -2887163 -1962002 -249398 677885 -243146 -2259254 -3683112
33198 -3683112 -3420590 -1653369 240212 564638 -983059 -2550575 -2013073 507411 3041399
33189 3041399 4409752 4999526 5012075 3863735 1869538 662258 935638 1369129 930818
33180 930818 603858 1279665 1526431 -312103 -2805331 -2869121 -340212 1515613 663278
33171 663278 -935254 -519865 1447904 2401768 1616851 756972 771444 536918 -786596
33162 -786596 -1988912 -1753809 -1028599 -1634301 -3193760 -3578794 -2503812 -2405540 -4695875
33153 -4695875 -7060605 -6335213 -2897136 -38064 548344 388104 1161657 2216562 2112203
33144 2112203 1042016 375578 624508 1008166 662968 -448714 -1537610 -1516324 -17598
33135 -17598 1841626 2401281 1498237 768560 1473657 2898993 3539381 3030838 2079658
33126 2079658 1148389 162027 -850474 -1645684 -2116984 -2208198 -1732215 -741628 187759
33117 187759 427217 -162299 -1251193 -2169094 -2077094 -819677 356140 -13593 -1524040
33108 -1524040 -2274791 -1688592 -1398605 -2540453 -3815528 -3575737 -2408890 -1965221 -2308490
33099 -2308490 -2316614 -1953404 -2142004 -2759246 -2707321 -1910905 -1451439 -1638780 -1658766 -1343955
33089 -1343955 -1595797 -2588804 -3114862 -2402301 -1296702 -876317 -989804 -1003416 -1092862 -1790013
33079 -1790013 -2725560 -2784981 -1569248 -165058 -140260 -1750560 -3412137 -3396535 -1906531
33070 -1906531 -639086 -256667 357564 1765085 2553908 1614442 371500 789402 2194526
33061 2194526 2369140 1166361 526143 1118082 1618856 1554315 2158052 3659230 4256519
33052 4256519 2979391 1416958 1290430 2193111 3017066 3722240 4231311 3442984 1144819
33043 1144819 -654407 -204858 1457402 2298347 2316855 2742634 3339690 2872512 1620705
33034 1620705 1098439 1517993 1665514 1214768 1099856 1480888 1371274 689827 795237
33025 795237 2254564 3632585 3391424 1844853 383134 -349513 -682647 -937127 -974915
33016 -974915 -533953 367199 1333663 1985670 2562571 3662797 4976430 5001624 2911414
33007 2911414 113136 -1194124 -612268 516594 1337314 2086442 2591059 1960685 265355
32998 265355 -961810 -621350 664472 1773057 2514252 3147461 3457343 3182413 2714831
32989 2714831 2616436 2850686 2970990 2658066 1817894 685452 -56499 -1749 83849 -871821
32979 -871821 -2301259 -2243564 -112099 2123958 2462076 1371782 580584 430684 57067
32970 57067 -427859 203604 2126798 3714046 3536419 2084908 842516 361900 28430
32961 28430 -604143 -1060009 -748537 -40849 43066 -757426 -1487732 -1370566 -1054749 -1594591
32951 -1594591 -2578399 -2566389 -1439414 -819197 -1554680 -2196000 -1042553 1366446 3087479
32942 3087479 3325312 2810563 2211908 1630389 1355996 1625196 1665909 436432 -1498303
32933 -1498303 -2205012 -898532 1016052 1963751 2107534 2441688 2916005 2545027 1025785
32924 1025785 -640189 -1166173 -209562 1366132 2256541 1878384 831138 5137 -597198
32915 -597198 -1623792 -3091083 -4176150 -4439814 -4343421 -4144414 -3239648 -1400700 103738
32906 103738 -225003 -1956823 -2933430 -1806780 456296 1965370 2127421 1840559 1799729
32897 1799729 1484068 188553 -1534104 -2322869 -1909415 -1643611 -2577867 -3797249 -3635888
32888 -3635888 -2137525 -1094246 -1611102 -2784364 -3103914 -2162905 -582024 801313 1199248
32879 1199248 305382 -958231 -1077675 53176 841146 454330 256526 1524811 2985369
32870 2985369 2471004 270962 -1259202 -1147661 -715124 -922926 -1067043 -820520 -1452530
32861 -1452530 -3635742 -5578027 -5011392 -2240284 220864 594030 -702370 -2110472
32853 -2110472 -2372203 -1189350 574930 1440855 739910 -652039 -1436317 -1263946 -487129
32844 -487129 668377 1765043 1724585 62351 -1776472 -1689693 433178 2511968 2860581
32835 2860581 1886374 1027265 1103975 2092682 3498034 4399129 3964326 2525279 1476200
32826 1476200 1556199 1873055 1252697 -14891 -541001 355460 1903843 2855712 2697429
32817 2697429 1913991 1385663 1505627 1731932 1166426 -274967 -1519537 -1403043 90724
32808 90724 1824473 2554186 1864772 338749 -990242 -1518707 -1539677 -1688740 -1977589
32799 -1977589 -1755574 -683525 725546 1750559 2239548 2472765 2596843 2512289 2099700
32790 2099700 1313424 227847 -856554 -1534581 -1598755 -1064781 -49997 995836 1192684
32781 1192684 113295 -1267641 -1423046 -305468 406140 -459156 -1991014 -2512321 -1648316
32772 -1648316 -264799 947091 1815482 2095050 1613272 852474 522719 693979 1082273
32763 1082273 1863123 3211786 4240143 3616359 1486736 -260252 -141226 1247695 2203095
32754 2203095 1957915 1141670 565658 276774 -53921 -282899 140759 1171994 1754532
32745 1754532 1023161 -326355 -797418 -280259 -271622 -1385208 -1992664 -535647 1875973
32736 1875973 2818845 1911078 1007717 1239097 1762128 1737314 1689974 2124927 2322065 1596968
32726 1596968 674331 670605 1376646 1516530 328404 -1722708 -3372351 -3325211 -1300312
32717 -1300312 1220441 2058170 729473 -936614 -1076526 178748 1535488 2318677 2470542
32708 2470542 1772423 372164 -567846 -108606 969940 1184543 528633 288663 893728
32699 893728 1457646 1573975 2030977 3213827 4117399 3779044 2716293 1997009 1576797
32690 1576797 614479 -905420 -1954367 -1952729 -1556721 -1488492 -1238452 218334 2536134
32681 2536134 3796990 2704069 279503 -1479060 -2154286 -2881541 -3872638 -3600978 -1168737
32672 -1168737 1917715 3577631 3789401 3963094 4374664 3943904 2410690 1028711 736604
32663 736604 999684 978899 714146 558932 416490 201566 258413 629020 557343 -562708
32653 -562708 -2184036 -3144020 -2875056 -1667526 -156679 990556 1270714 744930 52337
32644 52337 -285373 -358810 -537159 -1006345 -1732159 -2391637 -2282635 -983929 780726 1805378
32634 1805378 2126999 2932157 4251042 4199734 1718184 -1170157 -1605870 263144 1629050
32625 1629050 1009428 -189808 -416187 -136412 -197491 173231 2002824 4243034 4705223
32616 4705223 3067701 1331260 1120792 1875176 2149621 1631257 1149958 1293547 1676509
32607 1676509 1390633 -102443 -2307135 -3846792 -3679903 -2250088 -952922 -422417 -42352
32598 -42352 687993 1267891 1245356 1225378 1853932 2469221 2019779 1019486 1184487 2935938
32588 2935938 4509124 4088787 1940730 -140707 -789291 70395 1646254 2909456 3240397
32579 3240397 2984201 3009557 3378138 3035160 1313736 -876209 -2054884 -1906020 -1306271
32570 -1306271 -1039147 -1234760 -1746889 -2264924 -2259875 -1618099 -1188210 -1894928 -3365130 -4231907
32560 -4231907 -3848572 -2933494 -2358683 -2023381 -1284950 -35452 1054054 1246148 545326
32551 545326 -223509 -261245 330042 881303 1274546 1928126 2520327 1933938 196016 -773608
32541 -773608 359391 2116969 2124120 555940 -304067 329069 762538 -246834 -1682978
32532 -1682978 -2206593 -2137164 -2357066 -2536360 -1690680 239012 2278032 3386744 3112540
32523 3112540 1953866 1246427 1751212 2351306 1475480 -227521 -557025 586962 623882
32514 623882 -1595578 -3571576 -2841082 -715086 -19945 -860341 -1322478 -1117382 -1549013
32505 -1549013 -2523311 -2575103 -1736516 -1571380 -2182849 -1896613 -388469 519310 15599
32496 15599 -228288 1050677 2528470 2508462 1536717 1149998 1365082 1108581 245968 -367530
32486 -367530 -335003 -8227 263514 274081 -185380 -872712 -1033474 -440272 118758 -38080
32476 -38080 -610405 -1106210 -1557958 -1724002 -644217 1911381 4373550 4968358 3853119
32467 3853119 2600173 2092488 2065887 2278477 2825563 3368742 3175051 2113916 920471
32458 920471 379999 664655 1313897 1553475 1054492 675757 1677907 3679525 4458783
32449 4458783 2805311 572193 436562 2305187 3630458 2963829 1400159 440097 207375
32440 207375 283587 760830 1620433 2127096 1655425 459503 -843756 -1869976 -2265764
32431 -2265764 -1793299 -1000183 -910154 -1571156 -1739569 -488777 1645899 3495962 4305944
32422 4305944 3592556 1214977 -1638435 -2742863 -1242002 1149680 2423523 2727131
32414 2727131 3192105 3435199 2285913 467832 160128 1611643 2408950 958424 -1204918
32405 -1204918 -1811495 -999650 -525356 -951162 -1338569 -1125682 -657265 -100315 674828
32396 674828 1222294 965283 577274 1483859 3672662 5319571 5079432 3570053 2057867
32387 2057867 890957 -34136 -438600 -314744 -482972 -1418722 -2280548 -2156284 -1513158
32378 -1513158 -1266249 -1225930 -885077 -958845 -2263979 -3479759 -2241655 1280484 4008555
32369 4008555 3877267 2223583 1235176 863125 -92684 -1200383 -804499 1230424 3030037
32360 3030037 3100436 1881427 656404 -47985 -568732 -1270544 -1993410 -2124057 -1223979
32351 -1223979 232673 1035153 497408 -765596 -1680680 -1912210 -1751674 -1306788 -487629
32342 -487629 491293 1232959 1598713 1590028 1126416 356937 -288286 -797775 -1652439 -2618260
32332 -2618260 -2344301 -121837 2705008 4178701 3893873 2612219 668812 -1587693
32324 -1587693 -2587183 -1018029 1666536 2522359 1134560 55949 662971 1053102 -679194
32315 -679194 -3338148 -4652571 -4649458 -4812503 -5080316 -4096319 -1948533 -379158 -185727
32306 -185727 -292995 284310 1153703 1665326 1948418 2240176 2269415 1924366 1681024 1809322
32296 1809322 1880159 1582439 1372168 1755081 2447963 2768568 2416176 1420400 -162008
32287 -162008 -1888012 -2713631 -1985404 -543148 14008 -638222 -1046457 -75475 1129451
32278 1129451 368055 -2387444 -4171934 -2292245 2215050 5530656 5368915 3213626
32270 3213626 1941537 2320616 2697385 1486378 -1044051 -3284145 -3765151 -2143467 586975
32261 586975 2667159 2826334 1275255 -600149 -1515844 -1220878 -399080 121074 172114
32252 172114 344142 1054477 1610839 856146 -1068741 -2467742 -2180291 -1097145 -636082
32243 -636082 -414096 1117230 3869365 5544236 4452083 1767077 107057 543022 1909859
32234 1909859 2711577 2719110 2502479 2097781 800232 -1662882 -4167733 -4898172 -3175869
32225 -3175869 -313477 1583882 1474498 -84756 -1785602 -2472326 -1583716 490486 2380716
32216 2380716 2661365 1145339 -893048 -1857533 -1146660 418564 1238407 313152 -1631401
32207 -1631401 -2651596 -1593596 724297 2663468 3469778 3212527 1859644 -353798
32199 -353798 -2144115 -2314213 -1612898 -1917327 -3381717 -4030402 -2684991 -635211 477878
32190 477878 867621 1444666 1846862 1293347 478018 783637 2052195 2882634 2979132 3442401
32180 3442401 4518376 4747687 3067505 525349 -981733 -916913 -297082 -192774 -705792
32171 -705792 -1200329 -1100733 -509614 -87460 -149189 -128849 528000 1200392 709429 -891913
32161 -891913 -2141179 -2034154 -1091132 -165507 727464 1655062 1848825 706010 -839509
32152 -839509 -1162266 -15231 1256955 1539834 1036690 451022 12675 -371857 -750564
32143 -750564 -1314861 -2375335 -3708511 -4366030 -3596798 -1730593 117369 913931 85433
32134 85433 -2382513 -5571749 -7659823 -7198431 -4629923 -2003350 -829087 -584558 224794
32125 224794 1857358 2960438 2499797 1197866 373286 -40520 -1177964 -3050183 -4042448
32116 -4042448 -3151067 -1482199 -483125 263839 1914282 3682970 3359801 682050 -1819823
32107 -1819823 -2184327 -1535514 -2033338 -3745372 -5145717 -5681434 -5994856 -6155210 -5572355
32098 -5572355 -4560693 -4212344 -4512580 -4157615 -2583450 -730994 588583 1638086 2569729
32089 2569729 2776651 2136769 1532566 1348468 823808 -236572 -642234 109694 511431
32080 511431 -579678 -1657453 -751188 1140279 1251405 -770114 -2439888 -2302267 -1727209
32071 -1727209 -2179930 -2942258 -2720887 -1787551 -1181933 -1039487 -930439 -810278 -493472
32062 -493472 817410 3232146 5217949 5232872 3729885 2339985 1606049 813797 -319919
32053 -319919 -1206449 -1597172 -1962653 -2449884 -2505449 -1848183 -953827 -225449 550292 1482115
32043 1482115 1983427 1539166 685979 518223 1215630 1657570 826901 -765279 -1616433
32034 -1616433 -1131091 -262286 47158 247092 1188481 2395227 2598403 1781071 1256294
32025 1256294 1552698 1716012 1176687 744748 897602 628182 -694063 -1645608 -628925
32016 -628925 1491244 2491594 1995296 1661249 2347979 3005583 2657482 1805910 1314978
32007 1314978 1191643 1011012 503247 -656966 -2593851 -4409436 -4669212 -3115733 -986472
31998 -986472 613409 1643060 2293152 2500402 2618246 3224510 3814123 3129155 1382416
31989 1382416 529099 1384318 2127138 1051789 -683331 -845566 446496 1121438 349628
31980 349628 -706960 -1123307 -1263185 -1508968 -1661466 -1840566 -2392302 -2610463 -1207010
31971 -1207010 1387717 2792889 1640132 -517848 -1240741 -56652 1732093 3072249
31963 3072249 3725720 3550423 2615947 1725535 1594446 1662091 859369 -539882 -1100359
31954 -1100359 -476571 -248143 -1858875 -4593887 -6408536 -6261009 -4874717 -3502635 -2692846
31945 -2692846 -2229260 -1673459 -816546 80129 462317 157320 -228758 49029 916937
31936 916937 1596625 1635463 1309147 969800 629175 400685 669375 1363735 1661477 1077464
31926 1077464 394021 717747 1883396 2666902 2502124 2084191 2163839 2636341 3117684
31917 3117684 3580210 3934949 3706377 2761013 1849442 1770247 2331536 2708830 2522508 1994202
31907 1994202 1317470 499210 -313167 -877543 -1115832 -921251 -10644 1442611 2322174
31898 2322174 1545052 -472397 -2070259 -2181375 -1245252 -186978 700064 1473999 1905810
31889 1905810 1837988 1811511 2594595 4086166 5198064 4968281 3532633 1919642 1081557
31880 1081557 1202094 1796728 2326368 2665804 3009767 3427732 3633705 3234221 2195301
31871 2195301 1085406 789493 1743046 3325124 4260019 3890793 2862636 2204110 1963537
31862 1963537 1376451 376159 82728 1233611 2727178 2689267 967517 -374356 476765
31853 476765 2784605 4213001 3772889 2834708 2991705 3843313 3632823 1591370 -1190854
31844 -1190854 -3056353 -3190964 -1863428 -134188 569880 -512001 -2503301 -3653511
31836 -3653511 -3367886 -2673534 -2341089 -1682469 -52120 1541494 1695260 836036 628612
31827 628612 1419998 1931836 1629856 1666427 2783987 3807101 3383700 2170235 1928101
31818 1928101 3033013 4225766 4594294 4483715 4326396 3804824 2716177 1765049 1712434
31809 1712434 2213508 2279574 1692627 1181374 1129113 901536 -77245 -1162311 -1180647 -105242
31799 -105242 789343 572252 -327343 -1079956 -1610928 -2110457 -2055042 -757534 1306750
31790 1306750 2709346 2700236 1861609 1025368 308454 -506011 -1257550 -1454454 -742633 721971
31780 721971 2055215 2071282 608093 -817550 -626087 703037 1335303 907682 1051585
31771 1051585 2577181 3870395 3312528 1892204 1736180 2929639 3628873 2924189 1770075
31762 1770075 1085408 663448 306439 457840 1019899 831174 -753819 -2628088 -3164713
31753 -3164713 -2116456 -543791 642191 1259917 1297915 646890 -490235 -1450716 -1650464
31744 -1650464 -1167484 -695908 -866399 -1564761 -2066089 -1994914 -1878577 -2362041 -3131062 -3232178
31734 -3232178 -2379416 -1265275 -543159 -223072 -198340 -561023 -1078368 -1143214 -733110 -729378
31724 -729378 -1692737 -2909608 -3296525 -2728260 -1787864 -753823 256186 539562 -647612
31715 -647612 -2775275 -4263858 -4259051 -3365125 -2347987 -993817 1155889 3595765 5178917
31706 5178917 5385488 4611646 3359226 1848092 478515 -77290 305481 737253 244176
31697 244176 -978685 -1785133 -1567382 -983781 -990474 -1642381 -2242459 -2284430 -1726961 -631426
31687 -631426 781083 1778059 1550790 222668 -1074826 -1352536 -653591 222644 431339
31678 431339 -408284 -1730553 -2072569 -535989 1641480 2129150 584226 -622253 330737
31669 330737 2065346 2111542 582859 -284524 264216 705563 210226 22016 947049
31660 947049 1565367 493877 -1087589 -1011609 685323 2008436 2044856 1991114 3021989
31651 3021989 4531859 4936798 3435598 758248 -1337671 -1496393 -260295 319224 -666311
31642 -666311 -1469179 -143839 2174153 2458942 200590 -1668696 -965204 783826 927598
31633 927598 -544179 -1668485 -1671809 -1323028 -792645 573680 2299816 2636050 986201
31624 986201 -1011729 -1551111 -694345 271297 478152 -207190 -1546879 -2740924 -2617293
31615 -2617293 -978121 701253 809004 -480608 -1655484 -1961440 -2063258 -2599301 -3085622
31606 -3085622 -2709624 -1540804 -347080 449793 1033093 1507137 1534657 843174 -286607
31597 -286607 -1318671 -2004141 -2321183 -2117112 -1312996 -380614 38033 156693 990489
31588 990489 2826089 4393431 4295532 2788720 1224057 64173 -1308134 -2766420 -2888684
31579 -2888684 -1004556 1280022 1780614 458531 -712843 -465155 333564 247293 -698250
31570 -698250 -1241948 -629200 644887 1710967 2233568 2260688 1746660 676591 -644468
31561 -644468 -1903426 -3151489 -4311857 -4566802 -3133154 -703581 932399 1077778 825292
31552 825292 919291 227902 -2362815 -5597997 -7169417 -6763614 -5855000 -4852150 -2806620
31543 -2806620 -107564 1180317 638392 694826 2890499 5033898 4220766 1164071 -897974
31534 -897974 -693846 93638 -105230 -990970 -1687033 -1769184 -845926 1097856 2747247
31525 2747247 2555899 1048590 374470 1270421 2149161 1639221 367630 -389239 -295344
31516 -295344 449344 1627370 2428335 1775600 -58245 -1496836 -1837511 -1769858 -1207117
31507 -1207117 1201262 5185648 7710826 6619505 3632892 1598217 433338 -1562726
31499 -1562726 -3750791 -3829425 -2032340 -1253865 -2533468 -3503778 -2396101 -827939 -947867
31490 -947867 -2030533 -2003798 -864535 -356704 -1016282 -1572005 -1100804 -156248 338698
31481 338698 107575 -695555 -1758381 -2548512 -2738956 -2737371 -3138644 -3732170 -3767021 -3113944
31471 -3113944 -2357063 -1732801 -865162 252989 882032 553561 -216828 -714489 -950648
31462 -950648 -1249442 -1393271 -895391 82194 775515 817349 652062 811268 1172007 1143933
31452 1143933 387169 -780127 -1573193 -1380373 -441860 160915 -465318 -1960520 -3027686
31443 -3027686 -2917174 -2210298 -1922550 -2230379 -2474346 -2173742 -1586790 -1324449 -1774758
31434 -1774758 -2930768 -4486763 -5968509 -6872348 -6796745 -5603117 -3660017 -1857980 -1010911
31425 -1010911 -1137204 -1622428 -2075988 -2545937 -2888416 -2681110 -2002763 -1447131 -933031
31416 -933031 500980 2940028 4624815 3924394 1591340 -210291 -569888 -218874 129995
31407 129995 231402 -416648 -1855079 -2464397 -587114 2621646 4236132 3702932 3363709
31398 3363709 4195098 4026062 1565658 -686750 -41464 2133367 2704038 1645271 1364092
31389 1364092 2200630 2117833 656841 -209531 319720 450240 -1023470 -2653476 -2732568
31380 -2732568 -1710756 -898474 -428996 165381 677838 759568 715303 819512 759462 421198
31370 421198 182488 -83993 -995365 -2089715 -1825111 30418 1603844 1550259 854373
31361 854373 716614 334104 -1421976 -3527737 -4175616 -3707075 -3897296 -4786006 -4583216
31352 -4583216 -2848082 -1568288 -2342163 -4089626 -4511203 -2853007 -445282 918688
31344 918688 607426 -485822 -939780 -328074 449785 638676 791232 1654789 2529772
31335 2529772 2082115 603030 -48807 939546 2172724 2193842 1664778 2348416 4510091
31326 4510091 6438094 6535219 5083665 3613091 2956660 2492504 1401334 139044 -8107
31317 -8107 1247937 2626036 2828493 1928875 774690 -201298 -910259 -1127505 -969382
31308 -969382 -1165510 -1853974 -1817805 -189311 1731880 1966276 762243 182982 907406
31299 907406 1538664 1437472 1970742 3895388 5519040 5039592 3182373 1766341 905519
31290 905519 -360154 -1569029 -1302791 127233 759052 48126 -217136 1203821 2994658
31281 2994658 3217738 1833669 51227 -1673111 -3498582 -4830892 -4739957 -3544320 -2534789
31272 -2534789 -2056169 -1183093 425514 1637868 1448249 443136 -172174 -269801 -532273
31263 -532273 -907381 -425081 1324162 3286803 3879959 2565534 346975 -1217644 -1557119
31254 -1557119 -1645831 -2713267 -4392046 -4857678 -3208036 -926466 -180276 -1247226 -2579269
31245 -2579269 -2910850 -2152439 -631944 1057789 1604449 121036 -1945563 -1855335 684330
31236 684330 2499048 902288 -2710510 -4753231 -3908155 -1965097 -830877 -583462 -509611
31227 -509611 -447396 -583935 -878257 -1086119 -841879 228195 1853653 2814214 2114396
31218 2114396 328695 -1049549 -1469981 -1681061 -2341415 -3193014 -3628341 -3273661 -2053895
31209 -2053895 -488895 185617 -854381 -2725788 -3539354 -2484024 -491352 1080444
31201 1080444 1582152 1015318 -193173 -1333766 -2113224 -2987232 -3916076 -3364096 -83502
31192 -83502 4322695 6462483 5088100 2284265 290098 -1039276 -2715755 -4289293
31184 -4289293 -4506094 -3322546 -1951586 -1394699 -1731600 -2297421 -2000471 -218882 2100194
31175 2100194 3100669 2235543 804322 -111092 -837176 -1587771 -1455484 -149133 791071
31166 791071 113536 -1010486 -683946 856677 1851327 1683584 1103217 440180 -458372
31157 -458372 -937418 -167299 1110944 1369070 738926 775692 1761214 2259693 1652260 1117188
31147 1117188 1514795 2150584 2372371 2635624 3091958 2820883 1593117 848572 1570712
31138 1570712 2517727 2098712 934318 841564 1968994 2694095 2082625 841995 -136182
31129 -136182 -680836 -585705 636291 2665579 4107102 4054441 3241861 2922975 3069142
31120 3069142 2469264 528716 -1679491 -2409534 -1081624 1018360 1865849 583154 -1711132
31111 -1711132 -2998456 -2400494 -1012135 -531523 -1258118 -1937170 -1620723 -935859 -920282
31102 -920282 -1206386 -490163 1244853 2258216 1386563 -182961 -430691 852190 2015613
31093 2015613 1820422 682936 -282896 -482041 7672 627640 478278 -974818 -3058962
31084 -3058962 -4352438 -4173399 -3062262 -1752989 -449971 711041 1423772 1899822 2935196
31075 2935196 4592919 5537890 4612289 2625009 1494117 1681690 1576331 -190594 -2685994
31066 -2685994 -3681607 -2289878 240744 2266712 3354262 3806035 3497245 2137342 301370
31057 301370 -911028 -1318567 -1775393 -2619845 -3033842 -2415957 -1373204 -619576 176630
31048 176630 1496860 2742007 3073811 2911079 3317611 4223202 4482166 3545216 1991302
31039 1991302 607423 -3235 707947 2405750 3227937 1591282 -1406862 -3085597 -2783089
31030 -2783089 -2477722 -3390919 -4023141 -2622283 92722 2003626 2143886 996026 -565556
31021 -565556 -1421005 -533752 1393243 1658417 -1326362 -5383719 -6781253 -4675880 -1677371
31012 -1677371 -270703 -494122 -1254654 -2065601 -2704546 -2501002 -1083793 715639 1555550
31003 1555550 1092948 396908 800096 2378932 3660658 3155203 1201174 -337755 -473719
30994 -473719 -308642 -1150277 -2316661 -2078965 -351932 981895 513744 -1122192 -2417077
30985 -2417077 -2726111 -2375191 -1781788 -1077836 -328269 246111 289679 -319300 -1025553 -960877
30975 -960877 -118722 370404 -287272 -1414654 -2014605 -2347948 -3119447 -3650837 -2588674
$$ [...]
##END NTUPLES=NMR SPECTRUM
##END=
