##TITLE=31Pdec_ANY-168-1
 CDCl3, 24 sc
 11.4.2019
##JCAMPDX= 6.0         $$ Bruker NMR JCAMP-DX V2.0
##DATA TYPE= NMR SPECTRUM
##DATA CLASS= NTUPLES
##ORIGIN= UXNMR, Bruker Analytische Messtechnik GmbH
##OWNER= root
$$ XWIN-NMR		Version 3.5
$$ Thu Apr 11 15:41:06 2019 Russian Standard Time (UT+4h)  she@DPX200
##.OBSERVE FREQUENCY= 81.013821
##.OBSERVE NUCLEUS= ^31P
##.ACQUISITION MODE= SIMULTANEOUS
##.ACQUISITION SCHEME= undefined
##.AVERAGES= 24
##.DIGITISER RES= 17
##SPECTROMETER/DATA SYSTEM= spect
##.PULSE SEQUENCE= zgpg30
##.SOLVENT NAME= CDCl3
##.SHIFT REFERENCE= (INTERNAL, CDCl3, 0, 182.463)
##AUDIT TRAIL= $$ (NUMBER, WHEN, WHO, WHERE, WHAT)
$$ ##TITLE= Audit trail, XWIN-NMR		Version 3.5
$$ ##JCAMPDX= 5.01
$$ ##ORIGIN= Bruker BioSpin GmbH
$$ ##OWNER= she
$$ F:/spectra/data/she/nmr/P31/1/pdata/1/auditp.txt
$$ ##AUDIT TRAIL=  $$ (NUMBER, WHEN, WHO, WHERE, WHAT)
(   1,<2019-04-11 15:40:16.07 +0400>,<she>,<DPX200>,
      <created by zg, POWCHK disabled, PULCHK disabled
       configuration hash MD5:
       00 E9 B6 7A A2 85 ED C7 34 08 36 98 17 FE 4E 26
       data hash MD5: 32K
       6A 70 63 68 26 D0 93 94 90 82 7D 3A E5 1E 1D 04>)
(   2,<2019-04-11 15:40:19.31 +0400>,<she>,<DPX200>,
      <Start of raw data processing
       efp BC_mod = 2 LB = 1 FT_mod = 6 PKNL = 1 PHC0 = -1826.166 PHC1 = 123.999 SI = 64K 
       data hash MD5: 64K
       80 94 AC 5D CB 12 D9 F5 89 21 1D FB 91 2F BE 21>)
(   3,<2019-04-11 15:40:35.25 +0400>,<she>,<DPX200>,
      <pk PHC0 = 1.948658 PHC1 = 0 
       data hash MD5: 64K
       75 06 A4 DD A8 00 99 6D 5E 50 56 E8 A9 73 F0 D0>)
(   4,<2019-04-11 15:40:38.40 +0400>,<she>,<DPX200>,
      <abs ABSG = 5 
       data hash MD5: 64K
       B0 45 C6 80 E3 B3 9C DA B2 FA EE F2 A0 73 DA FC>)
$$ ##END=
$$ 
$$ hash MD5
$$ DB 83 20 87 B8 89 B7 FD 79 8C E1 95 44 2B 81 6F
##$RELAX= 
##$RELAX= 
##$RELAX= 
##$RELAX= 
##$RELAX= 
##$RELAX= 
##$RELAX= 
##$RELAX= 
$$ Bruker specific parameters
$$ --------------------------
##$DU= <F:/spectra>
##$EXPNO= 1
##$NAME= <P31>
##$PROCNO= 1
##$TYPE= <nmr>
##$USER= <she>
##$AMP= (0..31)
100 100 100 100 100 100 100 100 100 100 100 100 100 100 100 100 100 100 
100 100 100 100 100 100 100 100 100 100 100 100 100 100 
##$AQSEQ= 0
##$AQ_mod= 1
##$AUNM= <au_zg>
##$AUTOPOS= <>
##$BF1= 81.014009
##$BF2= 200.13
##$BF3= 200.13
##$BF4= 200.13
##$BF5= 200.13
##$BF6= 200.13
##$BF7= 200.13
##$BF8= 200.13
##$BYTORDA= 1
##$CFDGTYP= 0
##$CFRGTYP= 5
##$CHEMSTR= <none>
##$CNST= (0..31)
1 1 145 1 1 1 1 1 1 1 1 1 1 1 1 1 1 1 1 1 1 1 1 1 1 1 1 1 1 1 1 1 
##$CPDPRG= <waltz16>
##$CPDPRG1= <>
##$CPDPRG2= <waltz16>
##$CPDPRG3= <>
##$CPDPRG4= <mlev>
##$CPDPRG5= <mlev>
##$CPDPRG6= <mlev>
##$CPDPRG7= <mlev>
##$CPDPRG8= <mlev>
##$CPDPRGB= <>
##$CPDPRGT= <>
##$D= (0..31)
0 1 0 0 0 0 0 0 0 0 0 0.03 2e-05 3e-06 0 0 0 0 0 0 0 0 0 0 0 0 0 0 0 0 
0 0 
##$DATE= 1554982815
##$DBL= (0..7)
120 120 120 11 120 120 24 19 
##$DBP= (0..7)
150 150 150 150 150 150 150 150 
##$DBP07= 0
##$DBPNAM0= <>
##$DBPNAM1= <>
##$DBPNAM2= <>
$$ [...]
##$SUBNAM3= <"">
##$SUBNAM4= <"">
##$SUBNAM5= <"">
##$SUBNAM6= <"">
##$SUBNAM7= <"">
##$SUBNAM8= <"">
##$SUBNAM9= <"">
##$SW= 369.568048894756
##$SWIBOX= (0..15)
0 1 3 0 0 0 0 0 0 0 0 0 0 0 0 0 
##$SW_h= 29940.119760479
##$TD= 32768
##$TD0= 1
##$TE= 0
##$TE2= 300
##$TE3= 300
##$TEG= 300
##$TL= (0..7)
0 120 53 12 22 120 120 120 
##$TP= (0..7)
150 150 150 150 150 150 150 150 
##$TP07= 0
##$TPNAME0= <>
##$TPNAME1= <>
##$TPNAME2= <>
##$TPNAME3= <>
##$TPNAME4= <>
##$TPNAME5= <>
##$TPNAME6= <>
##$TPNAME7= <>
##$TPOAL= (0..7)
0.5 0.5 0.5 0.5 0.5 0.5 0.5 0.5 
##$TPOFFS= (0..7)
0 0 0 0 0 0 0 0 
##$TUNHIN= 0
##$TUNHOUT= 0
##$TUNXOUT= 0
##$USERA1= <user>
##$USERA2= <user>
##$USERA3= <user>
##$USERA4= <user>
##$USERA5= <user>
##$V9= 5
##$VALIST= <valist>
##$VCLIST= <CCCCCCCCCCCCCCC>
##$VD= 0
##$VDLIST= <DDDDDDDDDDDDDDD>
##$VPLIST= <PPPPPPPPPPPPPPP>
##$VTLIST= <TTTTTTTTTTTTTTT>
##$WBST= 1024
##$WBSW= 4
##$XGAIN= (0..3)
0 0 0 0 
##$XL= 0
##$YL= 0
##$YMAX_a= 7729
##$YMIN_a= -9837
##$ZGOPTNS= <>
##$ZL1= 120
##$ZL2= 120
##$ZL3= 120
##$ZL4= 120
##$ABSF1= 182.463
##$ABSF2= -187.1042
##$ABSG= 5
##$ABSL= 3
##$ALPHA= 0
##$AQORDER= 0
##$ASSFAC= 0
##$ASSFACI= 0
##$ASSFACX= 0
##$ASSWID= 0
##$AUNMP= <proc_1d>
##$AZFE= 0.1
##$AZFW= 0.5
##$BCFW= 0
##$BC_mod= 2
##$BYTORDP= 0
##$COROFFS= 0
##$CY= -3
##$DATMOD= 1
##$DC= 0
##$DFILT= <>
##$DTYPP= 0
##$F1P= 0
##$F2P= 0
##$FCOR= 1
##$FTSIZE= 65536
##$FT_mod= 6
##$GAMMA= 0
##$GB= 0
##$INTBC= 1
##$INTSCL= 5.30512e-09
##$ISEN= 30
##$LB= 1
##$LEV0= 0
##$LPBIN= 0
##$MAXI= 10000
##$MC2= 0
##$MEAN= 0
##$ME_mod= 0
##$MI= 50
##$NCOEF= 0
##$NC_proc= -6
##$NLEV= 6
##$NOISF1= 182.463
##$NOISF2= 159.3651
##$NSP= 0
##$NTH_PI= 0
##$NZP= 0
##$OFFSET= 182.463
##$PC= 4
##$PHC0= -1824.217
##$PHC1= 123.999
##$PH_mod= 1
##$PKNL= yes
##$PPARMOD= 0
##$PSCAL= 0
##$PSIGN= 0
##$REVERSE= no
##$SF= 81.0140089999434
##$SI= 65536
##$SIGF1= 159.3651
##$SIGF2= -187.1042
##$SINO= 113.3802
##$SIOLD= 16384
##$SREGLST= <1H.CDCl3>
##$SSB= 0
##$STSI= 65536
##$STSR= 0
##$SW_p= 29940.119760479
##$SYMM= 0
##$S_DEV= 0
##$TDeff= 32768
##$TDoff= 0
##$TI= <>
##$TILT= no
##$TM1= 0
##$TM2= 0
##$TOPLEV= 0
##$USERP1= <user>
##$USERP2= <user>
##$USERP3= <user>
##$USERP4= <user>
##$USERP5= <user>
##$WDW= 1
##$XDIM= 65536
##$YMAX_p= 436498612
##$YMIN_p= -16936308
$$ End of Bruker specific parameters
$$ ---------------------------------
##NTUPLES= NMR SPECTRUM
##VAR_NAME=  FREQUENCY,     SPECTRUM/REAL,   SPECTRUM/IMAG
##SYMBOL=    X,             R,               I
##VAR_TYPE=  INDEPENDENT,   DEPENDENT,       DEPENDENT
##VAR_FORM=  AFFN,          ASDF,            ASDF
##VAR_DIM=   65536,         65536,           65536
##UNITS=     HZ,            ARBITRARY UNITS, ARBITRARY UNITS
##FACTOR=    0.456856943014862, 1,           1
##FIRST=     14782.0589164792, 0,            0
##LAST=      -15158.0608439998, 0,           0
##MIN=       -15158.0608439998, -16936308,   0
##MAX=       14782.0589164792, 436498612,    0
$$ Real data points
##PAGE= N=1
##DATA TABLE= (X++(R..R)), XYDATA
$$ [...]
$$ plain form
40995 -1175647 -440246 518963 1168091 1810993 2667047 3109179 2459403 1185988 569196
40986 569196 1179774 2299647 2941590 2848456 2313099 1649459 1192287 1277913 1801302 2193812
40976 2193812 2127256 1745705 1001087 -430829 -2134152 -2821831 -2033917 -1103040 -1393528
40967 -1393528 -2366789 -2672878 -2464254 -2966722 -4072253 -4221984 -2898988 -1517350 -1277801
40958 -1277801 -1659250 -1807828 -2039445 -2878615 -3629268 -3139150 -1471355 168557 847129
40949 847129 529551 -321451 -1089973 -1294510 -1162277 -1602189 -3021729 -4485328 -4657811
40940 -4657811 -3369262 -1709044 -736311 -551017 -502496 31706 943401 1308678 330507
40931 330507 -1492463 -2648886 -2302549 -1108446 -85560 509452 693735 119871 -1124628
$$ packed form
40995a175647P35401R59209O49128O42902Q56054M42132o49776j273415o16792
40986E69196O10578J119873O41943r3134n35357o63640m57172Q5626N23389L92510
40976B193812o6556l81551p44618j431916j703323o87679P87914R30877k90488
40967a393528r73261l06089K08624n02468j105531j49731J322996J381638K39549
40958a277801l81449j48578k31617q39170p50653M90118J667795J639912O78572
40949H47129l17578q51002p68522k04537J32233m39912j419540j463599j72483
40940d657811J288549J660218R72733J85294M8521N34202R11695L65277r78171
40931C30507j822970j156423L46337J194103J022886N95012J84283n73864j244499
$$ plain form
40922 -1124628 -1848813 -1126060 102756 90867 -1257630 -2350682 -2318313 -1952756 -1873254
40913 -1873254 -1311739 337817 2004435 2274970 1452692 885977 756051 150282 -757018
40904 -757018 -439540 1431027 2816844 1978381 156874 -50152 1646266 3071138 3007799
40895 3007799 2729076 3465264 4228899 3495722 1676450 259341 -589922 -1726084 -2823574
40886 -2823574 -2499428 -740884 638240 471815 -397392 -880126 -1274278 -2179367 -3008383
40877 -3008383 -2783044 -1667928 -691084 -474968 -991662 -1911869 -2473022 -1799242 -187065
40868 -187065 792691 429186 84085 948874 1625959 -83521 -3442762 -5094190 -3480261
40859 -3480261 -996278 -837526 -3131022 -5267027 -5118675 -2921370 -545336 304535 -432377
$$ packed form
40922a124628p24185P22753J228816j1889j348497j093052L2369L65557P9502
40913a873254N61515J649556J666618K70535q22278n66715j29926o05769r07300
40904g57018L17478J870567J385817q38463j821507k07026J696418J424872o3339
40895C007799k78723P36188P63635p33177j819272j417109q49263j136162j097490
40886b823574L24146J758544J379124j66425q69207m82734l94152r05089q29016
40877c008383K25339J115116R76844K16116n16694r20207n61153O73780J612177
40868a87065R79756l63505l45101Q64789O77085j709480l359241j651428J613929
40859c480261K483983J58752k293496k136005J48352K197305K376034Q49871p36912
$$ plain form
40850 -432377 -1004349 338503 3038501 4523744 3304684 873705 -295886 163162 545775
40841 545775 -288768 -1578393 -1949251 -983759 763991 2528825 3702631 3907579 3116692
40832 3116692 1651051 35437 -1095129 -1259186 -674102 -300362 -834188 -1749777 -1823326
40823 -1823326 -567719 1276801 2590196 2759112 1858291 521258 -418519 -718791 -1084215
40814 -1084215 -2108923 -3036151 -2516425 -650043 858531 959903 507251 570863 713919
40805 713919 116099 -555944 -23308 1283584 1510967 108472 -1301869 -1236021 -136038
40796 -136038 836558 1540744 2412348 3226562 3401541 2934280 2088925 757215 -877387
40787 -877387 -1701519 -1009609 -49323 -676721 -2503699 -3042750 -1150927 1232853 1734282
$$ packed form
40850d32377n71972J342852K699998J485243j219060k430979j169591M59048L82613
40841E45775q34543j289625l70858R65492J747750J764834J173806K04948p90887
40832C116692j465641j615614j130566j64057N85084L73740n33826r15589p3549
40823a823326J255607J844520J313395J68916r00821j337033r39777l00272l65424
40814a084215j024708r27228N19726J866382J508574J01372m52652O3612J43056
40805G13919n97820o72043N32636J306892K27383j402495j410341O5848J099983
40796a36038R72596P04186Q71604Q14214J74979m67261q45355j331710j634602
40787h77387q24132O91910R60286o27398j826978n39051J891823K383780N01429
$$ plain form
40778 1734282 654842 61621 542911 566840 -890956 -2617382 -2834380 -1696228 -1043670
40769 -1043670 -1866184 -2988590 -2636962 -662016 1456367 2548899 2905726 3363862 4006352
40760 4006352 4274343 3903395 3156579 2368389 1755565 1457219 1282405 681351 -483624
40751 -483624 -1414227 -1279999 -421878 84178 -101672 -368319 -328434 -324033 -698514 -1371049
40741 -1371049 -2173208 -2810760 -2608222 -1377725 -524817 -1911031 -5256678 -8014586 -8386264
40732 -8386264 -7163379 -5921523 -4873423 -3622418 -2709458 -2872040 -3563512 -3649441 -3047779
40723 -3047779 -2467514 -2106959 -1817004 -1904950 -2452142 -2478587 -1267601 54090 -108329
40714 -108329 -1342322 -1918757 -1580289 -1580932 -2044409 -1599240 -73060 730063 -136398 -1165271
$$ packed form
40778A734282j079440n93221M81290K3929j457796j726426k16998J138152O52558
40769a043670q22514j122406L51628J974946K118383J092532L56827M58136O42490
40760D006352K67991l70948p46816p88190o12824k98346j74814o01054j164975
40751d83624r30603J34228Q58121N06056j85850k66647L9885M401l74481o72535
40741a371049q02159o37552K02538J230497Q52908j386214l345647k757908l71678
40732h386264J222885J241856J048100J251005R12960j62582o91472q5929O01662
40723c047779N80265L60555K89955q7946n47192k6445J210986J321691j62419
40714a08329j233993n76435L38468o43m63477M45169J526180Q03123q66461j028873
$$ plain form
40704 -1165271 -859497 -68031 -407046 -1724831 -2685002 -2818537 -2467044 -1540401 79660
40695 79660 1453426 1435057 376506 -277381 82964 800653 1238492 1408265 1417793 1287011
40685 1287011 1307050 1757583 2307306 2406448 2143921 2015377 2006202 1595315 511349 -1098796
40675 -1098796 -2958272 -4551501 -5224533 -5081266 -5119991 -5577889 -4966502 -2121505 1452912
40666 1452912 3031998 2162898 837558 253199 -415162 -1563045 -1823736 -434057 1020849
40657 1020849 958955 419018 1268167 2749911 2195342 -901808 -3672983 -3366828 -537193
40648 -537193 2056453 2637413 1614611 345053 -305143 -348423 -339844 -788397 -1669207 -2521510
40638 -2521510 -3074991 -3558239 -4228924 -4813422 -4698529 -3689850 -2421121 -1878179 -2426966
$$ packed form
40704a165271L05774P91466l39015j317785r60171j33535L51493R26643J620061
40695G9660J373766j8369j058551o53887L60345P17689M37839J69773R528j30782
40685A287011K0039M50533N49723R9142k62527j28544r175m10887j083966j610145
40675a098796j859476j593229o73032J43267l8725m57898O11387K844997L574417
40666A452912J579086q69100j325340n84359o68361j147883k60691J389679J454906
40657A020849o1894n39937Q49149J481744n54569l097150k771175L06155K829635
40648e37193K593646N80960j022802j269558o50196m3280Q579m48553q80810q52303
40638b521510n53481m83248o70685n84498J14893J008679J268729N42942n48787
$$ plain form
40629 -2426966 -3326007 -3367305 -2103489 -314216 827616 855361 145696 -744877 -1513529
40620 -1513529 -1974491 -1865935 -973194 541530 1897523 1978975 352211 -1887492 -2878021
40611 -2878021 -1990201 -553476 -113915 -587178 -895968 -811960 -961584 -1303626 -1067150
40602 -1067150 -360059 -333558 -1161858 -1293699 259923 2081139 2150045 675023 -408237
40593 -408237 -275128 120953 104517 226095 749979 834458 97995 -305917 644102 2008132
40583 2008132 2043491 677111 -511576 -578820 -136693 181099 845980 2309574 3662978
40574 3662978 3474531 1741639 145217 169612 1459203 2329939 1697044 207332 -579268
40565 -579268 34585 1169495 1565887 1262992 1562213 3136530 4756533 4605796 2671206
$$ packed form
40629b426966q99041m1298J263816J789273J141832K7745p09665q90573p68652
40620a513529m60962J08556Q92741J514724J355993Q1452j626764k239703r90529
40611b878021Q87820J436725M39561m73263l08790Q4008j49624l42042K36476
40602a067150P07091K6501q28300j31841J553622J821216O8906j475022j083260
40593d08237J33109L96081j6436J21578N23884Q4479p36463m03912R50019J364030
40583B008132L5359j366380j188687o7244M42127L17792O64881J463594J353404
40574C662978j88447j732892j596422K4395J289591Q70736o32895j489712p86600
40565e79268O13853J134910L96392l02895K99221J574317J620003j50737j934590
$$ plain form
40556 2671206 895336 677263 1172436 843293 -118094 -270835 471227 447900 -1002189
40547 -1002189 -2001243 -597721 2268106 3798845 2818684 702144 -889979 -1554024 -1360787
40538 -1360787 -267633 1106020 1578950 1097337 1140983 2617873 4456958 5174865 4729014
40529 4729014 3798575 2402119 608063 -373596 484356 2147578 2607124 1545756 408585
40520 408585 132999 446969 1179539 2370125 3017084 1771205 -633858 -1632121 -333790
40511 -333790 1095125 688823 -484637 -308740 1090473 2010751 2079879 2274198 2506950
40502 2506950 1528374 -504918 -1441814 -19084 2157100 2671708 1406260 337161 643644
40493 643644 1268765 619872 -1158748 -2316973 -1691954 -79183 850791 487347 -430012
$$ packed form
40556B671206j775870k18073M95173l29143r61387j52741P42062k3327j450089
40547a002189r99054J403522K865827J530739r80161k116540j592123o64045J93237
40538a360787J093154J373653M72930m81613M3646J476890J839085P17907m45851
40529D729014r30439j396456j794056r81659Q57952J663222M59546j061368j137171
40520D08585k75586L13970P32570J190586O46959j245879k405063r98263J298331
40511c33790J428915m06302j173460J75897J399213R20278O9128J94319K32752
40502B506950r78576k033292r36896J422730K176184N14608j265448j069099L06483
40493F43644O25121o48893j778620j158225O25019J612771R29974l63444r17359
$$ plain form
40484 -430012 -1103870 -1395064 -1294222 -744776 -372164 -1322557 -3549599 -5074239 -4049562
40475 -4049562 -1133452 1274927 1912015 1636201 1599790 1696558 1281425 482098 41437
40466 41437 250227 606549 433523 -417430 -1374380 -1587689 -763116 430504 1036922 885960
40456 885960 677138 971157 1466083 1435341 640595 -382695 -894822 -755484 -624285 -1208508
40446 -1208508 -2322794 -3061893 -3062083 -3098735 -3997277 -5347949 -5901447 -5014674 -3090519 -757760
40436 -757760 1621521 3529205 4102845 2854663 391645 -1851974 -2672560 -2036107 -1094484
40427 -1094484 -1088088 -2070178 -2941754 -2857143 -2155039 -1640509 -1495524 -1371874 -1063890 -533982
40417 -533982 239480 844935 472955 -827235 -1534740 -374139 1776295 2877399 2359672
$$ packed form
40484d30012o73858k91194J00842N49446L72612r50393k227042j524640J024677
40475d049562K916110K408379O37088k75814l6411R6768m15133p99327m40661
40466D1437K08790L56322j73026q50953r56950k13309Q24573J193620O06418j50962
40456H85960k08822K94019M94926l0742p94746j023290n12127J39338J31199n84223
40446a208508j114286p39099j90l6652q98542j350672n53498Q86773J924155K332759
40436g57760K379281J907684N73640j248182k463018k243619q20586O36453R41623
40427a094484O396r82090q71576Q4611P02104N14530J44985J23650L07984N29908
40417e33982P73462O05455l71980j300190p07505J160601K150434J101104n17727
$$ plain form
40408 2359672 1502281 1326703 1485000 1340457 794590 -256005 -2016344 -3930936 -4872000
40399 -4872000 -4624417 -4130524 -3942675 -3654964 -3254304 -3579257 -4679113 -5076722 -3696714
40390 -3696714 -1456359 60985 526699 496922 186739 -250846 -199918 438572 658782
40381 658782 16605 -132402 1337712 2966697 2392757 -72208 -1708624 -1244871 -338408
40372 -338408 -765821 -2108513 -3116008 -3702267 -4338163 -4618119 -3791371 -2122191 -606263
40363 -606263 316437 864712 1021968 459848 -624236 -1316267 -918097 226499 1046807
40354 1046807 830673 -75181 -677733 -405477 403091 1067664 1228389 750394 -488778
40345 -488778 -2164112 -3242062 -2883345 -1489447 -270662 57404 -415432 -1433454 -2657970
$$ packed form
40408B359672q57391j75578J58297j44543n45867j050595j760339j914592r41064
40399d872000K47583M93893J87849K87711M00660l24953j099856l97609J380008
40390c696714K240355J517344M65714k9777l10183m37585N0928O38490K20210
40381F58782o42177j49007J470114J628985n73940k464965j636416M63753R06463
40372c38408m27413j342692j007495n86259o35896k79956Q26748J669180J515928
40363f06263R22700N48275J57256n62120j084084o92031L98170J144596Q20308
40354A046807k16134r05854o02552K72256Q08568O64573J60725m77995j239172
40345d88778j675334j077950L58717J393898J218785L28066m72836j018022j224516
$$ plain form
40336 -2657970 -3301716 -2709026 -1402215 -623629 -635300 -363279 925854 2370647 2422283
40327 2422283 586861 -1992961 -3429221 -2699867 -830489 -119137 -1484401 -3132433
40319 -3132433 -2972811 -1725063 -1848064 -3653073 -4779206 -3957923 -2850056 -2979059 -3139202
40310 -3139202 -1694594 396367 1102866 531571 191241 -31042 -1525529 -3926010 -5019228
40301 -5019228 -3950851 -2325114 -1669476 -1749414 -1869266 -1927597 -1562190 -131676 1624947
40292 1624947 1693699 -437412 -2720669 -3330066 -2882690 -2657288 -2312629 -1122700 -64805
40283 -64805 -516090 -1704160 -1671875 -432372 -7977 -1241873 -2594897 -2657258 -2138430
40274 -2138430 -2421178 -3318571 -3347518 -1720810 672981 2100059 1544355 -285532 -1463385
$$ packed form
40336b657970o43746N92690J306811P78586j1671K72021J289133J444793N1636
40327B422283j835422k579822j436260P29354J869378P11352j365264j648032
40319c132433J59622J247748j23001j805009j126133Q21283J107867j29003j60143
40310c139202J444608K090961P06499n71295l40330k22283j494487k400481j093218
40301e019228J068377J625737O55638p9938j19852n8331L65407J430514J756623
40292A624947O8752k131111k283257o09397M47376K25402L44659J189929J057895
40283f4805m51285j188070L2285J239503M24395j233896j353024o2361N18828
40274b138430k82748q97393k8947J626708K393791J427078n55704j829887j177853
$$ plain form
40265 -1463385 -705073 1345746 3019717 3450827 2926713 1913595 714365 -175457 -441448
40256 -441448 -531741 -834579 -600425 948518 2718256 2778969 1382269 814579 1652997
40247 1652997 1506166 -1160125 -4089161 -4193937 -1911775 -222014 -280812 -561919 35939
40238 35939 740886 771532 447268 -64903 -1182306 -2428609 -2305500 -526451 1141239
40229 1141239 1230041 424404 54084 30118 -476723 -1343201 -1840911 -1930327 -1883387 -1204498
40219 -1204498 670799 2911411 3891072 3232499 2085547 1317074 598691 -404938 -1041645
40210 -1041645 -565926 614851 1358381 1251010 1025548 1415370 2055787 1950904 914564
40201 914564 -39630 -23629 600598 1060017 1567391 2731752 3824881 3233730 1066522
$$ packed form
40265a463385P58312K050819J673971M31110n24114j013118j199230q89822k65991
40256d41448r0293l02838K34154J548943J769738O0713j396700n67690Q38418
40247A652997j46831k666291k929036j04776K282162J689761n8798k81107N97858
40238C5939P04947L0646l24264n12171j117403j246303J23109J779049J667690
40229A141239Q8802q05637l70320k3966n06841q66478m97710q9416M6940O78889
40219a204498J875297K240612R79661o58573j146952p68473p18383j003629o36707
40210a041645M75719J180777P43530j07371k25462L89822O40417j04883j036340
40201I14564r54194J6001O24227M59419N07374J164361J093129n91151k167208
$$ plain form
40192 1066522 -294541 729328 2593636 2773598 1246393 192587 799276 2099017
40184 2099017 2812235 2645587 1616790 -287689 -2294017 -3046415 -2293881 -1311690 -1034018
40175 -1034018 -772828 485720 2376176 3588815 3453940 2386737 1183471 474588 529216
40166 529216 1085079 1564907 1665176 1404790 645584 -660324 -1622163 -889430 1422617
40157 1422617 3223535 2740209 680302 -765279 -565108 413707 911596 530603 -406567
40148 -406567 -1402206 -2080618 -2429367 -2750454 -3158186 -3462960 -3757410 -4393880 -4912980 -4011498
40138 -4011498 -1586502 149342 -853562 -3456442 -4600969 -3397455 -1873684 -1376999
40130 -1376999 -594608 1654742 3746980 3396638 1217340 -115967 281145 724896 32841
$$ packed form
40192A066522j361063J023869J864308J79962j527205j053806O06689J299741
40184B099017P13218j66648j028797j904479k006328p52398P52534R82191K77672
40175a034018K61190J258548J890456J212639j34875j067203j203266p08883N4628
40166E29216N55863M79828J00269k60386p59206j305908r61839P32733K312047
40157A422617J800918m83326k059907j445581K00171R78815M97889l80993r37170
40148d06567r95639o78412l48749l21087m07732l04774k94450o36470n19100R01482
40138d011498K424996J735844j002904k602880j144527J203514J523771M96685
40130a376999P82391K249350K092238l50342k179298j333307L97112M43751o92055
$$ plain form
40121 32841 -847704 -908235 -792587 -1238471 -1345783 -32706 1712520 1850765 286118
40112 286118 -865823 -235452 1060032 1266629 396468 -196032 89890 553997 551216 415374
40102 415374 785506 1589656 2080469 1743324 968622 712536 1367789 2079606 1605566 -43063
40092 -43063 -1387927 -1310042 -546577 -658640 -1839250 -2666523 -2070072 -636042 433877
40083 433877 957380 1693359 2908634 3710365 3043081 1115735 -474943 -243447 1593530
40074 1593530 3296594 3491480 2567185 1965688 2448492 3461177 3894384 3014876 987330
40065 987330 -974485 -1378845 -109248 1103824 798022 -67148 606027 2828875 4284093
40056 4284093 3605830 2118295 1487195 1331309 505284 -605755 -776566 -88605 303011
$$ packed form
40121C2841q80545o0531J15648m45884j07312J313077J745226J38245j564647
40112B86118j151941O30371J295484K06597q70161n92500K85922M64107k781j35842
40102D15374L70132Q04150M90813l37145p74702k56086O55253P11817m74040j648629
40092d3063j344864P7885P63465j12063j180610q27273N96451J434030J069919
40083D33877N23503P35979J215275Q01731o67284j927346j590678K31496J836977
40074A593530J703064J94886r24295o01497M82804J012685M33207q79508k027546
40065I87330j961815m04360J269597J213072l05802q65170O73175K222848J455218
40056D284093o78263j487535o31100j55886q26025j111039j70811O87961L91616
$$ plain form
40047 303011 52011 -281361 -591072 -1088764 -1150800 -62713 1221938 991391 -379955
40038 -379955 -540994 1265892 2772966 1966457 19231 -634830 224099 956629 1002162
40029 1002162 1309212 2016148 1792185 50335 -1781707 -2158887 -1562472 -1648745 -2724434
40020 -2724434 -3170076 -1576179 1223979 2835716 1978148 -26279 -827427 208662 1553765
40011 1553765 1748200 1022456 263223 -456154 -1222165 -1087434 804446 3201595 3695746
40002 3695746 2039873 808438 1921399 3997667 4415087 2853421 1203235 616830
39994 616830 399584 -240348 -944822 -1103186 -798702 -365278 73119 177803 -596341 -2007834
39984 -2007834 -2799832 -2098681 -486653 847489 1464864 1651244 1635708 1504209 1429158
$$ packed form
40047C03011k51000l33372l09711m97692o2036J088087J284651k30547j371346
40038c79955j61039J806886J507074q06509j947226o54061Q58929P32530M5533
40029A002162L07050P06936k23963j741850j832042l77180N96415q6273j075689
40020b724434m45642J593897K800158J611737q57568k004427q01148J036089J345103
40011A553765J94435p25744p59233p19377p66011J34731J891880K397149M94151
40002C695746j655873j231435J112961K076268M17420j561666j650186n86405
39994F16830k17246o39932p04474j58364L04484M33424M38397J04684p74144j411493
39984b007834p91998P01151J612028J334142O17375J86380j5536j31499p5051
$$ plain form
39975 1429158 1328457 716627 -442694 -1163554 -477265 1267215 2873735 3757367 4155815
39966 4155815 4199537 3707230 2794841 1808869 703922 -661094 -1648180 -1203479 726697
39957 726697 2865059 3805021 3003577 835734 -1479309 -2294643 -1068940 575273 563805
39948 563805 -897446 -1748175 -1254571 -895086 -1583186 -2077777 -1303109 -358264 -567160
39939 -567160 -1084803 -463151 532754 -51052 -2104726 -3511127 -3363709 -2999835 -3538470
39930 -3538470 -4302655 -4297631 -3674027 -2965744 -2128512 -1113990 -437798 -475693 -881396 -1117984
39920 -1117984 -888504 110616 1897586 3421635 3190685 1186291 -821273 -1391851 -921119
39911 -921119 -534904 -529539 -620610 -760116 -817116 -260629 881664 1442728 555818 -808782
$$ packed form
39975A429158j00701o11830j159321p20860O86289J744480J606520Q83632L98448
39966D155815M3722m92307r12389r85972j104947j365016r87086M44701J930176
39957G26697K138362R39962q01444k167843k315043q15334J225703J644213j1468
39948E63805j461251q50729M93604L59485o88100m94591P74668R44845k08896
39939e67160n17643O21652R95905n83806k053674j406401J47418L63874n38635
39930c538470p64185N024O23604P08283Q37232J014522O76192l7895m05703k36588
39920a117984K29480R99120J786970J524049k30950k004394k007564n70578M70732
39911i21119L86215N365r1071j39506n7000N56487J142293N61064q86910j364600
$$ plain form
39901 -808782 -846626 749010 2442061 2839375 2230716 2003253 3013212 4661203 5423184
39892 5423184 4478769 2883644 2558457 3814189 4662810 3282183 454332 -1481407 -1627744
39883 -1627744 -1193707 -1238020 -1153944 37851 1903941 2995234 2610749 1432819 524651
39874 524651 246537 229625 69947 -137711 94658 1040875 2278723 2921634 2387373 865964
39864 865964 -948915 -2366090 -2867800 -2179694 -657303 528536 270667 -1138569 -2136563
39855 -2136563 -1852054 -1363082 -2126579 -3544488 -3407184 -947298 1893314 2929981 2308559
39846 2308559 1608426 1363665 879310 -17933 -566471 -375257 116426 614288 1350894
39837 1350894 2330239 3097710 3399021 3302510 2729915 1733091 1085252 1554097 2670890
$$ packed form
39901h08782l7844J595636J693051L97314o08659k27463J009959J647991P61981
39892E423184r44415j595125l25187J255732Q48621j380627k827851j935739j46337
39883a627744M34037m4313Q4076J191795J866090J091293l84485j177930r08168
39874E24651k78114j6912j59678k07658K32369R46217J237848O42911n34261j521409
39864H65964j814879j417175n01710O88106J522391J185839k57869j409236r97994
39855b136563K84509M88972p63497j417909J37304K459886K840612J036667o21422
39846B308559p00133k44761m84355q97243n48538J91214M91683M97862P36606
39837A350894R79345P67471L01311r6511n72595r96824o47839M68845J116793
$$ plain form
39828 2670890 3287493 3183038 2888067 2193911 502019 -1367316 -1658855 -369845 477633
39819 477633 -108020 -732170 -216785 491530 348998 216174 1083991 1928902 1355975 125124
39809 125124 -69572 631623 863953 646182 1057344 1705308 926185 -1332119 -2972845
39800 -2972845 -2630019 -1361349 -818711 -1130148 -1349998 -1017325 -543408 -541346 -1116455 -1615784
39790 -1615784 -1300767 -548302 -674980 -1957577 -2833448 -2139925 -1077637 -1409775 -2651448
39781 -2651448 -2991663 -2357607 -2334427 -3269614 -3743541 -3066548 -2129691 -1425332 -340887
39772 -340887 1019480 1331667 125932 -1411532 -2378311 -3085169 -3379323 -2087170 774813
39763 774813 3083238 3219291 2078950 1292757 1010358 752264 854885 1434628 1224421
$$ packed form
39828B670890O16603j04455k94971o94156j691892j869335k91539J289010Q47478
39819D77633n85653o24150N15385P08315j42532j32824Q67817Q44911n72927j230851
39809A25124j94696P01195K32330k17771M11162O47964p79123k258304j640726
39800b972845L42826J268670N42638l11437k19850L32673M73917K062n75109m99329
39790a615784L15017P52465j26678j282597q75871O93523J062288l32138j241673
39781b651448l40215O34056K3180r35187m73927O76993R36857P04359J084445
39772c40887J360367L12187j205735j537464r66779p06858k94154J292153K861983
39763G74813K308425J36053j140341p86193k82399k58094J02621N79743k10207
$$ plain form
39754 1224421 -814970 -3662293 -5529362 -6062300 -5822209 -4654079 -2331021 -20743
39746 -20743 741106 121025 -529424 -778741 -1129624 -1413262 -941110 -93942 -58602 -883939
39736 -883939 -1287746 -600270 405697 857411 781749 485899 -43589 -800096 -1554632 -2133547
39726 -2133547 -2320095 -1704008 -422282 305884 -501076 -1926192 -2086890 -773831 163053
39717 163053 -588469 -2016920 -2217993 -746532 1128361 1975974 1461443 357616 -356321
39708 -356321 -537745 -966928 -2085115 -2940627 -2126281 281688 2547914 3256294 2772922
39699 2772922 2417011 2765244 3257282 3166309 2473195 1756948 1480933 1589733 1796164 1922742
39689 1922742 1660608 451737 -1566757 -2782500 -1597170 1068880 2263389 745368
$$ packed form
39754A224421k039391k847323j867069n32938K40091J168130K323058K310278
39746b0743P61849o20081o50449k49317l50883k83638M72152Q47168L5340q25337
39736h83939m03807O87476J005967M51714p5662k95850n29488p56507p54536n78915
39726b133547j86548O16087J281726P28166q06960j425116j60698J313059R36884
39717A63053p51522j428451k01073J471461J874893Q47613n14531j103827p13937
39708c56321j81424m29183j118187q55512Q14346K407969K266226P08380m83372
39699B772922l55911L48233M92038r0973o93114p16247k76015J08800K06431J26578
39689A922742k62134j208871k018494j215743J185330K666050J194509j518021
$$ plain form
39681 745368 -1240447 -1114640 553531 1436530 1128668 1135608 1742977 1454487 -200494
39672 -200494 -1647307 -1854026 -1968769 -3228323 -4789761 -5005703 -3778942 -2293280 -1134677
39663 -1134677 -31605 879756 813554 -441099 -1811499 -1824761 -37322 2483951 4094028
39654 4094028 4067062 3106875 2283543 1807764 1227653 421849 -274655 -668662 -713470 -172816
39644 -172816 914276 1707638 1474848 821801 921972 1651611 1752563 889280 171714
39635 171714 341998 788794 887094 1123172 2228220 4098469 6025008 7087652 6128717
39626 6128717 2684837 -1552531 -3654798 -2694886 -838458 -340561 -794363 -527735 564378
39617 564378 1211383 989540 653863 535747 75323 -1007498 -2164036 -2756369 -2626597
$$ packed form
39681G45368j985815J25807J668171Q82999l07862O940O07369k88490j654981
39672b00494j446813k06719j14743j259554j561438k15942J226761J485662J158603
39663a134677J103072R11361o6202j254653j370400j3262J787439K521273J610077
39654D094028k6966r60187q23332m75779n80111q05804o96504l94007m4808N40654
39644a72816J087092P93362k32790o53047J00171P29639J00952q63283p17566
39635A71714J70284M46796R8300K36078J105048J870249J926539J062644r58935
39626F128717l443880m237368k102267R59912J856428M97897m53802K66628J092113
39617E64378O47005k21843l35677j18116m60424j082821j156538n92333J29772
$$ plain form
39608 -2626597 -1960908 -1131359 -505974 -15524 726622 1565443 1752643 1204231 898697
39599 898697 1298689 1366509 199998 -1242866 -1371847 -274495 614804 738230 850172
39590 850172 1392589 1838256 1771661 1491543 1370089 1480268 1859767 2345870 2340182 1652596
39580 1652596 1305041 2359292 4073349 4452799 2746721 307968 -1175996 -1284488 -542633
39571 -542633 439834 1119759 1064795 217183 -1206837 -2900089 -4123234 -3842872 -2154957
39562 -2154957 -878690 -1368037 -2315596 -1485931 722253 1591869 96183 -1695084 -1887504
39553 -1887504 -1223263 -1112686 -1208416 -575330 248189 189181 -375765 -305733 354011 713837
39543 713837 783717 1324966 2304938 2916270 2913520 2663808 2082725 757633 -984594 -2223166
$$ packed form
39608b626597O65689Q29549O25385M90450P42146Q38821J87200n48412l05534
39599H98697L99992O7820j166511j442864j28981J097352Q89299J23426J11942
39590H50172N42417M45667o6595k80118j21454J10179L79499M86103n688o87586
39580A652596l47555J054251J714057L79450j706078k438753j483964j08492P41855
39571e42633R82467O79925n4964q47612j424020j693252j223145K80362J687915
39562b154957J276267m89347r47559Q29665K208184Q69616j495686j791267j92420
39553a887504O64241J10577r5730O33086Q23519n9008n64946P0032O59744L59826
39543G13837O9880N41249R79972O11332k750k49712n81083j325092j742227j238572
$$ plain form
39533 -2223166 -2518225 -1935654 -476310 1334594 1860278 22968 -2622884 -3286704 -1594887
39524 -1594887 -70162 -499691 -1642237 -1480650 -142154 788916 738924 441645 436798
39515 436798 642012 1031632 1510952 1371948 70822 -1540951 -1916953 -851648 230877
39506 230877 246643 -307361 -507542 -435096 -672097 -988538 -519345 828005 1952857 1841662
39496 1841662 843727 317283 1142321 2861776 4298402 4761920 4452503 3828179 2980860
39487 2980860 1821618 581161 -267349 -548660 -546301 -606682 -847775 -1289705 -1971720 -2795968
39477 -2795968 -3460501 -3700516 -3494763 -2995135 -2399980 -1891420 -1482664 -930596 -47027
39468 -47027 964747 1851852 2879282 4394499 5734359 5459225 3216972 611775 -576770
$$ packed form
39533b223166k95059N82571J459344J810904N25684j837310k645852o63820J691817
39524a594887J524725m29529j142546J61587J338496R31070m9992k97279m847
39515D36798K05214L89620M79320j39004j301126j611773l76002J065305J082525
39506B30877J5766n54004k00181P2446k37001l16441M69193J347350J124852j11195
39496A841662r97935n26444Q25038J719455J436626M63518l09417o24324q47319
39487B980860j159242j240457q48510k81311K359o0381k41093m41930o82015q24248
39477b795968o64533k40015K05753M99628N95155N08560M08756N52068Q83569
39468d7027J011774Q87105J027430J515217J339860k75134k242253k605197j188545
$$ plain form
39459 -576770 -438022 -275890 -515750 -573454 -500410 -1120289 -2256521 -2422921 -1070526 143372
39449 143372 -610810 -2935147 -4870031 -5218630 -4214019 -2630848 -1397606 -1436833 -2568965
39440 -2568965 -3057067 -1608592 629628 1645455 1715042 2939115 5562179 7106535 6063668
39431 6063668 4304770 4265707 5406844 5474378 4212941 3552124 4391593 5361493 5178977
39422 5178977 4482706 4457819 4821077 4257966 2378213 362584 -343119 426396 1415649
39413 1415649 1282533 -32035 -1484813 -2376707 -2937683 -3202259 -2280521 279242 3071461
39404 3071461 4102498 3259166 2219793 2002200 2066791 2001340 2392251 3327595 3610291
39395 3610291 2583643 1461238 1499566 1915905 1227862 -115804 -314678 868799 1678749
$$ packed form
39459e76770J38748J62132k39860n7704P3044o19879j136232j66400J352395J213898
39449A43372p54182k324337j934884l48599J004611J583171J233242l9227j132132
39440b568965m88102J448475K238220J015827O9587J224073K623064J544356j042867
39431F063668j758898l9063J141137O7534j261437o60817Q39469R69900j82516
39422E178977o96271k4887L63258n63111j879753k015629p05703P69515R89253
39413A415649j33116j314568j452778q91894n60976k64576R21738K559763K792219
39404C071461J031037q43332j039373k17593O4591o5451L90911R35344K82696
39395C610291j026648j122405L8328M16339o88043j343666j98874J183477Q09950
$$ plain form
39386 1678749 1036535 -76714 -376730 134546 981783 2112896 3035138 2447871 107895
39377 107895 -1923659 -1461019 909071 2623256 2555847 2055651 2481791 3283521 3154173
39368 3154173 1907303 380898 -720849 -1091892 -548766 669024 1684420 1810541 1370850
39359 1370850 1091159 967378 464063 -361451 -813784 -715288 -744620 -1263575 -1548236 -826000
39349 -826000 389734 797220 34001 -845434 -780776 82918 997445 1818353 2823322
39340 2823322 3557224 2856941 404670 -2436852 -3942984 -3793240 -2946702 -2121050 -1208032
39331 -1208032 -122855 677906 883352 892168 1178900 1467462 1079074 9317 -788879
39322 -788879 -389246 924550 1659985 616759 -1492990 -2380925 -654648 2344581 3864875
$$ packed form
39386A678749o42214j113249l00016N11276Q47237J131113R22242n87267k339976
39377A07895k031554M62640K370090J714185o7409n00196M26140Q01730j29348
39368C154173j246870j526405j101747l71043N43126J217790J015396J26121m39691
39359A370850k79691j23781n03315q25514m52333R8496k9332n18955k84661P22236
39349h26000J215734M07486p63219q79435O4658Q63694R14527Q20908J004969
39340B823322P33902p00283k452271k841522j506132J49744Q46538Q25652R13018
39331a208032J085177Q00761K05446Q816K86732K88562l88388j069757p98196
39322g88879L99633J313796P35435j043226k109749q87935J726277K999229J520294
$$ plain form
39313 3864875 2720416 131308 -2220068 -3723790 -4197680 -3186528 -911074 1077469
39305 1077469 1430103 680595 325934 665129 699315 -60481 -868409 -874461 -36406 1157717
39295 1157717 2067743 2043232 1051166 127375 294277 1060714 1005661 -137679 -1161065
39286 -1161065 -1323561 -1276634 -1506135 -1175944 429759 2209924 2261152 318718 -1796140
39277 -1796140 -2193240 -767474 1011400 1765895 1535000 1459697 2169802 2887635 2605536
39268 2605536 1660473 1126456 930255 29872 -1399325 -1700317 -389035 639001 -150800
39259 -150800 -1442336 -1028417 842897 2083238 2013533 1762516 1651144 579010 -1542700
39250 -1542700 -2966377 -2683377 -1976087 -2148314 -2297313 -973513 1094163 1852953 1029254
$$ packed form
39313C864875j144459k589108k351376j503722m73890J011152K275454J988543
39305A077469L52634p49508l54661L39195L4186p59796q07928o052Q38055J194123
39295A157717R10026k4511r92066r23791J66902P66437n5053j143340j023386
39286a161065j62496M6927k29501L30191J605703J780165N1228j942434k114858
39277a796140l97100J425766J778874P54495k30895p5303P10105P17833k82099
39268B605536r45063n34017j96201r00383j429197l00992J311282J028036p89801
39259a50800j291536M13919J871314J240341o9705k51017j11372j072134k121710
39250a542700j423677K83000P07290j72227j48999J323800K067676P58790q23699
$$ plain form
39241 1029254 562379 1882770 4253082 6118777 6828813 6518996 5404768 3970028 3105008
39232 3105008 3207615 3562202 3328068 2798219 2902417 3684033 4180160 3885488 3428431
39223 3428431 3416173 3417640 2785695 1916825 1751578 2208149 2102793 840611 -638293 -1059313
39213 -1059313 -387872 314354 214805 -610447 -1503098 -1700266 -750601 936322 2088673
39204 2088673 1749231 441712 -434740 -362246 -101365 -190063 -34550 830434 1421239 458061
39194 458061 -1445397 -2098738 -503260 1926639 3464030 4097391 4408522 3723408 1305410
39185 1305410 -1255998 -1318756 826152 1714816 -402216 -2715228 -1810110 1404206 3322915
39176 3322915 2995532 2766005 3878418 4646902 3655407 1974040 1002485 463522 -63128
$$ packed form
39241A029254m66875J320391K370312J865695P10036l09817j114228j434740q65020
39232C105008J02607L54587k34134n29849J04198P81616M96127k94672m57057
39223C428431j2258J467o31945q68870j65247M56571j05356j262182j478904m21020
39213a059313O71441P02226r9549q25252q92651j97168R49665J686923J152351
39204B088673l39442j307519q76452P2494K60881q8698J55513Q64984N90805r63178
39194D58061j903458o53341J595478K429899J537391O33361L11131o85114k417998
39185A305410k561408o2758K144908Q88664k117032k313012R05118L214316J918709
39176C322915l27383k29527J112413P68484r91495j681367r71555n38963n26650
$$ plain form
39167 -63128 240160 1584138 2217177 861111 -993859 -1235039 -289467 -35825 -654994
39158 -654994 -865035 -504129 -455442 -429511 730530 2595274 3358236 2749295 2551587 3709954
39148 3709954 4889527 4577268 2910958 747951 -1497221 -3337024 -3934160 -3144021 -1826757
39139 -1826757 -727081 -93833 -398407 -1856999 -3117643 -2347915 -98182 932133 -281707
39130 -281707 -1586766 -1020291 414583 767730 -17051 -1019359 -2326460 -4022917 -4644813
39121 -4644813 -2997242 -603327 -59332 -1500871 -2790978 -2758122 -2133408 -1548457 -787649
39112 -787649 -131684 -438014 -1510797 -2077430 -1782376 -1689213 -2395712 -3073186 -2872634 -2057853
39102 -2057853 -1284481 -846096 -995360 -1925237 -3059526 -3373810 -2747639 -2046635 -1671261
$$ packed form
39167f3128L03288J343978O33039j356066j854970k41180R45572K53642o19169
39158f54994k10041L60906M8687K5931J160041J864744P62962o08941j97708J158367
39148C709954J179573l12259j666310k163007k245172j839803n97136P90139J317264
39139a826757J099676O33248l04574j458592j260644P69728K249733J030315j213840
39130b81707j305059N66475J434874L53147p84781j002308j307101j696457o21896
39121d644813J647571K393915N43995j441539j290107L2856O24714N84951P60808
39112g87649O55965l06330j072783n66633K95054R3163p06499o77474K00552Q14781
39102b057853P73372M38385j49264r29877j134289l14284O26171P01004L75374
$$ plain form
39093 -1671261 -1115678 -231020 221483 -274377 -1198492 -1678589 -1174867 478728 2622757
39084 2622757 3513006 2060135 -85201 -17337 2433326 4207799 3334367 1558100 1197659
39075 1197659 1437127 -6688 -2884191 -4615744 -3907284 -1856142 272966 2084179
39067 2084179 2810400 1416357 -1335626 -2890182 -2021907 -444184 -229695 -1021543 -1176454
39058 -1176454 -559148 -440898 -1080794 -1201989 -139209 902098 436825 -1329938 -2950251
39049 -2950251 -3663514 -3955268 -4232599 -3886452 -2252441 4297 1329547 1124988 361750
39040 361750 65266 15517 -369567 -610034 185156 1526044 1794956 548506 -717960
39031 -717960 -681096 142373 701563 1190200 2155682 2746689 1701320 -229304 -860509
$$ packed form
39093a671261N55583Q84658M52503m95860r24115m80097N03722J653595K144029
39084B622757Q90249j452871k145336O7864K450663J774473q73432j776267l60441
39075A197659K39468j443815k877503j731553P08460K051142K129108J811213
39067B084179P26221j394043k751983j554556Q68275J577723K14489p91848j54911
39058a176454O17306J18250o39896j21195J062780J041307m65273j766763j620313
39049b950251p13263k91754k77331L46147J634011K256738J325250k04559p63238
39040C61750k96484m9749l85084k40467P95190J340888K68912j246450j266466
39031g17960L6864Q23469N59190M88637R65482N91007j045369j930624o31205
$$ plain form
39022 -860509 135452 514581 -1083218 -2796868 -2189478 94083 1236274 150110 -1503895
39013 -1503895 -2106284 -2014216 -2292533 -3039734 -3676362 -3800595 -3130038 -1555200 149904
39004 149904 618145 -395601 -1390991 -923246 702474 2202755 2953142 3017934 2360229
38995 2360229 1126038 157260 53190 59021 -955766 -2596445 -3213693 -2170712 -783471
38986 -783471 -655177 -1805996 -2828017 -2488225 -982662 200951 -214961 -1733743 -2430990
38977 -2430990 -1211149 910460 2339065 2857354 3061943 2723328 1277268 -488112 -1025099
38968 -1025099 -342851 -36425 -746300 -1291220 -845876 -283390 -494182 -891781 -681716
38959 -681716 -305669 -367505 -207129 1072222 2933766 4080817 4183295 3717334 2752196
$$ packed form
39022h60509R95961L79129j597799j713650O07390K283561J142191j086164j654005
39013a503895o02389R2068k78317p47201o36628j24233O70557J574838J705104
39004A49904M68241j013746r95390M67745J625720J500281P50387O4792o57705
38995B360229j234191r68778j04070N831j014787j640679o17248J042981J387241
38986g83471J28294j150819j022021L39792J505563J183613m15912j518782o97247
38977b430990J219841K121609J428605N18289K04589l38615j446060j765380n36987
38968a025099O82248L06426p09875n44920M45344N62486k10792l97599K10065
38959f81716L76047o1836J60376J279351J861544J147051J02478m65961r65138
$$ plain form
38950 2752196 1306828 400337 1093034 2513437 2369687 -211084 -3494085 -5179932 -4707809
38941 -4707809 -3119655 -1485360 -122041 1019021 1781626 1761937 872095 -101886 33044
38932 33044 1503224 3101564 3616723 3330160 3459481 4468603 5653736 6148603 5659378
38923 5659378 4507972 3651864 4264739 6504170 9229227 11913235 15979917 22424817
38915 22424817 28503930 29273068 23265988 14706123 8824196 6522159 5131930 2989138
38907 2989138 1012019 227741 13968 -615450 -1426343 -1458979 -344305 1405812 2892280
38898 2892280 3293919 2389595 984913 418640 1313331 3032283 4456918 4963634 4607538
38889 4607538 3851567 3307427 3296368 3433816 3030686 2051481 1160376 625133 -92857 -1145344
$$ packed form
38950B752196j445368r06491O92697J420403j43750k580771l283001j685847M72123
38941d707809J588154J634295J363319J141062P62605j9689q89842r73981J34930
38932C3044J470180J598340N15159k86563J29321J009122J185133M94867m89225
38923E659378j151406q56108O12875K239431K725057K684008M066682O444900
38915B2424817O079113P69138o007080q559865n881927k302037j390229k142792
38907B989138j977119p84278k13773o29418q10893l2636J114674J750117J486468
38898B892280M01639r04324j404682n66273Q94691J718952J424635N06716l56096
38889D607538p55971n44140j1059J37448m03130r79205q91105n35243p17990j052487
$$ plain form
38879 -1145344 -1453329 -35746 2200397 3173268 2222111 936116 1027071 2304186 3350264
38870 3350264 3412677 2792393 1894932 882533 121987 111733 834337 1705951 2199717 2147703
38860 2147703 1624158 1013087 900177 1276466 1203933 88822 -1100469 -1013595 -53073
38851 -53073 125256 -697741 -797030 771309 2581033 2924012 2031979 1024220 -4839
38842 -4839 -1323917 -2101063 -1396068 61928 806585 807005 997132 1182454 409100 -868262
38832 -868262 -1154241 -484125 -417578 -1194221 -1260825 -278816 -90317 -1434977 -2095428 -207841
38822 -207841 2530089 3270617 2216905 1836583 2690100 2767424 960383 -1252987 -2137467
38813 -2137467 -1763258 -990253 -4802 1154863 1797607 1383491 480909 85949 377990
$$ packed form
38879a145344l07985J417583K236143R72871r51157j285995R0955J277115J046078
38870C350264O2413o20284q97461j012399p60546j0254P22604Q71614M93766n2014
38860B147703n23545o11071j12910L76289p2533j115111j189291Q6874R60522
38851e3073J78329q22997r9289J568339J809724L42979q92033j007759j029059
38842d839j319078p77146P04995J457996P44657M20J90127J85322p73354j277362
38832h68262k85979O70116O6547p76643o6604R82009J88499j344660o60451J887587
38822b07841K737930P40528j053712l80322Q53517P7324j807041k213370q84480
38813b137467L74209P73005R85451J159665O42744m14116r02582l94960K92041
$$ plain form
38804 377990 738769 698091 394003 263907 537969 922820 774611 -188716 -1440979 -2222767
38794 -2222767 -2391845 -2301838 -2081831 -1601779 -959569 -352116 409994 1581063 2771004
38785 2771004 3266626 3001951 2498561 1929804 1057559 75409 -367623 -82821 533549
38776 533549 1338769 2487779 3524426 3462420 2122545 506003 -498850 -910184 -862144
38767 -862144 -76265 1308152 2316513 2295864 1815509 1766951 2162157 2403089 2182677 1608013
38757 1608013 980113 852003 1647019 2825459 3175997 2350488 1304672 837052 688197
38748 688197 561771 829678 1476457 1593737 947566 891306 2512752 4898430 6506531
38739 6506531 7227633 7629967 7197047 5196172 2740563 2092179 3941075 6724097 8492131
$$ packed form
38804C77990L60779m0678l04088j30096K74062L84851j48209r63327j252263p81788
38794b222767j69078R0007K20007M80052O42210O07453P62110J171069J189941
38785B771004M95622k64675n03390n68757q72245r82150m43032K84802O16370
38776E33549Q05220J149010J036647o2006j339875j616542j004853m11334M8040
38767h62144P85879J384417J008361k0649m80355m8558L95206K40932k20412n74664
38757A608013o27900j28110P95016J178440L50538q25509j045816m67620j48855
38748F88197j26426K67907O46779J17280o46171n6260J621446K385678J608101
38739F506531P21102M02334m32920k000875k455609o48384J848896K783022J768034
$$ plain form
38730 8492131 8405350 6902679 5540343 6016107 8229408 10166045 10694311 10991986 12012392
38721 12012392 12913901 14063904 18565056 27481409 37208454 47038415 65410928 98837782
38713 98837782 134595816 146070284 121415078 78970591 46919708 33858556 27915861
38706 27915861 19368549 11733275 10513559 12753475 12737698 10655294 9967463 10622826 9955255
38697 9955255 7660356 5667734 4641478 3836840 3270643 3483376 4042778 4132884 3666844
38688 3666844 2561058 354765 -2247762 -3271352 -2330035 -1690525 -2870639 -4139732
38680 -4139732 -3301417 -1092087 344397 707306 981274 1103760 601454 351978 1295605
38671 1295605 2361398 1969492 660379 -38876 -359219 -1436877 -2618081 -2258721 -572000
$$ packed form
38730H492131q6781j502671j362336M75764K213301J936637N28266K97675J020406
38721A2012392R01509J150003M501152Q916353R727045R829961J8372513L3426854
38713I8837782L5758034J1474468k4655206m2444487l2050883j3061152n942695
38706B7915861q547312p635274j219716K239916j5777k082404o87831O55363o67571
38697I955255k294899j992622j026256q04638n66197K12733N59402R0106m66040
38688C666844j105786k206293k602527j023590R41317O39510j180114j269093
38680d139732Q38315K209330J436484L62909K73968J22486n02306k49476R43627
38671A295605J065793l91906j309113o99255l20343j077658j181204L59360J686721
$$ plain form
38662 -572000 913280 2087420 3707428 4762539 3561810 1200724 581325 1800964
38654 1800964 1966405 170081 -964435 77291 1030293 -245099 -2210680 -2362483 -1046887
38645 -1046887 -61092 529833 1523174 2115567 1071194 -665221 -1081338 -138533 603211
38636 603211 776416 1286035 2003191 1754082 608805 37851 575350 1212497 1354822
38627 1354822 1561590 1977057 1784175 784851 -33279 -144764 -285130 -898372 -1089445
38618 -1089445 32523 2007724 3789389 4922380 5277786 4600436 3162894 2063834
38610 2063834 2040710 2620510 3073326 3396119 3660775 3369329 2445861 1950463 2566425 3158094
38600 3158094 2322928 815747 678290 2134232 3229317 2823661 2037559 1956827 1717737
$$ packed form
38662e72000J485280J174140J620008J055111j200729k361086o19399J219639
38654A800964J65441j796324j134516J041726R53002j275392j965581j51803J315596
38645a046887R85795N90925R93341N92393j044373j736415m16117R42805P41744
38636F03211J73205N09619P17156k49109j145277n70954N37499O37147J42325
38627A354822K06768M15467j92882r99324q18130j11485j40366o13242j91073
38618a089445J121968J975201J781665J132991L55406o77350j437542j099060
38610B063834k3124N79800M52816L22793K64656k91446r23468m95398O15962N91669
38600C158094q35166j507181j37457J455942J095085m05656p86102q0732k39090
$$ plain form
38591 1717737 290775 -1161839 -590313 1783941 3409390 2688316 955930 657290 2447497
38582 2447497 4760210 5836414 5575031 5295512 5967099 7199586 8402924 10373540 14330690
38573 14330690 19111396 21047667 17982477 12260534 8079788 6721453 6313771 5596558
38565 5596558 5309059 5716433 5485860 4066089 2961657 3236517 3566715 2354591 262691
38556 262691 -1076684 -1646621 -2528048 -3714945 -4247037 -3914043 -3226467 -2243022 -928823
38547 -928823 -78984 -323502 -776926 -285030 550800 348960 -529954 -375863 1131513
38538 1131513 2441070 2378327 1170674 -680543 -2735964 -3831826 -2859820 -534271 1354298
38529 1354298 2502827 4012862 5752973 6159183 5122044 4629301 5588268 6264865 5127770
$$ packed form
38591A717737j426962j452614N71526K374254J625449p21074j732386k98640J790207
38582B447497K312713J076204k61383k79519O71587J232487J203338J970616L957150
38573A4330690M780706J936271l065190n721943m180746j358335m07682p17213
38565E596558k87499M07374k30573j419771j104432K74860L30198j212124k091900
38556B62691j339375n69937q81427j186897n32092L32994O87576R83445J314199
38547i28823Q49839k44518m53424M91896Q35830k01840q78914J54091J507376
38538A131513J309557o2743j207653j851217k055421j095862R72006K325549J888569
38529A354298J148529J510035J740111M06210j037139m92743R58967O76597j137095
$$ plain form
38520 5127770 3188004 2021999 1302970 42633 -1168858 -1016064 412781 1941875
38512 1941875 2990289 3615221 3669008 3190980 2937457 3381490 3876038 3781608 3549178 3648100
38502 3648100 3408627 2190939 857159 723067 1646231 2382185 2338053 1892463 1455411
38493 1455411 1159002 1018097 707597 -132260 -827496 -40428 1989668 2923483 1250815
38484 1250815 -1472013 -2695138 -2070435 -1074389 -488362 49678 770066 1680025 3050821
38475 3050821 4497691 4455146 2285256 53385 243822 2353424 3786673 3579581 2980392
38466 2980392 2613125 1531472 -577637 -2418311 -2988728 -2796871 -2573383 -2189983 -1387196
38457 -1387196 -336963 922016 2436966 3456322 2875048 995039 -309403 276799
$$ packed form
38520E127770j939766j166005p19029j260337j211491J52794J428845J529094
38512A941875J048414O24932N3787m78028k53523M44033M94548r4430k32430R8922
38502C648100k39473j217688j333780j34092R23164P35954m4132m45590m37052
38493A455411k96409j40905l10500q39857o95236P87068K030096R33815j672668
38484A250815k722828j223125O24703R96046N86027N38040P20388R09959J370796
38475C050821J446870m2545k169890k231871J90437K109602J433249k07092n99189
38466B980392l67267j081653k109109j840674n70417J91857K23488L83400Q02787
38457a387196J050233J258979J514950J019356n81274j880009j304442N86202
$$ plain form
38449 276799 2044552 3276456 3022894 1699338 564074 619749 1485578 1643484 418938
38440 418938 -894138 -798880 258773 784073 603446 769168 1527358 2064521 2089939 2034728
38430 2034728 1775847 815002 -258648 -144541 1146715 2153907 2035042 1348989 643195
38421 643195 -223554 -1069468 -1129179 -219036 954563 1849210 2408864 2423391 1830421 1548201
38411 1548201 2550567 4070231 4223894 2649258 1122944 1202651 2421514 3178689 2571756
38402 2571756 1220894 872277 2828540 6123161 8056549 7459778 6326920 7003466 9146441
38393 9146441 11097888 12633081 14044589 14032641 11452852 8133617 6846979 7192262 6633906
38384 6633906 4942183 4134893 4440653 4058004 2875279 2611489 3028027 1918332 -583240
$$ packed form
38449B76799J767753J231904k53562j323556j135264N5675Q65829J57906j224546
38440D18938j313076R5258J057653N25300j80627J65722P58190N37163K5418n5211
38430B034728k58881r60845j073650J14107J291256J007192j18865o86053p05794
38421F43195q66749q45914n9711R10143J173599Q94647N59654J4527n92970k82220
38411A548201J002366J519664J53663j574636j526314P9707J218863P57175o06933
38402B571756j350862l48617J956263L294621J933388n96771j132858O76546K142975
38393I146441J951447J535193J411508j1948k579789l319235j286638L45283n58356
38384F633906j691723q07290L05760l82649j182725k63790M16538j109695k501572
$$ plain form
38375 -583240 -1633113 -456777 424043 -203459 -406950 703547 927749 -964471 -2704730
38366 -2704730 -2169496 -434218 725075 1381567 1764049 1082760 -204502 -9788 1815542
38357 1815542 2614672 1172958 -451407 -794051 -1020396 -1531569 -615879 1551262 1842971
38348 1842971 -495528 -1735080 476807 3450627 4455769 4814791 5785096 5156608 1906863
38339 1906863 -321147 1193591 3422947 2892286 1556842 2454049 3712466 2445286
38331 2445286 798876 2162169 4638551 4395683 2658951 3213789 5397294 5651845 3957660
38322 3957660 2958161 2736504 1912849 1628936 3104143 3923274 2132347 785660 2714613
38313 2714613 4594615 2627941 33026 1742156 5834817 7908576 9439903 13415680
$$ packed form
38375e83240j049873J176336Q80820o27502k03491J110497K24202j892220j740259
38366b704730N35234J735278J159293O56492L82482o81289j287262J94714J825330
38357A815542P99130j441714j624365l42644k26345n11173R15690K167141K91709
38348A842971k338499j239552K211887K973820J005142L59022R70305o28488l249745
38339A906863k228010J514738K229356n30661j335444Q97207J258417j267180
38331B445286j646410J363293K476382k42868j736732N54838K183505K54551j694185
38322C957660r99499k21657q23655k83913J475207Q19131j790927j346687J928953
38313B714613J880002j966674k594915J709130M092661K073759J531327L975777
$$ plain form
38305 13415680 16662279 15980921 16550322 23568381 31330798 32673493 32639540 38509435 44032207
38296 44032207 41766439 43096307 62466783 89094922 106434441 137254430 225222019
38289 225222019 355518494 436498612 395674784 268223751 153512832 102058217 85259421
38282 85259421 64751144 42578299 34479222 34868878 30432790 24006126 24244888 26942722
38274 26942722 23543930 17009896 14968109 15783417 13524211 9471200 8040173 7507597
38266 7507597 4296297 1015025 1654801 3687708 2752232 635498 1278871 3103712 2357194
38257 2357194 289002 291955 1297709 381645 -1105546 -56884 2420567 3126140 2329917
38248 2329917 2073494 1574456 -539539 -2029701 -356276 2098126 1344395 -1641124 -2776615
$$ packed form
38305A3415680L246599o81358N69401P018059P762417J342695l3953N869895N522772
38296D4032207k265768J329868J9370476K6628139J7339519L0819989Q7967589
38289B25222019J30296475Q0980118m0823828j27451033j14710919n1454615j6798796
38282H5259421k0508277k2172845q099077L89656m436088o426664K38762K697834
38274B6942722l398792o534034k041787Q15308k259206m053011j431027n32576
38266G507597l211300l281272O39776K032907r35476k116734O43373J824841p46518
38257B357194k068192K953J005754r16064j487191J048662K477451P05573p96223
38248B329917k56423m99038k113995j490162J673425K454402p53731k985519j135491
$$ plain form
38239 -2776615 -1589494 -964401 -1480360 -1000005 805836 2018389 2108177 2133511 1897227
38230 1897227 509242 -942421 -807960 -208337 -1453206 -3803650 -4305999 -2420997 -520721
38221 -520721 -28578 -109463 -59578 -234357 -618281 -746538 -851245 -1247495 -1275560 -620302
38211 -620302 -497130 -1521626 -1863966 107904 2827723 3794412 3393639 3609974 4301444
38202 4301444 3925044 2884226 2820096 3304855 2565690 1044466 955939 2472552 3492934
38193 3492934 3254997 3188237 3929727 4323676 3883402 3746446 4548741 5402938 5520252 5171598
38183 5171598 4777561 4486095 4562796 4857698 4425207 3187029 3056522 5424882 8402060
38174 8402060 8842399 6419318 3354704 896683 -1200323 -2285547 -1106203 1304659
$$ packed form
38239b776615J187121O25093n15959M80355J805841J212553Q9788K5334k36284
38230A897227j387985j451663J34461N99623j244869k350444n02349J885002J900276
38221e20721M92143q0885M9885j74779l83924j28257j04707l96250k8065O55258
38211f20302J23172j024496l42340J971870K719819R66689m00773K16335O91470
38202D301444l76400j040818o4130M84759p39165j521224q8527J516613J020382
38193C492934k37937o6760P41490L93949m40274j36956Q02295Q54197J17314l48654
38183E171598l94037k91466P6701K94902m32491j238178j30507K368360K977178
38174H402060M40339k423081l064614k458021k097006j085224J179344K410862
$$ plain form
38166 1304659 1940037 -268859 -3076387 -4031612 -3083737 -1743636 -1386088 -2545275 -4295973
38157 -4295973 -4488296 -2244349 261592 406803 -1206221 -1967168 -1366640 -1025956 -1076699
38148 -1076699 187735 2790714 4368741 3719462 2305079 1476634 838393 181826 428813
38139 428813 1607376 2230336 1705022 1192376 1213193 670386 -824865 -1939870 -1924841
38130 -1924841 -1681224 -1577038 -633446 958349 1093328 -911250 -2690142 -2415583 -1705322
38121 -1705322 -2675803 -4082627 -3181724 -279744 1362790 -74137 -2852117 -4133852
38113 -4133852 -3079362 -1223834 -629082 -1788904 -3082698 -2623979 -667169 695882
38105 695882 357244 -545542 -615498 -58338 227491 189884 244500 243743 -235307 -1127138 -1969811
$$ packed form
38166A304659O35378k208896k807528r55225R47875J340101L57548j159187j750698
38157d295973j92323K243947K505941J45211j613024p60947O00528L40684n0743
38148a076699J264434K602979J578027o49279j414383q28445o38241o56567K46987
38139D28813J178563O22960n25314n12646K0817n42807j495251j115005J5029
38130a924841K43617J04186R43592J591795J34979k004578j778892K74559P10261
38121a705322r70481j406824R00903K901980J642534j436927k777980j281735
38113d133852J054490J855528N94752j159822j293794M58719J956810J363051
38105F95882l38638r02786o9956N57160K85829l7607N4616p57m79050q91831q42673
$$ plain form
38094 -1969811 -2244308 -1458136 344437 2159952 3078532 3571587 4473268 5046427 3892379
38085 3892379 1666149 692221 1579805 2439099 1951701 920037 128831 -840605 -1725850
38076 -1725850 -1105566 883996 1851820 702527 -570184 -336554 31726 -851264 -1335565
38067 -1335565 483564 2989120 3242045 1556162 696212 1450033 2122413 1907719 1733869
38058 1733869 1836242 1257939 10288 -653138 -492769 -760461 -1989490 -3034760 -2751472
38049 -2751472 -1285022 522885 1869051 2166684 1545773 948448 845055 534594 -293829
38040 -293829 -489294 582557 1343428 350824 -887185 2836 2303907 3271834 2595205
38031 2595205 2546412 3718445 4057198 2788228 1941206 2655736 2997087 1264733 -1055254
$$ packed form
38094a969811k74497P86172J802573J815515R18580M93055R01681N73159j154048
38085C892379k226230r73928Q87584Q59294m87398j031664p91206r69436q85245
38076a725850O20284J989562R67824j149293j272711K33630L68280q82990m84301
38067a335565J819129K505556K52925j685883q59950P53821O72380k14694j73850
38058A733869J02373n78303j247651o63426J60369k67692j229029j045270K83288
38049b751472J466450J807907J346166K97633o20911n97325j03393l10461q28423
38040b93829j95465J071851P60871r92604j238009Q90021K301071R67927o76629
38031B595205m8793J172033L38753j268970q47022P14530L41351j732354k319987
$$ plain form
38022 -1055254 -1729941 -1135953 -975879 -1252828 -849740 -44925 -178063 -1348897 -2386730
38013 -2386730 -2814835 -3174892 -3574197 -3438610 -2724987 -2072250 -1622805 -800935 532815
38004 532815 1631954 1864120 1500520 1237492 1375289 1659652 1652332 1174374 537822 250708
37994 250708 347555 242846 -511371 -1566951 -2178288 -2058904 -1536568 -1029442 -698866 -539069
37984 -539069 -524056 -654059 -982586 -1525095 -2047625 -2121534 -1615638 -1050261 -1164934 -2023168
37974 -2023168 -2777457 -2607110 -1789893 -1394664 -1810840 -2207494 -1908956 -1610607 -2250125
37965 -2250125 -3141888 -2677411 -935550 -1272 -1073428 -2695476 -2839952 -1555129 -389000
37956 -389000 -200747 -799336 -1831652 -2615296 -1897704 594011 2909783 2857227 903873
$$ packed form
38022a055254o74687N93988J60074k76949M03088Q04815j33138j170834j037833
38013b386730m28105l60057l99305J35587P13623O52737M49445Q21870J333750
38004E32815J099139K32166l63600k63028J37797K84363p320m77958o36552k87114
37994B50708R6847j04709p54217j055580o11337J19384N22336N07126L30576J59797
37984e39069J5013j30003l28527n42509n22530p3909N05896N65377j14673q58234
37974b023168p54289J70347Q17217L95229m16176l96654K98538K98349o39518
37965b250125q91763M64477J741861R34278j072156j622048j44476J284823J166129
37956c89000J88253n98589j032316p83644P17592K491715K315772n2556j953354
$$ plain form
37947 903873 -524743 -375072 176062 118501 -68632 124799 209902 -163293 -422162 -184572
37937 -184572 -38390 -475652 -963015 -786668 -166569 47640 -590516 -1599667 -1762146
37928 -1762146 -125936 2566795 3999371 2857885 701304 -127816 160439 -511753 -2403012
37919 -2403012 -3397463 -2528492 -1623853 -2416391 -4091738 -4995446 -4990223 -4682244 -3867302 -2340539
37909 -2340539 -1037601 -849733 -1288757 -1604022 -2078502 -2856001 -2770543 -1091160 606579
37900 606579 252356 -1726194 -3124000 -3158147 -2987476 -3297475 -3383926 -2818345 -2260136 -2185358
37890 -2185358 -2206128 -2030385 -1854898 -1503443 -464520 777219 725801 -1066216 -2869936
37881 -2869936 -2567993 -76266 2637686 3634567 2691720 1184771 616354 1191212 1821921
$$ packed form
37947I03873j428616J49671N51134n7561j87133J93431Q5103l73195k58869K37590
37937a84572J46182m37262m87363J76347O20099K14209o38156j009151j62479
37928a762146J636210K692731J432576j141486k156581q29120K88255o72192j891259
37919b403012r94451Q68971R04639p92538j675347r03708N223L07979Q14942J526763
37909b340539J302938J87868m39024l15265m74480p77499Q5458J679383J697739
37900F06579l54223j978550j397806l4147J70671l09999q6451N65581N58209P4778
37890b185358k0770J75743J75487L51455J038923J241739n1418j792017j803720
37881b869936L01943K491727K713952R96881r42847j506949n68417N74858O30709
$$ plain form
37872 1821921 1589565 830807 415636 428363 289249 -135383 -449676 -659547 -1274086 -2379142
37862 -2379142 -3382591 -3774477 -3445783 -2332826 -677392 394822 -187159 -1590200 -1521346
37853 -1521346 689401 2698454 2100003 -149621 -912099 883660 2979561 3056199 1535233
37844 1535233 204093 -527502 -1470692 -2540699 -2622912 -1607117 -962587 -1704174 -2967154
37835 -2967154 -3344843 -2702219 -1828333 -1092695 -428712 -38667 -32540 257308 1544896 3375632
37825 3375632 4558861 4605794 3905183 2854676 1833847 1613378 2502921 3363098 2892570
37816 2892570 1758008 1864229 3462868 4699359 4338940 3216363 2471129 2077565 1822589
37807 1822589 1997897 2220537 1297400 -642130 -1618428 -745267 31632 -1148549 -2956253
$$ packed form
37872A821921k32356p58758m15171J2727j39114m24632l14293k09871o14539j105056
37862b379142j003449l91886L28694J112957J655434J072214n81981j403041O8854
37853a521346K210747K009053n98451k249624p62478J795759K095901P6638j520966
37844A535233j331140p31595r43190j070007q2213J015795O44530p41587j262980
37835b967154l77689O42624Q73886P35638O63983L90045O127K89848J287588J830736
37825C375632J183229M6933p00611j050507j020829k20469Q89543Q60177m70528
37816B892570j134562J06221J598639J236491l60419j122577p45234l93564k54976
37807A822589J75308K22640r23137j939530r76298Q73161P76899j180181j807704
$$ plain form
37798 -2956253 -2759961 -478643 1652848 2400935 2414513 2250046 1684741 890306 362519
37789 362519 -327731 -1975798 -3960949 -4734326 -4074843 -3113645 -2112418 -191623 2396098
37780 2396098 3722451 2717314 666082 -657434 -989017 -891737 -408826 535067 1341410
37771 1341410 1390243 904229 432383 38815 -392215 -634311 -531284 -476316 -914687 -1655037
37761 -1655037 -2056470 -1709640 -813084 -115320 -374829 -1464806 -2216387 -1705316 -440330
37752 -440330 387344 484419 422925 389703 72780 -395877 -548641 -541596 -844107 -1097267
37742 -1097267 -595633 161124 -99651 -1308146 -1929600 -1270788 -334949 93433 597569
37733 597569 1640947 2457441 2378979 1991832 1987506 1976159 1408723 685939 434571 577909
$$ packed form
37798b956253J96292K281318K131491P48087J3578j64467n65305p94435n27787
37789C62519o90250j648067j985151p73377O59483R61198J001227J920795K587721
37780B396098J326353j005137k051232j323516l31583R7280M82911R43893Q06343
37771A341410M8833m86014m71846l93568m31030k42096J03027N4968m38371p40350
37761a655037m01433L46830Q96556O97764k59509j089977p51581N11071J264986
37752d40330Q27674R7075o1494l3222l16923m68657j52764P045l02511k53160
37742a097267N01634P56757k60775j208495o21454O58812R35839M28382N04136
37733E97569J043378Q16494p8462l87147m326j1347n67436p22784k51368J43338
$$ plain form
37723 577909 894874 1507112 2044882 1458054 -385588 -1941515 -1817385 -421128 1109020
37714 1109020 2510682 3854190 4515782 4053869 3286945 3189175 3402592 3056053 2341335
37705 2341335 2014907 1999462 1756507 1440256 1441336 1434833 1170933 1479665 2948772 4175825
37695 4175825 3082007 -182922 -3168350 -3950028 -2801664 -1198586 -360701 -584832 -873285
37686 -873285 425034 3405918 5625658 4845437 2150063 417436 160213 -685311 -2811981
37677 -2811981 -4181064 -3517717 -2576771 -3207788 -4127606 -2834077 341533 2340797 1340339
37668 1340339 -1156937 -2466340 -1742922 -387786 -121025 -1155363 -2191504 -2034762 -944815
37659 -944815 -54949 281428 777097 1787276 2550073 2316315 1475545 928421 872506 811873
$$ packed form
37723E77909L16965O12238N37770n86828j843642j555927J24130J396257J530148
37714A109020J401662J343508O61592m61913p66924r7770K13417l46539p14718
37705B341335l26428j5445k42955l16251J080o503k63900L08732J469107J227053
37695D175825j093818l264929k985428p81678J148364J603078Q37885k24131k88453
37686h73285J298319K980884K219740p80221k695374j732627k57223q45524k126670
37677b811981j369083O63347R40946o31017r19818J293529L175610J999264j000458
37668A340339k497276j309403P23418J355136K66761j034338j036141J56742J089947
37659i44815Q89866L36377M95669J010179P62797k33758q40770n47124n5915o0633
$$ plain form
37649 811873 355627 -531416 -1675248 -2546888 -2357397 -953552 576896 833888 -320842
37640 -320842 -1553105 -1534070 -365223 629787 423361 -669845 -1656167 -2277773 -3045928
37631 -3045928 -3787449 -3282929 -1185673 687894 417922 -1225910 -1767598 -626504 226888
37622 226888 -465783 -1407294 -1069359 71429 986403 2031343 3572806 4112061 2186311
37613 2186311 -600130 -1064345 1015135 2358568 855896 -1501810 -1704335 20873
37605 20873 909517 -293173 -1975978 -2340276 -1790513 -1967752 -3352136 -4781334 -5159176
37596 -5159176 -4837083 -4900789 -5460865 -5366817 -3829357 -1694055 -469832 -449992 -626778
37587 -626778 -357524 -115715 -331856 -480842 18399 700018 649205 -223116 -1251052 -2006880
$$ packed form
37649H11873m56246q87043j143832q71640J89491J403845J530448K56992j154730
37640c20842j232263J9035J168847R95010k06426j093206r86322o21606p68155
37631c045928p41521N04520K097256J873567k69972j643832n41688J141094Q53392
37622B26888o92671r41511L37935J140788R14974J044940J541463N39255j925750
37613B186311k786441m64215K079480J343433j502672k357706k02525J725208
37605B0873Q88644j202690j682805l64298N49763j77239j384384j429198l77842
37596e159176L22093o3706n60076R4048J537460K135302J224223J9840j76786
37587f26778K69254K41809k16141j48986M99241O81619n0813q72321j027936p55828
$$ plain form
37577 -2006880 -2427028 -2228385 -1144336 289616 1091388 1084173 949412 908542 368002 -718660
37567 -718660 -1171894 -63138 1855662 3070419 3132230 2723139 2409288 2346940 2863418
37558 2863418 4120670 5232391 4891304 3127432 1485278 1174994 1912086 2807216 3401432
37549 3401432 3433656 2629824 1371837 704987 970135 1201636 617509 -76327 238421
37540 238421 1378503 2213639 2237789 1788877 1104028 224255 -346028 123461 1652600
37531 1652600 3460100 4630232 4443403 2713520 588156 183961 2143577 4178001
37523 4178001 3591423 850462 -1145211 -1191423 -1081782 -2382320 -4029735 -4242348 -3174657
37514 -3174657 -2292106 -2254826 -2771893 -3686531 -4851191 -5479094 -4840481 -3305610 -1816386
$$ packed form
37577b006880m20148J98643J084049J433952Q01772p215j34761m0870n40540j086662
37567g18660m53234J108756J918800J214757O1811m09091l13851o2348N16478
37558B863418J257252J111721l41087j763872j642154l10284P37092Q95130N94216
37549C401432L2224q03832j257987o66850K65148K31501n84127o93836L14748
37540B38421J140082Q35136K4150m48912o84849q79773n70283M69489J529139
37531A652600J807500J170132j86829j729883k125364m04195J959616K034424
37523D178001n86578k740961j995673m6212J09641j300538j647415k12613J067691
37514c174657Q82551L7280n17067r14638j164660o27903O38613J534871J489224
$$ plain form
37505 -1816386 -734636 15998 290436 171638 479576 1677983 2695142 2070119 71720
37496 71720 -1517373 -1655357 -921676 -148135 570752 1213868 1337160 777077 -32070 -950382
37486 -950382 -2470219 -4501454 -5641769 -4659262 -2286436 -513145 -217250 -523300 -637818
37477 -637818 -1130336 -2600074 -3941402 -3321555 -837192 1148743 901915 -474305 -613764
37468 -613764 1100944 3261954 4657054 5275363 5099616 3526689 735011 -1540673 -1663883
37459 -1663883 16483 1733699 2349102 2149098 1961875 2180626 2532509 2368563 1340774
37450 1340774 43685 -370855 492031 1735985 2205154 1565631 147776 -1582011 -2991802
37441 -2991802 -3463787 -3148292 -2888377 -2933545 -2578011 -1656242 -1287192 -2088477 -2658607 -1300290
$$ packed form
37505a816386J081750P50634K74438j18798L07938J198407J017159o25023j998399
37496G1720j589093j37984P33681P73541P18887O43116J23292n60083q09147r18312
37486i50382j519837k031235j140315R82507K372826J773291K95895l06050j14518
37477f37818m92518j469738j341328O19847K484363J985935k46828j376220j39459
37468f13764J714708K161010J395100O18309j75747j572927k791678k275684j23210
37459a663883J680366J717216O15403k00004j87223K18751L51883j63946j027789
37450A340774j297089m14540Q62886J243954M69169o39523j417855j729787j409791
37441b991802m71985L15495K59915m5168L55534R21769L69050q01285n70130J358317
$$ plain form
37431 -1300290 1337230 2861612 2114177 144914 -1587621 -2521701 -2516106 -1596839 -505191
37422 -505191 -227348 -610579 -568076 77719 222036 -645873 -1547237 -1707935 -1883871 -2952939
37412 -2952939 -4165427 -4074254 -2686770 -1456520 -1277204 -1529835 -1218726 -209051 947370
37403 947370 1819145 2346462 2641544 2959602 3732889 5159114 6578001 6659729 4737511
37394 4737511 1880575 76834 213074 1352643 2085976 1880865 889631 -587706 -1808624
37385 -1808624 -1697905 -218049 1088634 963353 164430 196483 1026698 1507571 1475316
37376 1475316 1698204 2089645 1894602 1557418 2292864 3550264 3158163 737691 -1177200
37367 -1177200 -577272 1365386 2450901 2520926 2711234 3109732 3077226 2845217 2854697 2282005
$$ packed form
37431a300290K637520J524382p47435j969263j732535r34080N595R19267J091648
37422e05191K77843l83231M2503O45795J44317q67909r01364j60698j75936j069068
37412b952939j212488R1173J387484J230250J79316k52631L11109J009675J156421
37403I47370Q71775N27317K95082L18058P73287J426225J418887Q1728j922218
37394D737511k856936j803741J36240J139569P33333k05111r91234j477337j220918
37385a808624J10719J479856J306683j25281p98923L2053Q30215M80873l2255
37376A475316K22888L91441j95043l37184P35446J257400l92101k420472j914891
37367a177200N99928J942658J085515P0025J90308L98498l2506k32009R480n72692
$$ plain form
37357 2282005 200865 -2265037 -2916627 -1475381 149225 569076 196034 -320512 -1185355
37348 -1185355 -2398640 -3001785 -2236184 -665372 467475 496097 -310027 -1091732 -989444
37339 -989444 27290 904204 707261 -25342 44854 1093643 1824194 1259436 -123941
37330 -123941 -1351638 -2149063 -2741012 -3172187 -3318905 -3108423 -2424983 -1254862 -98841
37321 -98841 315815 -57573 -497240 -482802 -165363 260122 928452 1761305 2226530 2013597
37311 2013597 1391091 606562 -425452 -1510611 -1996629 -1719369 -1439592 -1717353 -2006457
37302 -2006457 -1633575 -1064103 -1170767 -1628036 -1257040 26938 835500 260303 -857729
37293 -857729 -1264579 -993559 -809113 -663864 28327 882423 744001 -425656 -1289681
$$ packed form
37357B282005k081140k465902o51590J441246J624606M19851l73042n16546q64843
37348a185355j213285o03145P65601J570812J132847K8622q06124p81705J02288
37339i89444J016734Q76914j96943p32603P0196J048789P30551n64758j383377
37330a23941j227697p97425n91949m31175j46718K10482O83440J170121J156021
37321i8841M14656l73388m39667J4438L17439M25485O68330Q32853M65225k12933
37311B013597o22506p84529j032014j085159m86018K77260K79777k77761k89104
37302b006457L72882N69472j06664m57269L70996J283978Q08562n75197j118032
37293h57729m06850K71020J84446J45249O92191Q54096j38422j169657q64025
$$ plain form
37284 -1289681 -1297196 -1638567 -3018716 -3910814 -2744671 -822486 -798640 -2590483 -3302227
37275 -3302227 -1611403 268055 82040 -1292097 -1842014 -1649171 -1913097 -2137208 -873938
37266 -873938 1318513 2153312 851158 -989103 -1890332 -1925116 -1409860 -157647 1350313
37257 1350313 1765668 666070 -761422 -1471434 -1754145 -2145078 -2485932 -2727676 -3348472
37248 -3348472 -4188065 -4088236 -2557564 -720187 205911 334526 261245 -55864 -649283
37239 -649283 -872575 -416559 -58147 -407815 -831421 -592403 -87679 105901 385918 1104607
37229 1104607 1379675 329785 -1288524 -2063736 -1809364 -1106291 117288 1853432 2685420
37220 2685420 1290228 -1089031 -1800592 -391113 1007276 1044164 689385 799137 344771
$$ packed form
37284a289681p515l41371j380149q92098J166143J922185K3846j791843p11744
37275c302227J690824J879458j86015j374137n49917J92843k63926k24111J263270
37266h73938K192451Q34799j302154j840261r01229l4784N15256J252213J507960
37257A350313M15355j099598j427492p10012k82711l90933l40854k41744o20796
37248c348472q39593R9829J530672J837377R26098J28615p3281l17109n93419
37239f49283k23292M56016L58412l49668m23606K39018N04724J93580K80017P18689
37229A104607K75068j049890j618309p75212K54372P03073J223579J736144Q31988
37220B685420j395192k379259p11561J409479J398389L6888l54779J09752m54366
$$ plain form
37211 344771 -1616116 -3782438 -3990351 -1945245 629469 2037387 1910144 972422 311560
37202 311560 560197 1297344 1597590 1345132 1299060 1649835 1539688 553042 -360298 -266634
37192 -266634 345416 511054 396950 859542 1908049 2711325 2814952 2360895 1449007
37183 1449007 362303 94765 1319646 2884630 2795263 1018871 -152561 724047 2055040
37174 2055040 1438663 -880079 -2426255 -2022084 -1107883 -1170613 -1497471 -579226 1334654
37165 1334654 2522318 2199645 1262663 667684 408719 406032 1109681 2454511 3182743
37156 3182743 2211501 148349 -1438030 -1860897 -1590475 -1063870 -227047 804399 1515906
37147 1515906 1538960 814635 -716406 -2885531 -4814035 -5461011 -4777057 -3651039 -2642911
$$ packed form
37211C44771j960887k166322k07913K045106K574714J407918j27243r37722o60862
37202C11560K48637P37147L00246k52458m6072L50775j10147r86646r13340R3664
37192b66634O12050J65638j14104M62592J048507Q03276J03627m54057r11888
37183A449007j086704k67538J224881J564984q9367j776392j171432Q76608J330993
37174B055040o16377k318742j546176M04171R14201o2730l26858R18245J913880
37165A334654J187664l22673r36982n94979k58965k687P03649J344830P28232
37156C182743r71242k063152j586379m22867K70422N26605Q36823J031446P11507
37147A515906K3054p24325j531041k169125j928504o46976O83954J126018J008128
$$ plain form
37138 -2642911 -1468555 167973 1980243 3514444 4445179 4288274 2655184 197760
37130 197760 -1434199 -1190360 192806 1009929 295809 -1519537 -3270319 -4069858 -3931198
37121 -3931198 -3568668 -3457278 -3272337 -2628633 -1984032 -2001601 -2267095 -1743351 -513587
37112 -513587 163130 -193133 -568685 -228533 117912 -207757 -424150 435882 1689076
37103 1689076 1818766 672379 -433327 -610989 -315175 -422701 -1298417 -2717346 -3951659
37094 -3951659 -4060076 -2831183 -1294575 -591891 -565399 -235033 601206 1207326 1242581
37085 1242581 1244101 1655981 2244381 2665139 2843123 2581857 1541366 -65215 -1316406
37076 -1316406 -1443550 -497812 905703 2029666 2183809 1147116 -270051 -639006 614641
$$ packed form
37138b642911J174356J636528J812270J534201R30735j56905j633090k457424
37130A97760j631959K43839J383166Q17123p14120j815346j750782p99539J38660
37121c931198L62530J11390J84941O43704O44601j7569k65494N23744J229764
37112e13587O76717l56263l75552L40152L46445l25669k16393Q60032J253194
37103A689076J29690j146387j105706j77662K95814j07526q75716j418929j234313
37094c951659j08417J228893J536608P02684K6492L30366Q36239O06120L5255
37085A242581J520M11880N88400M20758J77984k61266j040491j606581j251191
37076a316406j27144R45738J403515J123963J54143j036693j417167l68955J253647
$$ plain form
37067 614641 2359601 2778783 1278020 -809460 -1577238 -594230 712911 1004736 856917
37058 856917 1722683 3318871 3605845 1899518 307337 693644 1606980 314640 -2787608
37049 -2787608 -4216425 -2086944 1358938 2711773 1260164 -1087402 -2466277 -2471275 -1700180
37040 -1700180 -997576 -891057 -1161087 -1173890 -813919 -577744 -641935 -573333 -156913 260367
37030 260367 417771 290684 -469588 -2132558 -3773333 -3940651 -2845415 -2369535 -3255072
37021 -3255072 -3995004 -3563128 -3377146 -4772020 -6086109 -4692993 -1125620 1403287 1448429
37012 1448429 798943 1133355 1649334 1083392 47167 -246710 -189358 -912096 -2025878
37003 -2025878 -2072644 -1023961 -593034 -1708749 -3114564 -3218971 -2235879 -1443378 -1085268
$$ packed form
37067F14641J744960M19182j500763k087480p67778R83008J307141K91825j47819
37058H56917Q65766J596188K86974j706327j592181L86307R13336j292340l102248
37049b787608j428817K129481L445882J352835j451609k347566j378875m998P71095
37040a700180P02604J06519k70030j2803L59971K36175o4191O8602M16420M17280
37030B60367J57404j27087p60272j662970j640775j67318J095236M75880q85537
37021c255072p39932M31876J85982j394874j314089J393116L567373K528907M5142
37012A448429o49486L34412N15979n65942j036225k93877N7352p22738j113782
37003b025878m6766J048683M30927j115715j405815j04407R83092P92501L58110
$$ plain form
36994 -1085268 -395363 529032 464316 -852571 -1783813 -1004175 348245 161873 -1532345
36985 -1532345 -2519276 -1441556 621655 1920834 2036708 1625673 1357074 1686632 2648063
36976 2648063 3355538 2784755 1490348 1226056 2266225 2689127 1311133 -301637 -157063
36967 -157063 1342641 2641604 3710998 5340633 6791982 6613496 5271382 4526225 4412748
36958 4412748 3317942 1154322 -50968 769741 2344555 3382738 4053128 4371705 3409414
36949 3409414 1280396 -166828 -22007 244331 -488056 -784887 821803 2770321 2385278
36940 2385278 -103526 -1896488 -1549599 -292034 539542 1248801 2476793 3777648 4219328
36931 4219328 3476267 1941997 449865 -95631 386212 690396 -362589 -2236640 -3242593
$$ packed form
36994a085268O89905R24395o4716j316887r31242P79638J352420j86372j694218
36985a532345r86931J077720K063211J299179J15874m11035k68599L29558R61431
36976B648063P07475n70783j294407k64292J040169M22902j377994j612770J44574
36967a57063J499704J298963J069394J629635J451349j78486j342114p45157j13477
36958D412748j094806k163620j205290Q20709J574814J038183O70390L18577r62291
36949C409414k129018j447224J44821K66338p32387k96831J606690J948518l85043
36940B385278k488804j792962L46889J257565Q31576P09259J227992J300855M41680
36931D219328p43061j534270j492132n45496M81843L04184j052985j874051j005953
$$ plain form
36922 -3242593 -2719994 -1621768 -902016 -466527 -6572 213825 -18008 -251095 -86053
36913 -86053 -49125 -1027299 -2835509 -3857302 -2570165 455817 2555091 1676001 -1050050
36904 -1050050 -2487251 -1419801 67035 -170739 -1261653 -984837 685850 1763184
36896 1763184 1422801 813335 711184 522020 65511 336206 1614863 2515585 1988320
36887 1988320 886436 441405 436459 103120 -324678 -364572 -650890 -1950642 -3418443
36878 -3418443 -3483208 -2211747 -1178346 -966794 -413836 1242390 2908463 3162358 2207918
36869 2207918 1309575 909913 365801 -688026 -1733033 -2253080 -2382139 -2280168 -1552103
36860 -1552103 21178 1563320 1822977 877272 268616 1054374 2416513 2805704 1922990
$$ packed form
36922c242593N22599J098226P19752M35489M59955K20397k31833k33087J65042
36913h6053L6928r78174j808210j021793J287137L025982K099274q79090k726051
36904a050050j437201J067450J486836k37774j090914K76816J670687J077334
36896A763184l40383o09466j02151j89164m56509K70695J278657R00722n27265
36887A988320j101884m45031m946l33339m27798l9894k86318j299752j467801
36878c418443o4765J271461J033401K11552N52958J656226J666073K53895r54440
36869B207918q98343l99662n44112j053827j045007n20047j29059J01971P28065
36860a552103J573281J542142K59657r45705o08656P85758J362139L89191q82714
$$ plain form
36851 1922990 813315 361325 547448 1018511 1514112 1719715 1508470 1410364 2078632
36842 2078632 3192817 3662260 3041367 1955599 1011407 184896 -515058 -788316 -802711
36833 -802711 -1183558 -1775176 -1501540 -121618 980536 650404 -428728 -1069822 -1523490
36824 -1523490 -2642963 -3847662 -3693613 -2312222 -1568274 -2462443 -3778568 -3896001 -2882189
36815 -2882189 -2077449 -2285409 -3039309 -3368872 -2951840 -2643788 -3728525 -6177444 -7910220
36806 -7910220 -6681361 -2804581 846884 1804716 236330 -1947375 -3222811 -3155046 -1877111
36797 -1877111 129054 1961375 2724406 2109833 409398 -1731597 -3375473 -3653790 -2613526
36788 -2613526 -1420261 -1209751 -1876356 -2359636 -1920031 -740570 519334 1291370 1318544
$$ packed form
36851A922990j109675m51990J86123M71063M95601K05603k11245r8106O68268
36842B078632J114185M69443o20893j085768r44192q26511o99954k73258j4395
36833h02711l80847n91618K73636J379922J102154l30132j079132o41094m53668
36824a523490j119473j204699J54049J381391P43948q94169j316125j17433J013812
36815b882189Q04740k07960p53900l29563M17032L08052j084737k448919j732776
36806g910220J228859L876780L651465R57832j568386k183705j275436O7765J277935
36797a877111K006165J832321P63031o14573j700435k140995j643876k78317J040264
36788b613526J193265K10510o66605m83280M39605J179461J259904P72036K7174
$$ plain form
36779 1318544 775001 215751 110562 417815 815941 1198069 1594553 1755831 1340134
36770 1340134 579536 217239 495610 657471 -52718 -1148967 -1307899 -63584 1515724
36761 1515724 2138132 1743332 1162783 799888 434759 125286 313524 866019 964542 395425
36751 395425 63351 554807 1013875 400477 -769977 -1127697 -525199 -89737 -239594
36742 -239594 -27688 1170430 2537578 3060957 2993589 3294859 4190903 4962660 4775428
36733 4775428 3266889 774282 -1613834 -2766224 -2707505 -2548074 -2797810 -2501272 -736791
36724 -736791 1736948 3271833 3286630 2452552 1296089 -241285 -1894173 -2809463 -2484395
36715 -2484395 -1277103 202371 1649102 2951996 4076378 5040978 5492652 4574798 2078956
$$ packed form
36779A318544n43543n59250j05189L07253L98126L82128L96484J61278m15697
36770A340134p60598l62297K78371J61861p10189j096249j58932J244315J579308
36761A515724O22408l94800n80549l62895l65129l09473J88238N52495R8523n69117
36751C95425l32074M91456M59068o13398j170454l57720O02498M35462j49857
36742b39594K11906J198118J367148N23379o7368L01270Q96044P71757j87232
36733D775428j508539k492607k388116j152390N8719J59431k49736K96538J764481
36724g36791K473739J534885J4797q34078j156463j537374j652888r15290L25068
36715b484395J207292J479474J446731J302894J124382R64600M51674r17854k495842
$$ plain form
36706 2078956 -473789 -1095266 158841 1142619 472133 -832031 -1227595 -865805 -742616
36697 -742616 -671647 280871 1790845 2381283 1616329 727647 670330 835487 337142 -462910
36687 -462910 -531196 463819 2100797 3874648 5135792 5018143 3456593 1863190 1664161
36678 1664161 2343092 2118536 606366 -484535 233955 1882893 2609578 1984386 1060738
36669 1060738 480774 -363650 -2185411 -4578325 -6242317 -6163546 -4530370 -2639255 -1732709
36660 -1732709 -1759967 -1600252 -692566 166507 142857 -219120 156369 1051941 1172332 132076
36650 132076 -972231 -1244913 -1156952 -1513384 -2153812 -2378984 -2073646 -1709124 -1539747 -1301378
36640 -1301378 -549289 884733 2480394 3099764 2066336 207292 -953548 -1131938 -1417841
$$ packed form
36706B078956k552745o21477J254107R83778o70486j304164l95564L61790J23189
36697g42616P0969R52518J509974N90438p64954q88682n7317J65157m98345q00052
36687d62910o8286R95015J636978J773851J261144j17649j561550j593403j99029
36678A664161O78931k24556j512170j090901P18490J648938P26685o25192r23648
36669A060738n79964q44424j821761k392914j663992P8771J633176J891115R06546
36660a732709k7258J59715R07686Q59073k3650l61977L75489Q95572J20391j040256
36650A32076j104307k72682Q7961l56432o40428k25172L05338L64522J69377K38369
36640a301378P52089J434022J595661O19370j033428j859044j160840j78390k85903
$$ plain form
36631 -1417841 -2236066 -2437855 -1111887 878109 2125982 2426881 2215521 1309023 -389022
36622 -389022 -1786067 -1851526 -1399627 -1870691 -2718660 -2011416 322954 1903256 1090556
36613 1090556 -1022710 -2600600 -3411346 -4138761 -4711432 -4602146 -3918280 -3093935 -2183156
36604 -2183156 -1327345 -1106142 -1469539 -1177168 515593 2281504 2142741 97264 -1913559
36595 -1913559 -2469295 -1949052 -1423297 -1401310 -1858173 -2608090 -3342548 -3797135 -3941841 -3672206
36585 -3672206 -2671844 -1186861 -437192 -1267422 -2689123 -2921125 -1792052 -869211 -1084582
36576 -1084582 -1583236 -1413951 -1093356 -1596836 -2675453 -3192419 -2661847 -1575608 -477619
36567 -477619 516040 1381533 1976975 2164712 1804487 793883 -551667 -1435465 -1373409
$$ packed form
36631a417841q18225k01789J325968J989996J247873L00899k11360r06498j698045
36622c89022j397045o5459M51899m71064q47969P07244K334370J580302q12700
36613A090556k113266j577890q10746p27415n72671J09286O83866Q24345R10779
36604b183156Q55811K21203l63397K92371J692761J765911j38763k045477k010823
36595a913559n55736N20243N25755K1987m56863p49917p34458m54587j44706K69635
36585c672206J000362J484983P49669q30230j421701k32002J129073R22841k15371
36576a084582m98654J69285L20595n03480j078617n16966N30572J086239J097989
36567d77619R93659Q65493N95442J87737l60225j010604j345550q83798O2056
$$ plain form
36558 -1373409 -895111 -985096 -1888318 -2874622 -3169926 -2783997 -2410432 -2743750 -3827130
36549 -3827130 -4856055 -4790817 -3490635 -2106450 -1942037 -2977157 -3965570 -4025820 -3597499
36540 -3597499 -3549361 -3826592 -3585497 -2546621 -1517949 -1242313 -1227578 -407631 1134255
36531 1134255 1919189 932217 -919828 -1914001 -1681698 -1358563 -1656722 -1870624 -1210968
36522 -1210968 -208981 -1550 -718687 -1394074 -1270498 -497919 381463 1022036 1329053
36513 1329053 1421925 1591615 1951172 2222426 2223509 2315806 2829323 3331602 3254649 3061889
36503 3061889 3730286 4961415 5140814 3662136 2163191 2425636 3823185 4106963 2357957
36494 2357957 -110033 -1725636 -2273230 -2260246 -1827667 -943989 55441 774554 1130492
$$ packed form
36558a373409M78298q9985r03222r86304k95304L85929L73565l33318j083380
36549c827130j028925O5238J300182J384185J64413j035120r88413o0250M28321
36540c597499M8138k77231K41095J038876J028672K75636J4735Q19947J541886
36531A134255P84934r86972j852045r94173K32303L23135k98159k13902O59656
36522a210968J001987K07431p17137o75387J23576P72579Q79382O40573L07017
36513A329053R2872J69690L59557K71254J083R2297N13517N02279p6953j92760
36503C061889O68397J231129J79399j478678j498945K62445J397549K83778j749006
36494B357957k467990j615603n47594J2984M32579Q83678R99430P19113L55938
$$ plain form
36485 1130492 969039 -118350 -2000443 -3522005 -3547614 -2269725 -913107 -376388 -682326
36476 -682326 -1416398 -2006119 -1840995 -949838 -426719 -1276780 -2820411 -3213671 -1780596
36467 -1780596 109810 860556 402797 -415216 -1249723 -2160329 -2729527 -2350701 -1187250
36458 -1187250 -37225 579828 547986 -237295 -1488756 -2096512 -1244508 112022 159555
36449 159555 -1175207 -1895653 -801731 622990 287002 -1484091 -2406557 -1339265 463114
36440 463114 1262464 776187 -223126 -1284295 -2497407 -3755063 -4472883 -4084287 -2594011
36431 -2594011 -694870 601011 656194 -279844 -1287968 -1520256 -680929 1019200 3039334
36422 3039334 4681010 5455809 5357212 4541010 2877131 297020 -2489103 -4341580 -4979934
$$ packed form
36485A130492j61453j087389j882093j521562k5609J277889J356618N36719l05938
36476f82326p34072n89721J65124Q91157N23119q50061j543631l93260J433075
36467a780596J890406P50746m57759q18013q34507r10606n69198L78826J163451
36458a187250J150025O17053l1842p85281j251461o07756Q52004J356530M7533
36449A59555j334762p20446J093922J424721l35988j771093r22466J067292J802379
36440D63114P99350m86277r99313j061169j213112j257656p17820L88596J490276
36431b594011J899141J295881N5183r36038j008124k32288Q39327J700129K020134
36422C039334J641676P74799r8597q16202j663879k580111k786123j852477o38354
$$ plain form
36413 -4979934 -5215508 -5485424 -4912809 -2648479 310751 1673766 248647 -2969165 -6102632
36404 -6102632 -7956489 -8149734 -6708522 -4233798 -1940255 -773701 -579318 -506652 -11633
36395 -11633 870706 1907565 2837256 3377737 3525350 3653342 3888014 3670053 2509782
36386 2509782 936828 -24436 -221966 -424257 -974773 -1286251 -955111 -539964 -724195
36377 -724195 -1367614 -1969736 -2508443 -3136971 -3487650 -3076876 -2228035 -1875383 -2452775 -3508107
36367 -3508107 -4384592 -4780220 -4652961 -4085882 -3342135 -2685623 -2081831 -1341684 -512825
36358 -512825 169204 657291 1149291 1858107 2896114 4090042 4667658 3662969 1199853
36349 1199853 -1126325 -1949578 -1832105 -2314568 -3592229 -4357480 -3886783 -2879838 -1924179
$$ packed form
36413d979934k35574k69916N72615K264330K959230J363015j425119l217812l133467
36404f102632j853857j93245J441212K474724K293543J166554J94383P2666M95019
36395a1633Q82339J036859R29691N40481J47613J27992K34672k17961j160271
36386B509782j572954r61264j97530k02291n50516l11478L31140M15147j84231
36377g24195o43419o02122n38707o28528l50679M10774Q48841L52652n77392j055332
36367c508107q76485l95628J27259N67079P43747O56512O03792P40147Q28859
36358e12825O82029M88087M92000P08816J038007J193928N77616j004689k463116
36349A199853k326178q23253J17473m82463j277661p65251M70697J006945R55659
$$ plain form
36340 -1924179 -561807 1406931 2959360 3214375 2803196 2758505 2801068 2005655 690333
36331 690333 272789 1302554 2783174 3563424 3446173 2761848 1763260 817111 525614
36322 525614 1193801 2451215 3576113 3987934 3516902 2581703 2018503 2293982 2952236
36313 2952236 3237659 3061828 2808728 2417269 1441359 3367 -1122260 -1554631 -1737398
36304 -1737398 -2084694 -2328692 -2039689 -1298231 -535529 -65046 48329 13350 264270 922795
36294 922795 1299776 576026 -899589 -1730253 -1190498 -115880 357620 257449 340848
36285 340848 717452 720941 19171 -839168 -1131721 -817874 -451120 -337421 -30447 1028843
36275 1028843 2356253 2499307 773711 -1592048 -2881724 -3051778 -3303430 -3726202 -2988192
$$ packed form
36340a924179J362372J968738J552429K55015m11179m4691M2563p95413j315322
36331F90333m17544J029765J480620P80250j17251o84325r98588r46149k91497
36322E25614O68187J257414J124898M11821m71032r35199n63200K75479O58254
36313B952236K85423j75831k53100l91459r75910j437992j125627m32371j82767
36304a737398l47296k43998K89003P41458P62702M70483J13375l4979K50920O58525
36294I22795L76981p23750j475615q30664N39755J074618M73500j00171Q3399
36285C40848L76604L489p01770q58339k92553L13847L66754J13699L06974J059290
36275A028843J327410J43054j725596k365759j289676j70054k51652m22772P38010
$$ plain form
36266 -2988192 -760277 1198612 1337769 348446 -311123 -737412 -1835061 -3054161 -2763593
36257 -2763593 -765327 1231034 1916190 1818291 1996334 2403872 2209880 1121258 -153124
36248 -153124 -539714 390236 1836605 2440222 1878779 1279643 1463867 1548289 366415
36239 366415 -1427883 -2188091 -1745328 -1227322 -607915 1310360 4056865 5080993 3421482
36230 3421482 1638835 2230935 3836845 3414484 1156555 427235 2766119 5510271 5338879
36221 5338879 2400048 -386057 -1079971 -402561 16124 -127907 174442 1370863 2212436
36212 2212436 1125152 -1418216 -2924309 -1859201 290628 934480 -337348 -1687904
36204 -1687904 -1802803 -1132413 -416445 313198 844712 530160 -344352 -445608 348088
$$ packed form
36266b988192K227915J958889J39157r89323o59569m26289j097649j219100K90568
36257b763593J998266J996361O85156r7899J78043M07538j93992j088622j274382
36248a53124l86590R29950J446369O03617n61443n99136J84224Q4422j181874
36239C66415j794298p60208M42763N18006O19407J918275K746505J024128j659511
36230C421482j782647N92100J605910m22361k257929p29320K338884K744152j71392
36221E338879k938831k786105o93914O77410M18685j44031L02349J196421Q41573
36212B212436j087284k543368j506093J065108K149829O43852j271828j350556
36204a687904j14899O70390P15968P29643N31514l14552q74512j01256P93696
$$ plain form
36195 348088 67721 -2489389 -5255227 -5210880 -2560611 -427703 -457839 -1006686 -370093
36186 -370093 364185 -703734 -2879258 -3538559 -1802339 378754 1093271 801995 1005533
36177 1005533 1808784 2059755 1343234 532857 367498 585899 778258 1136286 1758942
36168 1758942 1971810 1219960 238207 347147 1603672 2544759 2005645 455038 -830349
36159 -830349 -1257935 -1085738 -663082 -206680 -35870 -293481 -471884 136227 1378572
36150 1378572 2147665 1617478 296475 -402942 427665 2273285 3613824 3335493 1866448
36141 1866448 787061 1140727 2359137 3155812 3143824 2935988 2797749 2095491 403344
36132 403344 -1548931 -2591828 -2398372 -1607269 -1016900 -1083200 -1808846 -2542285 -2213299
$$ packed form
36195C48088k80367k557110k765838M4347K650269K132908l0136n48847O36593
36186c70093P34278j067919k175524o59301J736220K181093P14517k91276K03538
36177A005533Q03251K50971p16521q10377j65359K18401J92359L58028O22656
36168A758942K12868p51850r81753J08940J256525R41087n39114j550607j285387
36159h30349m27586J72197M22656M56402J70810k57611j78403O08111J242345
36150A378572P69093n30187j321003o99417Q30607J845620J340539k78331j469045
36141A866448j079387L53666J218410P96675j1988k07836j38239p02258j692147
36132D03344j952275j042897J93456P91103N90369o6300p25646p33439L28986
$$ plain form
36123 -2213299 -513960 1265549 1344348 -486529 -2506024 -2889199 -1350100 1064027 3039769
36114 3039769 3589779 2434980 477300 -631439 -112913 1052484 1464301 1114011 1028765
36105 1028765 1405870 1249320 67659 -1114782 -1055466 43498 792042 132597 -1860005
36096 -1860005 -4227520 -5620876 -5030365 -2814521 -751120 -270569 -791623 -647158 491226
36087 491226 1268517 916278 507041 1094351 1720514 697720 -1611631 -2863210 -1741104
36078 -1741104 442890 1697058 1786631 1870306 2491057 3042032 2992252 2662647 2649789 3111624
36068 3111624 3784143 4271141 4215302 3524671 2480047 1373376 169313 -1141114 -2101301
36059 -2101301 -2257912 -1888954 -1586537 -1246746 -337646 840018 1273063 940961 1189536
$$ packed form
36123b213299J699339J779509P8799j830877k019495l83175J539099K414127J975742
36114C039769N50010j154799j957680j108739N18526J165397M11817l50290q5246
36105A028765L77105j56550j181661j182441N9316J098964P48544o59445j992602
36096a860005k367515j393356N90511K215844K063401M80551n21054J44465J138384
36087D91226P77291l52239m09237N87310O26163j022794k309351j251579J122106
36078a741104K183994J254168Q9573Q3675O20751N50975m9780l29605j2858M61835
36068C111624O72519M86998n5839o90631j044624j106671j204063j310427r60187
36059b101301j56611L68958L02417L39791R09100J177664M33045l32102K48575
$$ plain form
36050 1189536 2632191 3781591 2994027 1022090 111409 816038 1314058 179212 -1586729
36041 -1586729 -2029569 -755145 954663 1990819 2476326 3079641 3894672 4186071 3170269
36032 3170269 1108895 -541508 -533471 634615 1203764 297510 -1162716 -1995084 -2339140
36023 -2339140 -2973222 -3722311 -3615305 -2477296 -1374307 -1212294 -1556827 -1274353 -54383
36014 -54383 1109983 1013723 -373676 -1858219 -2403229 -2134036 -1551847 -293093 2225663
36005 2225663 5004878 5784481 3855988 1312868 444913 932525 973761 280335 107845
35996 107845 697909 758266 -226988 -1045829 -825882 -462853 -1036815 -2167666 -3084315 -4111012
35986 -4111012 -5607083 -6280787 -4350803 -268763 3242582 4176855 3178659 2163573 2008627
$$ packed form
36050A189536J442655J149400p87564j971937r10681P04629M98020j134846j765941
36041a586729m42840J274424J709808J036156M85507O03315Q15031K91399j015802
36032C170269k061374j650403Q037J168086N69149r06254j460226q32368l44056
36023b339140o34082p49089J07006J138009J102989J62013l44533K82474J219970
36014e4383J164366r6260j387399j484543n45010K69193N82189J258754K518756
36005B225663K779215P79603j928493k543120q67955M87612M1236o93426j72490
35996A07845N90064O0357r85254q18841K19947L63029n73962j130851r16649j026697
35986d111012j496071o73704J929984M082040L511345R34273r98196j015086j54946
$$ plain form
35977 2008627 2235215 2307811 2377841 2737053 3054616 2496397 627519 -1971417 -4177356
35968 -4177356 -5326213 -5451545 -4644431 -2811406 -320217 1729037 2431132 1947887 994921
35959 994921 -182772 -1741794 -3400780 -4347355 -4017398 -2556579 -569160 1213945 2152274
35950 2152274 2075106 1504403 1208963 1507898 2109890 2443373 2041302 967191 30432
35941 30432 79216 837116 1097988 441598 -92493 346701 1092083 1265710 1405666 2302700
35931 2302700 2976259 1739868 -934364 -2620271 -2223457 -1139730 -665558 -249908 768102
35922 768102 1586471 1484327 1388513 2296471 3376370 3384351 2959018 3502004 4379927 3416314
35912 3416314 201701 -2999667 -4051877 -3131203 -1676741 -599516 -204597 -671452 -1681601
$$ packed form
35977B008627K26588P2596P0030L59212L17563n58219j868878k598936k205939
35968d177356j148857j25332Q07114J833025K491189K049254P02095m83245r52966
35959I94921j177693j559022j658986r46575L29957J460819J987419J783105R38329
35950B152274p7168n70703k95440K98935O01992L33483m02071j074111r36759
35941C0432M8784P57900K60872o56390n34091M39194P45382J73627J39956Q97034
35931B302700O73559j236391k674232j685907L96814J083727M74172M15650J018010
35922G68102Q18369j02144r5814R07958J079899P981m25333N42986Q77923r63613
35912C416314l214613l201368j052210R20674J454462J077225L94919m66855j010149
$$ plain form
35903 -1681601 -2287111 -1914693 -1047324 -417918 -21304 616269 1661112 2943436 4317305
35894 4317305 5559050 6143615 5597707 4121733 2666637 2225418 2823395 3189972 1919060
35885 1919060 -711622 -2627864 -2272787 -528236 490511 97680 -571480 -537579 -86967
35876 -86967 108624 -196420 -1007055 -1995450 -2217720 -1178763 -156683 -855294 -2521279
35867 -2521279 -2340991 546184 3391600 3475013 1686207 803879 1542634 2220542 1491046
35858 1491046 -447144 -2795015 -4614212 -4802429 -3183044 -1205344 -169447 534893
35850 534893 1835839 2645125 1412992 -655193 -728688 1308246 2482736 1192821 -756667
35841 -756667 -1476084 -1523325 -1643611 -665936 2157479 4783290 4825943 2928472 1299353
$$ packed form
35903a681601o05510L72418Q67369O29406L96614O37573J044843J282324J373869
35894D317305J241745N84565n45908j475974j455096m41219N97977L66577j270912
35885A919060k630682j916242L55077J744551J018747l92831o69160L3901M50612
35876h6967J95591l05044q10635r88395k22270J038957J022080o98611j665985
35867b521279J80288K887175K845416Q3413j788806q82328P38755O77908p29496
35858A491046j938190k347871j819197j88217J619385J977700J035897P04340
35850E34893J300946Q09286j232133k068185p3495K036934J174490j289915j949488
35841g56667p19417m7241j20286R77675K823415K625811M2653j897471j629119
$$ plain form
35832 1299353 152840 -1727184 -3737628 -3774821 -1803735 -371232 -937954 -1958913 -1545346
35823 -1545346 -174819 458751 -32060 -631516 -583903 -88190 314278 362527 294173 722992
35813 722992 1940090 3218243 3379298 2265804 1069711 898732 1484812 1607755 470604
35804 470604 -1508251 -2987668 -2779246 -978303 1010659 1872387 1596783 972527 379273
35795 379273 -193127 -373467 288906 1357259 1830866 1466009 916128 603882 375261
35786 375261 214793 278605 222646 -409156 -1105127 -900581 -67132 63067 -758975 -1136631
35776 -1136631 -89155 1680153 3135555 4104610 4403687 3319991 1133092 -150446
35768 -150446 958824 3277105 4348273 3367822 1535750 100657 -718016 -1222085 -1707728
$$ packed form
35832A299353j146513j880024k010444l7193J971086J432503n66722j020959M13567
35823a545346J370527O33570m90811n99456M7613M95713M02468M8249o8354M28819
35813G22992J217098J278153J61055j113494j196093j70979N86080J22943j137151
35804D70604j978855j479417K08422J800943J988962Q61728k75604o24256n93254
35795C79273n72400j80340O62373J068353M73607l64857n49881l12246k28621
35786C75261j60468O3812n5959o31802o95971K04546Q33449J30199q22042l77656
35776a136631J047476J769308J455402R69055K99077j083696k186899j283538
35768a50446J109270K318281J071168r80451j832072j435093q18673n04069m85643
$$ plain form
35759 -1707728 -2252493 -2399367 -1524013 4044 874771 649329 396464 712962 515442
35750 515442 -920782 -2150752 -1571735 -95169 250335 -487999 -659355 -104510 -326569
35741 -326569 -1672433 -2686379 -2466226 -1545055 -268662 1468148 2569521 1261010 -1980293
35732 -1980293 -4263220 -4015728 -2809623 -2444058 -2388489 -1548194 -583704 -683388 -1505022
35723 -1505022 -2007550 -2059253 -1744446 -498712 1418497 2040021 222606 -2173478 -2687276
35714 -2687276 -1689777 -1157296 -1129210 -213271 944842 -80846 -3350461 -5590916 -4509536
35705 -4509536 -1767428 -253540 -310222 -425919 -327446 -1282335 -3633759 -5734738 -5788596
35696 -5788596 -3937679 -2044946 -1642001 -2455330 -3129632 -3126413 -3171595 -3661209 -3740985 -2855912
$$ packed form
35759a707728n44765j46874Q75354J528057Q70727k25442k52865L16498j97520
35750E15442j436224j229970N79017J476566L45504p38334j71356N54845k22059
35741c26569j345864j013946K20153R21171J276393J736810J101373j308511l241303
35732a980293k282927K47492J206105L65565N5569Q40295R64490r9684q21634
35723a505022n02528n1703L14807J245734J917209O21524j817415k396084n13798
35714b687276R97499N32481K8086R15939J158113j025688l269615k240455J081380
35705d509536K742108J513888n6682j15697R8473r54889k351424k100979n3858
35696e788596J850917J892733M02945q13329o74302L219m5182m89614p9776Q85073
$$ plain form
35686 -2855912 -2157633 -2830618 -3694156 -2449184 792363 3310816 3480455 2598540 2256931
35677 2256931 2004613 1005500 169014 671143 1579568 1079638 -593045 -1512753 -1076358
35668 -1076358 -629733 -972379 -1181661 -494972 293661 200746 -460674 -947565 -1411730 -2217352
35658 -2217352 -2648908 -1598936 628405 2280364 2088930 559681 -814571 -1111509 -624144
35649 -624144 -354470 -974774 -2035899 -2300951 -1233735 51682 -6595 -1297550 -1989789
35640 -1989789 -921557 832856 1442200 615791 -546315 -1462800 -2499355 -3510562 -3375877
35631 -3375877 -1630176 428138 1106398 236024 -1000638 -1687296 -1822791 -1629182 -1044662
35622 -1044662 -27740 1052559 1441678 444987 -1747603 -3625209 -3554753 -1892978 -1053731
$$ packed form
35686b855912O98279o72985q63538J244972L241547K518453J69639q81915l41609
35677B256931k52318r99113q36486N02129R08425m99930j672683r19708M36395
35668a076358M46625l42646k09282O86689P88633r2915o61420m86891m64165q05622
35658b217352m31556J049972K227341J651959j91434j529249j374252k96938M87365
35649f24144K69674o20304j061125k65052J067216J285417n8277j290955o92239
35640a989789J068232J754413O09344q26409j162106r16485j036555j011207J34685
35631c375877J745701K058314O78260q70374j236662o86658j35495J93609N84520
35622a044662J016922J080299L89119r96691k192590j877606P0456J661775Q39247
$$ plain form
35613 -1053731 -2647180 -5277597 -6216156 -4639518 -1993511 281836 1809301 2346053
35605 2346053 1672657 691724 878674 2004506 2015968 59810 -1910865 -1787558 -287266
35596 -287266 236370 -913022 -2277869 -2542403 -1751379 -435798 966236 1701988 1054004
35587 1054004 -525204 -1611534 -1477976 -756310 -217075 224038 926499 1747531 2289292
35578 2289292 2304688 1534001 -126404 -1827247 -1914486 318714 3434844 5158259 4658644
$$ packed form
35613a053731j593449k630417r38559J576638K646007K275347J527465N36752
35605B346053o73396r80933J86950J125832J1462j956158j970675J23307J500292
35596b87266N23636j149392j364847k64534P91024J315581J402034P35752o47984
35587A054004j579208j086330J33558P21666N39235M41113P02461Q21032N41761
35578B289292J5396p70687j660405j700843q7239K233200L116130J723415m99615
$$ [...]
##END NTUPLES=NMR SPECTRUM
##END=
