##TITLE=31Pdec_ANY-167B
 CDCl3, 24 sc
 11.4.2019
##JCAMPDX= 6.0         $$ Bruker NMR JCAMP-DX V2.0
##DATA TYPE= NMR SPECTRUM
##DATA CLASS= NTUPLES
##ORIGIN= UXNMR, Bruker Analytische Messtechnik GmbH
##OWNER= root
$$ XWIN-NMR		Version 3.5
$$ Thu Apr 11 14:50:08 2019 Russian Standard Time (UT+4h)  she@DPX200
##.OBSERVE FREQUENCY= 81.013821
##.OBSERVE NUCLEUS= ^31P
##.ACQUISITION MODE= SIMULTANEOUS
##.ACQUISITION SCHEME= undefined
##.AVERAGES= 24
##.DIGITISER RES= 17
##SPECTROMETER/DATA SYSTEM= spect
##.PULSE SEQUENCE= zgpg30
##.SOLVENT NAME= CDCl3
##.SHIFT REFERENCE= (INTERNAL, CDCl3, 0, 182.463)
##AUDIT TRAIL= $$ (NUMBER, WHEN, WHO, WHERE, WHAT)
$$ ##TITLE= Audit trail, XWIN-NMR		Version 3.5
$$ ##JCAMPDX= 5.01
$$ ##ORIGIN= Bruker BioSpin GmbH
$$ ##OWNER= she
$$ F:/spectra/data/she/nmr/P31/1/pdata/1/auditp.txt
$$ ##AUDIT TRAIL=  $$ (NUMBER, WHEN, WHO, WHERE, WHAT)
(   1,<2019-04-11 14:49:04.31 +0400>,<she>,<DPX200>,
      <created by zg, POWCHK disabled, PULCHK disabled
       configuration hash MD5:
       00 E9 B6 7A A2 85 ED C7 34 08 36 98 17 FE 4E 26
       data hash MD5: 32K
       FA B4 E8 7C 01 66 32 DA 75 7F 2B AA 72 9C 97 A1>)
(   2,<2019-04-11 14:49:07.01 +0400>,<she>,<DPX200>,
      <Start of raw data processing
       efp BC_mod = 2 LB = 1 FT_mod = 6 PKNL = 1 PHC0 = -1828.451 PHC1 = 138.199 SI = 64K 
       data hash MD5: 64K
       FE 57 EA 9F 99 A4 26 6C 17 2A B5 54 C8 7F FA D3>)
(   3,<2019-04-11 14:49:34.48 +0400>,<she>,<DPX200>,
      <pk PHC0 = 2.285151 PHC1 = -14.2 
       data hash MD5: 64K
       BE 09 E0 73 F3 60 89 94 EE A7 BE F7 B7 A1 47 06>)
(   4,<2019-04-11 14:49:37.93 +0400>,<she>,<DPX200>,
      <abs ABSG = 5 
       data hash MD5: 64K
       7A 7B 4F 5D 15 09 73 30 D2 36 88 BC 35 3C 07 3A>)
$$ ##END=
$$ 
$$ hash MD5
$$ 06 8E 56 D8 3F B3 95 5F 4C B5 34 BB E7 EC 3F F2
##$RELAX= 
##$RELAX= 
##$RELAX= 
##$RELAX= 
##$RELAX= 
##$RELAX= 
##$RELAX= 
##$RELAX= 
$$ Bruker specific parameters
$$ --------------------------
##$DU= <F:/spectra>
##$EXPNO= 1
##$NAME= <P31>
##$PROCNO= 1
##$TYPE= <nmr>
##$USER= <she>
##$AMP= (0..31)
100 100 100 100 100 100 100 100 100 100 100 100 100 100 100 100 100 100 
100 100 100 100 100 100 100 100 100 100 100 100 100 100 
##$AQSEQ= 0
##$AQ_mod= 1
##$AUNM= <au_zg>
##$AUTOPOS= <>
##$BF1= 81.014009
##$BF2= 200.13
##$BF3= 200.13
##$BF4= 200.13
##$BF5= 200.13
##$BF6= 200.13
##$BF7= 200.13
##$BF8= 200.13
##$BYTORDA= 1
##$CFDGTYP= 0
##$CFRGTYP= 5
##$CHEMSTR= <none>
##$CNST= (0..31)
1 1 145 1 1 1 1 1 1 1 1 1 1 1 1 1 1 1 1 1 1 1 1 1 1 1 1 1 1 1 1 1 
##$CPDPRG= <waltz16>
##$CPDPRG1= <>
##$CPDPRG2= <waltz16>
##$CPDPRG3= <>
##$CPDPRG4= <mlev>
##$CPDPRG5= <mlev>
##$CPDPRG6= <mlev>
##$CPDPRG7= <mlev>
##$CPDPRG8= <mlev>
##$CPDPRGB= <>
##$CPDPRGT= <>
##$D= (0..31)
0 1 0 0 0 0 0 0 0 0 0 0.03 2e-05 3e-06 0 0 0 0 0 0 0 0 0 0 0 0 0 0 0 0 
0 0 
##$DATE= 1554979743
##$DBL= (0..7)
120 120 120 11 120 120 24 19 
##$DBP= (0..7)
150 150 150 150 150 150 150 150 
##$DBP07= 0
##$DBPNAM0= <>
##$DBPNAM1= <>
##$DBPNAM2= <>
$$ [...]
##$SUBNAM3= <"">
##$SUBNAM4= <"">
##$SUBNAM5= <"">
##$SUBNAM6= <"">
##$SUBNAM7= <"">
##$SUBNAM8= <"">
##$SUBNAM9= <"">
##$SW= 369.568048894756
##$SWIBOX= (0..15)
0 1 3 0 0 0 0 0 0 0 0 0 0 0 0 0 
##$SW_h= 29940.119760479
##$TD= 32768
##$TD0= 1
##$TE= 0
##$TE2= 300
##$TE3= 300
##$TEG= 300
##$TL= (0..7)
0 120 53 12 22 120 120 120 
##$TP= (0..7)
150 150 150 150 150 150 150 150 
##$TP07= 0
##$TPNAME0= <>
##$TPNAME1= <>
##$TPNAME2= <>
##$TPNAME3= <>
##$TPNAME4= <>
##$TPNAME5= <>
##$TPNAME6= <>
##$TPNAME7= <>
##$TPOAL= (0..7)
0.5 0.5 0.5 0.5 0.5 0.5 0.5 0.5 
##$TPOFFS= (0..7)
0 0 0 0 0 0 0 0 
##$TUNHIN= 0
##$TUNHOUT= 0
##$TUNXOUT= 0
##$USERA1= <user>
##$USERA2= <user>
##$USERA3= <user>
##$USERA4= <user>
##$USERA5= <user>
##$V9= 5
##$VALIST= <valist>
##$VCLIST= <CCCCCCCCCCCCCCC>
##$VD= 0
##$VDLIST= <DDDDDDDDDDDDDDD>
##$VPLIST= <PPPPPPPPPPPPPPP>
##$VTLIST= <TTTTTTTTTTTTTTT>
##$WBST= 1024
##$WBSW= 4
##$XGAIN= (0..3)
0 0 0 0 
##$XL= 0
##$YL= 0
##$YMAX_a= 11711
##$YMIN_a= -13819
##$ZGOPTNS= <>
##$ZL1= 120
##$ZL2= 120
##$ZL3= 120
##$ZL4= 120
##$ABSF1= 182.463
##$ABSF2= -187.1042
##$ABSG= 5
##$ABSL= 3
##$ALPHA= 0
##$AQORDER= 0
##$ASSFAC= 0
##$ASSFACI= 0
##$ASSFACX= 0
##$ASSWID= 0
##$AUNMP= <proc_1d>
##$AZFE= 0.1
##$AZFW= 0.5
##$BCFW= 0
##$BC_mod= 2
##$BYTORDP= 0
##$COROFFS= 0
##$CY= -3
##$DATMOD= 1
##$DC= 0
##$DFILT= <>
##$DTYPP= 0
##$F1P= 0
##$F2P= 0
##$FCOR= 1
##$FTSIZE= 65536
##$FT_mod= 6
##$GAMMA= 0
##$GB= 0
##$INTBC= 1
##$INTSCL= 5.30512e-09
##$ISEN= 30
##$LB= 1
##$LEV0= 0
##$LPBIN= 0
##$MAXI= 10000
##$MC2= 0
##$MEAN= 0
##$ME_mod= 0
##$MI= 50
##$NCOEF= 0
##$NC_proc= -5
##$NLEV= 6
##$NOISF1= 182.463
##$NOISF2= 159.3651
##$NSP= 0
##$NTH_PI= 0
##$NZP= 0
##$OFFSET= 182.463
##$PC= 4
##$PHC0= -1826.166
##$PHC1= 123.999
##$PH_mod= 1
##$PKNL= yes
##$PPARMOD= 0
##$PSCAL= 0
##$PSIGN= 0
##$REVERSE= no
##$SF= 81.0140089999434
##$SI= 65536
##$SIGF1= 159.3651
##$SIGF2= -187.1042
##$SINO= 113.3802
##$SIOLD= 16384
##$SREGLST= <1H.CDCl3>
##$SSB= 0
##$STSI= 65536
##$STSR= 0
##$SW_p= 29940.119760479
##$SYMM= 0
##$S_DEV= 0
##$TDeff= 32768
##$TDoff= 0
##$TI= <>
##$TILT= no
##$TM1= 0
##$TM2= 0
##$TOPLEV= 0
##$USERP1= <user>
##$USERP2= <user>
##$USERP3= <user>
##$USERP4= <user>
##$USERP5= <user>
##$WDW= 1
##$XDIM= 65536
##$YMAX_p= 479083879
##$YMIN_p= -8952420
$$ End of Bruker specific parameters
$$ ---------------------------------
##NTUPLES= NMR SPECTRUM
##VAR_NAME=  FREQUENCY,     SPECTRUM/REAL,   SPECTRUM/IMAG
##SYMBOL=    X,             R,               I
##VAR_TYPE=  INDEPENDENT,   DEPENDENT,       DEPENDENT
##VAR_FORM=  AFFN,          ASDF,            ASDF
##VAR_DIM=   65536,         65536,           65536
##UNITS=     HZ,            ARBITRARY UNITS, ARBITRARY UNITS
##FACTOR=    0.456856943014862, 1,           1
##FIRST=     14782.0589164792, 0,            0
##LAST=      -15158.0608439998, 0,           0
##MIN=       -15158.0608439998, -8952420,    0
##MAX=       14782.0589164792, 479083879,    0
$$ Real data points
##PAGE= N=1
##DATA TABLE= (X++(R..R)), XYDATA
$$ [...]
41300A106285k36099r58004j209667r01047j04771P49737R98891N00429j32491
41291a86737l74706l74947l69339j29139M82229R46376P31991J21915k15499j66051
41281D66093q0866l6483J61525L95094K73913k59918q10423r69573n88368J92651
41271a256355Q75265Q68517J95112m00963m24826k48964l02599k60802K32886
41262g22729O38705L07798k50319m1460P40599R68592M08417m5097l2948k08286
41252A763272p40077p94587q8348M22368J77241J9035N96686J019142L39693o85241
41242B029184p53760j12750K5960m47911o39163l86560k80427j90282N31849J409925
41232A186065J145073k03519j018610n53668N3171j73721n72955l27905K3249
$$ plain form
41300 1106285 870186 -87818 -1297485 -2198532 -2303303 -1553566 -554675 -54246 -186737
41291 -186737 -561443 -936390 -1305729 -1434868 -952639 -6263 725728 847643 632144 466093
41281 466093 385227 348744 510269 905363 1179276 919358 108935 -860638 -1449006 -1256355
41271 -1256355 -381090 487427 682539 281576 -143250 -392214 -694813 -955615 -722729
41262 -722729 -84024 223774 -26545 -68005 672594 1641186 2049603 2004506 1971558 1763272
41252 1763272 1023195 228608 140260 562628 739869 758904 1355590 2374732 2714425 2029184
41242 2029184 1275424 1162674 1188634 740723 101560 -285000 -565427 -755709 -223860 1186065
41232 1186065 2331138 2127619 1109009 555341 608512 434791 -138164 -466069 -442820
41223d42820k58558o13397j59013O80952Q44285L26901k9100J622m4008k48036
41213E8828k86274k54481m83539o96096l44706L21272N05781J48392Q844M02057
41203f19922P25593M33783k26052o55214n65128r3920L47584L88943J57010J44313
41193C6990L24907J3249q50382j113652p9505J063409Q39706j53450k00884O35541
41183E15929O48587m45291q48200K39979J072797J40521j334942j337300j17522
41174a465442N21966J06070k35060O6951L51889K15280J55956M86718P41244N00791
41164A446363Q119k91393k49559K2316K24882M3n56832p61158k36801L95478L60876
41153C62334j12410k31869J06559L54260L28600K91016J97924j89242n47308k80318
$$ plain form
41223 -442820 -701378 -1314775 -1473788 -792836 51449 378350 349250 350872 306864 58828
41213 58828 -227446 -481927 -965466 -1661562 -2006268 -1684996 -1179215 -1030823 -1021979 -619922
41203 -619922 105671 539454 313402 -341812 -906940 -1000860 -653276 -264333 -107323 36990
41193 36990 361897 375146 -475236 -1588888 -1668393 -604984 234722 81272 -119612 515929
41183 515929 1164516 719225 -128975 111004 1183801 1324322 -10620 -1347920 -1465442
41174 -1465442 -943476 -837406 -1072466 -1005515 -653626 -438346 -282390 204328 945572 1446363
41164 1446363 1454482 1163089 913530 935846 1160728 1160771 603939 -157219 -394020 1458 362334
41153 362334 249924 18055 124614 478874 807474 1098490 1296414 1107172 559864 279546
41143B79546M46263Q26769N62679P0455l66284p43897p41802l9175P52343O01362
41133A648259l37229p65475j60690N07567L85606j02566k90662l68347o65551
41124a49088p72501k67540L83350N07119K25732J4672j52620m30410m51871O3200
41114a029957N38573L10769k22200j93456K87436L33708j88977m14825R5411O46005
41104A62487M80614j73814n73518m57010j55321j9651q0087j16375J05818N39143
41094b87714P67333M28606k63144o75492m65294J06415N56598O02251K17900l82715
41084F04744p60424n83706o5636K33307J51174J11714L63365M57036n8846p12551
41074b59823n71124L30289P73763P629j013762q34819L79341R71276J49760q88365
$$ plain form
41143 279546 725809 1552578 2115257 2185712 1819428 1075531 333729 294554 1046897 1648259
41133 1648259 1311030 545555 384865 892432 1278038 1175472 884810 516463 -149088
41124 -149088 -921589 -1189129 -805779 -298660 -72928 -58256 -210876 -641286 -1093157 -1029957
41114 -1029957 -491384 -180615 -402815 -596271 -308835 24873 -164104 -578929 -483518 162487
41104 162487 643101 469287 -104231 -561241 -716562 -736213 -816300 -932675 -826857 -287714
41094 -287714 479619 908225 645081 -30411 -495705 -389290 167308 769559 987459 604744
41084 604744 -155680 -739386 -805022 -571715 -420541 -308827 54538 511574 452728 -259823
41074 -259823 -830947 -500658 273105 280734 -733028 -1567847 -1188506 -217230 -67470 -955835
41064i55835p61006J55271N44484K05752M1007L12981K85645k90764o17897k05455
41054a285817K75757R7842m05141m67442O456N57099Q32035O38040q3637q53787
41044f88595q57466n9495N48767L46202n7661j4941J2501n38270r96912l99104
41034b704974P74451J158108N29530o2546q7959p7761k69883q4635O34494J031879
41024H40704M90844m06014p38811l78783K17197O98384Q62251N78996P4175k07740
41014B031203k66741m81046p10561k99716O71304J072070L02302o39426n22368
41005A157021L18128N51133j63839q34211p18136k50819j29378k43660j5062N89710
40995B60887R02731M16710m91138r10292m70732J73910J74938l80072o09273r1974
$$ plain form
41064 -955835 -1716841 -1561570 -1017086 -811334 -770327 -457346 -171701 -462465 -1080362 -1285817
41054 -1285817 -1010060 -912218 -1317359 -1784801 -1778345 -1221246 -389211 248829 165192 -688595
41044 -688595 -1546061 -1605556 -1056789 -710587 -768248 -783189 -770688 -1308958 -2305870 -2704974
41034 -2704974 -1930523 -772415 -242885 -305431 -393390 -471151 -741034 -825669 -191175 840704
41024 840704 1331548 925534 186723 -192060 25137 723521 1585772 2164768 2238943 2031203
41014 2031203 1764462 1283416 572855 273139 944443 2016513 2318815 1679389 1157021
41005 1157021 1475149 2026282 1862443 1028232 310096 59277 -70101 -313761 -328823 260887
40995 260887 1163618 1580328 1089190 178898 -291834 -117924 57014 -323058 -932331 -1024305
40985a024305N73943O71339K94380P179j5489l5911j90322l37768l70294l29067
40975g56315k67751k16046j71458Q17M24646Q29191O80800k1393m84288j03195
40965h4992O13275O63690q0556p47869o93180k40217j9733q7323o0897J78531
40955e59271L64759L58461L85056O13657P73958N01431m3541l15380k24184l48809
40945A506137r75289j399924q30226L06765P87191K93256k04078J8272M33258
40936f4638L03352r0274l2591L66791L96260l6546k76906p064K92156J42165k27859
40925G64846k58295J64877N63078M20916j93484o08979k92736M14853O30786P2114
40915A677976n75953o57077m03123l80586n32320l65909J54814M96927K61722
$$ plain form
40985 -1024305 -450362 220977 515357 522536 507047 471136 280814 -56954 -427248 -756315
40975 -756315 -1024066 -1240112 -1411570 -1410753 -986107 -156916 523884 502491 18203 -84992
40965 -84992 528283 1191973 1111417 363548 -329632 -569849 -589582 -676905 -737802 -559271
40955 -559271 -194512 163949 549005 1162662 1936620 2438051 2394510 2079130 1854946 1506137
40945 1506137 530848 -869076 -1699302 -1392537 -605346 -312090 -516168 -497896 -64638
40936 -64638 238714 148440 115849 482640 878900 842354 565448 558384 850540 992705 764846
40925 764846 506551 671428 1234506 1655422 1461938 852959 560223 975076 1605862 1677976
40915 1677976 1102023 444946 41823 -338763 -871083 -1236992 -1082178 -585251 -323529
40906c23529m08538j017526j020011k08151Q71723J242001O35455j01937k08139
40897e38652n0251k97862o39543l11799M69994P39183K96834j17243j56172k15317
40887h20828l39012j235O84123P28309j85983r72987o67418K12168N97009L81082
40877c84772J37503l0024l86514p18223n18079J41070O51004O89023M40369J55887
40867A77244j9772L7471K47713K73224J7139j40835L2469K05403J06825J4987
40857I51868Q2549j64142q89354j189048l10983Q95779R92272Q0730m41662j15327
40847a07318J20862j52383r1403O56439R79111M8215j176603j333802o05046o6818
40837a728746J17823N03873R02791N93167j94080m10677J20752M43892J11471
$$ plain form
40906 -323529 -732067 -1749593 -2769604 -2977755 -2106032 -864031 -228576 -330513 -538652
40897 -538652 -588903 -886765 -1526308 -1838107 -1368113 -628930 -332096 -449339 -605511 -820828
40887 -820828 -1159840 -1161075 -476952 251357 65374 -907613 -1575031 -1362863 -765854 -384772
40877 -384772 -247269 -277293 -663807 -1382030 -1900109 -1759039 -1108035 -419012 21357 177244
40867 177244 157472 194943 442656 715880 733019 592184 624653 830056 936881 951868
40857 951868 1034417 870275 -19079 -1208127 -1519110 -623331 368941 449671 8009 -107318
40847 -107318 13544 -138839 -230242 426197 1405308 1453523 276920 -1056882 -1661928 -1728746
40837 -1728746 -1610923 -1107050 -204259 388908 194828 -215849 -95097 348795 460266
40828D60266j46029K03749N98111M41863O8563m4977j36380m53011n01694Q0321
40818E70782N92693K55527m14137l67208K21748K60508l61931n97052j01180J62316
40808B22066l38102p29096k88205K46271j0410m77214j21509O58408O69845K2146
40798a45800m8803O02369O84847k82814j004728m90846K96569M6452p40360o56233
40788a739347K11757M31415l57068q06661n9228Q27572N23163m93103o58514L17095
40778a802919J054750N59231l99506n05303K30642O55905K52702k12569J340M83582
40768C17855M22878p8751k38007J15267L46027J40881m6728M7914o4982o96379
40758B65975j163179o71146M00321R18094N28182j5891o1105J47787Q0218k63511
$$ plain form
40828 460266 314237 517986 1116097 1557960 1626523 1581546 1445166 992155 490461 570782
40818 570782 1163475 1419002 1004865 637657 859405 1119913 757982 160930 59750 222066
40808 222066 -116036 -845132 -1133337 -887066 -897476 -1374690 -1496199 -837791 -167946 -145800
40798 -145800 -194603 407766 1092613 809799 -194929 -685775 -389206 -342754 -1083114 -1739347
40788 -1739347 -1527590 -1096175 -1453243 -2259904 -2319132 -1491560 -968397 -1461500 -2120014 -1802919
40778 -1802919 -748169 -188938 -588444 -1093747 -863105 -207200 45502 -167067 -165727 317855
40768 317855 740733 661982 423975 539242 885269 1026150 979422 1027336 962354 265975
40758 265975 -897204 -1568350 -1168029 -249935 278247 262356 201251 349038 429256 165745
40748A65745m86891l96247j52280R043N574p5478j18718j38223j90285j19683
40738a497443K88695P57490O04631k12929o82679p3330P68774M78838o94311j079135
40728a341399o2382R63542P23407j13055k13681K91052K66955m17276p61957l65679
40718a030473N8639N4040Q5435M33647N08068r0722o79306m60731K14321M04113
40708e02969L804k61793q6525O8037q7766k23376j19021q5190k35624k4383Q48023
40697g06783J580640J180693J131n79591r5213L58097j74688j029697r21475J58482
40687b28404R81769P89858N2849m65413n60188l62197j2383K00409J2471k85920
40677A22851j15339M23063N70857J39210j44584R0406J85063l25527p59231m34210
$$ plain form
40748 165745 -321146 -717393 -869673 -860630 -855056 -930534 -1049252 -1187475 -1377760 -1497443
40738 -1497443 -1208748 -451258 153373 -59556 -742235 -815565 -46791 432047 -262264 -1341399
40728 -1341399 -1403781 -440239 283168 170113 -43568 247484 514439 97163 -664794 -1030473
40718 -1030473 -971834 -917794 -832359 -398712 109356 18634 -660672 -1121403 -907082 -502969
40708 -502969 -499165 -760958 -847483 -779446 -867212 -1090588 -1209609 -1294799 -1530423 -1554806 -706783
40697 -706783 873857 2054550 2055681 1476090 1380877 1738974 1564286 534589 -386886 -228404
40687 -228404 753365 1543223 1596072 1130659 570471 208274 195891 396300 408771 122851
40677 122851 7512 430575 1001432 1140642 996058 1086464 1271527 946000 186769 -247441
40667b47441Q9720J0302k20752K69399R84719O48819o08632j229548n14621N29463
40657b88572R04598P71808M83168j25478q67899r46832k85694J01378j83807j62494
40647e99824O46834J012262j4937j152668o57185Q58767J290081K23127p14661
40638H91796n73911k05535l71965n11496m7736M81981M15558M9914p551K08524
40628C29579L20272K21658l7570l91749n31233k00696J46654j74589q38393p64990
40618a921057J53786P44003L64469j72717p2701K51438J96233J6637l866k93337
40608g37112r06392q40989L48436J319042P62243m41154n22795M01017O72585
40599E4881j52343p72433l82992L03253N65956O52001Q03078O67258J82882j25616
$$ plain form
40667 -247441 -157721 -147419 -368171 -98772 885947 1534766 926134 -303414 -818035 -288572
40657 -288572 616026 1387834 1871002 1745524 877625 -69207 -354901 -253523 -437330 -599824
40647 -599824 47010 1059272 1044335 -108333 -765518 93249 1383330 1606457 891796
40638 891796 317885 112350 -259615 -771111 -818847 -336866 78692 128606 121055 329579
40628 329579 649851 871509 833939 442190 -89043 -289739 -143085 -317674 -1156067 -1921057
40618 -1921057 -1767271 -1023268 -658799 -831516 -904217 -652779 -456546 -439909 -443775 -737112
40608 -737112 -1643504 -2484493 -2136057 -817015 -54772 -495926 -1018721 -617704 54881
40599 54881 -97462 -869895 -1252887 -949634 -383678 268323 1071401 1738659 1921541 1795925
40589A795925j80188n42980j163351j135181k44580M31289J59908l17873r5628
40580a292659M69519N57160K63303J82371K60932O0608k97563l58866j65079p3196
40570c93470m8778J49653L60722K47184j10238l87142m94635m27539n4313M46237
40560g12319M59290j41731m90159R8184R32557Q21453j96496r28986o78405N5196
40550g81416M78860L54790p8427m16540l17476J15515L15560L0652k13356O1718
40540d50120M62478M02127R2538J5843o2832m98667o81696J19812J137371Q67536
40530A404390n46136j311452o49475J70287L1590l84341q1352N18926N18407J27097
40520b02059J7551n6083o32274j145969n83890P43168J394850P35206m04249r92473
$$ plain form
40589 1795925 1615737 1072757 -90594 -1225775 -1470355 -1039066 -879158 -1197031 -1292659
40580 -1292659 -823140 -265980 -2677 179694 440626 501234 203671 -155195 -320274 -393470
40570 -393470 -442248 -292595 68127 315311 205073 -182069 -676704 -1104243 -1158556 -712319
40560 -712319 -253029 -394760 -884919 -786735 145822 967275 770779 -158207 -836612 -781416
40550 -781416 -302556 52234 -26193 -442733 -760209 -644694 -329134 -298482 -511838 -450120
40540 -450120 12358 414485 507023 522866 460034 -38633 -720329 -600517 536854 1404390
40530 1404390 858254 -453198 -1102673 -932386 -900796 -1285137 -1366489 -847563 -329156 -202059
40520 -202059 -184508 -240591 -872865 -2018834 -2602724 -1859556 -464706 270500 -133749 -1126222
40510a126222p75026q256Q27935J019099K51610o50975n35395M27660Q73704K47788
40500E51922l94003q1708N86175M79869k89257o56051k90226M6712j72399m84829
40490g03795l14614R2440J32802j45263j05936M56700R11003O17544j94472p37302
40480I107o70858l82111k81223k67247o6293K59541M24066L25547J01401o6457
40470f14527k8869K51281N46738N39174K74046R7767J3679l51621q53939o37586
40460g63857N21915J379414P21913p62405j320770o03798Q1677K2198L5332O70984
40450a7397J032930L83119l72317j14946N37956K38946p68737j002253j68976
40441b51675M41489J26743k73611m3026K66994R1361l9483L79801O57746K2825
$$ plain form
40510 -1126222 -1901248 -1909504 -1081569 -62470 189140 -461835 -997230 -569570 304134 551922
40500 551922 157919 76211 662386 1142255 852998 196947 -93279 -46567 -218966 -703795
40490 -703795 -1018409 -925969 -793167 -938430 -1044366 -587666 323337 940881 746409 9107
40480 9107 -661751 -1043862 -1325085 -1592332 -1658625 -1399084 -975018 -649471 -548070 -614527
40470 -614527 -643396 -392115 154623 693797 967843 1065610 1079289 727668 -126271 -763857
40460 -763857 -241942 1137472 1859385 1096980 -223790 -827588 -745911 -723713 -688381 -17397
40450 -17397 1015533 1398652 1026335 911389 1449345 1688291 919554 -82699 -251675
40441 -251675 189814 316557 42946 -80 266914 358275 318792 698593 1356339 1379164
40431A379164q66546q16682k6194K17801l97627p74594j98855O05438O65048R3476
40421a19571l37364l17115j00987P6952J56647P1840j68728l87612m82751n44285
40411b152974n39030k10902M37968R10579Q08297L79888J18390P4106k6150k02669
40401d02497k38427j56639k20163m53266n35162k20494L69308Q51025Q18766J66905
40391b0644n92283o32421J72050Q51615N27824k90281l79052L65147P54127J44569
40381I00651o05711n55426j06529j45679m67478j85840O06354Q15839R6227m91437
40371a39029l2569Q62999R11011j11369j162546j255468m15886N97928J068577
40362C23648Q03781K03066j12683M0251J83260j41709o17703n26970J42526N29207
$$ plain form
40431 1379164 512618 -304064 -330258 -112457 -510084 -1284678 -1483533 -878095 -213047 -119571
40421 -119571 -456935 -774050 -875037 -798085 -641438 -569598 -738326 -1125938 -1608689 -2152974
40411 -2152974 -2692004 -2902906 -2464938 -1554359 -746062 -366174 -247784 -173678 -199828 -402497
40401 -402497 -640924 -797563 -1017726 -1470992 -2006154 -2226648 -1857340 -1006315 -187549 -20644
40391 -20644 -612927 -1245348 -1073298 -221683 306141 15860 -363192 1955 756082 900651
40381 900651 294940 -260486 -367015 -512694 -980172 -1166012 -559658 256181 352408 -139029
40371 -139029 -171598 691401 1602412 1491043 328497 -926971 -1342857 -744929 323648
40362 323648 1127429 1330495 1217812 1258063 1441323 1299614 681911 154941 297467 826674
40352H26674P2294o52127p34648k41373q9704o62071j191882q04936K92019J107250
40342b078504J113575P04407M23275K49975q7444m46995l88395R9660M56949L31908
40332C78411J22575L40291O86154L85468n21210r49409k59952O33910M09829p46059
40322D80008j327017o32572L17239M02522r80J53483Q05157Q82045o094r60538
40312A13253j044431l91856K11478K94702m7623m32931m29903J35399Q66020J089484
40302C63592O68126J96489J90489M37561M33288J35629q5445m2215R4200J21268
40292B512982K4570r4225j29919o4082l2369j78963l88115l76365j44559o5254
40282A063701l53763p17616p49584m45996j15441L4543K6601J0676J63588M76372
$$ plain form
40352 826674 898968 246841 -487807 -729180 -818884 -1480955 -2672837 -3477773 -3185754 -2078504
40342 -2078504 -964929 -260522 162753 412728 325284 -121711 -510106 -410446 46503 378411
40332 378411 500986 841277 1527431 1912899 1391689 442280 182328 816238 1226067 480008
40322 480008 -847009 -1479581 -1162342 -759820 -760800 -607317 197840 1079885 1073791 113253
40312 113253 -931178 -1323034 -1111556 -816854 -864477 -1297408 -1727311 -1591912 -725892 363592
40302 363592 1031718 1228207 1418696 1856257 2289545 2425174 2339729 2297514 2391714 2512982
40292 2512982 2537552 2443327 2313408 2249326 2216957 2037994 1649879 1273514 1128955 1063701
40282 1063701 709938 -7678 -757262 -1203258 -1318699 -1284156 -1257555 -1246879 -1083291 -606919
40272f06919O00179K69729r0468K17623R58636R69385j23509j026867n14416O34069
40262A287442O55417n68720j329661o43223M39765O11961J41073J3287J96048
40253H03389n6872o56331o80971P1554N87195M7500r53470j108141j3761J330724
40243f29184J631597O81307m84695p86595k69521J47639l3803l20810r3150M55161
40233B97946O35787K06331m51912q82899q56259l21591M49182Q16107M07893k47794
40223E2791k81668L23597O98774L64686j02047Q91M70958O01109K38499j30147
40213B237443j94001j67854k83637l75577j75012K25228M41475K82525k5512j83539
40203A781539k60507n37433q85816p04030J91404R66810O93203k71026o13555
$$ plain form
40272 -606919 -6740 262989 172521 390144 1348780 2318165 2194656 1167789 653373 1287442
40262 1287442 1942859 1374139 44478 -598745 -158980 452981 594054 607341 803389
40253 803389 746517 90186 -590785 -519231 67964 115464 -838006 -1946147 -1959908 -629184
40243 -629184 1002413 1683720 1199025 412430 142909 290548 256745 -64065 -157215 297946
40233 297946 933733 1140064 688152 -194747 -1051006 -1372597 -923415 -107308 300585 52791
40223 52791 -228877 94720 793494 1158180 1056133 1057024 1527982 2129091 2367590 2237443
40213 2237443 2043442 1875588 1591951 1216374 1041362 1266590 1708065 1990590 1965078 1781539
40203 1781539 1521032 983599 97783 -606247 -414843 551967 1245170 974144 360589
40194C60589R2884P58909M12568l81123m87688O9438L41929M8716j54314O1191
40184A123099K00118j02255n12363o66193o52872n47885j87866K74589L15035
40175g56593r2881k67309J04328M28110K59966J03735M36414O73789N9555r24701
40165B4413j089273k49805N46011M51048l08922r59156r08154o3654R55121J127166
40155d75205K27644n85563k00602P80493Q59557j16252q15741n33639m4069k7908
40145i31285k4583M08695O95778K63783l57134l65368P1682K63558J35207J23741
40135B84074L51860N70270N74496K15527n27086j108777p53323L12354Q01647
40126G21042J72752m52394k5968P47677O42026k9096m4450N64200N91690k50790
$$ plain form
40194 360589 453473 1212382 1624950 1243827 756139 825577 1167506 1216222 1061908 1123099
40184 1123099 1323217 1220962 708599 42406 -610466 -1158351 -1346217 -1071628 -756593
40175 -756593 -849474 -1116783 -1012455 -584345 -324379 -220644 215770 889559 949114 24413
40165 24413 -1064860 -1314665 -768654 -317606 -626528 -1585684 -2493838 -2557492 -1602371 -475205
40155 -475205 -247561 -833124 -1033726 -253233 606324 490072 -325669 -859308 -903377 -931285
40145 -931285 -955868 -547173 148605 412388 55254 -310114 -238432 25126 160333 284074
40135 284074 635934 1206204 1780700 1996227 1469141 360364 -392959 -80605 721042
40126 721042 893794 441400 415432 1163109 1805135 1776039 1731589 2295789 2887479 2636689
40116B636689q70604n84758l1037M8546j95258l43819l95093m14464k65517l1624
40106d46939n6643l20809l71405k4129M31282P43712Q18387M50299l05484o79710
40096B38561n7468Q29909P05067k85553o90076j4072N34020L1544p72033p92690
40086b72791j75568L34184N97621P56506N53918q2067m80192j56774L06650J61449
40076A542936l40768n37552n00614o36635o73569j04086O87351P76369N1092o57582
40066c93058p28849l03596K33706O53332P96834O28111L20728l0879n25379r91829
40056c40879r21084k96061J22137p5980k08908L40833R26904O04450k55011m73807
40046e77406J41733O82575O16144K59477j13275n29226p23135l56339J78953K12117
$$ plain form
40116 2636689 1766085 1181327 1150290 1198836 1003578 659759 264666 -149798 -415315 -446939
40106 -446939 -503582 -824391 -1195796 -1219925 -788643 -44931 773456 1223755 918271 238561
40096 238561 181093 1011002 1716069 1430516 740440 726368 1260388 1291932 519899 -272791
40086 -272791 -448359 -114175 483446 1239952 1793870 1711803 1231611 1074837 1381487 1542936
40076 1542936 1202168 664616 164002 -472633 -1146202 -1250288 -562937 213432 264524 -393058
40066 -393058 -1121907 -1425503 -1191797 -538465 258369 886480 1207208 1176329 650950 -340879
40056 -340879 -1261963 -1558024 -1435887 -1511867 -1720775 -1379942 -453038 151412 -103599 -577406
40046 -577406 -435673 246902 863046 1122523 1009248 480022 -243113 -599452 -420499 -208382
40036b08382n630L15670R67053Q95084K4974m66002n6590L22598l5615m91267
40026A261893l94924k93935p68688j115816m33699O97854R08559L0866p51749
40017h59639n95059J35793O39910N30647p5656o79684o52976Q9601P91592P31890
40007E6419J85323n7545J26991J96010l7230j62710K0312J74993N4480j27878
39997D29165j29620q610J07853J65910M0307l13233n44768k59429K87618M26544
39987B01737Q5346r3761J72360L61856J28208m5669K36408M11164j64910r61822
39977C30917r06780m1599N07500K35186j35425r961J69589o7779k40782K16682
39967E7548P79157N16229m17413r73059p16914j75887K70778P96025J248570R53490
$$ plain form
40036 -208382 -214012 101658 1068711 1963795 1988769 1522767 1466177 1788775 1753160 1261893
40026 1261893 866969 573034 -195654 -1311470 -1745169 -1047315 -138756 -107890 -859639
40017 -859639 -1454698 -1318905 -678995 -148348 -224004 -903688 -1556664 -1467063 -675471 56419
40007 56419 241742 184197 311188 507198 469968 307258 327570 502563 557043 429165
39997 429165 299545 290935 398788 564698 605005 291772 -252996 -512425 -224807 201737
39987 201737 287083 193322 365682 727538 855746 810077 1046485 1457649 1292739 330917
39977 330917 -575863 -617462 -109962 125224 -10201 -20162 149427 81648 -159134 57548
39967 57548 836705 1352934 935521 -37538 -754452 -930339 -659561 136464 1385034 2338524
39957B338524r8716p65771k04496Q10839Q46381k73579j323058j325537o08117
39948f03530j09132k01285m59096l09694L18824R52207J099196P66203L53089
39939A806782J25033K4415n8565j68247l91191o60858n32415K39856R23448M50703
39929A758961r48652j701398r43763L10607P16716L78693J72007J52066j42775
39920b47538m09024J2336P30424O92653o1373l61145K21687P10083K82117o00293
39910I69927j091844j074059q51995n01425m6579K82569M03563N36393P29913
39901f43537P08917M00905J22751O7375P3003J119j22219l26957n45228l82620
39891f46491L04660Q27809M95982k04391k76666J62018J68105k56721j86086L69080
$$ plain form
39957 2338524 2239808 1474037 1269541 2080380 2926761 2653182 1330124 4587 -603530
39948 -603530 -712662 -913947 -1373043 -1682737 -1363913 -411706 687490 1453693 1806782
39939 1806782 1931815 1956230 1897665 1729418 1338227 677369 144954 384810 1308258 1758961
39929 1758961 810309 -891089 -1834852 -1524245 -807529 -428836 -256829 -104763 -247538
39920 -247538 -656562 -644226 86198 778851 717478 356333 578020 1288103 1570220 969927
39910 969927 -121917 -1195976 -2047971 -2549396 -2595975 -2313406 -1909843 -1373450 -643537
39901 -643537 65380 466285 589036 656411 729414 730533 608314 281357 -263871 -646491
39891 -646491 -341831 485978 981960 777569 500903 662921 831026 574305 388219 757299
39881G57299L30323l50878l08453P89774J274470J10338j221889r97814N4988
39872D38158J25878p34078j004161l27088K16429J43965P2856K62462K63293O3669
39862d78617J48923L51099P908o24317m76441N74933J326785R94224K15766j13790
39852A926473m0975r6819m02117o84296o82014l04023J98031K54251l18616q41980
39842i92085o42171o4617J88966L04097Q21834J235117N55086p92225j194146
39833e80144k28737O87085M92096j11703j17078K38935K47696k4942j59066j81702
39823B62440j71088J11978N13529L26900m39846o67770J33843P86175K49636n93106
39813E12691l82886L88978K39893o73585p51933K73470P57414j67218j101336
$$ plain form
39881 757299 1087622 736744 428291 1218065 2492535 2602873 1380984 383170 438158
39872 438158 564036 -170042 -1174203 -1501291 -1284862 -1140897 -1068041 -805579 -542286 -478617
39862 -478617 -329694 21405 29313 -595004 -1071445 -496512 830273 1824497 2040263 1926473
39852 1926473 1885498 1788679 1386562 702266 20252 -283771 -85740 168511 -150105 -992085
39842 -992085 -1634256 -1698873 -1509907 -1205810 -383976 851141 1406227 614002 -580144
39833 -580144 -808881 -121796 370300 258597 141519 380454 628150 603208 444142 262440
39823 262440 91352 203330 716859 1043759 603913 -63857 69986 856161 1105797 512691
39813 512691 129805 518783 758676 85091 -666842 -393372 364042 196824 -904512
39804i04512n61446P40235J086172L16811k30167N0562K89636k21768q40119n89563
39794h64159L71070J021504Q66558L54299K551k28157n27979p49695o71566l97340
39784h22914j38970J20616L83082L49003j34974n67721l28785L71083P06195M14565
39774C51180R4962J90750L59632J64288k11190l68719l55855m40400n55788m44685
39764a215825j53228L1755K8977L1397J95411M62745O22648M72380N8056k46405
39754B87911j49497J05872O1226k38330l46655k21543k62045m44327k28387L80138
39744a055637N61754J7016l09448L41531J146847Q25827l28800q09490j59766
39735B29834L99088j18070j022655j036470q4528P14595N36991k54485o81054
$$ plain form
39804 -904512 -1465958 -725723 360449 677260 447093 497655 787291 565523 -274596 -864159
39794 -864159 -493089 528415 1394973 1749272 1751823 1523666 995687 245992 -425574 -822914
39784 -822914 -961884 -841268 -458186 -109183 -244157 -811878 -1140663 -769580 -63385 351180
39774 351180 446142 636892 996524 1160812 949622 580903 225048 -215352 -771140 -1215825
39764 -1215825 -1369053 -1337298 -1308321 -1276924 -1081513 -618768 3880 476260 534316 287911
39754 287911 138414 244286 305512 67182 -279473 -501016 -763061 -1207388 -1435775 -1055637
39744 -1055637 -493883 -476867 -786315 -444784 702063 1527890 1199090 389600 229834
39735 229834 628922 510852 -511803 -1548273 -1632801 -918206 -381215 -635700 -1316754
39726a316754k79588M48683O93612L47216P9334K85509M36443l5540o26569l68933
39716c36587N95560J027753L58617n12005o25173k78689k29534l41053j7081M78616
39706A20424L01949m50468o60922R1661P79375M63765k82705l27044K64714M50451
39696G51200p1275m64571j76326K56420K04293r4531j45677r3566k86600m37217
39686e57850m6489N83806O07017j24135q14622q23016l44732J46368N01951O88800
39676a82902N49520J52632l9224K47072O28815N53873N7495l09969k20164M8802
39666A485950j3593n23352j008043q96136k21034L47722L22263j2030j11713J5746
39656f14220M867r2202J21416N80498P05253K75823k39372l92764k54493n0867
$$ plain form
39726 -1316754 -1596342 -1147659 -454047 -106831 -27497 258012 694455 658915 32346 -336587
39716 -336587 258973 1286726 1645343 1133338 508165 229476 -58 -341111 -358192 120424
39706 120424 422373 -28095 -689017 -597356 182019 645784 363079 36035 300749 751200
39696 751200 679925 215354 39028 295448 499741 405210 259533 165967 -120633 -557850
39686 -557850 -604339 -20533 586484 462349 -352273 -1175289 -1520021 -1373653 -871702 -182902
39676 -182902 366618 519250 480026 727098 1355913 1909786 1967281 1657312 1437148 1485950
39666 1485950 1472357 949005 -59038 -955174 -1176208 -828486 -506223 -518253 -629966 -614220
39656 -614220 -609353 -701555 -580139 359 705612 981435 742063 349299 94806 43939
39646D3939J53547K58940J47170J6700J43943K64513r6633o09252l72432N69913
39636E20348R69945J69091q19477p84003l1486L02677J1909j72199M7239J87899
39626D01943p5154m51775n41129k44850K56588N54415K85507k87387l89647J61103
39616c30386N45645J86346l04444j96920P2698k32268o12528k0350J213529J591647
39606A912969O35033m94775q06727o48782o30431n37781l27O27464P73013M57609
39596A287265M2110l26872n37610k96755L84050Q92826P04699N5852m75229p38001
39586I92335r32269j033304p84811j86145L96813O45715N94740M71100L57667
39577E21841J25384k68278n44183m05095m2717M1480j86780j88481K49116N96314
$$ plain form
39646 43939 197486 456426 603596 620296 764239 1028752 932119 322867 -49565 520348
39636 520348 1490293 1659384 839907 55904 24418 327095 339004 166805 214044 401943
39626 401943 326789 -124986 -666115 -910965 -654377 -99962 185545 -101842 -491489 -330386
39616 -330386 215259 401605 97161 -99759 -27061 -259329 -871857 -892207 321322 1912969
39606 1912969 2548002 2053227 1246500 597718 -32713 -570494 -570821 56643 829656 1287265
39596 1287265 1329375 1002503 464893 168138 552188 1445014 2149713 2205565 1730336 992335
39586 992335 60066 -973238 -1758049 -1944194 -1547381 -901666 -306926 164174 521841
39577 521841 647225 378947 -165236 -570331 -613048 -571568 -758348 -946829 -697713 -101399
39567a01399M82789L82462P55266J096271O92944j36792n47464n54677q14436
39558A254964j225323r84299p1667N38028L74746N4982O2746O4866j33400m4395
39548a08752M98280P66643K59794m29327n68524l50708k74473j79214K60067O51854
39538E25640M09619k12523m47684j53553J24306P8596m8144k4966O6238J09243
39528D26772J08048M5569j05904k43092k14099p680K44086L53668J65852k26842
39518E46378l97464n4926M22509L55529l11824r15508r26919m28945K31584O99862
39508g79724N91753p4042m78724J00701J012776R03821k20014q57865l00189L28774
39498B27267J3995n23987k09138N36689O29889J57900j1333J58494M6400k57861
$$ plain form
39567 -101399 381390 763852 1519118 2615389 3308333 3171541 2624077 2069400 1254964
39558 1254964 29641 -954658 -1026325 -488297 -113551 -58569 4177 69043 -64357 -108752
39548 -108752 389528 1156171 1415965 986638 418114 67406 -207067 -386281 -126214 525640
39538 525640 935259 722736 275052 121499 245805 324401 276257 251291 317529 426772
39528 426772 534820 580389 474485 231393 17294 9614 253700 607368 773220 546378
39518 546378 148914 93988 516497 872026 560202 -355306 -1282225 -1711170 -1479586 -779724
39508 -779724 -187971 -262013 -740737 -640036 372740 1276561 1056547 198682 -101507 227267
39498 227267 241262 -282725 -491863 44826 674715 832615 821282 979776 1026176 768315
39488G68315j46244J97817M8165m10323k46256N16301P13709r6445q15429m42963
39478H6647M28489N28512k90709r64828p08818N6086L86167O2471j97684J71334
39468d42333O82891N01555j52430j70419O96899J257421O09712m77148p65892
39459A740256l28595o7347j19815J0356J73385k15823q62052q21642p4395L93240
39449a72432K03523N1154L02901L59082j41219n78749l95947M1555K19813K90129
39439A79810M77106M14302j99479q22086o78145J51201Q07658O35825k49890j121064
39429d04762j139464q2606J207682J535310P50275n2002j5488L78995J87910n35202
39419A830648q60611l66239K85240K78198k86531n41888K5164Q53058R17349L9511
$$ plain form
39488 768315 622071 819888 868053 457730 211474 727775 1441484 1345039 529610 86647
39478 86647 515136 1043648 752939 -211889 -920707 -864621 -478454 -415983 -613667 -442333
39468 -442333 240558 742113 589683 419264 1116163 2373584 2983296 2506148 1740256
39459 1740256 1411661 1344314 1224499 1234855 1408240 1192417 330365 -491277 -565672 -172432
39449 -172432 31091 82245 385146 744228 603009 24260 -371687 -330132 -110319 179810
39439 179810 656916 1071218 871739 49653 -628492 -477291 330367 966192 716302 -404762
39429 -404762 -1544226 -1626832 -419150 1116160 1866435 1814433 1798945 2177940 2365850 1830648
39419 1830648 970037 603798 889038 1167236 880705 338817 363981 1217039 2134388 2173899
39409B173899p73860n55365L83887Q93330M53270l54068p72632o74544l50639
39400D23278l2488J74928K37790K27284K02894R0379j09987j87037r7119j62333
39390G67589m45391l50445M63319J175268P56658m07863r40752m52762Q3523P2376
39380G21520J19770O68676J021354M85328m31141q07529o08185l97092l22441
39371D50260j84426j01903l41979p13840p51540l63923J25039M14082L99130J41081
39361i28019j11691j32808n7925j45160k00760J63545O78836O25823M3947k01392
39351b65604J38243K39319k83236n29217J88163J004826P63522j59306n06379
39342E90331j05586Q2458l53407p39108m89404J36760N65679M90866q3418p74084
$$ plain form
39409 2173899 1400039 844674 1228561 2121891 2575161 2221093 1448461 773917 423278
39400 423278 390790 565718 803508 1030792 1233686 1324065 1214078 1027041 929922 767589
39390 767589 322198 -28247 435072 1610340 2366998 1959135 1018383 565621 649144 721520
39380 721520 841290 1509966 2531320 3016648 2585507 1777978 1169793 772701 450260
39371 450260 265834 163931 -178048 -891888 -1643428 -2007351 -1882312 -1468230 -1069100 -928019
39361 -928019 -1039710 -1172518 -1230443 -1375603 -1576363 -1412818 -733982 -108159 -64212 -265604
39351 -265604 -127361 111958 -171278 -700495 -512332 492494 1256016 1096710 590331
39342 590331 484745 567203 213796 -525312 -1014716 -877956 -312277 178589 95171 -678913
39332f78913q86787j47479P74896J051219P62157N46293M78883J22202m64611
39323A557860o46552k04053L20450L97935J01629j49970m8878L44091N18336j624
39313B189224p80083o80694M81802J259879M81287q77111j025751o5616K56958
39304A239895o20955j252917n70614N19719P13556J90361o0170J47195K75185
39295E81255J47853K4493m3567j87609k95423j55791J75868M92062O25901L56878
39285A721920l73343r66268n91189N47066J137812M82173m93240o24431j50998
39276F89502m8583l42750k48669L02344M97432O6672k24829J52918O16842L81774
39266A842653l65806p89074n40587j9674L63639O49494R40366R42247K57965q99748
$$ plain form
39332 -678913 -1565700 -1713179 -938283 112936 875093 1421386 1900269 2022471 1557860
39323 1557860 911308 707255 1027705 1425640 1527269 1377299 1328421 1672512 2190848 2189224
39313 2189224 1409141 728447 1210249 2470128 2951415 2074304 1048553 982937 1239895
39304 1239895 618940 -633977 -1204591 -684872 28684 219045 158875 306070 581255
39295 581255 729108 753601 710034 522425 227002 71211 247079 739141 1365042 1721920
39285 1721920 1348577 382309 -208880 338186 1475998 1958171 1464931 840500 689502
39276 689502 640919 298169 49500 351844 849276 915948 691119 844037 1460879 1842653
39266 1842653 1476847 687773 147186 127512 491151 1140645 2081011 3023258 3281223 2381475
39256B381475j635873j254469o7318R34464J114465O13741j00331o27256o25013
39247G33885k8626N80685M57529j99631l04945N40856J272345Q27118k69251p07493
39237B902472l11367l8695k72954l44259Q5288L24529j69568q43757r14849m96065
39227g9225j97227j34728k1327J43653J39006K4556K420r295j48444k02948K8916
39216d54643K42051J01525m8912K98839P76687N10254m45046r82373n22744J70483
39206c53879K21954r0180M0944O25021R21625N20320k63047q95029j026520n79523
39196h78314R7811L63167J7450l20051l4115N76898P66761M27828M6931j82443
39186H81923m18607m82144p046O67861O74595p2174n87535k20585M30062N19933
$$ plain form
39256 2381475 745602 -508867 -576185 358279 1472744 2086485 1986154 1358898 733885
39247 733885 705259 1285944 1743473 1543842 1238897 1779753 3052098 3879216 3609965 2902472
39237 2902472 2591105 2552410 2279456 1935197 2020485 2345014 2175446 1331689 416840 -79225
39227 -79225 -276452 -411180 -432507 -288854 -149848 -125292 -122872 -132167 -280611 -483559 -454643
39216 -454643 -212592 -111067 -159979 138860 915547 1425801 980755 -1618 -524362 -353879
39206 -353879 -131925 -222105 -181161 443860 1365485 1885805 1622758 727729 -298791 -878314
39196 -878314 -780503 -417336 -399886 -719937 -754052 -177154 589607 1017435 1064366 881923
39186 881923 463316 -18828 -25874 641987 1316582 1244408 656873 436288 866350 1386283
39176A386283K02892J98001N64088O45576J04933n76373p02936j71233M21119
39167B072350M29248p1329l42781p013L19563p8358q07300q88279l45492k02021
39157G8588p44644r66511k13966P21988Q76408M94696K85509J57228k90047p03090
39147c03841m80535J59529N99033Q14168R82407O80381l61677j205934p48455
39138A35076M80873R38748L35710j49532O9002K18592k35878o41195l61097K07269
39128I97568M16405K46266q9817n56876r09004p52485l36948l52259o50642k99312
39118b287104O98262J060969K97903k53240M96524J511040J205429n5846o30313
39109B043624j80710R7862l39022o10143p5364N96482N78556J10557o5379J54778
$$ plain form
39176 1386283 1589175 1787176 2351264 2996840 3101773 2525400 1822464 1651231 2072350
39167 2072350 2501598 2430269 2087488 2080475 2400038 2321680 1514380 626101 280609 78588
39157 78588 -666056 -1632567 -1846533 -1124545 -248137 246559 532068 689296 399249 -303841
39147 -303841 -784376 -624847 -25814 788354 1770761 2451142 2089465 883531 135076
39138 135076 615949 1554697 1890407 1740875 1809877 2028469 1792591 1151396 790299 997568
39128 997568 1413973 1660239 1570422 1013546 104542 -647943 -984891 -1337150 -1987792 -2287104
39118 -2287104 -1588842 -527873 -229970 -483210 13314 1524354 2729783 2673937 2043624
39109 2043624 1862914 1960776 1621754 1011611 936247 1532729 2111285 2221842 2156463 2311241
39099B311241K58221p2941o16710r31056p95830m13129j87508k14996j43750K74801
39089e31657P57128R16095Q19717O99244M09365k41164q37180p17364N7346P24071
39079B055601Q21176N76048K69596j29183n50380o74676m59076k98573l97445
39070A213088m38135j41981K80837N25998O09626N71875K05555m98110r97163
39061A331590p88358j15215L76330M83505M55722L49323j867l98096l35371J45278
39051A502841K79802l66657j144182j113875k84329M95632O92505N39390L78135
39042I79262J89598n6502j44111j0559K5893k13088l74561j01233L32799L61242
39032I88740o7332m53084m31477j12585K20593M04680L92217K36442P6907m2650
$$ plain form
39099 2311241 2569462 2496521 1879811 948755 152925 -260204 -447712 -662708 -806458 -531657
39089 -531657 225471 1141566 1961283 2660527 3069892 2828728 1991548 1274184 1331530 2055601
39079 2055601 2876777 3452825 3722421 3593238 3042858 2368182 1909106 1610533 1213088
39070 1213088 774953 632972 913809 1439807 2049433 2621308 2826863 2328753 1331590
39061 1331590 543232 428017 804347 1287852 1743574 2092897 2091030 1692934 1357563 1502841
39051 1502841 1782643 1415986 271804 -842071 -1126400 -630768 61737 601127 979262
39042 979262 1168860 1112358 968247 957688 983581 770493 395932 294699 627498 988740
39032 988740 921408 468324 36847 -75738 144855 549535 941752 1178194 1255101 1212451
39022A212451k29309m28012k93916K99306Q56392P99190K63190r5537k195J77070
39012B558630M5439l61109p15902o89889j76569M81167O70878K44991j90944j07031
39002A759661K08523K43306J35189K36542K53239k49780q20664o76445q1936q13
38992A006822m61691n49553o7960J75108m6402K4820N27091N07715k72013n93625
38982B50312J88595Q24236J40852r24036q06345J39665L22453m25649o70494K22487
38972g37924J130611R43295O1440l84705m3620M21108K69943l92058o46804R1070
38962G12356J057426R46845j77654q18058k81031K80139j36522o87206k46763
38953F49532N49482M66131j02799K7437M60710j60520j464064j544880l1634J190531
$$ plain form
39022 1212451 983142 555130 261214 560520 1416912 2216102 2479292 2383755 2381560 2558630
39012 2558630 2604069 2242960 1527058 837169 660600 1141767 1812645 2057636 1866692 1759661
39002 1759661 1968184 2211490 2346679 2583221 2836460 2586680 1766016 1089571 1007635 1006822
38992 1006822 545131 -4422 -72382 102726 56324 81144 608235 1115950 843937 250312
38982 250312 438907 1263143 1403995 479959 -326386 -186721 135732 -289917 -960411 -737924
38972 -737924 392687 1335982 1397422 1012717 969097 1390205 1660148 1268090 621286 712356
38962 712356 1769782 2716627 2538973 1720915 1439884 1720023 1583501 896295 649532
38953 649532 1199014 1665145 1562346 1589783 2050493 1889973 425909 -1118971 -1150605 39926
38943C9926Q52798m2858j94376J33137J75382R5866K47293K24123k48662m81164
38933H01465O9952P03595N14923j72288m09613j00799P8641j41820l73327k85444
38923F85285M5959L83400N47234N26963M92505M95313L82857M74924J736924M131168
38913I902532N291565K740250k351217n649787m753935j936674o21783r97610
38905A623341r61227O1909O34706M4212p25301p92627l99039M8531N14186P40405
38895G89096L88293p8712J72263R03507R55848j7113j096949j532952j458839
38886i75558r87989J16094J429820J766816P73872l53713m65888P5189K46584
38877A625227q8290l19537k09691l4097M5767M9226j03383l59116l34051R5818
$$ plain form
38943 39926 892724 849866 655490 788627 964009 1059875 1307168 1531291 1282629 801465
38933 801465 871417 1575012 2089935 1917647 1508034 1407235 1485876 1344056 970729 685285
38923 685285 731244 1114644 1661878 2188841 2681346 3176659 3559516 4034440 5771364 9902532
38913 9902532 15194097 17934347 15583130 9933343 5179408 3242734 2620951 1623341
38905 1623341 662114 724023 1358729 1402941 677640 -114987 -514026 -465495 48691 789096
38895 789096 1177389 1098677 1270940 2174447 3130295 3113182 2016233 483281 -975558
38886 -975558 -1963547 -1847453 -417633 1349183 2123055 1769342 1303454 1378643 1625227
38877 1625227 1536937 1217400 1007709 973612 1019379 1068605 965222 606106 272055 367873
38867C67873L58227k8165n48335l10276O05017J172816P85880j12415q12518j067290
38857D10814q84353k93340L43252L97719j66083m83899R4118R55864R87030J65943
38847A527065m07180j05990M37359M45484J06209p301N907k93295o73262m88577
38837E46419J37925L22924k26437p26328n20095O219K10778K22930N09708Q93079
38827A377122P61909M6649o80065r68589q11768l36221K56639N43943K76055j16074
38817C49600l624M57746M83133j25509o33951m83383l3900K00591L81715P92199
38807A384617R99423M15708n55955q40737k15121L23348J4253n64128m17089L33655
38797H77974O00241q8967q73145o79835L84823J163889Q30766j93591p88584m32391
$$ plain form
38867 367873 726100 697935 149600 -160676 444341 1617157 2403037 2290622 1478104 410814
38857 410814 -473539 -766879 -423627 -25908 -191991 -675890 -581772 374092 1361122 1527065
38847 1527065 1119885 1013895 1451254 1896738 2002947 1995646 2001553 1708258 1034996 546419
38837 546419 684344 1007268 780831 54503 -465592 -459373 -248595 -25665 484043 1377122
38827 1377122 2139031 2185680 1505615 537026 -274742 -610963 -354324 189619 465674 349600
38817 349600 345976 803722 1286855 1161346 527395 44012 10112 210703 592418 1384617
38807 1384617 2384040 2799748 2243793 1403056 1187935 1511283 1525536 961408 544319 877974
38797 877974 1478215 1389248 516103 -163732 221091 1384980 2215746 2022155 1233571 801180
38787H01180K39020K38518n41693j163504p75199L57647J194963J131524N48181
38778B030637J87028K74469L75322J985p08588j012102m34409M55135O21213N741
38768A796431k87991L79912J174744J091400M56110J25190l600l27813j88979
38759D215404J010113K086809J953522K664565O967391J2197265J1013289R61443
38751D3069801j0267590j3173688p760368k079042j032852j967737j371332k30235
38743E186957n85792j307348n61576N13525p8474j430425j239268K75684R23555
38734A696838J82048m33023k00619P6751N6329L64374R84808R98691J91028n80499
38724C336726p90869p17720m78812J05154O65035N64632O6344K8273M77358P27721
$$ plain form
38787 801180 1040200 1278718 737025 -426479 -1201678 -844031 350932 1482456 2030637
38778 2030637 2217665 2492134 2867456 2869441 2160853 1148751 714342 1169477 1790690 1796431
38768 1796431 1508440 1888352 3063096 4154496 4610606 4735796 4732196 4404383 4215404
38759 4215404 5225517 7312326 9265848 11930413 18897804 31095069 42108358 43069801
38751 43069801 32802211 19628523 11868155 9789113 8756261 6788524 5417192 5186957
38743 5186957 4601165 3293817 2732241 3245766 3167292 1736867 497599 773283 1696838
38734 1696838 1878886 1445863 1245244 1321995 1378324 1742698 2727506 3726197 3917225 3336726
38724 3336726 2545857 1828137 1349325 1454479 2119514 2684146 2750490 2778763 3256121 3983842
38714C983842Q41589J516362K370439J886349l78578k772873l443209k349040
38706A654881q22457N5127N1826n20924j050872r71189l25116K93396N38473O23059
38696d73796O98648M90058j56136q15725r31416m55249J77735N30230N02987L46751
38686h5913L57924M79424L69416l94j50039K07240O30259N47331P7503k29950
38676B202801k12655j47222j98564k94138l64200l14376l992M04785M39105K7274
38666A538818k45442k9288J92096n2171l57035j06723N20066R35850J046683J039695
38656D482549P80318J95252k52536k55711k77013o71643q67264l60378K00852
38647B974426N9628k49626J14820N74759j1891j181342j297342r1816Q98300O24453
$$ plain form
38714 3983842 4825431 6341793 8712232 10598581 10220003 7447130 4003921 1654881
38706 1654881 832424 887551 939377 418453 -632419 -1603608 -1928724 -1635328 -1096855 -473796
38696 -473796 224852 714910 558774 -256951 -1188367 -1643616 -1465881 -935651 -432664 -85913
38686 -85913 272011 751435 1120851 1120457 970418 1177658 1807917 2355248 2432751 2202801
38676 2202801 1990146 1842924 1644360 1350222 986022 671646 667654 1072439 1511544 1538818
38666 1538818 1293376 1264088 1456184 1404013 1046978 940255 1460321 2396171 3442854 4482549
38656 4482549 5262867 5458119 5205583 4949872 4672859 4001216 3133952 2773574 2974426
38647 2974426 3034054 2784428 2899248 3474007 3462116 2280774 983432 891616 1789916 2414369
38637B414369k41345o89229o59544n33065m17889l19485j88907L05205J222001
38628H92111J710254R70198l16164p29054j75028J17371l55066p49394m62734
38619I02494L5352K38995K35740M4715m91081r43638o12044K32580N97646L60510
38609F01269L33131O59144N68090p8099m58846l20439l88288q78919j003592l99394
38599a365943K49581M35332M45098M64026L06677K23088O34115R87988L92466
38590B772428n91339n44497L49024M53676m73328q39632j25165J70755o41713
38581E30209j067809j03901R65069Q99556N38344Q60108R77885n3696j123995
38572B421770p75995L14721N31485j10100m33331k24297j48881k94184l12228
$$ plain form
38637 2414369 2173024 1483795 824251 291186 -126703 -446188 -635095 -329890 892111
38628 892111 2602365 3572563 3256399 2527345 2352317 2469688 2114622 1365228 902494
38619 902494 937846 1176841 1412581 1457296 966215 22577 -589467 -356887 240759 601269
38609 601269 934400 1593544 2161634 2083535 1624689 1304250 915962 37043 -966549 -1365943
38599 -1365943 -1116362 -681030 -235932 228094 534771 757859 1391974 2379962 2772428
38590 2772428 2181089 1636592 1985616 2439292 1965964 1126332 1001167 1171922 530209
38581 530209 -537600 -641501 323568 1223124 1761468 2621576 3599461 3545765 2421770
38572 2421770 1645775 1960496 2491981 2381881 1948550 1724253 1575372 1281188 968960
38563I68960l34180m81205k67996L98829O36600R3489j71583M85191R45758K20044
38553B493907o88456m29850M40477O01643K24144K67604N20751K14171k26365
38544C418026J24932Q92883R87534M01787j18276n47742j208749j580128r99940
38535A370327O350M59505L73236K50734n6282p01353r20743j15400R21838J099391
38525B687603N41576n0557n40422q42808m91577K53295K76532m23254l81427O31784
38515A660745P45676p00779j444372P4410J806768J322181l11268o89651o0523
38506B403187p5902l82571K78087J089904N58461m44412k20559N11642J23247
38497C841084n96415Q851J007348N40531m60246J2729R82887J82628j455137j315195
$$ plain form
38563 968960 634780 153575 -114421 284408 921008 1014497 842914 1328105 2273863 2493907
38553 2493907 1805451 1375601 1816078 2417721 2641865 2909469 3430220 3644391 3418026
38544 3418026 3542958 4435841 5423375 5825162 5706886 5159144 3950395 2370267 1370327
38535 1370327 1376677 1836182 2209418 2460152 2403870 1702517 781774 666374 1588212 2687603
38525 2687603 3229179 3178622 2638200 1795392 1303815 1557110 1833642 1410388 1028961 1660745
38515 1660745 2406421 1705642 261270 335680 2142448 3464629 3153361 2463710 2403187
38506 2403187 2327285 1944714 2222801 3312705 3871166 3426754 3206195 3717837 3841084
38497 3841084 3244669 3253520 4260868 4801399 4341153 4353882 5336769 5519397 4064260 2749065
38487B749065j7256k35946j488056r69068R50154J150329m42661o59653J021180
38478B058088J532368j04748j121308r3585R31975O04321K58975O03175M65879
38469E135140j81704J31900J076432Q12182j59724L10702J517416Q29676j010799
38460H461221q15867R23751O96058j196152r06357J491137J786926l68300o78885
38451I393532J470733J795906k62246m3427L256360M799433L596280M306813P093709
38442C5407093O242977J969620J782702O311672P349075M856098R677119K2290510
38434I5886866K8887014L0497690N1491745R5546457J15104302O1669805m1046358
38427D38037521j12648731j08799363o4327512l4651306k9269349k4134124j1114519
$$ plain form
38487 2749065 2731809 2495863 1007807 38739 988893 2139222 1696561 1036908 2058088
38478 2058088 3590456 3485708 2364400 2270815 3202790 3807111 4066086 4669261 5135140
38469 5135140 4953436 5085336 6161768 6973950 6814226 7124928 8642344 9472020 8461221
38460 8461221 7645354 8569105 9265163 8069011 7162654 8653791 10440717 10072417 9393532
38451 9393532 10864265 12660171 12397925 12354498 15610858 20410291 24006571 28313384 35407093
38442 35407093 41650070 43619690 45402392 51714064 59063139 63919237 73596356 95886866
38434 95886866 124773880 155271570 206763315 302309772 417414074 479083879 438037521
38427 438037521 325388790 216589427 152261915 117610609 88341260 64207136 53092617
38420E3092617l569768n963406p496423l627032j802439m965019o515320l564398
38412A5588812j397391k559426k916021p02271L22965j165284j503141N66203
38404F234446J483192k45599j482726n74369L1060j000609j533046m87579J66319
38395B591089n23784q11339P3441N50707K3958j22292L89744K03073o13800m92401
38385A268396L53420J33141q84047o59313N60835M15948j056931j189736M50600
38376f07687J118153k23350j128789j46316P63076J0140q38993m9569J363441
38367B60106J665906J025235M15922n2032l38531M6218O56263J80570j173666
38358B685991j487411k35504O60136o2295j084601r06783m1444M94158R02145
$$ plain form
38420 53092617 49522849 43559443 36063020 32435988 30633549 25668530 19153210 15588812
38412 15588812 14191421 11631995 8715974 8013703 8336668 7171384 5668243 6234446
38404 6234446 7717638 7472039 5989313 5414944 5446004 4445395 2912349 2424770 2591089
38395 2591089 2067305 1255966 1329407 1880114 1904072 1781780 2171524 2374597 1760797 1268396
38385 1268396 1621816 1754957 870910 211597 772432 1188380 131449 -1058287 -607687
38376 -607687 510466 287116 -841673 -987989 -224913 -214773 -1053766 -1103335 260106
38367 260106 1926012 2951247 3367169 3315137 2976606 3022824 3679087 3859657 2685991
38358 2685991 1198580 963076 1623212 1560917 476316 -430467 -471911 22247 924392
38349I24392J464575J493967P78549M19406R25748J054318j47004j605945j844969
38340C463037j042599k69773J36660L08091O4782n24888p55809l26657J25662
38331A178506J40941O2576Q4294j28396m27926j47425M76758L42054n50586q01560
38321B29236P8836Q12049O04087M27435R89847J229379K12441j040013j147952
38312B395345m95196k59905m73400n31392n96543r73836r88155r220J133437J215140
38302D16275M81090P8818J98311J47056j83168k79488j35705j83891l14530p4738
38292A50030L35768K92002j66613l96678j93324M8409J07312J27868J29843k5070
38282D09547k53614l43563k83167j14326K49377O70751O55778L4795o13852o89186
$$ plain form
38349 924392 2388967 3882934 4661483 5080889 6006637 7060955 6913951 5308006 3463037
38340 3463037 2420438 2150665 2287325 2595416 2660198 2135310 1379501 1052844 1178506
38331 1178506 1319447 1382023 1466317 1337921 909995 762570 1239328 1581382 1030796 229236
38321 229236 308072 1120121 1724208 2151643 3141490 4370869 4583310 3543297 2395345
38312 2395345 1900149 1640244 1166844 635452 38909 -934927 -1923082 -1932302 -798865 416275
38302 416275 897365 976183 1174494 1321550 1138382 858894 723189 539298 224768 150030
38292 150030 485798 777800 611187 214509 21185 69594 176906 304774 434617 409547
38282 409547 155933 -187630 -470797 -585123 -335746 335005 990783 1025578 411726 -277460
38272b77460l41286r7195j23796k65545l77629k51849K98507R40948R82359L52085
38262H39139k38412m22226o02977q53302m74906O24151J220822M87052n48401
38253C0940m95430K41707K67296m08147m44587M83027J073359M48505n78187q52189
38243b33706m07256K8690K23579L88983M84709L03706k0438j76401k09801m18863
38233c6798p61508p85508k44382N02830Q65415O33428P1048m45323o45588l44243
38223a190629L98417J036786R16964J23515m86624m20607k33883n87777j122983
38214a566821j002016k19233M75508P42009Q41779P97335L39047k89515m47024
38205c28931j35209P22j79361j53668J29709Q1471k90208j68750N63046Q07238
$$ plain form
38272 -277460 -618746 -715941 -839737 -1105282 -1482911 -1734760 -1436253 -495305 487054 839139
38262 839139 600727 178501 -424476 -1277778 -1752684 -1128533 92289 579341 30940
38253 30940 -464490 -222783 44513 -363634 -808221 -325194 748165 1196670 618483 -233706
38243 -233706 -640962 -612272 -388693 290 484999 788705 768267 591866 382065 -36798
38233 -36798 -798306 -1583814 -1828196 -1325366 -459951 173477 244525 -200798 -846386 -1190629
38223 -1190629 -792212 244574 1161538 1285053 798429 377822 143939 -443838 -1566821
38214 -1566821 -2568837 -2788070 -2312562 -1570553 -728774 68561 407608 118093 -328931
38205 -328931 -464140 -463418 -642779 -796447 -666738 -585267 -875475 -1044225 -481179 326059
38195C26059m6006r86792q32994R8754O97288O52623L78341K314n29962q05385
38185a045760l92215L22079N56722J92154k42143l53367q7839M83455R87555P57292
38175A177933l32200j370237j379834m94832L64862O48926M73704J35875j01501
38166h77304m1889J41935l4176o06640q99964m31475M21735J070459J419908J456234
38156A618823Q50862l37583j189028r23633O1673P89449Q66785N18287O2317o2323
38146B255629N58641J479798J455422R0889j346190j612301j150567j059383j239978
38137e68040q36063J00909P21174P63762O27279M03421j9299k51949O3501L97013
38127A401708J20080l05981j25511K48069p1769p57320p81552k44618q1367k39572
$$ plain form
38195 326059 280053 -706739 -1539733 -1440979 -743691 -91068 287273 289587 -240375 -1045760
38185 -1045760 -1437975 -1115896 -559174 -367020 -609163 -962530 -1050369 -566914 420641 1177933
38175 1177933 845733 -524504 -1904338 -2399170 -2034308 -1385382 -911678 -775803 -877304
38166 -877304 -919193 -777258 -811434 -1418074 -2318038 -2749513 -2327778 -1257319 162589 1618823
38156 1618823 2469685 2132102 943074 19441 81114 870563 1737348 2255635 2317952 2255629
38146 2255629 2814270 4294068 5749490 5840379 4494189 2881888 1731321 671938 -568040
38137 -568040 -1404103 -1303194 -582020 181742 809021 1212442 1193143 941194 1004695 1401708
38127 1401708 1521788 1215807 1090296 1338365 1266596 509276 -272276 -516894 -598261 -837833
38117h37833J13571P34658N31228l15934m09853M16983P01379r0412n90351O1246
38107C14682P16674K55395n38406m68745P4532O3577l05123j96647J97499M7097
38097A60535n54532p37795k80557K40420N17518P39290Q85571O79400K03513j38271
38087A715092k36003k96653l60915l04665k09047k68809m11190l67276n6073L27373
38077d68166M98884K79950j78160l96353j57737K4301l89780r25488o21602L77775
38067a956376Q24049K38163l53056r6181L96141K37949k41626k15287K16008L88730
38057e61486K60479J57060j22981q01915j163163l78830R18387J205510K44365
38048b42574n74069l01203L54385L78301m1071j26128J15954O0254l41609m33375
$$ plain form
38117 -837833 -724262 10396 541624 225690 -184163 232820 934199 843787 253436 314682
38107 314682 1031356 1286751 748345 279600 354132 417709 112586 -84061 113438 160535
38097 160535 -393997 -1131792 -1412349 -1171929 -654411 84879 970450 1649850 1853363 1715092
38087 1715092 1479089 1182436 821521 516856 307809 39000 -372190 -739466 -795539 -468166
38077 -468166 30718 310668 132508 -263845 -421582 -397281 -787061 -1712549 -2334151 -1956376
38067 -1956376 -1132327 -894164 -1247220 -1343401 -947260 -709311 -950937 -1166224 -950216 -561486
38057 -561486 -301007 -143947 -266928 -1068843 -2232006 -2610836 -1692449 -486939 -242574
38048 -242574 -816643 -1117846 -763461 -385160 -426231 -552359 -436405 -376151 -717760 -1151135
38038a151135N1017M78333J97882n14799q23744m55022J7385N0499j71387j85127
38028b506098P846J06173J48450M06405P49677P40759L82215J55176K26471K36059
38018F53133P802j74759j91733l08786n26015m25334j0568N5612m66291q04156
38008b191095k85489N92816Q90111M94651o612k49978k07639J48939N90201N02501
37998B78406k29393p06343k32587M52758K04385o65278p88245J42916R75655R39301
37988C71575N90147N23533L62029k78687q10569n61333L7526R5183l30272m12134
37978d13002N9590M18641L05120K16097N24237O78413K1413j005511j247600l88238
37968h30840N97499P63072L40797J30263K46381J54984k92683o11507m76891j22669
$$ plain form
38038 -1151135 -1100118 -621785 -423903 -938702 -1762446 -2217468 -2200083 -2149584 -2320971 -2506098
38028 -2506098 -2498252 -2392079 -2243629 -1837224 -1087547 -346788 35427 190603 417074 653133
38018 653133 660935 486176 294443 -14343 -540358 -965692 -976260 -920648 -1386939 -2191095
38008 -2191095 -2476584 -1883768 -993657 -499006 -505618 -755596 -963235 -814296 -224095 278406
37998 278406 49013 -657330 -889917 -437159 -232774 -898052 -1686297 -1543381 -567726 371575
37988 371575 961722 1485255 1847284 1568597 758028 196695 234221 329404 -868 -413002
37978 -413002 -353412 65229 370349 586446 1110683 1789096 1810509 804998 -442602 -830840
37968 -830840 -233341 529731 870528 1000791 1247172 1402156 1109473 497966 21075 -101594
37958a01594J42078K39397Q5572l19949m93284Q9705R59293R30210j85670j029909
37948C15849n01843O75966J034033L76485k51913k27934M7337Q7598n5839j81103
37938A318636k41142j75867J7638N0489l04765o73003m35307L62823R54795P55938
37928A630235l5297p16504o89889N8078Q27287Q16305J03975m18637l71744m22232
37918G81577r50663j080385n7914J143474R87685k61539q75505k69596L26881
37909b55985N4501l23870J1347N30234M41568P5901J11219K45474k00491q67182
37899a77284p03623M15645J376138J205748J06311r86663j359534r22793p0085
37890a116140O47315Q64195N84361R1373k74875l38075k27158k20396l19660k01606
$$ plain form
37958 -101594 40484 279881 365453 45504 -447780 -358075 601218 1531428 1345758 315849
37948 315849 -185994 489972 1524005 1900490 1648577 1420643 1467980 1555578 1499739 1318636
37938 1318636 1077494 901627 919265 969754 664989 -8014 -443321 -80498 874297 1630235
37928 1630235 1594938 878434 188545 246623 1073910 1890215 1994190 1575553 1203809 781577
37918 781577 -169086 -1249471 -1307385 -163911 823774 562235 -313270 -582866 -255985
37909 -255985 -201484 -525354 -514007 16227 457795 533696 644915 890389 689898 -177284
37899 -177284 -880907 -465262 910876 2116624 2222935 1236272 -123262 -1046055 -1116140
37890 -1116140 -468825 395370 979731 1071104 796229 458154 230996 10600 -309060 -510666
37880e10666J73451K70324k25126o78607k91027O19519R65623M28868k55956n40759
37870d4356n80817m24132J69714Q10807N94054l40019n75092M73936J380360O90231
37860B154686q71701j438453n64945N50716R53305P18175J14227o89138j097183
37851a70311n16811N11136O93152k28276j037448p54520Q9823L73365j01628n61095
37841a702613l33340M53128J052596Q23735l8330n69763j83465M66463L57649
37832C26060l62924n80522L9481N31605J92176l35039j78746L61549L91793j20645
37822B64788l79869k0679M89512O60289M82470P2388n50022j143627j212800n83601
37812a921151K60575O40565L41978k62081n92891l39282K81847P16146O58907
$$ plain form
37880 -510666 -337215 -66891 -292017 -970624 -1261651 -642132 323491 752359 496403 -44356
37870 -44356 -625173 -1049305 -879591 -68784 525270 185251 -389841 84095 1464455 2154686
37860 2154686 1282985 -155468 -720413 -169697 783608 1501783 1616010 926872 -170311
37851 -170311 -687122 -175986 517166 288890 -748558 -1503078 -1413255 -1039890 -1141518 -1702613
37841 -1702613 -2035953 -1582825 -530229 293506 255176 -314587 -498052 -31589 326060
37832 326060 -36864 -617386 -577905 -46300 145876 -189163 -367909 -6360 385433 264788
37822 264788 -115081 -135760 353752 1014041 1496511 1568899 1018877 -124750 -1337550 -1921151
37812 -1921151 -1660576 -1020011 -678033 -940114 -1533005 -1872287 -1590440 -874294 -215387
37803b15387L87988L21853L89639K09261j72892k38723J58021M27989Q6331m63520
37793H90560n02775q7161O2861k99323n76339k64630L13462N49504L75243J26065
37783E87467r0710l87393o28688m91226O147M38748M95847K53676p8617l55390
37773b50139m07507j06649L81325O81015O28516L76485P7249k32617m25615l42558
37763C79505j27077j07825k58731k20271J8947P055l47984m35971J15318O94399
37753b82635N46699l2926j27154L88834P14729M25346L2646j8103j01099o18459
37743I27878j076910p16968K25460O84187K10714m43577m35639N1784K32965j23422
37733d63528n12443n19180k65350J0900L00977N60825N50588K42761L4654K00107
$$ plain form
37803 -215387 172601 494454 884093 1093354 920462 681739 839760 1267749 1354080 890560
37793 890560 387785 300624 363485 64162 -512177 -776807 -463345 86159 461402 587467
37783 587467 496757 109364 -519324 -1010550 -1004403 -565655 -69808 183868 105251 -250139
37773 -250139 -657646 -764295 -382970 298045 926561 1303046 1380295 1147678 722063 379505
37763 379505 252428 144603 -114128 -334399 -315452 -308397 -656381 -1092352 -977034 -282635
37753 -282635 264064 231138 103984 492818 1207547 1632893 1665539 1647436 1546337 927878
37743 927878 -149032 -866000 -640540 43647 254361 -189216 -624855 -573071 -340106 -463528
37733 -463528 -975971 -1495151 -1760501 -1749601 -1448624 -887799 -337211 -94450 -59796 140311
37723A40311M24888K77149j29680l91070m77566o06270o37420k41644L95136P00183
37713e45983N70546M21576L15811j66485r57559j238392o09751J95670L63934
37704a650633J41796K26589N26231L78536k46535o03466k36780M44164P37146
37695b82952L65947l72165q31397m84816M80313J163881Q91477k0286p54214r49759
37685g93971p50406k65240L93636P88516N67075P7403p3678N0759o9201l77275
37675d52382k51372L85896P97256N12783l3395k50947j51914l5121K1967L093
37665E45864k15396n17691m84281k6827L35219J97021j27110j15421J90517L55255
37655A37150K33536N4851l0016j08064k52298l80364l79984k53897j42981j97163
$$ plain form
37723 140311 565199 842348 712668 321598 -155968 -762238 -1399658 -1641302 -1246166 -545983
37713 -545983 24563 446139 761950 595465 -362094 -1600486 -2210237 -2014567 -1650633
37704 -1650633 -1508837 -1282248 -756017 -377481 -624016 -1227482 -1464262 -1020098 -282952
37695 -282952 82995 -289170 -1120567 -1605383 -1125070 38811 930288 910002 155788 -793971
37685 -793971 -1544377 -1809617 -1415981 -627465 -60390 17013 -56665 -5906 -75107 -452382
37675 -452382 -703754 -317858 479398 992181 958786 707839 555925 520804 542771 545864
37665 545864 330468 -187223 -671504 -698331 -363112 -166091 -293201 -408622 -218105 137150
37655 137150 370686 425537 395521 287457 35159 -345205 -725189 -979086 -1122067 -1319230
37645a319230l52910l43497q7833J20185R0134J52045O37477J173067J122772
37636A192210O00152K86302K71148l5598o90261q85034k42561M51211M04159m1610
37626A310118j15074J56588J78780k04228o46603r03193q88961n00105N4377J66882
37616a391419l11822n96962n1892P34366P89897K58195P2727M16028N83421L04722
37606H07261J08405K34114J97027k54883o16053m61877j19295p7735k71587l35573
37596g90196j53304J55790M44226N21228K68399r6600k10629o5443N5486Q7335
37586B16292J46759Q5978k65487m68543R8452J073531J260054K48855r37522j233005
37576B25364p75273k80550L5033K52256J56854l46180o98487l60815K91911M60332
$$ plain form
37645 -1319230 -1672140 -2015637 -2103470 -1983285 -1893151 -1741106 -1103629 69438 1192210
37636 1192210 1792362 2078664 2349812 2314214 1623953 738919 496358 947569 1351728 1310118
37626 1310118 1195044 1351632 1530412 1326184 679581 -223612 -1112573 -1612678 -1558301 -1391419
37616 -1391419 -1703241 -2300203 -2352095 -1617729 -827832 -569637 -496910 -80882 502539 807261
37606 807261 915666 1149780 1346807 1091924 475871 13994 -105301 -183036 -454623 -790196
37596 -790196 -943500 -787710 -343484 177744 446143 349543 138914 73471 128957 216292
37586 216292 363051 449029 183542 -285001 -186549 886982 2147036 2395891 1458369 225364
37576 225364 -549909 -830459 -795426 -543170 -386316 -732496 -1430983 -1791798 -1499887 -1039555
37566a039555O2975k73229j80136J06329K43652J07440k53307n51335l47988L68898
37556a756256R35501P78510J66704k31106k07227K6642L33309N47419L16742l02148
37546F08090n41509K7685O16154L03946m40185m56657K01705L82616k20343o30525
37536a49023k91014J49976J49698R1023K66244K55239m6438M4048O89557R07413
37526B066723J43598o42458n13513r5339l28323o81499j47127P51488O82529k24628
37516A011451o46303m02885o12395j355317j159257N18916K012582J668301O8278
37507A103371j025385r39570k75475L20287N17895J03820n88663o09620L24895
37498a068445J055766M72252p62920j098639l00946M44814M35929J93309K42150
$$ plain form
37566 -1039555 -976580 -1249809 -1429945 -1323616 -1079964 -972524 -1225831 -1777166 -2125154 -1756256
37556 -1756256 -820755 -42245 124459 -106647 -313874 -287232 46077 593496 910238 608090
37546 608090 66581 94266 710420 1014366 574181 117524 319229 701845 481502 -149023
37536 -149023 -440037 -290061 -140363 -49340 216904 472143 425705 469753 1159310 2066723
37526 2066723 2210321 1567863 1054350 959011 630688 -50811 -197938 553550 1236079 1011451
37516 1011451 365148 -37737 -650132 -2005449 -3164706 -2645790 -633208 1035093 1103371
37507 1103371 77986 -861584 -1137059 -816772 -298877 -195057 -783720 -1393340 -1068445
37498 -1068445 -12679 459573 -303347 -1401986 -1702932 -1258118 -822189 -628880 -386730
37489c86730L39612K15293R6100J10187k4330l44710l98554k0811L07838K47928
37479A41823J12853K08742K85277Q3278j52128j79323k24164m26421l92201P9793
37469d62471L66044j01957p35349m90680N08744J026617M66878l33367l74628
37460a30169J93867N15487K50542j86852l29844j18023K15250L63179J43122k64886
37450F51673l96086o8349K74522J00524m35986o46654k47912K68670L74593K27228
37440A02223K83197M27626N3255q92393j482282q83632M24814J115283O86989
37431a64920K1903k377K32127j09082p32958n08537O34414J233266L05665j055478
37421a45977j068145K54452J158464O25940l75548n02033J09863L57954q4027
$$ plain form
37489 -386730 -47118 168175 264275 374462 350132 5422 -393132 -413943 -106105 141823
37479 141823 254676 463418 748695 831973 679845 500522 276358 -150063 -542264 -462471
37469 -462471 -96427 -198384 -933733 -1424413 -915669 110948 577826 244459 -130169
37460 -130169 63698 579185 829727 642875 313031 195008 410258 773437 916559 651673
37450 651673 255587 187238 461760 562284 126298 -520356 -768268 -499598 -125005 102223
37440 102223 385420 813046 866301 -26092 -1508374 -2392006 -1967192 -851909 -164920
37431 -164920 -143017 -145394 86733 -22349 -755307 -1263844 -629430 603836 909501 -145977
37421 -145977 -1214122 -959670 198794 824734 449186 -52847 57016 414970 330943
37412C30943m71884k50288K28027L77015J82895N6869J91102L19926O4305n63140
37402D65770j045441r08804l72217r7387j92801l1666N78307P41505k08567j281371
37392b352672r07918O90336J541973O29362p28753q59144K8575N65051L22827
37383a070363k176j4844L325l3155J08829K28116j42034o82731m26449P27207
37373a304275J547385J042067k12931r04349o20327l9732J68256j1072k82811
37364f17789m75791n18297l14281J47814O35091P77296M54968L6911q153K02846
37354C20615L4889o79745j169942p23699K20304O45066L57902L8535M4124P7530
37344h34421M3995K29396M33763j3226r59075j201461k11175Q60394P47334j45842
$$ plain form
37412 330943 -140941 -391229 -163202 213813 396708 453577 644679 964605 1028910 465770
37402 465770 -579671 -1488475 -1860692 -1958079 -2150880 -2182546 -1604239 -862734 -1071301 -2352672
37392 -2352672 -3260590 -2570254 -1028281 -398919 -1127672 -1986816 -1958241 -1393190 -1070363
37383 -1070363 -1072539 -1087383 -1084058 -1117213 -1008384 -780268 -922302 -1605033 -2031482 -1304275
37373 -1304275 243110 1285177 1072246 167897 -452430 -492162 -323906 -334978 -617789
37364 -617789 -1093580 -1611877 -1926158 -1778344 -1143253 -365957 89011 125922 117769 320615
37354 320615 355504 -324241 -1494183 -2217882 -1997578 -1352512 -994610 -956075 -911951 -834421
37344 -834421 -790426 -561030 -127267 -140493 -1099568 -2301029 -2512204 -1651810 -904476 -1050318
37334a050318n19989j20524K31002J62055J09249K45062J69611j76301k48240
37325a198393J71403N56724M66425J41209m1877j37218l05525m11912l29820k63090
37315a352074l75510l75006J33330R88350J482928J082885L5628p86640p26787
37306A07104o4798K76011j28229o35764m24229L41738P39838L55492k71862n01983
37296b06682l13140L961L37281O20381O03381J50752m27841o68462m86109j87010
37286e73488j1997J10801L12567M40275J74140m26413p15856j73129P24220Q73529
37276G34649l618q61669p08898O2556L67708k235l39709k75696j20900j4167K89848
37265h72131O53369N25370m4125k59775J53857M03586j22439q39056q66315l02167
$$ plain form
37334 -1050318 -1570307 -1690831 -1459829 -1297774 -1188525 -943463 -773852 -950153 -1198393
37325 -1198393 -1026990 -470266 -3841 137368 95491 -41727 -347252 -759164 -1088984 -1352074
37315 -1352074 -1727584 -2102590 -1969260 -980910 502018 1584903 1620531 833891 107104
37306 107104 42306 318317 190088 -445676 -869905 -528167 211671 567163 295301 -206682
37296 -206682 -519822 -515861 -178580 441801 1045182 1195934 768093 99631 -386478 -573488
37286 -573488 -585485 -474684 -162117 278158 452298 25885 -689971 -863100 -138880 734649
37276 734649 731031 -130638 -839536 -776980 -409272 -411507 -751216 -1026912 -1147812 -1161979 -872131
37265 -872131 -218762 306608 262483 2708 156565 560151 437712 -401344 -1267659 -1569826
37255a569826J43895K74251L76172M49161K65104j1653o325J82272J56056j914
37245B57193J96023P43594R50058L44351o64488j233336r42047j21133M88449
37236A8664M10962q0939k75866N6135L52388J19480l11611l69035j76895k09732
37226d66449k97009J22566Q05848P97942l738l98073L74086J286339Q87817n14531
37216B594798j197438m64234M36670K14013o69619q97192l11523M0325l33181
37207e87381o78903l11529L35146N00827K09184q5258l63820p38344p38597J00486
37197b358189J162318J317543N52239l6041L1809O3946l08318l51397L76727J005320
37187A455957O77296n0579k28433j23113n39235j161153j018172k60580K7089
$$ plain form
37255 -1569826 -1425931 -1151680 -775508 -326347 -61243 -72896 -79221 103051 259107 257193
37245 257193 453216 1196810 2146868 2491219 1826731 593395 -348652 -469785 18664
37236 18664 429626 348687 72821 128956 481344 600824 289213 -79822 -256717 -466449
37226 -466449 -763458 -640892 164956 962898 959160 561087 935173 2221512 3109329 2594798
37216 2594798 1397360 933126 1369796 1583809 914190 16998 -294525 -254200 -587381
37207 -587381 -1266284 -1577813 -1242667 -741840 -532656 -617914 -981734 -1720078 -2458675 -2358189
37197 -2358189 -1195871 121672 673911 637870 669679 733625 425307 73910 450637 1455957
37187 1455957 2133253 2082674 1854241 1731128 1191893 30740 -987432 -1248012 -1220923
37178a220923l01799k73423L70734O53612J13238l12525J51032Q31991P36042
37169G47979L2097m72343o13117p28947p77167m52075J44967O31617Q53171P78937
37159A45119L16388k97743m58359q1293P5540l99831p62438k97604L86525L11109
37149a062587k07371j08671N49126O75518L0179l84163k5669L91340K25476j16660
37139c3482q1964J33052J70289J40489J10734k15135p49483q03647k35714N9728
37129a505133m58613r81778o37537O7034J79743m2064L05249J048644J163158
37120h61297M96455p0362j32266j48339k76767j02724K99688K88015r9503n7432
37110f64532M83361N58832j35532n80203j36852L87229K44515M0833M35301P45917
$$ plain form
37178 -1220923 -1522722 -1796145 -1425411 -771799 -658561 -971086 -820054 11937 747979
37169 747979 780076 307733 -305384 -1034331 -1811498 -2263573 -2118606 -1486989 -633818 145119
37159 145119 461507 163764 -294595 -375888 -300348 -700179 -1462617 -1760221 -1373696 -1062587
37149 -1062587 -1269958 -1378629 -829503 -153985 -123806 -507969 -533638 -142298 83178 -33482
37139 -33482 -115446 17606 187895 328384 439118 223983 -525500 -1329147 -1564861 -1505133
37129 -1505133 -1963746 -2945524 -3583061 -3516027 -3336284 -3378348 -3073099 -2024455 -861297
37120 -861297 -364842 -435204 -567470 -715809 -992576 -1095300 -795612 -507597 -607100 -664532
37110 -664532 -181171 377661 242129 -338074 -474926 -87697 156818 197651 632952 1378869
37100A378869J97073m62040j30997O48644N58397k11405l52092J97049J84700
37091B008198o27660r88956l72608J31584k08723n27378K2397P92191Q03296K72332
37081A304673n4672j63391l71685m78578k70213j50076l71187l86908J26869M21590
37071c93578r0376n53106R1047J193450J189303j4551q99189n63661K36515M82645
37061F78499J86670o3783o658J94332K04335k32040q46235q51472J2142Q02980
37051G8770N74818j49727j75912M24298N03941j43568m69143p0617J20491m27896
37041B65455q59216m51540J09862o6021o10578o49508k19005R3284K76782O48561
37031a461924R66676P75974K97496R0960J13420o8905l82293l61191L667K57592
$$ plain form
37100 1378869 1575942 1113902 982905 1631549 2189946 1978541 1626449 1823498 2008198
37091 2008198 1380538 391582 18974 150558 -58165 -585543 -563146 229045 1032341 1304673
37081 1304673 1250001 1086610 714925 236347 -33866 -183942 -555129 -942037 -815168 -393578
37071 -393578 -483954 -1037060 -946013 247437 1436740 1422189 523000 -40661 195854 678499
37061 678499 865169 801386 794728 989060 1193395 961355 115120 -736352 -724210 78770
37051 78770 653588 503861 327949 752247 1256188 1112620 643477 572860 693351 265455
37041 265455 -593761 -1045301 -935439 -1001460 -1612038 -2261546 -2480551 -2387267 -2110485 -1461924
37031 -1461924 -495248 280726 578222 669182 782602 713697 331404 -29787 -26120 231472
37021B31472K10897O4737m9991j12153J3653L07638L52877p8160m83578k98013
37011A59379J85551K43871j67953m60090l72791j57688N4061K98199L07239j87079
37001i7301p21906n36255J95974M47971j39500o84167l86024L38912N79197K09005
36991g94094j50246j03695J43356K51493J65118N9951Q1039J46749J2902l47697
36981e35124n08213k1177Q97609J434532J029532m8980j005445j193026n64288
36972e14580K61956M69018p7894n36526j12434P57548Q83205l925q10132n85557
36962b69321K41413O33307L84517J22895J84819K22117o6403m13132m12849j17494
36952E09869P5187k4424k06806k29432j61106j98997k63788q4501K66050K96645
$$ plain form
37021 231472 442369 507106 457115 344962 358615 666253 1019130 940970 457392 159379
37011 159379 344930 588801 420848 -39242 -412033 -569721 -515660 -217461 89778 -97301
37001 -97301 -819207 -1355462 -1159488 -711517 -851017 -1535184 -1921208 -1582296 -1003099 -794094
36991 -794094 -944340 -1048035 -904679 -653186 -488068 -428117 -347078 -200329 -187427 -535124
36981 -535124 -1043337 -1064514 -166905 1267627 2297159 2248179 1242734 49708 -514580
36972 -514580 -252624 216394 138500 -398026 -510460 247088 1130293 1126368 316236 -269321
36962 -269321 -27908 605399 989916 1112811 1297630 1519747 1453344 1040212 627363 509869
36952 509869 585056 560632 353826 124394 -36712 -235709 -499497 -583998 -317948 -21303
36942b1303j91679o60271n10699L8614K73690M4193j00445J59999M75085M73300
36932a9516K93621K14704K26011K40100K96504K74476j41265q51059j140669n66160
36922a173253L04512N68134J65681j84413r1214J08399J02932J22933L96971N61447
36912H82129J13035p26662j112971o30037J73394N45384M85315N00882O27047
36903H57516L52726l75366p89929l76100K66786K64326k46729m24114n4506K66028
36893b59362K19303J59883L04634L48324J33627l0614l261n7822j99985K801N16410
36882A133938N61388j97448r17878p34186j2974L18274J39830l5552j40129m46613
36872c31350o58745j78991P26134J015763L06649o07025q93958o14059k31970
$$ plain form
36942 -21303 -212982 -873253 -1383952 -1345338 -1071648 -1027455 -1127900 -967901 -492816 -19516
36932 -19516 274105 488809 714820 954920 1251424 1525900 1384635 533576 -607093 -1173253
36922 -1173253 -868741 -300607 -134926 -319339 -410553 -302154 -199222 -76289 320682 882129
36912 882129 995164 268502 -844469 -1474506 -1301112 -755728 -270413 230469 857516
36903 857516 1210242 834876 44947 -331153 -64367 199959 -46770 -470884 -525390 -259362
36893 -259362 -40059 119824 424458 772782 906409 875795 872534 814712 614727 617528 1133938
36882 1133938 1695326 1497878 580000 -154186 -167160 151114 290944 255392 115263 -331350
36872 -331350 -990095 -1169086 -442952 572811 879460 272435 -621523 -1235582 -1467552
36863a467552J12237M46855O11292N05366L68179M32147N13767K48975l86982
36854A384284r93804j121645o77197l2669L13051K80979K65829M90529O04208
36845E13565K59739k33523l63120k60659m12499o70940l84940M16790Q51576N02385
36835B18374J08574M19597J000600Q53276j48420j096936j177265m58687L65203
36826H4316O56148K96862k63015m62007k19581R0149K55935M15392N09486J15979
36816A479664p99783j472692j216874l58732K68410M39287M99693M85680J00140
36807e75207m59272m89020J62063P04295M50671k52422n43875j36785N06672Q33966
36797B01086O66572J76420k70053l36339l6736K32982J48964j70857l85028l44143
$$ plain form
36863 -1467552 -1355315 -908460 -297168 208198 576377 1008524 1522291 1771266 1384284
36854 1384284 390480 -731165 -1408362 -1441031 -1127980 -847001 -581172 -90643 513565
36845 513565 773304 539781 176661 -83998 -496497 -1167437 -1552377 -1135587 -284011 218374
36835 218374 326948 746545 1747145 2600421 2452001 1355065 177800 -280887 84316
36826 84316 740464 1037326 774311 312304 92723 182872 438807 854199 1363685 1479664
36816 1479664 679881 -792811 -2009685 -2368417 -2100007 -1660720 -1161027 -675347 -575207
36807 -575207 -1034479 -1523499 -1361436 -657141 -206470 -458892 -1002767 -1139552 -632880 201086
36797 201086 867658 1044078 774025 437686 400950 633932 782896 612039 227011 -117132
36787a17132j35627P4496O5666l00740p17795n34759L67052J095288P26605l88679
36777A34375r81967n27637J95419L78848K19323K40409L21052J06334j44189L8966
36767a9067L94875K77741k05384l16703N0491J91689j42536k86142J24060M22194
36757D91218O8076l08370P7167P27307N38375m05314q79241l75189K08966N9862
36747B02857l50739j75087L95997M35163k91275r55136p91318m6281M55579L91969
36737g28271K20564L90556O46974M38695j47282l75244P8332N70595L86967k23091
36727A258795m58499j43345J61650J10192n9436j44304k85553m83846m34256j10560
36717e89162N7249q4492n3359M64522R39684O90984p9879n51518m06937r5862
$$ plain form
36787 -117132 -252759 -178263 -112597 -413337 -1131132 -1665891 -1298839 -203551 523054 134375
36777 134375 -847592 -1375229 -1179810 -800962 -581639 -341230 -20178 86156 -58033 -19067
36767 -19067 375808 653549 448165 131462 181953 373642 231106 -55036 69024 491218
36757 491218 559294 250924 328091 1055398 1593773 1188459 309218 -65971 142995 202857
36747 202857 -147882 -322969 73028 508191 216916 -738220 -1529538 -1575819 -1120240 -728271
36737 -728271 -507707 -117151 529823 968518 821236 445992 524324 1094919 1481886 1258795
36727 1258795 800296 656951 818601 928793 869357 725053 439500 -44346 -478602 -589162
36717 -589162 -531913 -616405 -669764 -205242 734442 1425426 1345547 794029 387092 291230
36707B91230j2707j4206Q0321K2968m48196j003587r97793l52396K53805K84449
36697a896112Q0315K60230O19009L35415o17414j091705l11185Q95007J205048
36688e21392O45150K99315M60232K99186n09192j064202o39440J87257M64338
36679c78748J53100k08106m59997o72079n61590R5436P78718P35202M6530m46918
36669i18452k13634M69276R75393Q65106J11957p96866j116948n55097L85576
36660g93689R62135Q59649K07758n98155r17049l37119N60657O39308j79846o08427
36650b04778Q8755Q54925M77238m80214o71155j51791k5202l64245k01276N18997
36640a58746P11414R2785k85589R6329L52873j54947o73741m10666J36218J37595
$$ plain form
36707 291230 278523 264317 344638 367606 -80590 -1084177 -2081970 -2434366 -2180561 -1896112
36697 -1896112 -1815797 -1555567 -936558 -601143 -1218557 -2310262 -2621447 -1726440 -521392
36688 -521392 123758 423073 883305 1182491 673299 -390903 -1030343 -843086 -378748
36679 -378748 -225648 -433754 -893751 -1565830 -2127420 -2031984 -1253266 -518064 -471534 -918452
36669 -918452 -1132086 -662810 312583 1177689 1289646 492780 -624168 -1179265 -793689
36660 -793689 168446 1028095 1235853 637698 -279351 -616470 -55813 583495 403649 -204778
36650 -204778 -116023 738902 1216140 735926 64771 -87020 -112222 -476467 -677743 -158746
36640 -158746 552668 645453 359864 456193 809066 654119 -19622 -430288 -294070 -156475
36630a56475k28681l30326j68284q813L52520J038099J400655Q04103l48700j142956
36620A211142j277658j006896n03325N667M9519l48527l35189N07761J186288
36611e11218O32579n24185p71867M5856O75186N41902M41255Q67737J029706K08620
36601B635571r20336j179249m86451K21115L13247K4633j67572j47619p0715j2451
36591B10173J15440L50355M77752K00892l96427p56715m74578J14593K95236j19966
36581A6755n59618m11146K68835Q25915O76840p6885o70760m62558K87770P24702
36571F19850N28579K41501K61634J70809m20852r62758o76755J90813O67684M01850
36561A022355j04689m63411p34303q23139m39241K03072M37891J07959k23569
$$ plain form
36630 -156475 -385156 -715482 -883766 -892579 -540059 498040 1898695 2702798 2354098 1211142
36620 1211142 -66516 -1073412 -1576737 -1571070 -1521551 -1870078 -2205267 -1697506 -511218
36611 -511218 121361 -402824 -1174691 -1128835 -453649 88253 529508 1397245 2426951 2635571
36601 2635571 1715235 535986 49535 270650 583897 608530 440958 293339 222624 210173
36591 210173 325613 675968 1153720 1354612 958185 201470 -273108 -158515 136721 16755
36581 16755 -542863 -954009 -685174 140741 817581 740696 69936 -392622 -104852 619850
36571 619850 1148429 1389930 1651564 1822373 1401521 438763 -237992 -47179 620505 1022355
36561 1022355 917666 454255 -280048 -1103187 -1542428 -1339356 -901465 -793506 -1017075
36552a017075j86844k2926P7506K80737N01612K76985l80108p30266l51479K32804
36542a319054M24205L74456M07167K92262j99510n64570k08810N06644O65568
36533C78358R1358m85092n21036k71458k03445l32014l62939j89035j0902k8235
36523a934440j21276M0565M63756O05868O8802o21220n51571K18614O15395J34485
36513a081022l86953j26476M28907L76332r9502j76806J10992N3921k54006N3953
36503a100660R27374J046235k41620j664325j574784j17803J051480R00125L2220
36494g41758l77763M3398P48105J050414P32137N7381n61819q70917q29772n04226
36484a254820k6885L79155N15470L88945J68578j6023r7268J9236L15290M96544
$$ plain form
36552 -1017075 -1203919 -1226845 -1149339 -868602 -366990 -90005 -470113 -1200379 -1551858 -1319054
36542 -1319054 -894849 -520393 -113226 179036 -20474 -585044 -793854 -287210 378358
36533 378358 469716 -15376 -536412 -807870 -1011315 -1343329 -1706268 -1895303 -1906205 -1934440
36523 -1934440 -2055716 -2015151 -1551395 -945527 -876725 -1497945 -2049516 -1830902 -1215507 -1081022
36513 -1081022 -1467975 -1594451 -1165544 -789212 -888714 -1065520 -954528 -900607 -1154613 -1100660
36503 -1100660 -173286 872949 631329 -1032996 -2607780 -2725583 -1674103 -773978 -741758
36494 -741758 -1119521 -1076123 -328018 722396 1454533 1511914 950095 79178 -750594 -1254820
36484 -1254820 -1281705 -902550 -387080 1865 170443 154420 57152 76388 391678 888222
36474H88222L09850J3241R9131M71400M29202k66923q65597o56120p6864q9494
36464B56048o96438r22779l02547M71549O71272N19400N36226N73267K48151j17564
36454A236585R7850O62598O80435j9215n96053n35377l63391n80384p36087k72285
36444d25324L87490M51318J0431k18394j01489j13338l21695l05343n9494k4960
36434g20798j28553K19348R36889J075761K39909p03520q78330n52235m05414
36425i16943m04783j80317R2400M2797r8134J14515M82887M93706K27272J46799
36415A99K12858L1757k75099k07914J62974K37244q4604k38980L840J90464O4490
36404I7229J4871K68742L23070k87577j124284j306681o17123K98939P32949N87973
$$ plain form
36474 888222 1198072 1211313 1310444 1781844 2211046 1944123 1078526 422406 345542 256048
36464 256048 -440390 -1363169 -1665716 -1194167 -522895 -3495 532731 1105998 1354149 1236585
36454 1236585 1334435 1997033 2677468 2658253 2062200 1526823 1163432 583048 -153039 -425324
36444 -425324 -37834 413484 423915 205521 104032 -9306 -331001 -636344 -695838 -720798
36434 -720798 -849351 -630003 306886 1382647 1622556 919036 40706 -511529 -916943
36425 -916943 -1321726 -1502043 -1409643 -1366846 -1464980 -1350465 -867578 -373872 -146600 199
36415 199 213057 244814 -30285 -238199 -75225 162019 77415 -161565 -157725 32739 97229
36404 97229 112100 380842 703912 416335 -707949 -2014630 -2631753 -2332814 -1599865 -1011892
36394a011892K77150J68151K10475J08005k01229m36089m18363l30968l12794
36385a947554j43048L00514O15239M20049L4216n618J45056n0106m58379m09541
36375a499172J23035L89691R2225j48378J14796M24494K60648q4700k4407M56890
36365A05122R41895J131701Q58985O1947q31145j029515l80449K69333K21783
36356A349657j06695K4874M63645N07546P9350k84415l95798n30317o58409l68303
36346H1135L54244R30480R12159L88967l73546j152422j552804j177161k36181
36337a825129M79498M82759Q4016j64335j15777Q0392L13683M27790J60367m40274
36327e17010p92781m20588L18236N97623K08177j98795r2119J79764k6731o20069
$$ plain form
36394 -1011892 -734742 -566591 -356116 -248111 -449340 -885429 -1303792 -1634760 -1947554
36385 -1947554 -2090602 -1790088 -1174849 -754800 -720584 -726202 -581146 -631252 -1089631 -1499172
36375 -1499172 -1376137 -986446 -894221 -1042599 -927803 -503309 -242661 -327361 -351768 105122
36365 105122 1047017 2178718 3037703 3099650 2268505 1238990 858541 1127874 1349657
36356 1349657 1242962 1267836 1731481 2239027 2318377 2033962 1638164 1107847 449438 81135
36346 81135 435379 1365859 2278018 2666985 2293439 1141017 -411787 -1588948 -1825129
36337 -1825129 -1345631 -862872 -778856 -943191 -1058968 -978576 -664893 -237103 -76736 -517010
36327 -517010 -1309791 -1730379 -1412143 -814520 -606343 -805138 -897257 -717493 -744224 -1364293
36317a364293q41346k95295N65884J054661R24984L51515l03249n48707j16942
36308e72788M95271M14482l28098o03827J48263Q46480L06464q10684r04164P1175
36298i37426N60637q6951o73201j89592O54469P42516J95305k22740l64693m12344
36288g34020j64722M15455O80760K73967r5604J79627M36152j22376q48574n72998
36278e52333M23629Q22501L40990r9655j53929m52392j078285j134770k72454
36269b156698N98673O71568L00220J67311K85292L59685L85021L75333J48102
36260A134507k12356k95731j05385j88541o69258q48758k44025N65516O63568
36251b00463j8523o80184n81798K37397R81308Q39310l5203n32807m1060N39257
$$ plain form
36317 -1364293 -2205639 -2500934 -1935050 -880389 44595 396110 92861 -455846 -572788
36308 -572788 -77517 336965 8867 -594960 -446697 399783 706247 -104437 -1008601 -937426
36298 -937426 -376789 -463740 -1136941 -1326533 -672064 70452 265757 43017 -321676 -734020
36288 -734020 -898742 -483287 197473 471440 375836 555463 991615 869239 20665 -552333
36278 -552333 -128704 693797 1034787 935132 781203 328811 -749474 -1884244 -2156698
36269 -2156698 -1558025 -886457 -586237 -418926 -133634 226051 611072 986405 1134507
36260 1134507 922151 626420 521035 332494 -336764 -1185522 -1429547 -864031 -200463
36251 -200463 -218986 -899170 -1480968 -1243571 -262263 577047 541844 9037 -32023 507234
36241E07234P5031r00808q29986M12449J162789M20161p35877q44343o554O84630
36231e5274P18631L30569j76273n19028m35183j37377j38021k81846J40981R49414
36221C96593R39175j74259r92471n38759J87547k4741n37543j28037P17383O21146
36211D66034k26331l79877L49501O22839q1818o34825j99680M82601L81847l72333
36201D07958r41974q67131k58214M38632O18724P7925n31260m49346Q5741K79614
36191a139331J26989K71249O41258M88511j13064j46549O04803R80516K05634
36182A920016q83560j102070n05499K1635N4770j73163l08463p9760N40059J031313
36172E15278P66704j3145l89724j37999J747k92590l50552J83275N72347K19628
$$ plain form
36241 507234 582265 -318543 -1148529 -736080 426709 846870 110993 -733350 -739904 -55274
36231 -55274 663357 993926 817653 298625 -136558 -273935 -411956 -693802 -552821 396593
36221 396593 1335768 1161509 169038 -369721 -182174 -206915 -744458 -872495 -155112 466034
36211 466034 239703 -140174 209327 832166 750348 115523 -84157 398444 780291 407958
36201 407958 -534016 -1401147 -1659361 -1220729 -602005 -524080 -1055340 -1504686 -1418945 -1139331
36191 -1139331 -1012342 -741093 -99835 388676 275612 129063 733866 1714382 1920016
36182 1920016 1036456 -65614 -571113 -549478 -494708 -667871 -976334 -1056094 -516035 515278
36172 515278 1281982 1268837 879113 741114 742861 450271 99719 282994 855341 1074969
36162A074969l40030m61322m21004n72805m69147J59575N01332q3600p50371m11108
36152a773511M50516O29070K33185K79127O75514L55855o77909j177607p00953
36143a706713k15365k76466j65361N49324J024324N54518k16627m22680l10793
36134a185839m71782n87478m6856P78581R77953M86470M6216j8855q5971l58838
36124d66399n19507l31192K7032L09416M15682K57495j24819l37989k0657N22213
36114b68725N61236p1818o84016n98178K5634N00306N01552L26389L03794K60773
36104H56947j68744p74942p44244K62723J322529J182103o6791j008812p85545
36095G5224j06026O4957q5304O2479K34401j69008o91938l80799M79639O51796
$$ plain form
36162 1074969 734939 273617 -147387 -720192 -1189339 -1029764 -528432 -612032 -1362403 -1773511
36152 -1773511 -1322995 -693925 -460740 -181613 493901 849756 171847 -1005760 -1706713
36143 -1706713 -1922078 -2198544 -2363905 -1814581 -790257 -235739 -452366 -875046 -1185839
36134 -1185839 -1657621 -2245099 -2291955 -1513374 -535421 -48951 -2735 -21590 -107561 -466399
36124 -466399 -985906 -1317098 -1290066 -980650 -564968 -307473 -432292 -770281 -790938 -268725
36114 -268725 292511 220693 -463323 -1061501 -1035867 -535561 -34009 292380 596174 856947
36104 856947 688203 -86739 -830983 -568260 754269 1936372 1869581 860769 75224
36095 75224 -30802 34155 -51149 11330 245731 76723 -615215 -996014 -516375 135421
36085A35421L1163j19662N95129Q80330l3695r24684n66278J88612p0273p82100
36075f66037l81547Q34838J008131j87230r48504k82096N32188K82318k33081
36066d1020J26491P55022M37447n01502q01686l07181J40695L27646O53811Q58334
36056A648057L25068m84543m61696K49492L38682m51775p84915M4190Q36437L46186
36046A605183p89265j085551l52588L29430K84535j38864l92505l29083m9825
36037i18533K42036K83196M1887j72886j69917j51996k49894j88892J94518N20108
36027e70373M15288J35050J40866L76693M52462K70623Q976k49366m31825l14483
36017B33911J13976M19383K82994j6245r1871m6240j28104k17809j62725j78581
$$ plain form
36085 135421 166584 46922 642051 1522381 1488686 564002 -2276 186336 116063 -666037
36075 -666037 -1047584 -212746 795385 608155 -340349 -622445 -90257 192061 -41020
36066 -41020 85471 840493 1277940 776438 -25248 -332429 -191734 135912 789723 1648057
36056 1648057 1973125 1488582 1026886 1276378 1615060 1163285 378370 422560 1258997 1605183
36046 1605183 815918 -269633 -622221 -292791 -8256 -147120 -539625 -868708 -918533
36037 -918533 -676497 -393301 -351414 -524300 -694217 -846213 -1096107 -1284999 -1090481 -570373
36027 -570373 -155085 -20035 120831 497524 949986 1220609 1229585 980219 548394 233911
36017 233911 347887 767270 1050264 1034019 942148 895908 767804 549995 387270 208689
36007B08689l56854k68401K87440O66291K99244k77444k29692J99180J72912k58620
35997D42745l49405p4054p6001l19887j59232K31260l4845p84120o70783O32909
35987a161413J618097J100242j34441p82998q82672j065876j048445k54420P85674
35978a826252J063068O66636M61294N54514L40831j69034l26061p3910k2395k62974
35968D05717k16261K30099M69179K36790k5003o1654j62823m15698m67327k50465
35958b57446j12559m8383K93807O66044L27245n85025r07302j95400M78803J75957
35948a64259n00400n14599Q572L16118L59079M84647M64028N729l31487P236L27396
35937D62060k78511j063089m93715J104922J650561M01274q90715o95158J38438
$$ plain form
36007 208689 -148165 -416566 -129126 537165 836409 558965 329273 528453 701365 442745
35997 442745 93340 19286 -56715 -376602 -535834 -304574 -339419 -1123539 -1794322 -1161413
35987 -1161413 456684 1556926 1422485 639487 -243185 -1309061 -2357506 -2611926 -1826252
35978 -1826252 -763184 -96548 364746 919260 1260091 1091057 764996 691086 668691 405717
35968 405717 189456 419555 888734 1125524 1100521 1038867 876044 460346 -6981 -257446
35958 -257446 -370005 -418388 -124581 541463 868708 283683 -623619 -819019 -340216 -164259
35948 -164259 -664659 -1179258 -1170686 -854568 -495489 -10842 453186 458915 127428 134664 462060
35937 462060 183549 -879540 -1373255 -268333 1382228 1783502 892787 197629 336067
35928C36067J14752m74160l92703K85678M81455J06026P5487N22422N61026p9718
35918A536332o00596n66586n09866p04792n55543J86152O44426O1103r45791j182512
35908b637673m23546N58928J089627J044906N57379o9803l59861j33318J64273
35899b09088L9585l37819m10749j6171M95221P27077N12672j7207l75709j17439
35889B90373M19851L28958m94891r12706j65316Q08571P05201j18921l02763K06849
35879G65206J32066p70267j057845N4985J248607J032785o8909n27243j30881
35870F78504R9541j90555l38788j05363j00115n22371o08317J61836J112562J212416
35860A399350L84042n19631p68947m10557r272K4577j27535N3902O45033R90196
$$ plain form
35928 336067 450819 -23341 -416044 -130366 351089 457115 532602 1055024 1616050 1536332
35918 1536332 935736 369150 -140716 -845508 -1401051 -1214899 -570473 -509370 -1455161 -2637673
35908 -2637673 -3061219 -2502291 -1412664 -367758 189621 119818 -240043 -373361 -209088
35899 -209088 -169503 -507322 -918071 -934242 -439021 288056 800728 783521 407812 290373
35889 290373 710224 1039182 544291 -368415 -533731 274840 980041 861120 558357 765206
35879 765206 897272 127005 -930840 -875855 372752 1405537 1336628 809385 678504
35870 678504 778045 587490 248702 143339 43224 -479147 -1087464 -925628 186934 1399350
35860 1399350 1783392 1263761 494814 84257 74985 99562 -27973 25929 670962 1661158
35850A661158N36330k94841o32838m06231l30870o35707o76035j23224L25742
35841e76516L7564m43937j81833O76968J074935N37206k94708o29082l63936R8912
35831f4427L14293K4259n44968o48608R1952Q31049L81414r33170j368157j86684
35821b103047J077519P15199o55643r91353J89748J206673P32744m53150q11668
35812a092978j04379O88513Q34040L95857k86750q83552j003174m95081K01132
35803a746372M76275K75697K2937n9038j06465j57928j2229L73288O87692N93474
35793C47331P0734n73867q96124o08715J04641O59885O59945L06993N8697O4268
35783A93788J63215K08424J04138k25909n74472m49371K30037P35552L99830l45184
$$ plain form
35850 1661158 2197488 1902647 1269809 863578 532708 -102999 -779034 -902258 -576516
35841 -576516 -538952 -982889 -1164722 -487754 587181 1124387 829679 200597 -163339 -64427
35831 -64427 249866 274125 -270843 -919451 -827499 3550 384964 -548206 -1916363 -2103047
35821 -2103047 -1025528 -310329 -965972 -1957325 -1767577 -560904 171840 -281310 -1092978
35812 -1092978 -1197357 -508844 325196 721053 434303 -449249 -1452423 -1947504 -1746372
35803 -1746372 -1270097 -994400 -971463 -1030501 -1136966 -1294894 -1307123 -933835 -246143 347331
35793 347331 418065 -155802 -1051926 -1660641 -1556000 -896115 -236170 70823 129520 193788
35783 193788 357003 565427 669565 443656 -130816 -580187 -350150 385402 785232 440048
35773D40048m81341J40781O00332K42707m72064o94164k32693L71250M60605j63830
35763B11631r59471r85814K6357J094819J102821L45834R2814O22843Q17867L8581
35753B408282p66499n61125J38910J32574o00438r90008n17170K46944O56157
35744A47627O67159M50183N7848l55989n23541m23035k82562j83999p023K39720
35734b13612L79819L76102L89712N16919O52070N70149P7460p05971j169737p58432
35724A14479J29288L74226l48778r39949l93896O53690Q09557l3585o17832k20147
35714d72947M42157M63245J6530j04669L61057R32362J028875N00548l09005q46874
35704B011279q14442l97565K4508K45997J86972j99025o77799p41187k53412K53707
$$ plain form
35773 440048 -41293 99488 699820 942527 470463 -223701 -456394 -85144 375461 211631
35763 211631 -747840 -1733654 -1707297 -612478 490343 836177 928991 1551834 2369701 2408282
35753 2408282 1641783 1080658 1219568 1352142 751704 -238304 -755474 -508530 147627
35744 147627 814786 1264969 1322817 966828 443287 20252 -262310 -446309 -453332 -213612
35734 -213612 166207 542309 932021 1448940 2101010 2671159 2748619 2042648 872911 114479
35724 114479 243767 617993 269215 -670734 -1064630 -410940 398617 365032 -252800 -472947
35714 -472947 -30790 432455 448985 344316 705373 1637735 2666610 3167158 2858153 2011279
35704 2011279 1196837 799272 823780 1069777 1256749 1057724 379925 -361262 -614674 -360967
35694c60967L44373K90058M03816L36119k16467o72788m17960L132k78177q25311
35684a394172n10605M59728P52591J97822J05348Q78336J124560K287j204878
35675D11017j050493q2111L30195J73888K88979N77285L38652j81232j58106K55820
35665I03894K35396j22608j0212M25438J86582p18235j060539l67202L11470J25304
35655i0712l64746l65701j13072j39361k00674J61945O44207O33399K04037q7179
35645B82143o2837N8917J96063L46647K73362j71988o18974o10658k83750j07813
35635f98888j17091N4020M53211O65235M30559r037k64797j99938O6443L00831
35625F80548K92207P3849k7216J91779M02490Q3342p09256j246906r59520j17686
$$ plain form
35694 -360967 -16594 273464 677280 1013399 796932 124144 -293816 -290684 -568861 -1394172
35684 -1394172 -1904777 -1445049 -692458 -494636 -389288 489048 1613608 1615895 411017
35675 411017 -639476 -721587 -391392 -217504 71475 648760 987412 806180 648074 903894
35665 903894 1139290 1016682 1006470 1431908 1618490 900255 -160284 -527486 -216016 -90712
35655 -90712 -455458 -821159 -934231 -1073592 -1274266 -1112321 -468114 165285 369322 282143
35645 282143 219306 278223 474286 820933 1094295 922307 303333 -307325 -591075 -698888
35635 -698888 -815979 -761959 -308748 356487 787046 778009 513212 313274 379717 680548
35625 680548 972755 1046604 1019388 1211167 1613657 1696999 987743 -259163 -1218683 -1336369
35615a336369N10664N29130K18639M9531J44226K96628L12681J30618k76657q13000
35605b33909j058670n43465N46467J258244Q66354k04311q84053p58572l40519
35596a352434r6576J13734M27315M85265K7619m96036m81820n1298J82993M8199
35586a193039o3123O9918J96108J03216l6778J8222K59024N34827P02966O02429
35576A193770J68986l65240o79107p91059r25442r35667l72504O69729J298635
35567g37899Q46908j87302p07981l47259K44213L56247J1646k67504j45835K08751
35557g26015L36904j4153n14970n11676J57378Q12759P26794O9169l89866l61529
$$ plain form
35615 -1336369 -825705 -296575 -77936 -28405 115821 412449 725130 855748 579091 -233909
35605 -233909 -1292579 -1836044 -1289577 -31333 835021 630710 -253343 -1011915 -1352434
35596 -1352434 -1449010 -1335276 -907961 -422696 -395077 -891113 -1372933 -1424231 -1241238 -1193039
35586 -1193039 -1256162 -1186244 -990136 -886920 -923698 -905476 -646452 -111625 591341 1193770
35576 1193770 1362756 997516 318409 -472650 -1398092 -2333759 -2706263 -2036534 -737899
35567 -737899 109009 -78293 -786274 -1133533 -889320 -533073 -521427 -788931 -934766 -726015
35557 -726015 -389111 -403264 -918234 -1429910 -1272532 -459773 267021 336190 -53676 -415205
$$ [...]
##END NTUPLES=NMR SPECTRUM
##END=
