##TITLE=31Pdec_ANY-167A-k
 CDCl3, 24 sc
 11.4.2019
##JCAMPDX= 6.0         $$ Bruker NMR JCAMP-DX V2.0
##DATA TYPE= NMR SPECTRUM
##DATA CLASS= NTUPLES
##ORIGIN= UXNMR, Bruker Analytische Messtechnik GmbH
##OWNER= root
$$ XWIN-NMR		Version 3.5
$$ Thu Apr 11 15:56:19 2019 Russian Standard Time (UT+4h)  she@DPX200
##.OBSERVE FREQUENCY= 81.013821
##.OBSERVE NUCLEUS= ^31P
##.ACQUISITION MODE= SIMULTANEOUS
##.ACQUISITION SCHEME= undefined
##.AVERAGES= 24
##.DIGITISER RES= 17
##SPECTROMETER/DATA SYSTEM= spect
##.PULSE SEQUENCE= zgpg30
##.SOLVENT NAME= CDCl3
##.SHIFT REFERENCE= (INTERNAL, CDCl3, 0, 182.463)
##AUDIT TRAIL= $$ (NUMBER, WHEN, WHO, WHERE, WHAT)
$$ ##TITLE= Audit trail, XWIN-NMR		Version 3.5
$$ ##JCAMPDX= 5.01
$$ ##ORIGIN= Bruker BioSpin GmbH
$$ ##OWNER= she
$$ F:/spectra/data/she/nmr/P31/1/pdata/1/auditp.txt
$$ ##AUDIT TRAIL=  $$ (NUMBER, WHEN, WHO, WHERE, WHAT)
(   1,<2019-04-11 15:55:02.35 +0400>,<she>,<DPX200>,
      <created by zg, POWCHK disabled, PULCHK disabled
       configuration hash MD5:
       00 E9 B6 7A A2 85 ED C7 34 08 36 98 17 FE 4E 26
       data hash MD5: 32K
       88 DA 18 2E EE A2 22 93 13 35 3C B1 65 3C C4 62>)
(   2,<2019-04-11 15:55:06.37 +0400>,<she>,<DPX200>,
      <Start of raw data processing
       efp BC_mod = 2 LB = 1 FT_mod = 6 PKNL = 1 PHC0 = -1850.231 PHC1 = 180.599 SI = 64K 
       data hash MD5: 64K
       E0 EC 67 49 6C 13 FB 76 5A 07 F0 49 CD B6 CF A1>)
(   3,<2019-04-11 15:55:21.78 +0400>,<she>,<DPX200>,
      <abs ABSG = 5 
       data hash MD5: 64K
       C4 DD 41 F3 27 D6 60 30 95 59 F6 CB 98 1C D6 0B>)
(   4,<2019-04-11 15:55:43.62 +0400>,<she>,<DPX200>,
      <pk PHC0 = 3.020372 PHC1 = 0 
       data hash MD5: 64K
       56 16 AC 2B C9 18 98 C2 4E 03 EC 17 42 8E B9 54>)
$$ ##END=
$$ 
$$ hash MD5
$$ 85 BE 89 AE E6 A2 4F DA 97 07 5C 03 1E 64 91 6B
##$RELAX= 
##$RELAX= 
##$RELAX= 
##$RELAX= 
##$RELAX= 
##$RELAX= 
##$RELAX= 
##$RELAX= 
$$ Bruker specific parameters
$$ --------------------------
##$DU= <F:/spectra>
##$EXPNO= 1
##$NAME= <P31>
##$PROCNO= 1
##$TYPE= <nmr>
##$USER= <she>
##$AMP= (0..31)
100 100 100 100 100 100 100 100 100 100 100 100 100 100 100 100 100 100 
100 100 100 100 100 100 100 100 100 100 100 100 100 100 
##$AQSEQ= 0
##$AQ_mod= 1
##$AUNM= <au_zg>
##$AUTOPOS= <>
##$BF1= 81.014009
##$BF2= 200.13
##$BF3= 200.13
##$BF4= 200.13
##$BF5= 200.13
##$BF6= 200.13
##$BF7= 200.13
##$BF8= 200.13
##$BYTORDA= 1
##$CFDGTYP= 0
##$CFRGTYP= 5
##$CHEMSTR= <none>
##$CNST= (0..31)
1 1 145 1 1 1 1 1 1 1 1 1 1 1 1 1 1 1 1 1 1 1 1 1 1 1 1 1 1 1 1 1 
##$CPDPRG= <waltz16>
##$CPDPRG1= <>
##$CPDPRG2= <waltz16>
##$CPDPRG3= <>
##$CPDPRG4= <mlev>
##$CPDPRG5= <mlev>
##$CPDPRG6= <mlev>
##$CPDPRG7= <mlev>
##$CPDPRG8= <mlev>
##$CPDPRGB= <>
##$CPDPRGT= <>
##$D= (0..31)
0 1 0 0 0 0 0 0 0 0 0 0.03 2e-05 3e-06 0 0 0 0 0 0 0 0 0 0 0 0 0 0 0 0 
0 0 
##$DATE= 1554983701
##$DBL= (0..7)
120 120 120 11 120 120 24 19 
##$DBP= (0..7)
150 150 150 150 150 150 150 150 
##$DBP07= 0
##$DBPNAM0= <>
##$DBPNAM1= <>
##$DBPNAM2= <>
$$ [...]
##$SUBNAM3= <"">
##$SUBNAM4= <"">
##$SUBNAM5= <"">
##$SUBNAM6= <"">
##$SUBNAM7= <"">
##$SUBNAM8= <"">
##$SUBNAM9= <"">
##$SW= 369.568048894756
##$SWIBOX= (0..15)
0 1 3 0 0 0 0 0 0 0 0 0 0 0 0 0 
##$SW_h= 29940.119760479
##$TD= 32768
##$TD0= 1
##$TE= 0
##$TE2= 300
##$TE3= 300
##$TEG= 300
##$TL= (0..7)
0 120 53 12 22 120 120 120 
##$TP= (0..7)
150 150 150 150 150 150 150 150 
##$TP07= 0
##$TPNAME0= <>
##$TPNAME1= <>
##$TPNAME2= <>
##$TPNAME3= <>
##$TPNAME4= <>
##$TPNAME5= <>
##$TPNAME6= <>
##$TPNAME7= <>
##$TPOAL= (0..7)
0.5 0.5 0.5 0.5 0.5 0.5 0.5 0.5 
##$TPOFFS= (0..7)
0 0 0 0 0 0 0 0 
##$TUNHIN= 0
##$TUNHOUT= 0
##$TUNXOUT= 0
##$USERA1= <user>
##$USERA2= <user>
##$USERA3= <user>
##$USERA4= <user>
##$USERA5= <user>
##$V9= 5
##$VALIST= <valist>
##$VCLIST= <CCCCCCCCCCCCCCC>
##$VD= 0
##$VDLIST= <DDDDDDDDDDDDDDD>
##$VPLIST= <PPPPPPPPPPPPPPP>
##$VTLIST= <TTTTTTTTTTTTTTT>
##$WBST= 1024
##$WBSW= 4
##$XGAIN= (0..3)
0 0 0 0 
##$XL= 0
##$YL= 0
##$YMAX_a= 11010
##$YMIN_a= -12765
##$ZGOPTNS= <>
##$ZL1= 120
##$ZL2= 120
##$ZL3= 120
##$ZL4= 120
##$ABSF1= 182.463
##$ABSF2= -187.1042
##$ABSG= 5
##$ABSL= 3
##$ALPHA= 0
##$AQORDER= 0
##$ASSFAC= 0
##$ASSFACI= 0
##$ASSFACX= 0
##$ASSWID= 0
##$AUNMP= <proc_1d>
##$AZFE= 0.1
##$AZFW= 0.5
##$BCFW= 0
##$BC_mod= 2
##$BYTORDP= 0
##$COROFFS= 0
##$CY= -3
##$DATMOD= 1
##$DC= 0
##$DFILT= <>
##$DTYPP= 0
##$F1P= 0
##$F2P= 0
##$FCOR= 1
##$FTSIZE= 65536
##$FT_mod= 6
##$GAMMA= 0
##$GB= 0
##$INTBC= 1
##$INTSCL= 5.30512e-09
##$ISEN= 30
##$LB= 1
##$LEV0= 0
##$LPBIN= 0
##$MAXI= 10000
##$MC2= 0
##$MEAN= 0
##$ME_mod= 0
##$MI= 50
##$NCOEF= 0
##$NC_proc= -5
##$NLEV= 6
##$NOISF1= 182.463
##$NOISF2= 159.3651
##$NSP= 0
##$NTH_PI= 0
##$NZP= 0
##$OFFSET= 182.463
##$PC= 4
##$PHC0= -1847.211
##$PHC1= 180.599
##$PH_mod= 1
##$PKNL= yes
##$PPARMOD= 0
##$PSCAL= 0
##$PSIGN= 0
##$REVERSE= no
##$SF= 81.0140089999434
##$SI= 65536
##$SIGF1= 159.3651
##$SIGF2= -187.1042
##$SINO= 113.3802
##$SIOLD= 16384
##$SREGLST= <1H.CDCl3>
##$SSB= 0
##$STSI= 65536
##$STSR= 0
##$SW_p= 29940.119760479
##$SYMM= 0
##$S_DEV= 0
##$TDeff= 32768
##$TDoff= 0
##$TI= <>
##$TILT= no
##$TM1= 0
##$TM2= 0
##$TOPLEV= 0
##$USERP1= <user>
##$USERP2= <user>
##$USERP3= <user>
##$USERP4= <user>
##$USERP5= <user>
##$WDW= 1
##$XDIM= 65536
##$YMAX_p= 521896501
##$YMIN_p= -11757146
$$ End of Bruker specific parameters
$$ ---------------------------------
##NTUPLES= NMR SPECTRUM
##VAR_NAME=  FREQUENCY,     SPECTRUM/REAL,   SPECTRUM/IMAG
##SYMBOL=    X,             R,               I
##VAR_TYPE=  INDEPENDENT,   DEPENDENT,       DEPENDENT
##VAR_FORM=  AFFN,          ASDF,            ASDF
##VAR_DIM=   65536,         65536,           65536
##UNITS=     HZ,            ARBITRARY UNITS, ARBITRARY UNITS
##FACTOR=    0.456856943014862, 1,           1
##FIRST=     14782.0589164792, 0,            0
##LAST=      -15158.0608439998, 0,           0
##MIN=       -15158.0608439998, -11757146,   0
##MAX=       14782.0589164792, 521896501,    0
$$ Real data points
##PAGE= N=1
##DATA TABLE= (X++(R..R)), XYDATA
$$ [...]
41311a140945n98053J82265N16337L37011M41695Q54722P61551N0286m09069j98261
41301G97539J12942J17462J48869L57666K74822k12729m30843o6996J47052l71246
41291H74538r82301q14244j63362R2394o139K92783R69583J127994M70719j63460
41281A698505p1967L39590L04057k23688p11455q40726p26258o19826o55843o58483
41271b166094j70894Q93926J672371J148515l20600j153520o00848K70647K60172
41262a66325k63170k81913Q5872l283m44230l30001L99374Q13164N39400J87909
41252E36797Q6177j35690m49022k33217L97316L98627m42074q42726K2651J093883
41242D32722R96328K2826o30912p28845p78071o66930J2658P16429N05154l26225
$$ plain form
41311 -1140945 -1738998 -1556733 -1040396 -703385 -261690 593032 1354583 1404869 995800 797539
41301 797539 910481 1027943 1176812 1534478 1809300 1596571 1165728 1098732 1245784 874538
41291 874538 -107763 -922007 -1085369 -992975 -999114 -706331 263252 1391246 1861965 1698505
41281 1698505 1626538 1966128 2270185 2046497 1335042 494316 -231942 -851768 -1507611 -2166094
41271 -2166094 -2336988 -1443062 229309 1377824 1057224 -96296 -697144 -426497 -166325
41262 -166325 -429495 -711408 -625536 -628819 -1073049 -1403050 -1003676 -190512 348888 536797
41252 536797 622974 487284 38262 -194955 202361 600988 158914 -683812 -661161 432722
41242 432722 1429050 1451876 820964 92119 -685952 -1352882 -1340224 -623795 -118641 -444866
41232d44866n67979j627L60903K8613l04936j03959K41381L65569N10031P08034
41222G91164M63579k24197n31841j15755K32080n6776k84652K60494Q56247L47995
41212A738338r07290j389013n83059L93176N13667J40679J38655M91415M86190
41203A022758j26710q24522j066992q34752l60445K18238P11115P46034K02959
41194c12317l85327l54233J65233L64245n6881m15748j20290L78321L10664j98658
41184f24991m19273k17323r3660j47148O5893N73819Q03247N47483K60861J42166
41174H91074j65290o03064m21390N20106J111420N01625n20199o71457j15163
41165E27662n9444p18391r72681j88391P87395R06071L27927n5346N8901K02536
$$ plain form
41232 -444866 -1012845 -1014472 -653569 -624956 -929892 -1033851 -792470 -426901 83130 791164
41222 791164 1254743 1030546 498705 382950 615030 558254 273602 534096 1390343 1738338
41212 1738338 831048 -557965 -1141024 -747848 -234181 -93502 45153 536568 1022758
41203 1022758 896048 71526 -995466 -1830218 -2190663 -1972425 -1261310 -515276 -312317
41194 -312317 -697644 -1051877 -886644 -522399 -579280 -995028 -1115318 -736997 -426333 -624991
41184 -624991 -1044264 -1261587 -1355247 -1502395 -1436502 -862683 -59436 488047 748908 891074
41174 891074 725784 122720 -298670 221436 1332856 1834481 1314282 642825 527662
41165 527662 468218 -250173 -1222854 -1411245 -623850 282221 610148 554802 613703 816239
41155H16239J9391k57547k36968P3799K70580J1643n71844r34803o46671J35743
41145a320438P96509Q55163L52793l15641p89541r06536o32843l7407O08147Q63665
41135e26129M89825j86909n17870k76058Q3629J15413K2828K03681M35652J68598
41125A2660m31468m99330K39606R00837O14964k70358p31707m54528o0344j04562
41115g84230m14552m63594j4014O95205J170645J038032L57187l99877p36862
41106D47940m96260P4402M66943K59412l82310o79166j30957O98428Q51538L17568
41096A427538o6567l6835k14104p55819q43339j10103N20838L00403n2495L54759
41086E24276Q82382L64795p74288j011345r5271O61118N00213Q4186j2001j52082
$$ plain form
41155 816239 835630 578083 341115 414914 685494 697137 125293 -809510 -1456181 -1320438
41145 -1320438 -523929 331234 684027 368386 -421155 -1327691 -1960534 -1997941 -1389794 -526129
41135 -526129 -36304 -223213 -741083 -1017141 -933512 -818099 -795271 -591590 -155938 12660
41125 12660 -418808 -918138 -678532 222305 837269 566911 -164796 -619324 -679668 -784230
41115 -784230 -1198782 -1662376 -1676390 -981185 189460 1227492 1584679 1184802 447940
41106 447940 -48320 26082 493025 752437 370127 -309039 -439996 258432 1109970 1427538
41096 1427538 1360971 1324136 1110032 354213 -489126 -599229 -78391 222012 169517 524276
41086 524276 1406658 1771453 997165 -14180 -109451 551667 1051880 1136066 1124065 971983
41076I71983m82664l62977L05069M63277m42504j293235q92324J77690N39411
41067a016274J65531J34032O28268P03631R8640j83476L99819Q33594L4824j360526
41057D38063j748109p59390L27020M42858L9798Q6448N22967N55674J21707K2496
41047D9532N00104O95185K4549p49375o13770J46985M58700J20553j15231L3790
41037E51022K7746l19699m30089m8275K73567K10812K05011M26034K04335p16028
41027C84436j279108n20615Q02881J165724M38132j34942N2218K57230j39336
41018A026620o37946n83223k09520q0475j19873J04508N15144O22397L33723P6093
41008A047448R8076J33930r9541m50498o20702o39501o96285o24363k8404R39596
$$ plain form
41076 971983 489319 126342 431411 894688 452184 -841051 -1733375 -1555685 -1016274
41067 -1016274 -850743 -716711 -88443 615188 713828 530352 930171 1763765 1798589 438063
41057 438063 -1310046 -2069436 -1742416 -1299558 -1259760 -1173312 -650345 -94671 27036 49532
41047 49532 549636 1244821 1269370 519995 -93775 53210 511910 632463 517232 551022
41037 551022 578768 259069 -171020 -219295 54272 265084 470095 896129 1100464 384436
41027 384436 -894672 -1415287 -612406 553318 991450 856508 908726 1165956 1026620
41018 1026620 388674 -194549 -404069 -484544 -604417 -499909 15235 637632 971355 1047448
41008 1047448 1145524 1279454 1179913 729415 108713 -530788 -1227073 -1851436 -1879840 -940244
40998i40244J407211Q01460k59345o49148j77131K90886J79616n6133J67155N80331
40988A344658N15383p6757o25742p36752n08641j98090L2178J07340O5918J7463
40978f3042l8908j31195k1788N22626J036369O19970p06427j631350j157775N9642
40968a511878P35249O85205N86492N47244J25290m84466n44185n6408K05784K6400
40958C14727l8398J18422m6944m74600l61954L04905M51340k26749n22116K45337
40948b36030Q51649J32441r00155n79695O39500Q54677k33129r40810l71714L47133
40938d36133J41706l57508j35653N18412O91909L14432o0870k76196m43114l49139
40928c92154J06574L48563q5256n74166k21966O24591P47848p6603o88724k73755
$$ plain form
40998 -940244 466967 1268427 1009082 359934 182803 473689 653305 597172 764327 1344658
40988 1344658 1860041 1783284 1157542 420790 -87851 -285941 -253763 -146423 -80505 -63042
40978 -63042 -101950 -233145 -254933 267693 1304062 1924032 1217605 -413745 -1571520 -1511878
40968 -1511878 -776629 -91424 495068 1042312 1167602 683136 138951 82543 288327 314727
40958 314727 276329 394751 347807 -126793 -488747 -183842 267498 40749 -481367 -236030
40948 -236030 615619 748060 -152095 -731790 -92290 762387 529258 -411552 -783266 -436133
40938 -436133 -294427 -651935 -787588 -269176 422733 737165 676295 400099 -43015 -392154
40928 -392154 -285580 62983 -22273 -596439 -818405 -193814 554034 477431 -211293 -485048
40918d85048N10025O32095J17885k89254l25072k98000k92429n9402L26938L80992
40908B18730m9496m50309l28339J01226K30691j16029m82275l68185K03461P50248
40898b90277Q33019M61204O1513L5784K97404L18954k27791r44747j065595m06040
40888i26572L14064L31711j59801k40571M98099J326204J210951O0849j148971
40879A265963j422055o66512L99873R95710Q22525R5726p00436j086640q43286
40870a139132j84325L47935L50675K6982L4690O67962J303889J021969j67969
40861B262676j134932r46669l8031M01274N587m10383j25704M85892N82223M9307
40851A131240m24676l09951J73583M38995K06522k60892m30473k3559O02671P10414
$$ plain form
40918 -485048 24977 657072 774957 485703 160631 -137369 -429798 -489200 -162262 218730
40908 218730 169234 -281075 -609414 -508188 -277497 -393526 -875801 -1243986 -1040525 -290277
40898 -290277 542742 1003946 1065459 1101243 1398647 1717601 1489810 545063 -520532 -926572
40888 -926572 -612508 -280797 -440598 -681169 -183070 1143134 2354085 2414934 1265963
40879 1265963 -156092 -822604 -422731 572979 1395504 1491230 790794 -295846 -1139132
40870 -1139132 -1323457 -975522 -624847 -597865 -563175 104787 1408676 2430645 2262676
40861 2262676 1127744 181075 143044 544318 549905 139522 13818 499710 1081933 1131240
40851 1131240 706564 396613 570196 1009191 1215713 954821 524348 500789 1103460 1813874
40841A813874L5133p36645o81308J77583P85119L24610p34945j173091m82035
40832f71705N43782P82651J08309n50318m56167L338m3491o05743p37160N1312
40822a575192R20988P98046p5378m67914O4064O06854L53801j87295q0880N02724
40812H59818N13672l65391j204172j137385m80185o3249L2060L67709R56220R93295
40802D72392P5107r37901q78348J73719R48909N96577l84466r93779r15103m99326
40792b342219p4530K04158J65012j45915k64611J04103N14748M05471O7439K08409
40782a157935O76399N99065q5554l29033L35500Q45714J73286r84267j154157
40773a080982k51772L97472R7757l20655O0892Q55165J003157K62844n69584p57816
$$ plain form
40841 1813874 1849007 1112362 431054 608637 1393756 1718366 983421 -189670 -671705
40832 -671705 -127923 654728 763037 212719 -243448 -240110 -283601 -889344 -1626504 -1575192
40822 -1575192 -654204 143842 68464 -399450 -335386 271468 625269 437974 357094 859818
40812 859818 1373490 1008099 -196073 -1333458 -1813643 -1876892 -1844832 -1477123 -520903 472392
40802 472392 547499 -390402 -1268750 -1095031 -146122 450455 65989 -927790 -1842893 -2342219
40792 -2342219 -2416749 -2212591 -2047579 -2193494 -2458105 -2354002 -1839254 -1433783 -1366344 -1157935
40782 -1157935 -481536 117529 31975 -297058 38442 884156 1057442 73175 -1080982
40773 -1080982 -1332754 -935282 -837525 -1158180 -1097288 -242123 761034 1023878 454294 -303522
40763c03522m47656k93155n18499o14492p0196P76724R98447K60075o79188r15288
40753a806750m66203q371J02678M7524M0874J69382N45249J050474J095450K84781
40743A055088p71252j030797m18070J07146o606k02837J18310O04359N76524J13548
40733A45413j24191J21750M47691M13897N2245k27075o0456M47870O96533K27391
40723B141068n88632r00215m94637p7024k31123o29716o22623j33191M54853Q80488
40713b00752R94725N55223l80488j105673r16840k6057O78123P05793L39433J7726
40703F61213j36076j40397J0047J93336J93772L3834O048K34335M25072K37451
40693A718635k12563m22872j38483K26400N0038n73657p71044q9579O41596L45312
$$ plain form
40763 -303522 -751178 -1044333 -1562832 -2177324 -2247520 -1470796 -472349 -212274 -891462 -1806750
40753 -1806750 -2272953 -2281324 -2178646 -2131122 -2090248 -1920866 -1375617 -325143 770307 1055088
40743 1055088 283836 -746961 -1165031 -1057885 -1064491 -1267328 -1149018 -544659 31865 145413
40733 145413 21222 142972 590663 1004560 1056805 829730 769274 1217144 1913677 2141068
40723 2141068 1552436 652221 157584 80560 -150563 -780279 -1402902 -1536093 -1081240 -200752
40713 -200752 793973 1349196 968708 -136965 -1053805 -1079862 -401739 304054 643487 661213
40703 661213 525137 384740 394787 588123 781895 815729 821777 1056112 1481184 1718635
40693 1718635 1506072 1083200 944717 1171117 1221155 647498 -123546 -213125 428471 773783
40683G73783o27083q18299K22389J214951R98995R1661l51417k31901j77499k33492
40673H62088m6691J32040j48685m57506o8753N69122L35067o04304q19542J18880
40663a28284Q84615M81866k89130k95454K05206L58890K35512L21368K39260o24613
40653A389236j597539j277291L10330J370988O00355j104522j778358p20029Q86835
40644a919995J499923Q70759K1876j73468L7634o4440m70532n31641j22530J24614
40634g27800o1117j12042K97794N52878J50416l27329j77460J45630k05983q91667
40624a356680p79324K56123J128392J157037P61948M07931j2616m27965l03940
40615H30906L53140O15414r0777j013428j041807j48022P31668Q78519L46973
$$ plain form
40683 773783 146700 -671599 -449210 765741 1764736 1856397 1504980 1273079 1095580 862088
40673 862088 815397 947437 798752 341246 272493 841615 1176682 572378 -247164 -128284
40663 -128284 756331 1238197 949067 653613 858819 1217709 1453221 1774589 2013849 1389236
40653 1389236 -208303 -1485594 -1175264 195724 796079 -308443 -2086801 -2806830 -1919995
40644 -1919995 -420072 450687 472563 299095 336729 272289 -198243 -729884 -852414 -727800
40634 -727800 -788917 -900959 -603165 -50287 100129 -227200 -404660 -259030 -465013 -1356680
40624 -1356680 -2136004 -1879881 -751489 405548 1167496 1575427 1562811 1134846 830906
40615 830906 1184046 1799460 1708683 695255 -346552 -494574 237094 1115613 1462586
40606A462586l53826p04877n29802j71159p6309j44659O1480M32463L48700k17055
40596A07542m77824r7137K02938j22162m64617j17624M77725N17474K29235L53663
40586F09213O81461L52821n62603j013689n56354R5954K70043R4150j33188l80263
40576e42455m36662L6072O98330P05789N9177j97262L62655P16889J5549r02429
40566E15653p14625K96403O47009p9676o65967j72382O85692O51768k98514j023297
40556a57936p61897L6524M58327K16349k49351m90394m78401l22069J2421M28482
40546a307945M91480k1425n41303k83735N83995R99901M19155m60696p17674l60147
40536a198394Q46J19194J60712J51533J6960m4724J83690M54479L65778L7221
$$ plain form
40606 1462586 1108760 403883 -125919 -297078 -373387 -518046 -456566 -24103 324597 107542
40596 107542 -370282 -467419 -264481 -386643 -851260 -968884 -491159 26315 255550 609213
40586 609213 1290674 1643495 1080892 67203 -489151 -393197 -123154 -29004 -162192 -542455
40576 -542455 -979117 -943045 -244715 461074 520251 322989 685644 1402533 1418082 515653
40566 515653 -198972 97431 744440 664764 -1203 -173585 512107 1163875 865361 -157936
40556 -157936 -919833 -883309 -424982 -208633 -457984 -948378 -1426779 -1748848 -1736427 -1307945
40546 -1307945 -816465 -837890 -1379193 -1662928 -1078933 -79032 340123 -120573 -838247 -1198394
40536 -1198394 -1197548 -1078354 -917642 -766109 -749149 -793873 -610183 -155704 210074 247295
40526B47295m9810J99282M04992L10069Q82l76555o59575n57392j0352M69612
40516b1552L77558j952k3895K47496J77478k75601m41623j26132K0261l49542
40506d17504o62168m40481r0468m3309R8755P43244J282017Q68367j72172p09310
40496D56971m05001Q203m249j70727j86296k04280k71352m5402N12997P96669
40486D87533L80946k79640m78280k16544l3133j32722k17800q7089Q1090Q1330
40476d14309l8633j34407j60945j42110j13830j30578j87377j43324J11738M19530
40466i34245M78287K46445K6873N5482J80755J05237j73621l58880k62976m3748
40456f80391K0908j11985j96374J9839M70497P37765M29668l34201r17793q06523
$$ plain form
40526 247295 197485 396767 801759 1111828 1112710 736155 76580 -480812 -491164 -21552
40516 -21552 356006 354054 330159 577655 755133 479532 37909 -88223 -67962 -417504
40506 -417504 -1079672 -1520153 -1610621 -1653930 -1555175 -811931 470086 1338453 1166281 456971
40496 456971 51970 60173 55924 -114803 -301099 -505379 -776731 -822133 -309136 487533
40486 487533 868479 588839 110559 -105985 -139118 -271840 -489640 -576729 -495639 -414309
40476 -414309 -452942 -587349 -748294 -890404 -1004234 -1134812 -1322189 -1465513 -1353775 -934245
40466 -934245 -455958 -209513 -182640 -127158 53597 158834 -14787 -373667 -636643 -680391
40456 -680391 -659483 -771468 -967842 -948003 -477506 260259 689927 355726 -562067 -1368590
40446a368590j75878L76892N79864O36487O49067L78149j99346n50736k42899
40437H3010L57003N31107J81467j66940k27471k45269m09585n31370m45036k65079
40427a138163r6762Q6735J69888m4802l86192m11782p0297K69645N28080R32915
40417a60735J180339N40070p41116j185377p9099J194613R69966k65225o70524
40408G82912J05484N25868k86599j194377q40132M34997J269386J026068J13049
40399A936656p88120j138557p13862N6241L73465J17351K4809M21051N68031p0287
40389G86778p29133m51031L45814N23784M0801j06713L84880O81273K55132l18849
40379A412736l86363j43630q1986k03452k80636l54973m96492m81159j43942K64938
$$ plain form
40446 -1368590 -1544468 -1167576 -587712 48775 697842 1075991 876645 325909 83010
40437 83010 440013 971120 1152587 985647 758176 512907 103322 -428048 -873084 -1138163
40427 -1138163 -1234925 -1148190 -978302 -1023104 -1409296 -1821078 -1891375 -1621730 -1093650 -160735
40417 -160735 1019604 1559674 818558 -366819 -445918 748695 1718661 1453436 782912
40408 782912 888396 1414264 1127665 -66712 -906844 -471847 797539 1823607 1936656
40399 1936656 1148536 9979 -703883 -647642 -274177 -156826 -132017 289034 857065 786778
40389 786778 57645 -393386 -47572 476212 517013 410300 795180 1476453 1731585 1412736
40379 1412736 1026373 882743 800757 597305 316669 -38304 -534796 -1015955 -1159897 -894959
40369h94959M46641M94085O21005O93420L89353k90070r29525j080001o39092
40360a189143N0194M68653M38667L14621M48467O21286L74493k37302p22246q91238
40350c23548r35844q12872k66128M59236P03763M00275J99308L20105J73143m40794
40340e23356p30538j99974L87062K25841j73355N5476N27244K79327m30562m85864
40330a068699J16230K14436m54461o90006J77501J107634R49964J21604k48993
40321B25210m1054l230l88700o65797m14653J64949N88178N42977J30346j64490
40311b6264K2164M12904M88357L36069L93212L76791m68389j800146k101598q18129
40301c185029O12663P67190J53663k934J85367r1074m88694o0185P87652P12753
$$ plain form
40369 -894959 -448318 45767 666772 1360192 1749545 1459475 529950 -550051 -1189143
40360 -1189143 -1138949 -670296 -231629 82992 531459 1152745 1527238 1289936 567690 -323548
40350 -323548 -1259392 -2072264 -2338392 -1879156 -1175393 -775118 -575810 -255705 -82562 -523356
40340 -523356 -1253894 -1453868 -1066806 -840965 -1014320 -958844 -431600 -152273 -582835 -1068699
40330 -1068699 -952469 -738033 -1192494 -1882500 -1704999 -597365 352599 474203 225210
40321 225210 184156 180926 -207774 -873571 -1288224 -1123275 -535097 7880 138226 -26264
40311 -26264 -4100 408804 897161 1233230 1626442 2003233 1534844 -265302 -2366900 -3185029
40301 -3185029 -2572366 -1805176 -1651513 -1654447 -1469080 -1560154 -2048848 -2109033 -1321381 -608628
40291f08628k63236o38976J79907J026407R17811L39745J3071k33866o36258p42700
40281f46723k95199J37586J33153Q4345K40696J05923m54986n76706J94345Q49458
40271b28108M03476m32740l50684M47959O52985k0503n28219k64566J70583J56603
40261F786r3045j90284k24249l63416m28472k27442Q1864K07063N0174k38760
40251a419781l33405K5016O03269P42145K06702l25421j02944O36340R87635N65524
40241A585080j77926o60384o69982l09457O5043J1374m41546o43337j92036L85911
40231a047260L96239M9625P0582N32042Q45707P04617K89349k64025q44142j022256
40221b89522n31990R2355J67573o0837J25822O07121N83714n1990n50567n12429
$$ plain form
40291 -608628 -871864 -1510840 -1330933 -304526 613285 953030 966101 732235 95977 -646723
40281 -646723 -941922 -804336 -671183 -586838 -346142 -240219 -695205 -1271911 -1077566 -228108
40271 -228108 175368 -257372 -608056 -160097 492888 472385 -55834 -320400 -149817 6786
40261 6786 -86259 -276543 -500792 -864208 -1292680 -1520122 -1438258 -1231195 -1181021 -1419781
40251 -1419781 -1753186 -1728170 -1124901 -382756 -176054 -501475 -604419 31921 1019556 1585080
40241 1585080 1407154 746770 76788 -232669 -167626 -156252 -597798 -1241135 -1433171 -1047260
40231 -1047260 -651021 -601396 -530814 1228 846935 1551552 1840901 1576876 732734 -289522
40221 -289522 -821512 -729157 -561584 -622421 -496599 110522 694236 642246 91679 -420750
40211d20750k61926j4377L15950M72685P9241m77367m67243r2037j30957l70471
40201a367252J41914J160357J228866L3724r14027o18465K6527O0848o128L80538
40191A26902M55090l58389r43277j76677R72595Q27279l32883q35890k85744K06583
40181c44411J61228K34705N83021M67072k25844n74931j57911K74714R9640k90879
40171B26404l33266q0835K41736O08938P64009K50356p36730j277796r10667k39166
40161a487017L2j26428j25827J25739L69466M08549K75645J56960K26612L57644
40151A81375J34031n14217r27855m85523M44150R13478O12134O6604k20524j83497
40141B0156J00223M30798L57411k72611q12866o03242j4041J43484l7207J49785
$$ plain form
40211 -420750 -682676 -697053 -381103 91582 170823 -306544 -773787 -865824 -996781 -1367252
40201 -1367252 -1225338 -64981 1163885 1197609 283582 -334883 -308356 -247508 -253636 126902
40191 126902 581992 223603 -719674 -896351 76244 903523 570640 -265250 -550994 -344411
40181 -344411 -183183 51522 634543 1101615 875771 300840 142929 417643 517283 226404
40171 226404 -106862 -187697 54039 662977 1426986 1677342 940612 -337184 -1247851 -1487017
40161 -1487017 -1486985 -1613413 -1739240 -1613501 -1244035 -835486 -559841 -402881 -176269 181375
40151 181375 315406 -198811 -1126666 -1612189 -1168039 -254561 357573 424177 203653 20156
40141 20156 120379 551177 908588 635977 -176889 -780131 -794172 -650688 -687895 -538110
40131e38110O02983N31614l5055j94969J94741J96108n26329j033353o73621o6454
40121a542445J46761L33455Q40658J055347M68354k63704l45788j27777l15678
40112B49183o30832l94381J26475J46707k44388k76518J44002L73134K28051J98234
40102h0333M09422L33197k59438q15342p44017j21470N39511Q29958O66899K96583
40092A054970Q3875P1876p1087m09911m28226J64357O93466K93210p79718j359207
40082f86395q74104N6362N98177O18382M53805L32991K94191K85407J25106l39751
40072H64171q92568j046986o18889L1579M10418L36597l2892l70341l46389R4860
40062a570440N61540N55327Q2055k69489K1664P75875J223620P61920l79028j269499
$$ plain form
40131 -538110 64873 596487 561432 366463 561204 757312 230983 -802370 -1475991 -1542445
40121 -1542445 -1395684 -1062229 -221571 833776 1302130 1038426 692638 564861 249183
40112 249183 -381649 -776030 -649555 -502848 -747236 -1023754 -879752 -506618 -278567 -80333
40102 -80333 329089 662286 402848 -412494 -1156511 -1277981 -738470 91488 758387 1054970
40092 1054970 1138845 1210721 1139634 729723 301497 465854 1159320 1452530 672812 -686395
40082 -686395 -1560499 -1504137 -905960 -287578 166227 499218 793409 1078816 1203922 864171
40072 864171 -28397 -1075383 -1694272 -1662693 -1252275 -915678 -948570 -1318911 -1665300 -1570440
40062 -1570440 -1008900 -453573 -371518 -641007 -619343 156532 1380152 2142072 1763044 493545
40052D93545j207260m66897J00876J56982J35560L37256L54866j67003o75561
40043i37636l21277P01291J144365K64173j103102j439105l63632Q51858P64606
40034d38459m75592j259275n02168R89311J574683Q27285j82160m95727k83080
40025b45182r1379L8997K50780L36400Q6564k75096m48257m34774k38032K73902
40015g46077Q37989P74428L12n71717k48244M41534O13539K76487l9648k71735
40005A066868n38788m35367L41531J067950P87015k39699r20503r21332p81706
39996e74031o86414l37393N8193m6797l53104L383Q32674R09352n6546q26359
39986a077042n47933L7336L1196j94604M4962M02098K29966j11316J25848O58391
$$ plain form
40052 493545 -713715 -1180612 -1079736 -922754 -787194 -449938 -95072 -262075 -937636
40043 -937636 -1258913 -557622 586743 850916 -252186 -1691291 -2054923 -1203065 -438459
40034 -438459 -914051 -2173326 -2675494 -1686183 -111500 715785 533625 37898 -245182
40025 -245182 -336561 -297564 -46784 289616 376180 101084 -347173 -781947 -1019979 -746077
40015 -746077 91912 866340 866652 294935 46691 488225 1101764 1378251 1338603 1066868
40005 1066868 528080 92713 434244 1502194 2289209 2049510 1129007 207675 -574031
39996 -574031 -1260445 -1597838 -1539645 -1586442 -1939546 -1936163 -1103489 -194137 -250683 -1077042
39986 -1077042 -1624975 -1587639 -1556443 -1751047 -1706085 -1303987 -1074021 -1185337 -1059489 -401098
39976d01098N57932j95592o49348l47213R0794J8320l63892m64622j27323K96608
39966a585434M41264K87083J03050R1337J40861O0555l8239P8621K58784J37627
39956b4491j26296N4700O34836P16711j01357q59425m83154O00967J015461L60182
39946A788134l70892l44390M8177K4486l80203m98617r9695K89548J53976k87629
39936C22895l66699J27077O15291M68125j61468n93933n87445n32044o32555n23282
39926a864038j3956L60454R9486l44572j08779P54232J199790N79058m53505p42106
39916e33936l2106P87517P78797l12o89592p17663l80800k29092k62981j64780
39906a444948m9693k92048o39395l39696N87809J069780N11622j85221M0690P21264
$$ plain form
39976 -401098 156834 -38758 -688106 -1035319 -944525 -926205 -1290097 -1754719 -1882042 -1585434
39966 -1585434 -1144170 -857087 -754037 -662700 -521839 -461284 -499523 -420902 -162118 -24491
39956 -24491 -150787 -96087 538749 1255460 1154103 294678 -188476 412491 1427952 1788134
39946 1788134 1417242 1072852 1121029 1145515 765312 266695 167000 456548 610524 322895
39936 322895 -43804 83273 698564 1166689 1005221 411288 -176157 -708201 -1340756 -1864038
39926 -1864038 -1877994 -1517540 -1418054 -1762626 -1871405 -1117173 82617 661675 208170 -533936
39916 -533936 -566042 221475 1000272 999960 310368 -407295 -788095 -1017187 -1280168 -1444948
39906 -1444948 -1494641 -1786689 -2426084 -2765780 -2177971 -1108191 -596569 -781790 -741100 -19836
39896a9836O12083k58693o21468n1069L75347l5356l56960L69664J318083R70290
39886B302085m51171j110981k08312Q61412N59934o70018j263396p90205j89159
39877i59811k9868J96931Q23920J149346M90412o18216j051927n46487J76072
39868c69628N01187M62730K73344m5229m59043p86679q71942o43080q4006N72245
39858a450101Q28050N04060J14704J64394L19973m7063o70248n91834L68245J178384
39848G18564R23577q2034q33475p72107j22542M46419L07256n26196j184118q42783
39838a967439J34386O18138K97818j2146J96057L92461J19775j52447Q4739M81290
39828A92632N27115M10784M41284L07218k76253p96116o69520k15500n6724n9703
$$ plain form
39896 -19836 592247 333554 -287914 -338983 36364 1008 -355952 13712 1331795 2302085
39886 2302085 1850914 739933 531621 1393033 1952967 1282949 19553 -770652 -959811
39877 -959811 -989679 -792748 31172 1180518 1670930 1052714 787 -545700 -369628
39868 -369628 131559 594289 867633 822404 363361 -423318 -1295260 -1938340 -2022346 -1450101
39858 -1450101 -622051 -117991 -3287 161107 481080 434017 -236231 -828065 -459820 718564
39848 718564 1642141 1560107 726632 -45475 -168017 278402 585658 59462 -1124656 -1967439
39838 -1967439 -1833053 -1214915 -917097 -929243 -733186 -340725 -220950 -373397 -288658 192632
39828 192632 719747 1130531 1571815 1879033 1602780 806664 137144 -78356 -135080 -194783
39818a94783K39410O23965N75184K86883L17150N07280K31884m61513r06003q69457
39808C50000o67359l80180J22448N02657K60840l09911l91498J30439N69358N51043
39798G37837L47905J31965j74762l02047J31421P17120O07806j02791m05117J6028
39788A705365L14612r006k63895J71961P38113N97912q9384n68087n98842m64880
39778A533869k99420o5046Q2656m3586l03874l80623j37115L10071O34353M39800
39768A771085k32988o57379k86836K77787M3876p39964q43467o7154L62047j33692
39758e06685m59786K26136R30206M45213n28610m58521N14856Q40151N6672o18251
39748D41381l20232L13607M22198J32963n0037j13353j89479q5125K49812L59071
$$ plain form
39818 -194783 44627 668592 1243776 1530659 1847809 2355089 2586973 2125460 1219457 350000
39808 350000 -317359 -697539 -575091 -72434 188406 -121505 -513003 -382564 186794 737837
39798 737837 1085742 1217707 1042945 740898 872319 1589439 2197245 2094454 1689337 1705365
39788 1705365 2019977 2010971 1747076 1919037 2657150 3255062 3165678 2597591 1998749 1533869
39778 1533869 1234449 1169403 1252059 1208473 904599 523976 386861 696932 1331285 1771085
39768 1771085 1538097 880718 593882 871669 915545 175581 -667886 -735040 -372993 -506685
39758 -506685 -966471 -740335 189871 635084 106474 -352047 162809 1002960 1059632 441381
39748 441381 121149 434756 856954 989917 939880 826527 637048 551923 801735 1160806
39738A160806l5003m38334k63793K21655K43457l14601o78234k35568O03567R02030
39728A165982L65660l55860n97711n07612n90629p40593l98770L38504N94859
39719g26170M2556m22947K0863P97334P85903O9574k45288J80551M64065N1839
39709A018280l62113l2774N69882M73281l28623r22919p68577k32082J09320R6531
39699c79794j22871l23051k12755L32678R07595Q66562J84523l84893l08500k3469
39689E36025k26403p41953p64911j33796L79251K19320j89294j84689J97049M81244
39679d28157M83311K96920r279j80363K35193J052943J176846M1785j176612r57250
39669E35337K90891P54579m3761o51607j78601L20604j81747q69544n43293K81045
$$ plain form
39738 1160806 1125803 687469 423676 645331 888788 574187 -104047 -339615 263952 1165982
39728 1165982 1531642 1175782 578071 70459 -520170 -1260763 -1659533 -1321029 -726170
39719 -726170 -683614 -1106561 -1085698 -288364 497539 567113 321825 502376 966441 1018280
39709 1018280 656167 623393 1193275 1666556 1337933 415014 -353563 -585645 -476325 -379794
39699 -379794 -502665 -825716 -1038471 -705793 201802 1068364 1252887 867994 559494 536025
39689 536025 309622 -432331 -1197242 -1331038 -951787 -732467 -921761 -1106450 -909401 -428157
39679 -428157 55154 352074 342795 162432 397625 1450568 2627414 2669199 1492587 535337
39669 535337 826228 1580807 1537046 885439 706838 1027442 845695 -23849 -567142 -286097
39659b86097K93472l61419m15531L18077P03712K33108k70056j52142J46820J05164
39649C15108n031K07116N16140N56737M24368L42976K29535k5067k53518k96147
39639B012217k40643j91202j53604k34144n22547p34087m87351J5257J86759n97
39629c49942O256K66445J14791n99855r25375j58992Q92441R02205j14642q64892
39619h31560n78899J57675N06192M78221M97169M54691r0728r25076j097289j25795
39609a555399J144821J407320M81102n20578o81681l15461j74511k47451n959
39600d67797N29885P83843N72828K94931J39928j46273n75254p19468m54657k42002
39590b84036l49703l96125m4104M03287N31165M50046M43791M04334J03056l16742
$$ plain form
39659 -286097 7375 -354044 -769575 -451498 252214 485322 215266 63124 209944 315108
39649 315108 310077 517193 1033333 1590070 2014438 2357414 2586949 2561882 2308364 2012217
39639 2012217 1771574 1580372 1426768 1192624 670077 -64010 -551361 -536104 -349345 -349942
39629 -349942 -343686 -77241 37550 -562305 -1487680 -1646672 -754231 147974 33332 -831560
39619 -831560 -1410459 -1252784 -746592 -268371 228798 683489 592761 -332315 -1429604 -1555399
39609 -1555399 -410578 996742 1477844 957266 275585 -39876 -214387 -461838 -467797
39600 -467797 62088 845931 1418759 1713690 1853618 1707345 1132091 412623 -42034 -284036
39590 -284036 -633739 -1029864 -1073968 -670681 -139516 310530 754321 1158655 1261711 944969
39580I44969n76766o85367p01844m23583K12086P30547O62410K47754O9717J93215
39570F73138K27092Q1344M6099J57618Q9215k40378m65739l33278m8616R5330
39560B81825R8575J04760J50511K09116K59629K06368m9978l58180l57251P5331
39550F20706N68894O13004J07911n29141p72898m54174J58377O69896Q60468O51712
39540B494755j3633r60045j541294j108228R8312R64786P60692K2086k42013J02423
39530E77841L38703P9681k68631k70207m6152J09424J67438J35457j42700n94214
39520H6640p12220k01011M35080M62310l4997k22633K84195P94248M32767o37826
39510F86553j328221r37747J5264M74143J36750k54167P2327R01340J258779N61515
$$ plain form
39580 944969 368203 -317164 -1019008 -1442591 -1230505 -499958 162452 410206 479923 673138
39570 673138 900230 981574 1027673 1185291 1274506 1034128 568389 235111 186495 281825
39560 281825 380400 485160 635671 844787 1104416 1310784 1260806 902626 545375 620706
39550 620706 1189600 1802604 1910515 1381374 608476 154302 312679 982575 1843043 2494755
39540 2494755 2481122 1521077 -20217 -1128445 -1030133 -65347 695345 717431 475418 577841
39530 577841 916544 996225 727594 457387 411235 520659 688097 823554 680854 86640
39520 86640 -625580 -826591 -391511 70799 35802 -186831 97364 891612 1324379 686553
39510 686553 -641668 -1579415 -1564151 -1090008 -953258 -1207425 -1135098 -233758 1025021 1586536
39500A586536o81539j372171r14858K49928J133482J144514N43965J3458j08690
39491A594625m4154j05761k87253m39250n82782p50032o79781r3724P13635J008018
39481C33541N25060j37606l32321k12341l18874n83239m03008K75404O60681K28760
39471C6057m37204m40340J70387N47812K67994k34700m35329l10936n8887K21872
39461f73274L80386K36726l7374l3731K02650J50315k68631m14583j7691J76792
39451b98415m35778j131425p88754L57666R66709M92155k24233l60696r9001Q5571
39441a436201J93786L23952K84425N7746J7489K52201K90843p2620l24974q2568
39431d95921K56567K57580J90515L78747M45667j034m85413l53898R2447J18534
$$ plain form
39500 1586536 904997 -467174 -1382032 -1132104 1378 1145892 1689857 1703315 1594625
39491 1594625 1550471 1444710 1157457 718207 135425 -614607 -1294388 -1388112 -674477 333541
39481 333541 858601 720995 388674 176333 -142541 -725780 -1128788 -853384 -192703 36057
39471 36057 -401147 -841487 -671100 -123288 144706 -89994 -525323 -836259 -895146 -673274
39461 -673274 -292888 -56162 -93536 -127267 75383 225698 -42933 -457516 -475207 -298415
39451 -298415 -734193 -1865618 -2654372 -2296706 -1329997 -837842 -1062075 -1422771 -1521772 -1436201
39441 -1436201 -1242415 -918463 -634038 -576292 -558803 -306602 -15759 -88379 -413353 -495921
39431 -495921 -239354 18226 208741 587488 1033155 1032121 546708 192810 285257 403791
39421D03791j31766R6466P49075R04694J97185o86516j075731r78439n17429L41416
39411f97254J191492J223262L15722o41930r26092p55428n12169m1392O81232
39402a62557R94692M66364k62598l87505j64831l15417o67795m75236J67798L87028
39392d20057M518j85222J75380M16453Q0940k55448l5621K74763L8879l80329
39382b85744k35694K91779M07084O3632m2048K15671J63944l80815o27300o7057
39372d96548O54093P30090L39182Q6120q5437n59322j043943q66766j23475L67680
39362i98326K70736O7676R9880R0344j46789k64139N392L92574N77555N93581
39352F88484M73640Q8268l64590l71782P921m850o43948r54609j85025Q67454
$$ plain form
39421 403791 272025 368491 1117566 2022260 2219445 1532929 457198 -521241 -1038670 -697254
39411 -697254 494238 1717500 2033222 1391292 465200 -290228 -802397 -843789 -162557
39402 -162557 832135 1298499 1035901 648396 483565 168148 -499647 -974883 -807085 -420057
39392 -420057 -415539 -600761 -425381 -8928 72012 -183436 -219057 55706 94585 -285744
39382 -285744 -521438 -229659 177425 241057 199009 414680 578624 197809 -429491 -496548
39372 -496548 157545 887635 1226817 1312937 1227500 668178 -375765 -1242531 -1366006 -998326
39362 -998326 -727590 -659914 -560034 -469690 -616479 -880618 -875226 -482652 94903 688484
39352 688484 1162124 1250392 885802 514020 521941 517091 -126857 -1081466 -1266491 -399037
39342c99037R08674P4071l41896J26922N90639L40244k01301l87595k75402j89287
39332B46032r8286Q0517J28832n3424j33783J25147M12042L22805n8711l55231
39322F15940l67980j15278K51026L62372j00165q03386r09235j71726N81722M96241
39312a60469j94710n80660k58861L98458Q94528J020016P94447M33493K25322
39303B571564J15485l10841j071779j408362p21168M25155R10332N00464j8774
39294I92076q8565k1296k70496o92322q08274m08522K85706P69928N56956k88276
39284B6915r41435o28596L36212Q58127M77386j24480k16474K9029N9501j19307
39274b43122p5602K60334M55561J66867m30507p83539m25671N41254J351099J213267
$$ plain form
39342 -399037 509637 583708 241812 368734 959373 1299617 1098316 710721 435319 246032
39332 246032 147746 228263 357095 303671 169888 295035 707077 1029882 971171 615940
39322 615940 247960 132682 383708 746080 645915 -157471 -1066706 -1238432 -656710 -160469
39312 -160469 -355179 -935839 -1194700 -796242 98286 1118302 1912749 2346242 2571564
39303 2571564 2687049 2376208 1304429 -103933 -825101 -399946 510386 1010850 992076
39294 992076 903511 882215 611719 -80603 -888877 -1297399 -1011693 -241765 315191 26915
39284 26915 -914520 -1543116 -1206904 -348777 128609 4129 -212345 -183316 -123815 -243122
39274 -243122 -318724 -58390 397171 564038 133531 -650008 -1075679 -534425 816674 2029941
39264B029941J81274q50580j115479o87376j87049j09335m81851q10432l79348
39255b410235Q77895J854239J379309p0393p71290j83205K27888o59177j706458
39246a461427j262826J48015O19270j39343n05634L09635J106719Q02207Q539
39237c74845l25152m00547o44593n45319L01951R52386L60291p68838q68685R2421
39227b220930O26311J05875l73328J06690Q17421N66701m89122j070377m63737
39218b394496O72671J146307N17047n01599q45175k63330M84773O68957M30184
39209h4661K63647J33577k59297o66497n66159r9649J22074R1785L46296P85025
39199F6141O27862j57596n08550Q1184O12140J15144p68776q22156j92771j8357
$$ plain form
39264 2029941 2211215 1360635 245156 -442220 -629269 -738604 -1220455 -2030887 -2410235
39255 -2410235 -1532340 321899 1701208 1630815 859525 676320 904208 245031 -1461427
39246 -1461427 -2724253 -2576238 -1956968 -2096311 -2601945 -2292310 -1185591 -383384 -374845
39237 -374845 -699997 -1100544 -1745137 -2290456 -1988505 -1036119 -675828 -1444666 -2313351 -2220930
39227 -2220930 -1594619 -1488744 -1862072 -1755382 -937961 -371260 -860382 -1930759 -2394496
39218 -2394496 -1721825 -575518 -58471 -560070 -1405245 -1668575 -1183802 -514845 -84661
39209 -84661 178986 312563 53266 -613231 -1179390 -1279039 -1156965 -1065180 -718884 66141
39199 66141 694003 536407 27857 109041 721181 836325 67549 -754607 -947378 -965735
39189i65735m41898l98212M93601J123455N42590n34744p01164J88269Q74268
39180A80430M00037p20884j224023n80819N16097J016943O06046j39960n30549
39171d76682m69228l09265k09253N6613N82959R30212N90372j76116m18051K78027
39161C79588R79850M62194r79660j592760m34277J191318J358663P0405q88560
39152E46761m92568L19621K68498n09519r76508p14886j75413J57548J67655n9228
39142a468039k45162J9886P52409J314613J110861L53940k36995k81344O4391
39133A384560M70124O15243L01633k26278l94813j26562j26832q20269j464807
39124c88001j073590R6200Q29058N89831J7572k17175j80120j29110r965J73188
$$ plain form
39189 -965735 -1407633 -1805845 -1312244 -188789 353801 -180943 -882107 -693838 180430
39180 180430 580467 -140417 -1364440 -1945259 -1429162 -412219 193827 53867 -476682
39171 -476682 -945910 -1255175 -1464428 -1407815 -824856 105356 695728 519612 101561 379588
39161 379588 1359438 1821632 841972 -750788 -1185065 6253 1364916 1435321 546761
39152 546761 54193 373814 642312 132793 -843715 -1558601 -1734014 -1576466 -1408811 -1468039
39142 -1468039 -1713201 -1693315 -940906 373707 1484568 1838508 1601513 1320169 1384560
39133 1384560 1854684 2469927 2771560 2545282 2150469 2023907 1897075 1076806 -388001
39124 -388001 -1461591 -1365391 -536333 53498 71070 -146105 -326225 -455335 -465300 -292112
39114b92112J38909j39667k18803J16328M09653K10701k10451k90996j3294J82007
39104a07725J27306N9280Q2285N955j96378k24022K3847J26998k69616p70075
39094a142145o16829K54597J051766J146454P52750L30807j14043o41986q21516
39085A99855l16631L13704K77896j81586j51389L93921N03181j27172n95109k56699
39075E9971L35751M94361L66929K26266j74122p70154p35930J98059R06405M05662
39065A313198o06115q73638m44169j49165J6146N39021R93390N82159k60514l88932
39055G21381J07648N8024p22392j114603o20976p0639l6725M6977O68584J320500
39045C57779J350403P96141j5870q30239j174638o45763K81429O24017K08523
$$ plain form
39114 -292112 -153203 -292870 -511673 -395345 14308 225009 14558 -276438 -289732 -107725
39104 -107725 19581 78861 161146 167101 -29277 -253299 -229452 -102454 -372070 -1142145
39094 -1142145 -1758974 -1504377 -452611 693843 1446593 1777400 1663357 1021371 199855
39085 199855 -116776 196928 474824 293238 141849 535770 1038951 911779 316670 59971
39075 59971 395722 890083 1257012 1483278 1309156 539002 -196928 1131 907536 1313198
39065 1313198 707083 -166555 -610724 -759889 -743743 -204722 788668 1370827 1110313 721381
39055 721381 829029 887053 164661 -949942 -1570918 -1641557 -1678282 -1631305 -962721 357779
39045 357779 1708182 2504323 2488453 1658214 483576 -162187 119242 743259 951782
39036I51782k77033m99090o48724m96346L55444J228578Q97154m07032j064492
39027D0241m82974J71297J02081l998L19800K86647m87299r37859l31301L97062
39017i26303L20702J15487O06260J063042N05722m30907n76909k18464l36813
39008A21817o73316l22166L36340J19340q09841r91974R9590J322799J522358
38999G24947P82480j11822n45191l33606J60090K33676k77827o56749l94012m8638
38989d66652k62244n72956j98540N42144O75496P0778n18495o19782l66962K4609
38979a692604L33413K61388o7791r4618J47400j11089q26393p11872N96453J369187
38969g96526L12331j086380p20263P45618R99236j44627o96890L1843N63119J05908
$$ plain form
39036 951782 674749 175659 -473065 -969411 -613967 614611 1511765 1104733 40241
39027 40241 -442733 -271436 -169355 -173353 146447 433094 -54205 -992064 -1323365 -926303
39017 -926303 -605601 -490114 116146 1179188 1684910 1254003 677094 458630 121817
39008 121817 -551499 -873665 -537325 -417985 -1227826 -2219800 -2120210 -797411 724947
38999 724947 1507427 1395605 850414 516808 676898 910574 632747 -24002 -418014 -466652
38989 -466652 -728896 -1301852 -1500392 -958248 -282752 -211974 -730469 -1350251 -1717213 -1692604
38979 -1692604 -1359191 -1097803 -1165594 -1260212 -1112812 -1223901 -2050294 -2762166 -2165713 -796526
38969 -796526 -484195 -1570575 -2290838 -1545220 -545984 -690611 -1387501 -1355658 -792539 -686631
38959f86631k20840L22979P88848M10871q1780J3061J47833j93310l97754Q9546
38949A92823O58486N57916O5638j67474j05751j7842M5669j5452l63619o52990
38939A97404l12244L87267N37032M7334k18841M1770J86258K6283K31906Q78302
38929B002471R77097R6357q23392r60042p20014o57643m76140Q9219M81417K76379
38919B85709m879J62618M05748K23009j44309k71843k33446j82919j4670J52824
38909C77842l029k21997R9256O60643M92835k92082m62863J88399L42953n13248
38899F68709j037047l25251M86487K41312k53654J55131Q00918M50715m27869
38890G59451n56542j26404k67450q68159q21145n5460M70937N60796Q32508J117686
$$ plain form
38959 -686631 -907471 -584492 204356 615227 533447 546508 694341 501031 103277 192823
38949 192823 851309 1409225 1474863 1307389 1201638 1183796 1229465 1214013 850394 197404
38939 197404 -114840 272427 809459 856793 637952 679722 865980 892263 1124169 2002471
38929 2002471 2979568 3075925 2252533 1292491 572477 -85166 -561306 -472087 9330 285709
38919 285709 280830 443448 849196 1072205 927896 656053 422607 239688 225018 377842
38909 377842 374813 152816 252072 912715 1405550 1113468 650605 839004 1181957 668709
38899 668709 -368338 -693589 -207102 34210 -219444 -64313 736605 1187320 759451
38890 759451 202909 76505 -190945 -1059104 -1880249 -1935709 -1464772 -903976 -71468 1046218
38880A046218N38715o99562j218579n15238K88086K05152k93191k93724J78831
38871g63292M71933L80161K62542L41790L58214k5271o23641p43449k6496Q78573
38861E11064R89851K97569k64766j99078K2029n0800k59701n24692j061106j493187
38851b032817q87042P09398J851593J548851N05620j82280m50789o12348m85188
38842c5002j02586j08662m92607k02516R52388J472943N08774n29209k62241L38249
38832A539531j29953p79535m4513J175865P39388j049607j796672q27215J17184
38823a055527Q1193Q5420O54966P15851k07100q95441n22318L4538p9437l39964
38813a527819j63294k2295k61737k07828N32561J116671P81966M6795k71372k35860
$$ plain form
38880 1046218 1584933 885371 -333208 -848446 -560360 -355208 -648399 -942123 -763292
38871 -763292 -291359 88802 351344 693134 1051348 1026077 402436 -341013 -367509 511064
38861 511064 1500915 1798484 1533718 1334640 1356669 1305869 1046168 521476 -539630 -2032817
38851 -2032817 -2919859 -2210461 -358868 1189983 1695603 1513323 1062534 450186 -35002
38842 -35002 -137588 -246250 -738857 -941373 11015 1483958 1992732 1463523 1201282 1539531
38832 1539531 1409578 630043 585530 1761395 2500783 1451176 -345496 -1172711 -1055527
38823 -1055527 -974334 -888914 -233948 481903 274803 -620638 -1142956 -1108418 -1187855 -1527819
38813 -1527819 -1691113 -1713408 -1975145 -2182973 -1650412 -533741 248225 295020 23648 -212212
38803b12212j98832r394M05112N65790K74873Q3340K99780L97160M342m02300
38793A207659l99253l09457l85703k19220L62470O92479L00867k32487k04095
38784H13260J39540J79175o5361k14914k76755m41372n75005m70294k19558N1184
38774a080100L79373O19821M59795L8750r0540J17961N8937m33328o63568j87051
38764g79950M52026O37385O04080Q15618J039056P34039n4604p89928j123611
38755A534111j034144n93608k772L82910L80032J71118M1214J07008K87533L00088
38745A573490j51341q51545j045642m14822L23644M27750K41839M43537P34261
38736A281171M34333p4296R6118O16728L37820o67627j107785o21131j94993j73382
$$ plain form
38803 -212212 -411044 -420438 -15326 550464 825337 908677 1208457 1605617 1609959 1207659
38793 1207659 808406 498949 113246 -105974 256496 948975 1249842 1017355 813260
38784 813260 952800 1131975 1066614 851700 574945 133573 -441432 -911726 -1131284 -1080100
38774 -1080100 -700727 -80906 378889 417639 327099 445060 503997 70669 -592899 -779950
38764 -779950 -327924 309461 913541 1729159 2768215 3502254 3447650 2657722 1534111
38755 1534111 499967 -93641 -96413 286497 666529 837647 878861 985869 1273402 1573490
38745 1573490 1422149 570604 -475038 -889860 -566216 -138466 103373 546910 1281171
38736 1281171 1715504 1641208 1737326 2354054 2691874 2024247 916462 295331 100338 -73044
38726g3044K94221J265855J377513J22184r95191p60314j42053m94843j227800
38717f33472r06964K74245Q30398K88508l59075l16141J38704M15494L21000l6201
38707A6496m15271n28548l29759o6988J27527L38104M67342L06368Q3914K13699
38697B12884M22094N8312o03005n27728L08146O17194j76556r33017o11877J44153
38687a089400K35655j64221k26347N9963J71809J51525L63617O59329O69028M60684
38677A291642K13453j78377n54068k95223O01323J065304L86513o55515r42014
38668I33038n42925k03709n0742J91292L12909p502l78300j81130M21486P25853
38658A220270M68493J229k23134Q596M37710L29672o13013j359430o74736P95092
$$ plain form
38726 -73044 221177 1487032 2864545 2986729 1991538 1231224 1089171 594328 -633472
38717 -633472 -1540436 -1266191 -435793 -147285 -506360 -822501 -683797 -268303 52697 16496
38707 16496 -398775 -927323 -1257082 -1324070 -1196543 -858439 -391097 -84729 -815 212884
38697 212884 634978 693290 90285 -437443 -129297 487897 311341 -621676 -1233553 -1089400
38687 -1089400 -853745 -1017966 -1244313 -1184350 -1012541 -861016 -497399 161930 830958 1291642
38677 1291642 1505095 1326718 772650 477427 1078750 2144054 2530567 1875052 933038
38668 933038 390113 186404 135662 326954 639863 632361 254061 72931 494417 1220270
38658 1220270 1688763 1689992 1466858 1475454 1913164 2242836 1629823 270393 -404343 390749
38648C90749J059623k26453j061546j74028J020725P91660k48527m84071M7681
38639A115813J65501k46082l48864m2607R4642P9259K69896K98436l51734j104219
38629f9959r61905r5809M50094L32971Q4122K7949N6539J92450M93871P02338
38619A212661O43826N10826K69528m18527j198557j056592k516N74312L8988m66881
38609A07068j27546R9730n22529q26384J83895J171168M87976r56058j112051
38600a494731l2086O23006M75185M65778O25047J79522m89185k67751N18563M95932
38590A099280l36668o23653j9391M23879K31640J9525O398k36385n19946j76857
38580a32178N10735N71834J6962k15129J01222K95108J27416j5868n6821j59377
$$ plain form
38648 390749 1450372 1223919 162373 -11655 1009070 1800730 1552203 1068132 1115813
38639 1115813 1281314 1035232 686368 643761 738403 817662 1087558 1385994 1034260 -69959
38629 -69959 -1031864 -1127673 -677579 -344608 -260486 -232537 -175998 16452 510323 1212661
38619 1212661 1856487 2367313 2636841 2218314 1019757 -36835 -39351 534961 573949 107068
38609 107068 -20478 79252 -443277 -1269661 -1085766 85402 573378 -382680 -1494731
38600 -1494731 -1526817 -903811 -428626 37152 662199 841721 352536 84785 603348 1099280
38590 1099280 762612 138959 119568 543447 775087 794612 801010 564625 44679 -132178
38580 -132178 378557 950391 967353 752224 853446 1148554 1275970 1260102 1203281 1043904
38570A043904j03459J72687N8138n61971n92734M58803J152085K78826q97284
38561A008995n75693O11924Q58609L37960N78281J499211J655971Q51499M7576
38552F874333p15739j853924k393037j213490M84303O42674l16932l65510N54872
38543A697550P64812J30659K6909L79737j25288j130178j033530j30770j60713
38534D19188r11244n58264P40197R90286P5055j53632M51657J56860r72872r02344
38524f65113M78306R57442J7706l86547L42841M75294n06156r54957l54733p1499
38514f67416k39119N20166J770362J434316j91923n25983O69918Q70117m24216
38505C216222q46553J50328L23904p38347p19287O47523P26547q69120j232966
$$ plain form
38570 1043904 940445 1113132 1171270 609299 16565 475368 1627453 1906279 1008995
38561 1008995 433302 1045226 1903835 2241795 2820076 4319287 5975258 6826757 6874333
38552 6874333 6158594 4304670 1911633 698143 1182446 1825120 1508188 1142678 1697550
38543 1697550 2462362 2593021 2619930 2999667 2874379 1744201 710671 579901 419188
38534 419188 -492056 -1050320 -310123 680163 755218 601586 1053243 1210103 237231 -665113
38524 -665113 -186807 770635 788341 401794 744635 1219929 713773 -241184 -595917 -667416
38514 -667416 -906535 -386369 1383993 2818309 2626386 2100403 2770321 3640438 3216222
38505 3216222 2369669 2519997 2843901 2105554 1386267 2033790 2760337 1891217 658251
38496F58251L49934R56665m01380r71510K96859Q48581j44897r2529J457164J383805
38486D340943p40614j072109J360355K296626j09981j807290k52455J283292L80232
38477E678999k34088J107432J294146r80421j826028M08146J473292o30282j515785
38468D775411R05072J897693p27270j624127J826151L739915Q33980q06759K514921
38459A3334987M535644J683847J307607P252215J0222549M495461L11206N473595
38451D8617111R917331N794330N791602J9476160L0561471K7911302L9514999
38444A87584306R0813902J38804621J04693672j5365077j24736148j39028351
38438B42766925q2047510l5128714k8380074k9073644j4403609r30182l041408
$$ plain form
38496 658251 1008185 1964850 1563470 591960 888819 1737400 1592503 1499974 2957138 4340943
38486 4340943 3600329 2528220 3888575 6185201 6075220 4267930 4015475 5298767 5678999
38477 5678999 5444911 6552343 7846489 6866068 5040040 5448186 6921478 6291196 4775411
38468 4775411 5680483 7578176 6850906 5226779 7052930 10792845 11626825 10820066 13334987
38459 13334987 17870631 19554478 20862085 28114300 38336849 42832310 43143516 48617111
38451 48617111 58534442 64328772 70120374 89596534 120158005 148069307 187584306
38444 187584306 278398208 417202829 521896501 506531424 381795276 242766925
38438 242766925 160719415 125590701 97210627 68136983 53733374 52803192 49761784
38431D9761784q165035m450411m71458m519956q615385n266439j015148k378958
38423A4878994m109801j179571J244637j242008l419618q76254J475071q20570
38415E950880l236330j141106J618699M39073j637957m55725J365382P8535j842863
38406A138588p35294J279472O69876r27929m10608Q10546Q1714j108745k56647
38397E40973J104888L86183j107381p50171O39527P55815j2368j00116m3458q21200
38387E92692j252312j59804J108168J042721N33526O62570N05818n40321r48141
38378A544917J23360R63347M60328J81407J097903J381051j34484j475995j068075
38369C073759n33474j274750j541370Q8853J478487M89619j115132p68711N31919
$$ plain form
38431 49761784 41596749 37146338 36674880 32154924 23539539 18273100 17257952 14878994
38423 14878994 10769193 9589622 10834259 9592251 6172633 5296379 6771450 5950880
38415 5950880 2714550 1573444 3192143 3631216 1993259 1537534 2902916 2981451 1138588
38406 1138588 403294 1682766 2352642 1424713 1014105 1824651 1906365 797620 540973
38397 540973 1645861 2032044 924663 174492 814019 1569834 1557466 1457350 1413892 592692
38387 592692 -659620 -819424 288744 1331465 1864991 2527561 3033379 2493058 1544917
38378 1544917 1668277 2631624 3091952 3273359 4371262 5752313 5617829 4141834 3073759
38369 3073759 2540285 1265535 -275835 -186982 1291505 1781124 665992 -102719 429200
38360D29200M63840m06371k22226M56573J05348m68548K31980J133818M19893
38351B143507q90867o13921O43900N84475p44742j261527m44405L51752N50589
38342C18761O55801N26923k23753q05025m04327J21352k28195n80945J19772Q35403
38332C35767K97413l19431O10642J825105R50514j332067k142414r05578J51556
38323e28493j48767n56084m6084P48121J106911J089401O25318l86420j094022
38314H09881o07764K86782J37441p61371q72915k6291M91947K68412J70695M57569
38304C54386L95321j39685l80886j08113R8078J4967j16167l93790q67541p95761
38294a939191K98675J362576J108277Q633n60834n16865o94997r40781m68564
$$ plain form
38360 429200 893040 486669 264443 721016 826364 357816 589796 1723614 2143507
38351 2143507 1252640 638719 1282619 1867094 1122352 -139175 -583580 -231828 318761
38342 318761 974562 1501485 1277732 472707 68380 189732 -38463 -619408 -499636 335767
38332 335767 633180 313749 924391 2749496 3700010 2367943 225529 -680049 -528493
38323 -528493 -677260 -1233344 -1279428 -531307 575604 1665005 2290323 1903903 809881
38314 809881 202117 488899 626340 -135031 -1007946 -1034237 -542290 -273878 -103183 354386
38304 354386 749707 610022 229136 121023 219101 234068 117901 -275889 -1143430 -1939191
38294 -1939191 -1640516 -277940 830337 838970 278136 -238729 -933726 -1874507 -2343071
38285b343071L70746N77666L44892N66896R62363N84112k38332m20488j67204
38276B37580m87536j068456p29790L22694Q24493P26134R49510J186962L33131
38267B294722j036187j128126M4604O06895J2470k51277M20186O91322j12293
38258A542316p40266l14340K37523N3248k65689j07205N4673q0696M5470M69586
38248H94620L18947m31638n66648K10136N49431j85558o85593N5695J003396Q72375
38238B035163J04858k71375l73914p00713q40385k85024M42991O30553M58749
38229A200903L28135P7225l00867k52226K25879K61722l00555l42155N71823J139125
38219B609009L78187o92127p68505l12954l89186o76498l08293L11007K41903
$$ plain form
38285 -2343071 -1972325 -1394659 -1049767 -482871 479492 1063604 825272 404784 237580
38276 237580 -249956 -1318412 -2048202 -1725508 -901015 -174881 774629 1961591 2294722
38267 2294722 1258535 130409 175013 781908 794378 543101 963287 1654609 1542316
38258 1542316 802050 487710 725233 778481 512792 405587 460260 379564 425034 894620
38248 894620 1213567 781929 215281 425417 974848 789290 103697 159392 1162788 2035163
38238 2035163 2140021 1868646 1494732 794019 -46366 -331390 111601 742154 1200903
38229 1200903 1529038 1606263 1305396 1053170 1279049 1540771 1240216 898061 1469884 2609009
38219 2609009 2987196 2295069 1526564 1213610 824424 147926 -160367 150640 392543
38210C92543k24748j97507J00120j03752m30038Q0958J083659J271533M23617
38201B396385l95896n73107m92321m27435k07480J5084j44069m47847l49699n0362
38191f76747j58664m69709k62012L19832M38762Q1812R7612O22974P78900J96082
38181I68842l83466m02836k67994l88392m62737k19407L8264J19360L27826O66813
38171c727N16573l02543r33481o41093Q4607L19041P3421R6428O42281J169887
38161A021394J116890M14984o12080j385347j304235l65291N77327O60815M3173
38152A67630l62688r1778M24771N87716L04043j36112m05534k54687K91043P07431
38142A231835L80124n53506j193590r78169l67908q1985j11363k6948J31902K1110
$$ plain form
38210 392543 167795 -29712 70408 -33344 -463382 -382424 701235 1972768 2396385
38201 2396385 2000489 1427382 935061 507626 300146 315230 171161 -276686 -626385 -676747
38191 -676747 -835411 -1305120 -1567132 -1247300 -808538 -726726 -629114 -6140 772760 968842
38181 968842 585376 182540 -85454 -473846 -936583 -1155990 -1117726 -998366 -670540 -3727
38171 -3727 512846 210303 -723178 -1364271 -1279664 -960623 -887202 -790774 -148493 1021394
38161 1021394 2138284 2553268 1941188 555841 -748394 -1113685 -536358 124457 167630
38152 167630 -195058 -286836 137935 725651 1029694 893582 488048 233361 524404 1231835
38142 1231835 1611959 1058453 -135137 -1113306 -1481214 -1563199 -1674562 -1701510 -1569608 -1548498
38132a548498j70891Q3420O02799N53901j80735n71957R9939J088769J168143
38123A124890K51784o90802r57161o23704j2996O02069Q86574O89258L31960J42340
38113A744212r7571o66372j157571r61587k80639J64171K92271O12464J075156
38104G24534J013531L64177r7091l3635m6470m67509o63138j75063L42599J34885
38094A096820m06568l95255J43008M07142P5859l85776n26214l28598O8129M77979
38084B26526N83569K65082q1975l6773J77482L0973m27806o04277k64888J43052
38074A0965J74153p2326k19363m4951M59980J105772J446393J057367P6223p89413
38064C204800r92647o82804l35785j01577J58284L34331M7330o88366j174984
$$ plain form
38132 -1548498 -1719389 -1635969 -1033170 -479269 -660004 -1231961 -1132022 -43253 1124890
38123 1124890 1376674 685872 -271289 -894993 -907989 -305920 580654 1269912 1601872 1744212
38113 1744212 1646641 980269 -177302 -1138889 -1419528 -1255357 -963086 -350622 724534
38104 724534 1738065 2102242 2005151 1971516 1925046 1457537 794399 619336 961935 1096820
38094 1096820 690252 294997 438005 845147 921006 535230 9016 -319582 -251453 226526
38084 226526 810095 1075177 993202 956429 1133911 1164884 737078 132801 -132087 10965
38074 10965 185118 112792 -106571 -151522 308458 1414230 2860623 3917990 3994213 3204800
38064 3204800 2212153 1529349 1193564 1091987 1250271 1584602 1631932 943566 -231418
38055b31418p93784J11744N68034J96354l58872l78724K8193K99545K81272K30926
38045d6730K27356J20743m8865r1060o6021j76611l11699j78730J43843K94035
38035a33739K50173L15161M53395K70908j96902l26391J49343N96420L33265l60738
38025A350895o00755r4305M76750L33798m10881q56202m28197L11063L11539n29842
38015a36137j140722p38956J12707M67604L83945N02451P28903M46574j85299
38006D41070l47459K0488J20042k35206k89319J91233L91703p0223l64610J04439
37996c7842O08678L75953n7811J26805N05941J54708o89916r95102n83399j69204
37986g61189K0336L98694Q46655O51551j69658o14750j63813M33240L29776k39182
$$ plain form
38055 -231418 -1025202 -913458 -345424 -149070 -507942 -886666 -858473 -558928 -277656 -46730
38045 -46730 180626 301369 252504 161444 95423 -81188 -392887 -571617 -427774 -133739
38035 -133739 116434 431595 884990 1155898 958996 632605 781948 1378368 1711633 1350895
38025 1350895 750140 655835 1132585 1466383 1055502 199300 -228897 82166 393705 -136137
38015 -136137 -1276859 -2015815 -1903108 -1435504 -1051559 -549108 179795 626369 441070
38006 441070 93611 114099 234141 -1065 -290384 -99151 292552 222329 -142281 -37842
37996 -37842 570836 946789 888978 1015783 1521724 1676432 986516 -8586 -591985 -761189
37986 -761189 -740853 -342159 504496 1156047 986389 371639 207826 641066 970842 731660
37976G31660n38511m81230n13457p16829p13297l64856L980J58056K91360O16383
37966a526741R05730P48226J69575l05924k72410J19544M49877N09081L19682
37957A116640n0952m13917m31915l7039L04131J35358l49878o34720o37290o22719
37947a622301n60311k17509K20490L33547K27089L79050P42579P88858M59691
37938G51183K13985Q2639l23041p26462k85772Q40251J252066L04935p88801p43637
37928E77346q2827j22016q36913j028811k46930O57740Q52320M53379N4654j109
37918B76833K13949L45930P0743m65546p15383m61752j34020j41068l27337l80027
37908a717678k82896o3110L56063P37189N98668M2538j97039J05706K95759J9280
$$ plain form
37976 731660 193149 -288081 -801538 -1518367 -2231664 -2596520 -2592540 -2434484 -2143124 -1526741
37966 -1526741 -621011 127215 296790 -9134 -281544 -162000 287877 796958 1116640
37957 1116640 1065688 651771 219856 182817 486948 622306 272428 -362292 -999582 -1622301
37947 -1622301 -2182612 -2400121 -2179631 -1846084 -1618995 -1239945 -497366 291492 751183
37938 751183 965168 1047807 724766 -1696 -287468 552783 1804849 2109784 1320983 577346
37928 577346 494519 372503 -464410 -1493221 -1740151 -1082411 -230091 223288 277942 276833
37918 276833 490782 836712 907455 441909 -273474 -735226 -869246 -1010314 -1337651 -1717678
37908 -1717678 -2000574 -2063684 -1707621 -970432 -371764 -329226 -526265 -420559 -124800 -105520
37898a05520j75703L7142R7525k63704l03873L39545O60906j29442j056015p88466
37888a687605K61374P36443M92791L66754L86060n3346n94251k85161N79280P02988
37878I05327p6473n41813j57628K21620K3165j92227j8184O1645j98172k09471
37868a82211K66905M83709k4610n27215k35459M44667O00273J59026k22440k46508
37858E16137k52509n07272p16717m04319L39597P31500K45189m45496k05001P58582
37848E9691Q94975l31237j319427o30286P57128R78065J17050l11231l5883j10115
37838F8730o35315n84735N8113J35326m23902l09415O87116J030756R3458o17626
37828d97494j818P64626L20515n42603l09315O98463R49939J63989m90994l17503
$$ plain form
37898 -105520 -281223 -244081 -146556 -410260 -714133 -374588 286318 156876 -899139 -1687605
37888 -1687605 -1426231 -689788 -196997 169757 555817 502471 -91780 -376941 202339 905327
37878 905327 828854 287041 129413 351033 374198 181971 163787 225432 27260 -182211
37868 -182211 84694 568403 543793 16578 -218881 225786 826059 985085 762645 516137
37858 516137 263628 -243644 -960361 -1364680 -1025083 -293583 -48394 -493890 -698891 59691
37848 59691 954666 623429 -695998 -1326284 -569156 408909 525959 214728 178845 68730
37838 68730 -566585 -1151320 -1093207 -957881 -1381783 -1691198 -1004082 26674 120132 -497494
37828 -497494 -499312 265314 585829 43226 -266089 432374 1382313 1546302 1055308 737805
37818G37805J47874K24772m6735j89378J25681P38713J019290M94042m74401j095383
37808A682280j176268j079012q35269k61040K21809Q8845j00455N21943J272875
37799C35708O59697q95122j221040J91371J250666O54190j56460K10941P04629
37790A734580Q5515n69963Q9047R48475L10182r20736p16030M55460M36971p88104
37780A065397j099640L2483P76522K58014j18813N37800R71386R6026j079115
37771A440060j168680m65873J6116K39459N72465N88959k09712j168079j200150
37762a355435l32357M72192P14863O86808N99170K69772k59294m92864j64591
37753A38264K43559L8912p12157j115556n40575M89879R00974M11067k76461n77655
$$ plain form
37818 737805 885679 1110451 1063716 874338 1000019 1738732 2758022 3252064 2777663 1682280
37808 1682280 506012 -573000 -1408269 -1669309 -1447500 -1358655 -1459110 -937167 335708
37799 335708 995405 100283 -1120757 -929386 321280 975470 819010 1029951 1734580
37790 1734580 1820095 1250132 1339179 2287654 2597836 1677100 961070 1416530 1853501 1065397
37780 1065397 -34243 -1760 774762 1032776 913963 1451763 2423149 2519175 1440060
37771 1440060 271380 -194493 -178377 61082 633547 1222506 1012794 -155285 -1355435
37762 -1355435 -1687792 -1215600 -500737 186071 785241 1055013 795719 302855 138264
37753 138264 381823 420735 -291422 -1406978 -1947553 -1457674 -556700 -145633 -422094 -999749
37743i99749n90572m31259J11735Q71997J119411O46687K43375M46001O34632
37734B052258J45291n29173n74586j71351J7098J1388J29509O9308m86244r07091
37724b43593m56533L70414N37547O5871k44570k39091l01391k63574K32119O61243
37714A18442L03398l32181k14736L81785L09147m28898p25804l43598j38994k98247
37704a369686q5273M68843L67199m95898r11544k63759O08321Q86781P10887K99389
37694B15260l90176q00214j46160R67526R57747k65532r92879m18473K58784J79814
37684d34303K23810R51100J157431O301j125782o98762M83448O48661j53817m83897
37674E74190O8348O41416P19608M52289j35224q58412q61961K20126J152697N76189
$$ plain form
37743 -999749 -1590321 -2021580 -1909845 -1037848 81563 728250 971625 1417626 2052258
37734 2052258 2197549 1668376 1093790 922439 939537 950925 1080434 1149742 663498 -243593
37724 -243593 -700126 -329712 207835 273706 29136 -209955 -511346 -774920 -542801 118442
37714 118442 421840 89659 -125077 256708 565855 136957 -588847 -932445 -1071439 -1369686
37704 -1369686 -1454959 -986116 -618917 -1114815 -2026359 -2290118 -1681797 -795016 -84129 215260
37694 215260 -174916 -975130 -1121290 -153764 803983 538451 -454428 -872901 -614117 -434303
37684 -434303 -210493 740607 1898038 1904339 778557 79795 563243 1211904 1058087 574190
37674 574190 642538 1283954 2003562 2455851 2320627 1462215 600254 820380 1973077 2549266
37664B549266r02967j540460r24523j33205K09059M63170P25764N76664J34638
37655A157406L9756K69352J29067m89828q98323p08224k06310L03521O27190L77329
37645F00936m38656q29327o168J119595R86865k51515r37102m67961J1677k40758
37635d52414m27537J42653P88523P17735L09024J85692O3778m72424r16957o05017
37625f66944J10076L85502Q1321l84979q28838j117509p52938M14609J459477
37616a300223J339542L40965l30326k01009J31221J78031J07919N9417j63906
37607A61631m74947l71314K42883P35716N85445J7990m67641o77270n51105j7507
37597h16119N89029N54823k40750q95455o33780R0928L66868K44007M22498P84461
$$ plain form
37664 2549266 1646299 105839 -818684 -951889 -742830 -279660 446104 1022768 1157406
37655 1157406 1197162 1466514 1595581 1105753 207430 -500794 -707104 -403583 223607 600936
37645 600936 162280 -667047 -673215 446380 1433245 1181730 244628 -223333 -211656 -452414
37635 -452414 -879951 -737298 51225 768960 1077984 1263676 1327454 855030 -61927 -666944
37625 -666944 -556868 -171366 -90045 -475024 -1303862 -2421371 -3174309 -2759700 -1300223
37616 -1300223 39319 380284 49958 -151051 -19830 158201 266120 325537 161631
37607 161631 -313316 -684630 -441747 293969 879414 897404 429763 -247507 -798612 -816119
37597 -816119 -227090 327733 86983 -808472 -1442252 -1351324 -984456 -740449 -317951 466510
37587D66510M21441p32620j444557q55399K95554P47883L06675l10041n93870
37578a698424m88004p049O18759P93217K79453k50029q7749M40170N31973J66819
37568B99136n5589p200j2192J655L00674N09867J26845k83800K53708J258155
37558B391259J105876m30998j522024q84475L76350N66162j75129n39636k35897
37549F51488m5386j82586m5720M64474O10242J8772o86201p78036l63569j19587
37539d76109m07101q56960p79309m824P58876P22640J19226n2387N12757R42594
37529D79403M87811m25735r36251q72598n67507j71121J91068J39916l54006n65459
37519b594479N1915R37638J155398O79928K33253J77596K97820L95741L98437
$$ plain form
37587 466510 887951 155331 -1289226 -2144625 -1849071 -1101188 -794513 -1104554 -1698424
37578 -1698424 -2186428 -2193477 -1574718 -781501 -502048 -752077 -839826 -399656 132317 299136
37568 299136 243547 236347 224155 225810 526484 1036351 1163196 879396 1133104 2391259
37558 2391259 3497135 3066137 1544113 659638 1035988 1602150 1427021 887385 651488
37549 651488 606102 423516 377796 842270 1452512 1471284 785083 7047 -356522 -476109
37539 -476109 -883210 -1740170 -2519479 -2524303 -1765427 -1042787 -923561 -975948 -463191 479403
37529 479403 967214 541479 -394772 -1267370 -1834877 -2005998 -1814930 -1675014 -2029020 -2594479
37519 -2594479 -2542564 -1604926 -449528 230400 463653 641249 939069 1334810 1733247
37510A733247J24683m14686p45475n45399k03036j81566k42195K9117L58404K32747
37500A45841j34869j05349L49379O38390M01913k05628q14224r58759l67831M07259
37490f43878L43571n18905q29031J2652P04768J41180n78166N8433J213865R26435
37480H30924n23088r52342J07139P25169m1662o21244J93319J110455N93998n61684
37470H60984o83195N5787K15100m09742o61315p5279M79926K58234m05181p55833
37460a120514m94249J17404N54427M60951N4731j09845O2830J10662j09773j34650
37450f08026J73423K06686k98079n41434J63290J135305J185970L07137m52584
37441A271688n43648l98344m18903l76122r095M18749M52613J1045n34572o79573
$$ plain form
37510 1733247 1857930 1443244 697769 152370 -50666 -232232 -474427 -445310 -86906 145841
37500 145841 10972 -94377 255002 893392 1295305 1089677 275453 -683306 -1051137 -643878
37490 -643878 -300307 -819212 -1648243 -1635591 -930823 -789643 -1367809 -1309376 -95511 830924
37480 830924 307836 -644506 -537367 187802 146140 -475104 -281785 828670 1422668 860984
37470 860984 177789 233576 448676 38934 -622381 -697660 -217734 40500 -364681 -1120514
37460 -1120514 -1614763 -1497359 -942932 -481981 -427250 -537095 -474265 -363603 -473376 -608026
37450 -608026 -434603 -227917 -525996 -1067430 -904140 231165 1417135 1724272 1271688
37441 1271688 728040 329696 -89207 -465329 -474424 -55675 396938 407983 -126589 -806162
37431h06162k18200M76800P30199L05046k95661m50439j27321K45947L83944L31443
37421E75596K07080M2306j51507k91870k14179J64853N60720M22055l63690j092701
37411a41337j038417m19381m810K5624Q5694K25971J14896n5805K78269Q51319
37401g7977O76106k95635q26322k87549K82473j45066r15032p59232K55001R83739
37391a109494Q73046L08077k91696p33004p19217j69237L79550M39926L01986
37382g20063L85111L91166j8622k81967K08821P85655L70038o05655o31542M67586
37372C50528J080447K23354r58082q91483K52766J050605Q13034J08896l67740
37363A662325n45184n92466m85481j82591J37433K54239J79438Q1936o040k22794
$$ plain form
37431 -806162 -1024362 -547562 182637 487683 192022 -258417 -385738 -139791 244153 575596
37421 575596 782676 824982 673475 381605 167426 332279 892999 1315054 951364 -141337
37411 -141337 -1179754 -1599135 -1603945 -1578321 -1492627 -1266656 -1151760 -1207565 -929296 -77977
37401 -77977 598129 302494 -523828 -811377 -528904 -673970 -1589002 -2348234 -2093233 -1109494
37391 -1109494 -236448 71629 -220067 -953071 -1672288 -1841525 -1461975 -1022049 -720063
37382 -720063 -334952 56214 37592 -244375 -35554 750101 1120139 514484 -117058 350528
37372 350528 1430975 1654329 696247 -195236 57530 1108135 1921169 2030065 1662325
37363 1662325 1117141 524675 39194 -143397 -5964 248275 427713 509649 503609 280815
37353B80815n40679n88376p3593O94566J053670P80571K66499j34785m49582o49576
37343F39530m67053M2091L13401P9387j54205P5358M05388K73144j31401k18495
37333H57145M1945J95868N9249k47007p08017j179611j078285j09897R44681J038295
37323a85634K97231k27133j39496o3109l66767n25952o7940O41849R54256P10981
37313A028286J66310l79148o36752m61737j05111L4452n2633j06242j61351m19780
37303a093706o23482k60878N36190J001765P80547L09560K8344j04746j47058
37294D26536M6929L23472K01071l47847p12229n23315j01053K22066N14161O86471
37284G36262L29287m29527o85103k159P65255O08669k31682p54902o45172m13686
$$ plain form
37353 280815 -259864 -848240 -921833 -227267 826403 1606974 1873473 1738688 1289106 639530
37343 639530 172477 214568 527969 607356 453151 528509 933897 1207041 1075640 857145
37333 857145 899090 1094958 1154207 907200 199183 -980428 -2058713 -2168610 -1223929 -185634
37323 -185634 111597 -115536 -255032 -318141 -684908 -1210860 -1278800 -636951 317305 1028286
37313 1028286 1194596 815448 178696 -283041 -388152 -353700 -406333 -512575 -673926 -1093706
37303 -1093706 -1717188 -1978066 -1441876 -440111 340436 649996 678340 573594 426536
37294 426536 473465 796937 998008 650161 -62068 -585383 -686436 -464370 49791 736262
37284 736262 1065549 636022 -49081 -51240 714015 1322684 1091002 336100 -309072 -722758
37274g22758l71278k72112O6514M19680M76272J39463m05370o85760l15648L40616
37264a330381L63338m29976r85941m67143M27455N40826J14830K91969J019442
37255d55581R82525j49974r54518m21041M47607K61109n75638o28789K67908R15821
37245c10571O90449J83837j23768m96302r40313q08911K5905O46720M32738L0161
37235f70055J93896M96637J77431l97338k81629M53353Q60562O43996L57795J58492
37225A993140l91486j139889j215021m48654K08394J76304O0326L56661M24493
37216B4268l58017j272416j148603n0811Q92265J011258O20067K66366J81157
37207A65534L06990L51272M4051l28220j45627M48743M65752l56891q64780k56766
$$ plain form
37274 -722758 -1094036 -1366148 -1299634 -879954 -403682 -264219 -669589 -1355349 -1670997 -1330381
37264 -1330381 -967043 -1397019 -2382960 -2850103 -2422648 -1881822 -1766992 -1475023 -455581
37255 -455581 526944 376970 -577548 -998589 -550982 -289873 -865511 -1494300 -1226392 -310571
37245 -310571 379878 563715 439947 -56355 -996668 -1805579 -1779674 -1132954 -700216 -670055
37235 -670055 -476159 20478 197909 -199429 -481058 -27705 832857 1476853 1834648 1993140
37225 1993140 1601654 461765 -753256 -1201910 -993516 -817212 -756886 -400225 24268
37216 24268 -333749 -1606165 -2754768 -2805579 -1913314 -902056 -281989 -15623 165534
37207 165534 472524 823796 867847 539627 394000 842743 1308495 951604 86824 -169942
37197a69942M57240L7877q11478m92635Q01552J309915N12979j64586K17941P39832
37187B438695L46101n25597r25180q38583p37015n86865k06373Q6302r421j58830
37177a116766M5420M20129O41619P81038Q46833M34986n15494j210779r72895
37168f45909k38210J39610J37107L05913O10262M39274k68061p37764m07186L17389
37158c47575O41294L74297K2570P187J10600j14014n37798m92755K14248P89006
37148F67060M24565n39683j041598o69942M3609N33262O43270K75703n26314j108549
37138a298617p30054K76851P46905K90094k39021j47517J72681J38816j10358
37129i00220k11253j90633q3517L06087P91927P41111J04050l14108j01985J45835
$$ plain form
37197 -169942 287298 325175 -486303 -978938 -177386 1132529 1645508 1480922 1698863 2438695
37187 2438695 2784796 2259199 1334019 495436 -241579 -828444 -1034817 -948515 -957936 -1116766
37177 -1116766 -1071346 -651217 -9598 771440 1618273 2053259 1537765 326986 -645909
37168 -645909 -884119 -744509 -607402 -301489 308773 748047 479986 -257778 -664964 -347575
37158 -347575 293719 668016 690586 697773 808373 694359 156561 -336194 -121946 667060
37148 667060 1091625 551942 -489656 -1159598 -1115989 -582727 60543 336246 -190068 -1298617
37138 -1298617 -2028671 -1751820 -1004915 -714821 -953842 -1101359 -928678 -789862 -900220
37129 -900220 -1111473 -1302106 -1385623 -1079536 -287609 453502 557552 243444 141459 287294
37119B87294J3273J9121M41542M65202m74536j435003j251711l32607J05039j2156
37109b174542J96669Q03247R28753L11305k51594j74425K05390L40056Q3060m76543
37099b08624j058611j090797k89375P12178J020602O52041L14187K18846p346
37090B63101l57389l81377j21799j33031m15097k80496M32547Q99546M83776l53014
37080C6767p75456o24499k76097O8283M37585P29836P62617N86381M35527L84941
37070A765885K48365j25108n28066n27975o5158K57532j30071q55508r61859k50960
37060a172923M29892M76410K95637L56305L50459p734j87759K33622N89450J60962
37050A524321m14218n4015Q64028R33461q1209r14851q03507m39651n48868p57297
$$ plain form
37119 287294 300567 319688 761230 1226432 751896 -683107 -1934818 -2267425 -2162386 -2174542
37109 -2174542 -1977873 -1174626 -245873 65432 -186162 -360587 -155197 184859 267919 -208624
37099 -208624 -1267235 -2358032 -2647407 -1935229 -914627 -262586 51601 270447 263101
37090 263101 -94288 -475665 -597464 -730495 -1145592 -1426088 -993541 -93995 389781 36767
37080 36767 -738689 -1363188 -1639285 -1571002 -1133417 -403581 359036 945417 1380944 1765885
37070 1765885 2014250 1889142 1361076 833101 767943 1025475 895404 39896 -921963 -1172923
37060 -1172923 -743031 -266621 29016 385321 735780 728046 540287 773909 1363359 1524321
37050 1524321 1110103 1056088 1920116 2853577 2772368 1857517 1054010 614359 65491 -691806
37040f91806m98614p1675n6909l24354k94938J86271P20823Q67977N27192J5323
37030C79290j69589J01476L64726J93497j87709l46943l49648m15064k77083K83495
37020d23552O36259Q2617p74719o49062M37564J045255M52725l29842j96922M66151
37010G46474N43843k06581j011695j101523l86553N71943J013589O90131J43427
37001A003055p6697k09334o61387r54893l14869Q55674J271556N97664j83675
36992A327094l73508l06278k81767m7541K79098P3172n35534n70399O6974J78963
36982a89726o74458j156031k42423R88998R83423M0861m39144k21354j65776l92865
36972a468495j29175O78464R98469K46691q07386j043241l08147N57863P22205
$$ plain form
37040 -691806 -1190420 -1262095 -1319004 -1643358 -1938296 -1752025 -1031202 -163225 363967 379290
37030 379290 209701 311177 675903 869400 681691 334748 -14900 -429964 -707047 -423552
37020 -423552 212707 295324 -479395 -1128457 -690893 354362 807087 477245 280323 746474
37010 746474 1290317 1083736 72041 -1029482 -1416035 -844092 169497 859628 1003055
37001 1003055 926358 717024 55637 -899256 -1214125 -358451 913105 1510769 1327094
36992 1327094 953586 647308 365541 318000 597098 670270 134736 -435663 -368689 -189726
36982 -189726 -864184 -2020215 -2262638 -1273640 -290217 -249356 -688500 -909854 -1075630 -1468495
36972 -1468495 -1597670 -919206 79263 325954 -481432 -1524673 -1832820 -1274957 -552752
36963e52752K19471j85033n0249R7014l43313q60445n25133L04792L43624m00436
36953a952460l99213Q14970J591676P56686l95395k02004P06352O78049j51999
36944A446662m08379q6133l87477j234714j157957J48020J130132P42550j35145
36935E7559k86942J65685L77352O3340m41249o95749l84976L32446O47345L3240
36925a31949p26581m21877P25625J234485M93528m86022p05971l81579j07809
36916e08150N7740J62397r993l36225k46400K98153N62911K19479j31373j01189
36906c2650k04789p58884j039440m07294M92123O43363K35118K80546R40926J246714
36896A395733N41792n95919j132879p81255j26399K01504J84551K04784L58764
$$ plain form
36963 -552752 -333281 -518314 -568563 -471549 -814862 -1675307 -2200440 -1895648 -1552024 -1952460
36953 -1952460 -2351673 -1536703 54973 811659 416264 214260 920612 1598661 1446662
36944 1446662 1038283 952150 564673 -670041 -1827998 -1679978 -549846 192704 57559
36935 57559 -229383 -63698 313654 376994 -64255 -760004 -1144980 -812534 -165189 -131949
36925 -131949 -858530 -1280407 -554782 679703 1173231 687209 -18762 -400341 -508150
36916 -508150 -450410 -288013 -298006 -634231 -880631 -582478 -19567 199912 68539 -32650
36906 -32650 -237439 -996323 -2035763 -2443057 -1950934 -1307571 -1072453 -791907 149019 1395733
36896 1395733 1937525 1341606 208727 -572528 -698927 -497423 -312872 -108088 250676
36887B50676K98427j28034m51907k04332L03848L80033L11j72451J51760M47649
36877H75980J87348m09937p11394m46572M5848J95320j99053o66161n66127J1984
36867a682764L20630J40349J65462P06135R10336J78717n44259j74174N93115
36858F13547L81463m31664l36443N33179M96447o24113r54880K14005J037745
36849I29286J75510r36308n58847M56532L00118o98282q67048j28079J90992n5677
36839a191803K55743J133991J194563N3791r10308p04903j3739K39447J74261
36830B31043J31555j35815o59044p22014J6093P19652N20948k15590n40466k59745
36820i13383J09489K60191K55817J07954j53805k25626J04259N31730O45651N35178
$$ plain form
36887 250676 549103 421069 -30838 -235170 68678 448711 449022 276571 428331 875980
36877 875980 1063328 653391 -58003 -504575 -458727 -263407 -462460 -1128621 -1694748 -1682764
36867 -1682764 -1362134 -1221785 -1056323 -350188 560148 738865 194606 20432 613547
36858 613547 995010 563346 226903 760082 1256529 632416 -322464 -108459 929286
36849 929286 1104796 168488 -390359 66173 366291 -331991 -1199039 -1327118 -1136126 -1191803
36839 -1191803 -936060 197931 1392494 1446285 535977 -168926 -182665 56782 231043
36830 231043 362598 226783 -432261 -1154275 -1138182 -418530 102418 -113172 -653638 -913383
36820 -913383 -803894 -543703 -287886 -179932 -333737 -559363 -455104 76626 722277 1257455
36810A257455N30148N70968L42825j38443n82639r21139j213421j189313n42358
36801a885917L01149M39612k25477o65545j50878O12880M90328l67109p37388
36792b188345j38852N79434O42798L58342K59680J70322j52257k33795K91941
36783d10732O86147Q6636q98442q81100J34171O61882L1700o13712j87588O94949
36773f96089Q06327J38771l34787j73080J75472K38963K4349k04931j98615O7445
36763a56175K34260l7321m12922k37761L27610L66134l05864o93403j89404M32252
36753f72594L26646r5232o0917K29577K00037M6656J89622K81448r6883m24766
36743g6406j23788K32159j01819n34484j05328O56093N30254k03056k41180L61029
$$ plain form
36810 1257455 1787603 2358571 2701396 2562953 1980314 1059175 -154246 -1343559 -1885917
36801 -1885917 -1584768 -1145156 -1370633 -2036178 -2187056 -1574176 -1083848 -1450957 -2188345
36792 -2188345 -2327197 -1747763 -1104965 -746623 -486943 -316621 -468878 -702673 -410732
36783 -410732 275415 362051 -536391 -1417491 -1283320 -621438 -589738 -1203450 -1391038 -696089
36773 -696089 110238 249009 -85778 -258858 -83386 155577 179926 -25005 -223620 -156175
36763 -156175 78085 40764 -372158 -609919 -282309 83825 -222039 -915442 -1104846 -672594
36753 -672594 -345948 -441180 -502097 -272520 -72483 -25827 163795 445243 348360 -76406
36743 -76406 -200194 31965 -69854 -604338 -709666 -53573 476681 273625 32445 393474
36733C93474L16352m30316n27516K16962L30415o10673r60806K31123J440785
36724C99800J062657j07808m13767P839j10399q22952j075935n65940R8593O73448
36714h54464J256725J333043L01537j158288j578960o31380N17412Q24600M00694
36705D10919j15780l29818j48901K20006L15133J6581j20726K42249M10361l70671
36695E29353j447291j381177J9121J367051J506196O81840k36536p42120o51488
36686c55051J3729P23593P39964O7017n03973n13805l16014k29520j4329M25044
36676C6655N85076J67605k70924r5219M14668M48325k22696j021889j277935p79978
36666b016312J74908R35997Q91429O9958p44874p75587o6146O26760O58511Q8014
$$ plain form
36733 393474 709826 279510 -248006 -31044 299371 -311302 -1272108 -1040985 399800
36724 399800 1462457 1354649 940882 948721 838322 15370 -1060565 -1626505 -1527912 -854464
36714 -854464 402261 1735304 2036841 878553 -700407 -1331787 -814375 10225 410919
36705 410919 295139 -34679 -183580 36426 351559 368140 247414 489663 900024 529353
36695 529353 -917938 -2299115 -2279994 -912943 593253 1275093 1038557 296437 -355051
36686 -355051 -341322 382271 1122235 1189252 685279 171474 -144540 -374060 -388389 36655
36676 36655 621731 789336 518412 423193 837861 1286186 1063490 41601 -1236334 -2016312
36666 -2016312 -1841404 -905407 -13978 55980 -688894 -1464481 -1530627 -903867 -245356 -157342
36656a57342m57805m41845o513J84675j47604m01040Q5401R33233J111462L92673
36646A095295l37652l91049j14071p5825j75951q5113P2683Q9158J61076L52845
36636E91396J28303p63672j411756p75772O29068J193748M30076l58461J4493
36627c22577R81333J142942K05585p67706q10633j26171L37054K2530o51268p96664
36617g85575j37475N73579M76881k23346n40920j52286J71772j19576l83851J77301
36607i43496J058277J002299j32536j051612p79663J10377M76966J54292j25556
36598b30652M5192L25214L23135J01427j02291j94103j40883M9230J41687j39928
36588A78028n73580n15056J67075O43661J37502q72181j137893l24728N36949
$$ plain form
36656 -157342 -615147 -1056992 -1063505 -878830 -1026434 -1427474 -1342073 -408840 702622 1095295
36646 1095295 757643 366594 252523 176698 747 -84366 -11683 77475 238551 591396
36636 591396 719699 -43973 -1455729 -2231501 -1602433 -408685 21391 -337070 -322577
36627 -322577 658756 1801698 2007283 1239577 428944 302773 639827 662357 11089 -785575
36617 -785575 -923050 -349471 127410 -95936 -636856 -789142 -617370 -736946 -1120797 -943496
36607 -943496 114781 1117080 984544 -67068 -846731 -736354 -259388 -105096 -230652
36598 -230652 -185460 139754 462889 564316 462025 267922 127039 176269 317956 178028
36588 178028 -395552 -910608 -743533 -99872 37630 -834551 -1972444 -2297172 -1760223
36579a760223N45710J52332K85123P94800O96077j73636p49556l03971M43155
36570g0189M01695l08619o61456k71255K45540L73913K70873R3367l59373r51165
36560a236669r63705j54648N82900L65415l67135n32318l7441K62396P6521L9792
36550a964892M35788O62866L76958J64725M73436P56536M55551O1897K55287N94914
36540B273066J77095p74683j153215o65655j29346l9044l531J82983Q7131l15696
36530c60895k63218M74422R04295K76005o18455o07087O6552K41093k85173n65123
36520g37584p9647N86085P54085M53789M5413k24611j65001J96898L32323k15368
36510I46382r50068r05962p8193N21577M06268K10815L98373M36013q9342m92770
$$ plain form
36579 -1760223 -1214513 -1062181 -777058 17742 713819 540183 -209373 -513344 -70189
36570 -70189 331506 22887 -638569 -909824 -664284 -290371 -19498 73869 -285504 -1236669
36560 -1236669 -2200374 -2355022 -1772122 -1406707 -1773842 -2306160 -2343601 -2081205 -2004684 -1964892
36550 -1964892 -1529104 -866238 -489280 -324555 148881 905417 1360968 1422865 1678152 2273066
36540 2273066 2450161 1675478 522263 -143392 -272738 -311782 -315313 -132330 -45199 -360895
36530 -360895 -624113 -149691 754604 1030609 412154 -194933 -128381 112712 -172461 -737584
36520 -737584 -817231 -231146 522939 976728 1022141 797530 632529 829427 1161750 946382
36510 946382 -3686 -909648 -987841 -466264 -59996 150819 549192 985205 895863 403093
36500D03093l6257P54912Q24079J69445k96708j91817M587n0430j35431q2951
36490A362522p7991k34744m44661o53990p75925m61986L95102J073771P35866
36481I17964k87818p73815k80273L32950L14767N6427K21773O06348N48775K684
36471A659782m67117m98348k09033J55817M15003M14119J43036j93121m20124
36462A000014n52085n65051k84121K92810P93472Q02162K45957n81874j137804
36453A3480q65542J91196J046989P10993m41342j004575m54674K00678R8032k08158
36443g12923P1390M85769J87648m67614m94287r008K7460l86392k46332N83534
36433i60755R50567L18332k91112P148N27423K58668m09860l96904K28767L67102
$$ plain form
36500 403093 366836 1121748 1945827 2115272 1818564 1626747 1631334 1580904 1445473 1362522
36490 1362522 1284531 1049787 605126 -48864 -824789 -1286775 -891673 182098 917964
36481 917964 630146 -143669 -423942 -90992 223775 280202 501975 1108323 1657098 1659782
36471 1659782 1192665 694317 485284 641101 1056104 1470223 1613259 1420138 1000014
36462 1000014 447929 -117122 -401243 -108433 685039 1487201 1733158 1151284 13480
36453 13480 -852062 -660866 386123 1097116 655774 -348801 -803475 -602797 -504765 -712923
36443 -712923 -641533 -155764 31884 -435730 -930017 -939025 -911565 -1297957 -1544289 -960755
36433 -960755 -10188 308144 17032 24180 551603 810271 400411 3507 232274 599376
36423E99376l44575j001444p74532Q0825P70895Q63288M25662k00154n41313l40539
36413d62511N9381O6265l01787l82969R2592M79916J67179m10343l60961K78908
36403g74330N22996j09684q50229p64794j6354N00932L96417P915l67754p16378
36393b171263q03999k26506Q05144J404786J095002M02218J1816r8693k31340
36384A87165k61578Q480K63622J56864O14K12054M10531k2581p03422o20746K33559
36373a35438P05328K19540l66934j68704L95184M17325l4911j57983K54605N78414
36363A706426L65243j28270m82430o22280o19837m09482L5985M53568M80806J07058
36353H86787k22265q7098L55624N11938J29639l29167l32042k6247N1609j73890
$$ plain form
36423 599376 254801 -746643 -1521175 -1440350 -669455 193833 619495 419341 -121972 -462511
36413 -462511 -403130 -336865 -638652 -1021621 -929029 -449113 -281934 -692277 -1053238 -774330
36403 -774330 -251334 -361018 -1211247 -1976041 -1992395 -1491463 -1095046 -1087131 -1454885 -2171263
36393 -2171263 -2975262 -3201768 -2396624 -991838 103164 505382 517198 418505 187165
36384 187165 -74413 -65933 197689 354553 355167 567221 977752 955171 251749 -368997 -135438
36373 -135438 569890 789430 422496 253792 648976 1066301 1031390 873407 1128012 1706426
36363 1706426 2071669 1943399 1460969 838689 218852 -190630 -154645 298923 779729 886787
36353 886787 664522 577424 933048 1444986 1574625 1245458 913416 887169 938778 764888
36343G64888k67292k7063K52488L25570L17074L79530M35309L70072J42662l09105
36333B384133q97943j198385r15818m59503m57324p67981o72009j6124O30564
36324b370390R68764J181991J085240K10635r50421j070423J2240O72371j71545
36315d31538j262539q24856P25302J441322P19159j31149j23762J55462q8612
36306A78789n17454l53710L65085Q87714P19024N4619n38099o29480k40647K60081
36296A85922N75733O36607L58225k86001q07647n03929L94506O61104j96666r76586
36286D1268n01829M73832L74550p17198j215684m89022M16824O58837O72233R13948
36276F27759R08289K61587m40989n17229j65514Q4418J82109K40260R4269k52219
$$ plain form
36343 764888 497596 470533 723021 1048591 1365665 1745195 2180504 2550576 2693238 2384133
36333 2384133 1486190 287805 -628013 -1087516 -1544840 -2312821 -2984830 -3000954 -2370390
36324 -2370390 -1401626 -219635 865605 1076240 125819 -944604 -932364 -259993 -431538
36315 -431538 -1694077 -2518933 -1793631 -352309 366850 235701 111939 267401 178789
36306 178789 -338665 -692375 -327290 560424 1279448 1334067 795968 166488 -74159 185922
36296 185922 761655 1398262 1756487 1470486 662839 158910 553416 1214520 1017854 41268
36286 41268 -460561 13271 387821 -329377 -1545061 -2034083 -1617259 -958422 -286189 627759
36276 627759 1536048 1797635 1356646 839417 673903 758321 940430 1180690 1274959 1022740
36266A022740l59064m3714K42857J71098J9637j3419k44803p36551q57654k56847
36256a055720M19935M78120K02747K12511L95132K81837m9164k59317m48726p30878
36246e53523o10186K42723J002690N90894o29391j193227n83989J56983Q2824
36237a494202m21675m91894m3186L96827N44157M68475K20898j11317j99214J89817
36227i41314P26070Q01760L19044j37512o5552K57007J28208n73882j104086p74661
36217a364918J04412N90531L00383k09195k85756L0408K18438n9895o65394j091804
36207b432790q24998R4390Q92147Q70985L48188K06505N46072N80841P124m68297
36197a79833l38450o7962p5816Q6566P21852J047951L44071o55152p08088Q3221
$$ plain form
36266 1022740 663676 619962 862819 1033917 1053554 1040135 795332 58781 -798873 -1055720
36256 -1055720 -635785 -157665 45082 257593 652725 934562 885398 626081 177355 -553523
36246 -553523 -1163709 -920986 81704 672598 43207 -1150020 -1734009 -1577026 -1494202
36237 -1494202 -1915877 -2407771 -2450957 -2054130 -1509973 -1041498 -820600 -931917 -1131131 -941314
36227 -941314 -215244 586516 905560 768048 702496 959503 1087711 513829 -590257 -1364918
36217 -1364918 -1260506 -669975 -369592 -578787 -864543 -834135 -615697 -675592 -1340986 -2432790
36207 -2432790 -3257788 -3163398 -2271251 -1400266 -1052078 -845573 -299501 281340 288464 -179833
36197 -179833 -518283 -586245 -662061 -575495 146357 1194308 1538379 883227 175139 258360
36187B58360O10077N68451N79150O85772J97040q38107j377334r71855m04726
36178f93172l10065k93628K9138K08158j16895m02315j18334K82905J59745j83274
36168a437737l1941N14264P11720K98704k74315n52029m30413k4196L14685J24908
36158g86350n25915q70407m24943K60902M29382K26779K49083M27122L00194P2371
36148f41782L07525P17871M47908l59762n33164K51171P85295J65036p74363p49930
36138c84195P5932N22508J52155m35606p29955p29806m21252K19745P45376O00762
36128c84336j0994l61326k50416q1847J2050K36821L80520M778n41927m02035
36118a398712L18328N62692J33068J09423Q57859J111227O6638j010883p06966
$$ plain form
36187 258360 868437 1436888 2016038 2701810 2898850 2060743 683409 -288446 -693172
36178 -693172 -1003237 -1296865 -1267727 -1059569 -1176464 -1578779 -1697113 -1414208 -1254463 -1437737
36168 -1437737 -1469678 -955414 -243694 55010 -219305 -771334 -1201747 -1225943 -911258 -786350
36158 -786350 -1312265 -2182672 -2607615 -2346713 -1917331 -1690552 -1441469 -1014347 -714153 -641782
36148 -641782 -334257 383614 831522 471760 -61404 189767 975062 1140098 365735 -384195
36138 -384195 -308263 214245 366400 -69206 -799161 -1528967 -1950219 -1730474 -985098 -384336
36128 -384336 -395330 -756656 -1007072 -1088919 -1076869 -840048 -459528 -454750 -996677 -1398712
36118 -1398712 -1080384 -517692 -384624 -275201 582658 1693885 1760523 749640 42674
36109D2674K18877J70421n63253m67011L85505M43253m82218q04610K7413N45627
36099d83322j12497o69538J7414R53834P55096o1696j59172L72491N20681K51577
36089A384868K29557K53939l53018j171269j092792j33346O09449O95177O60275
36080A082840O83863L46469k25944l53061j03397k90706r32585j033086k78300
36071a103907L39156J31617k40036l1372L31362J24409l53615k78268L60791P58235
36061C8372M30025k48044n69433k44957L08892L78376j62279n51307j71171L90100
36051d01426R3790q72751j203442l92079N38438O09254J59820l5249j1130k13244
36041a728019n27740n02906j28405K28106L59534K94782J89763L61515R10649
$$ plain form
36109 42674 261551 431972 -131281 -598292 -212787 230466 -251752 -1056362 -1028949 -483322
36099 -483322 -595819 -1265357 -1247943 -294109 460987 399291 240119 612610 1133291 1384868
36089 1384868 1614425 1868364 1515346 344077 -748715 -882061 -272612 422565 1082840
36080 1082840 1766703 2113172 1887228 1534167 1430770 1140064 207479 -825607 -1103907
36071 -1103907 -764751 -633134 -873170 -904542 -573180 -448771 -802386 -1080654 -719863 38372
36061 38372 468397 220353 -349080 -594037 -285145 93231 -69048 -620355 -791526 -401426
36051 -401426 -307636 -1180387 -2383829 -2775908 -2237470 -1628216 -1468396 -1503645 -1514775 -1728019
36041 -1728019 -2255759 -2758665 -2887070 -2658964 -2299430 -2004648 -1814885 -1453370 -542721
36032e42721J192937M61890p73770j084925k09935M22754n5108n41311O7531Q02586
36022b60072J73695j131109j094813M37730J454081Q14738k86227m48544J3409
36013c27112J57230O3289K77096N55525L56842m822J74143O82925O16233j71623
36003B379726p78402n71412r361J72235j2008n3027J49691J93619j19793m81836
35993H69432n73426m61587k97989J2201M86703O97603K47893m81749o44176p2333
35983b17428M44896K61699k65568l79997K4663L94937L06780j30643n00383m25199
35973d86243J26502O74581O37602J04808j87864Q4170K96682j60633q69354r60381
35963g40130l64866K15782L92662M25872N40213N88598M73196L39918K38833L7864
$$ plain form
36032 -542721 650216 1112106 338336 -746589 -956524 -533770 -588878 -1130189 -1062658 -260072
36022 -260072 -86377 -1217486 -2312299 -1874569 -420488 394250 108023 -340521 -327112
36013 -327112 -169882 -106593 170503 726028 1082870 1078048 1252191 1935116 2551349 2379726
36003 2379726 1601324 1029912 1020551 1192786 1180778 1127751 1277442 1471061 1351268 869432
35993 869432 296006 -165581 -463570 -451369 35334 732937 980830 499081 -145095 -217428
35983 -217428 227468 489167 223599 -156398 -131735 263202 569982 439339 -61044 -486243
35973 -486243 -359741 314840 952442 1057250 869386 953556 1250238 1089605 220251 -740130
35963 -740130 -1104996 -889214 -496552 -70680 469533 1058131 1531327 1871245 2110078 2147942
35953B147942k42445l93779l66076l14743l18530l62361m99079o81931o11520
35944a642522j75314J77364L4420k24234N5884O82007Q12253K71428j96443j50099
35934c55256l8522k22889k77076J57647N38731K00998n08348o87218k23186J21753
35924a293366p0230l31261j70538J65153J96160N1627K56646P87858Q93025Q1658
35914E66732j044208j345942m69171P48627J265995R26132L88490K22768L46988
35905A606411L00309j27015n95815n77495n0994L42786J02427l75785l23549K28392
35895E29672M86205J61962j07616R3950K52110j08514n32324m24919n1635O2666
35885C61557R5610L78466M99910K9617m15298q5951L65477k34046j383172j307118
$$ plain form
35953 2147942 1905497 1511718 1145642 830899 512369 150008 -349071 -1031002 -1642522
35944 -1642522 -1817836 -1640472 -1606052 -1830286 -1774402 -1092395 -280142 -8714 -205157 -355256
35934 -355256 -393778 -616667 -893743 -736096 -197365 3633 -504715 -1191933 -1415119 -1293366
35924 -1293366 -1363596 -1694857 -1865395 -1700242 -1504082 -1452455 -1195809 -407951 485074 566732
35914 566732 -477476 -1823418 -2292589 -1543962 -277967 648165 1036655 1259423 1606411
35905 1606411 1906720 1779705 1183890 606395 555401 898187 1000614 624829 301280 529672
35895 529672 1015877 1177839 1070223 1164173 1416283 1307769 775445 350526 298891 361557
35885 361557 457167 835633 1335543 1365160 949862 863911 1229388 995342 -387830 -1694948
35875a694948K52047J378431P37809n64193q20444j18716K96763J20918J10002
35866c02331N70009R22819P05032J56525k23215k05214L2313K8332m68378r81486
35856B34406p58620O9638M69601l347m99921k50895J80384j01408p32624o03192
35846a995978L78836J148365J055523N84527L68626L37711J43859j91105m13281
35837A417083m53195m30679m42076m82323m65389l11030q5853N5393J42650L66111
35827f89308O50433N86641L4023n30295n68348j21658L70579N94119M47501k5939
35817G47748m92939n01925j14784O1217k01161l31455Q9275N64860M89398J47377
35807D57611J31659K42861j11479p39699q75543m27100n3506q274J47722N61981
$$ plain form
35875 -1694948 -1442901 -64470 673339 109146 -711298 -830014 -533251 -412333 -302331
35866 -302331 267678 1190497 1895529 2052054 1828839 1623625 1655938 1684270 1215892 234406
35856 234406 -524214 -454576 15025 11678 -488243 -739138 -558754 -660162 -1392786 -1995978
35846 -1995978 -1617142 -468777 586746 1171273 1539899 1877610 2021469 1830364 1417083
35837 1417083 963888 533209 91133 -391190 -856579 -1167609 -1253462 -1198069 -1055419 -689308
35827 -689308 -38875 547766 581789 51494 -516854 -638512 -267933 326186 773687 747748
35817 747748 254809 -247116 -361900 -300683 -501844 -833299 -744024 -179164 310234 457611
35807 457611 589270 832131 720652 -19047 -894590 -1321690 -1375196 -1383470 -1235748 -673767
35797f73767P27208L73875m7285j11876n750j9519l2962J10994J84299o3784m33568
35786G865n09650j78738K98744N69466M41134N2199j79145m926K85427K53128
35776A035504M514N7553M68830N99463R369p90910q73172o4680P44508N87943
35766A778922m21559j168457q68418l5544K69707o7234j71732L48248P74119N02109
35756I40161L1982N8515L02021R4763m31559o70740o02632n66053l80121K45535
35746i78128P59830M15262l38543l70242K94778M99783p8988m20127L4110M59594
35736B77329J68686k14984N4367N10079K95092m13283p23392k92998M49088R26214
35726A036198P23029k17137j211033j241494k58484N58443L68008k23726k60298
$$ plain form
35797 -673767 53441 427316 380031 268155 262405 242886 209924 320918 505217 441433 7865
35786 7865 -501785 -680523 -381779 187687 628821 681020 501875 496949 782376 1035504
35776 1035504 1040018 1097571 1566401 2165864 2175233 1384323 511151 446471 1190979 1778922
35766 1778922 1357363 188906 -679512 -715056 -445349 -512583 -684315 -336067 438052 940161
35756 940161 972143 1030658 1332679 1427442 995883 325143 -277489 -843542 -1223663 -978128
35746 -978128 -218298 196964 -141579 -511821 -217043 282740 203752 -216375 -182265 277329
35736 277329 446015 231031 285398 795477 1090569 677286 -46106 -339104 109984 1036198
35726 1036198 1759227 1542090 331057 -910437 -1168921 -610478 -242470 -466196 -726494
35717g26494J30775K43644P5487J25915L72716M05849K57962K12545Q0796m36319
35707G42876r11630o40029K09126P51616O16156J97042k25573p36222j131839
35698a128477q99014m9229P17760Q91787O34875K86933k2098j63222j7413J55263
35688D07165p2245n51468o06072l4794N07408M43270Q2345Q8987N09264P76526
35678A550386M95979j72820q48133j292800j372435r11913J13543J213791J535349
35669C10947P51875l04327m14109N16291J256063Q28111k81130r39130q50109
35660H74482n56874l64197q7596K62137L44455J14602m4674P1378K47837K65900
35650A127450J07460k35406o69658p81286k76903L79692M03467j95428n90551
$$ plain form
35717 -726494 -595719 -352075 -276588 -150673 222043 627892 885854 1098399 1179195 742876
35707 742876 -168754 -808783 -599657 151959 768115 965157 739584 3362 -1128477
35698 -1128477 -2027491 -2076720 -1358960 -467173 167702 454635 432537 269315 251902 407165
35688 407165 334920 -216548 -822620 -857414 -350006 93264 175609 264596 773860 1550386
35678 1550386 2046365 1873545 1025412 -267388 -1639823 -2551736 -2438193 -1224402 310947
35669 310947 1062822 758495 344386 860677 2116740 2944851 2663721 1724591 874482
35660 874482 317608 -46589 -134185 127952 472407 587009 542335 613713 861550 1127450
35650 1127450 1234910 999504 329846 -451440 -728343 -348651 54816 -140612 -731163
35641g31163l43994O4088J34006Q1403K98060O55741P93225O58411L55938j36017
35631A829698o65102p05628Q925Q81265J003835K53386n84799p86352m39122j60450
35621F35656l16701o63720o82651j70738N54872J033664J108802Q88932M38974
35612B827090k01769p57402q41367m53066o4033m4925k18682j77021J00602J91417
35602C60844j72255o27453n28657J74690O83660L01408n35741p28289l4147N70456
35592e35484L18735k95407m32011j88507j74063l14876n7840M89238O07716J12261
35582d70238m24145n82634m31279r648O29379R04574K50260p38236p77790K57330
35572a392427J053886P70935J09979m4677O5305j21143l50709j65313R1260j59507
$$ plain form
35641 -731163 -1075157 -1011069 -877063 -795660 -497600 158141 951366 1609777 1965715 1829698
35631 1829698 1164596 458968 467893 1349158 2352993 2606379 2021580 1235228 796106 635656
35621 635656 318955 -344765 -1027416 -1198154 -643282 390382 1499184 2388116 2827090
35612 2827090 2625321 1867919 1026552 573486 509453 464528 245846 68825 169427 360844
35602 360844 188589 -438864 -967521 -792831 -109171 192237 -343504 -1071793 -1105940 -535484
35592 -535484 -216749 -512156 -944167 -1132674 -1306737 -1621613 -1679453 -1190215 -582499 -470238
35582 -470238 -894383 -1477017 -1908296 -1917944 -1288565 -383991 -133731 -871967 -1649757 -1392427
35572 -1392427 -338541 432394 542373 497696 563001 441858 91149 -74164 17096 -142411
$$ [...]
##END NTUPLES=NMR SPECTRUM
##END=
