##TITLE=31Pdec_ANY-165B-2
 CDCl3, 24 sc
 11.4.2019
##JCAMPDX= 6.0         $$ Bruker NMR JCAMP-DX V2.0
##DATA TYPE= NMR SPECTRUM
##DATA CLASS= NTUPLES
##ORIGIN= UXNMR, Bruker Analytische Messtechnik GmbH
##OWNER= root
$$ XWIN-NMR		Version 3.5
$$ Thu Apr 11 15:48:51 2019 Russian Standard Time (UT+4h)  she@DPX200
##.OBSERVE FREQUENCY= 81.013821
##.OBSERVE NUCLEUS= ^31P
##.ACQUISITION MODE= SIMULTANEOUS
##.ACQUISITION SCHEME= undefined
##.AVERAGES= 24
##.DIGITISER RES= 17
##SPECTROMETER/DATA SYSTEM= spect
##.PULSE SEQUENCE= zgpg30
##.SOLVENT NAME= CDCl3
##.SHIFT REFERENCE= (INTERNAL, CDCl3, 0, 182.463)
##AUDIT TRAIL= $$ (NUMBER, WHEN, WHO, WHERE, WHAT)
$$ ##TITLE= Audit trail, XWIN-NMR		Version 3.5
$$ ##JCAMPDX= 5.01
$$ ##ORIGIN= Bruker BioSpin GmbH
$$ ##OWNER= she
$$ F:/spectra/data/she/nmr/P31/1/pdata/1/auditp.txt
$$ ##AUDIT TRAIL=  $$ (NUMBER, WHEN, WHO, WHERE, WHAT)
(   1,<2019-04-11 15:47:50.87 +0400>,<she>,<DPX200>,
      <created by zg, POWCHK disabled, PULCHK disabled
       configuration hash MD5:
       00 E9 B6 7A A2 85 ED C7 34 08 36 98 17 FE 4E 26
       data hash MD5: 32K
       67 23 A7 78 5D 05 E6 BE 9C A1 35 72 E5 AB 2B 1B>)
(   2,<2019-04-11 15:47:55.32 +0400>,<she>,<DPX200>,
      <Start of raw data processing
       efp BC_mod = 2 LB = 1 FT_mod = 6 PKNL = 1 PHC0 = -1824.217 PHC1 = 123.999 SI = 64K 
       data hash MD5: 64K
       A9 16 07 D9 57 17 0F E7 E0 D9 AD C4 7E D0 0B 36>)
(   3,<2019-04-11 15:48:11.28 +0400>,<she>,<DPX200>,
      <pk PHC0 = -26.01441 PHC1 = 56.6 
       data hash MD5: 64K
       6C AA F0 FC DE C9 94 1A A1 5E C3 02 44 FA 8F 86>)
$$ ##END=
$$ 
$$ hash MD5
$$ F3 C9 75 25 E1 16 19 56 EB 8B 9A 0F BA 09 F2 DA
##$RELAX= 
##$RELAX= 
##$RELAX= 
##$RELAX= 
##$RELAX= 
##$RELAX= 
##$RELAX= 
##$RELAX= 
$$ Bruker specific parameters
$$ --------------------------
##$DU= <F:/spectra>
##$EXPNO= 1
##$NAME= <P31>
##$PROCNO= 1
##$TYPE= <nmr>
##$USER= <she>
##$AMP= (0..31)
100 100 100 100 100 100 100 100 100 100 100 100 100 100 100 100 100 100 
100 100 100 100 100 100 100 100 100 100 100 100 100 100 
##$AQSEQ= 0
##$AQ_mod= 1
##$AUNM= <au_zg>
##$AUTOPOS= <>
##$BF1= 81.014009
##$BF2= 200.13
##$BF3= 200.13
##$BF4= 200.13
##$BF5= 200.13
##$BF6= 200.13
##$BF7= 200.13
##$BF8= 200.13
##$BYTORDA= 1
##$CFDGTYP= 0
##$CFRGTYP= 5
##$CHEMSTR= <none>
##$CNST= (0..31)
1 1 145 1 1 1 1 1 1 1 1 1 1 1 1 1 1 1 1 1 1 1 1 1 1 1 1 1 1 1 1 1 
##$CPDPRG= <waltz16>
##$CPDPRG1= <>
##$CPDPRG2= <waltz16>
##$CPDPRG3= <>
##$CPDPRG4= <mlev>
##$CPDPRG5= <mlev>
##$CPDPRG6= <mlev>
##$CPDPRG7= <mlev>
##$CPDPRG8= <mlev>
##$CPDPRGB= <>
##$CPDPRGT= <>
##$D= (0..31)
0 1 0 0 0 0 0 0 0 0 0 0.03 2e-05 3e-06 0 0 0 0 0 0 0 0 0 0 0 0 0 0 0 0 
0 0 
##$DATE= 1554983270
##$DBL= (0..7)
120 120 120 11 120 120 24 19 
##$DBP= (0..7)
150 150 150 150 150 150 150 150 
##$DBP07= 0
##$DBPNAM0= <>
##$DBPNAM1= <>
##$DBPNAM2= <>
##$DBPNAM3= <>
##$DBPNAM4= <>
##$DBPNAM5= <>
##$DBPNAM6= <>
##$DBPNAM7= <>
##$DBPOAL= (0..7)
0.5 0.5 0.5 0.5 0.5 0.5 0.5 0.5 
##$DBPOFFS= (0..7)
$$ [...]
##$SUBNAM2= <"">
##$SUBNAM3= <"">
##$SUBNAM4= <"">
##$SUBNAM5= <"">
##$SUBNAM6= <"">
##$SUBNAM7= <"">
##$SUBNAM8= <"">
##$SUBNAM9= <"">
##$SW= 369.568048894756
##$SWIBOX= (0..15)
0 1 3 0 0 0 0 0 0 0 0 0 0 0 0 0 
##$SW_h= 29940.119760479
##$TD= 32768
##$TD0= 1
##$TE= 0
##$TE2= 300
##$TE3= 300
##$TEG= 300
##$TL= (0..7)
0 120 53 12 22 120 120 120 
##$TP= (0..7)
150 150 150 150 150 150 150 150 
##$TP07= 0
##$TPNAME0= <>
##$TPNAME1= <>
##$TPNAME2= <>
##$TPNAME3= <>
##$TPNAME4= <>
##$TPNAME5= <>
##$TPNAME6= <>
##$TPNAME7= <>
##$TPOAL= (0..7)
0.5 0.5 0.5 0.5 0.5 0.5 0.5 0.5 
##$TPOFFS= (0..7)
0 0 0 0 0 0 0 0 
##$TUNHIN= 0
##$TUNHOUT= 0
##$TUNXOUT= 0
##$USERA1= <user>
##$USERA2= <user>
##$USERA3= <user>
##$USERA4= <user>
##$USERA5= <user>
##$V9= 5
##$VALIST= <valist>
##$VCLIST= <CCCCCCCCCCCCCCC>
##$VD= 0
##$VDLIST= <DDDDDDDDDDDDDDD>
##$VPLIST= <PPPPPPPPPPPPPPP>
##$VTLIST= <TTTTTTTTTTTTTTT>
##$WBST= 1024
##$WBSW= 4
##$XGAIN= (0..3)
0 0 0 0 
##$XL= 0
##$YL= 0
##$YMAX_a= 33790
##$YMIN_a= -45110
##$ZGOPTNS= <>
##$ZL1= 120
##$ZL2= 120
##$ZL3= 120
##$ZL4= 120
##$ABSF1= 0
##$ABSF2= 0
##$ABSG= 0
##$ABSL= 0
##$ALPHA= 0
##$AQORDER= 0
##$ASSFAC= 0
##$ASSFACI= 0
##$ASSFACX= 0
##$ASSWID= 0
##$AUNMP= <proc_1d>
##$AZFE= 0.1
##$AZFW= 0.5
##$BCFW= 0
##$BC_mod= 2
##$BYTORDP= 0
##$COROFFS= 0
##$CY= -3
##$DATMOD= 1
##$DC= 0
##$DFILT= <>
##$DTYPP= 0
##$F1P= 0
##$F2P= 0
##$FCOR= 1
##$FTSIZE= 65536
##$FT_mod= 6
##$GAMMA= 0
##$GB= 0
##$INTBC= 1
##$INTSCL= 5.30512e-09
##$ISEN= 30
##$LB= 1
##$LEV0= 0
##$LPBIN= 0
##$MAXI= 10000
##$MC2= 0
##$MEAN= 0
##$ME_mod= 0
##$MI= 50
##$NCOEF= 0
##$NC_proc= -3
##$NLEV= 6
##$NOISF1= 182.463
##$NOISF2= 159.3651
##$NSP= 0
##$NTH_PI= 0
##$NZP= 0
##$OFFSET= 182.463
##$PC= 4
##$PHC0= -1850.231
##$PHC1= 180.599
##$PH_mod= 1
##$PKNL= yes
##$PPARMOD= 0
##$PSCAL= 0
##$PSIGN= 0
##$REVERSE= no
##$SF= 81.0140089999434
##$SI= 65536
##$SIGF1= 159.3651
##$SIGF2= -187.1042
##$SINO= 113.3802
##$SIOLD= 16384
##$SREGLST= <1H.CDCl3>
##$SSB= 0
##$STSI= 65536
##$STSR= 0
##$SW_p= 29940.119760479
##$SYMM= 0
##$S_DEV= 0
##$TDeff= 32768
##$TDoff= 0
##$TI= <>
##$TILT= no
##$TM1= 0
##$TM2= 0
##$TOPLEV= 0
##$USERP1= <user>
##$USERP2= <user>
##$USERP3= <user>
##$USERP4= <user>
##$USERP5= <user>
##$WDW= 1
##$XDIM= 65536
##$YMAX_p= 347553092
##$YMIN_p= -3071190
$$ End of Bruker specific parameters
$$ ---------------------------------
##NTUPLES= NMR SPECTRUM
##VAR_NAME=  FREQUENCY,     SPECTRUM/REAL,   SPECTRUM/IMAG
##SYMBOL=    X,             R,               I
##VAR_TYPE=  INDEPENDENT,   DEPENDENT,       DEPENDENT
##VAR_FORM=  AFFN,          ASDF,            ASDF
##VAR_DIM=   65536,         65536,           65536
##UNITS=     HZ,            ARBITRARY UNITS, ARBITRARY UNITS
##FACTOR=    0.456856943014862, 1,           1
##FIRST=     14782.0589164792, 0,            0
##LAST=      -15158.0608439998, 0,           0
##MIN=       -15158.0608439998, -3071190,    0
##MAX=       14782.0589164792, 347553092,    0
$$ Real data points
##PAGE= N=1
##DATA TABLE= (X++(R..R)), XYDATA
$$ [...]
42792 99957 44585 -119790 -294986 -444396 -536570 -489450 -294316 -95953 -24354 -37145 -42718
42781 -42718 -63330 -138079 -192499 -175899 -196731 -311111 -310036 4690 421913 524874 272119
42770 272119 34811 21317 28365 -116889 -226158 -85502 157802 214295 66195 -99021
42760 -99021 -218827 -353864 -462149 -439824 -331975 -268610 -233856 -125244 -7235 -60855
42750 -60855 -271988 -404220 -331760 -195344 -158588 -191644 -184746 -121053 -35810 69793 170368
42739 170368 177028 65559 -34886 6637 128800 140372 -32642 -240738 -271057 -82888
42729 -82888 134282 150051 -51554 -242742 -218270 -39793 72836 52476 47685 165058 305187
42718 305187 329160 255971 180148 93100 -66368 -232944 -245276 -70734 126442 187876 140523
42707 140523 117276 168048 222568 206955 127730 45007 14391 58967 152724 217299 176015
42696 176015 40589 -79398 -82001 27038 161609 258631 316512 345680 330946 254540 128906
42685 128906 1166 -61453 -12942 111134 201713 192558 137234 108547 69467 -48934 -174281
42674 -174281 -147114 40711 219149 287150 311498 312778 161661 -166664 -425589 -395433 -207691
42663 -207691 -130165 -136116 24358 364170 581642 493008 271267 158667 175129 232242 326286
42652 326286 459101 521831 419703 216385 39113 -65460 -100427 -73796 -74649 -240131 -525119
42641 -525119 -661777 -502316 -254496 -195240 -289446 -313952 -244802 -250421 -348202 -353893 -206033
42630 -206033 -88257 -139027 -237013 -191463 -9711 136286 123425 -25309 -193343 -262610
42620 -262610 -201903 -92832 -27964 3753 66394 150109 196941 216707 244496 211007 20204
42609 20204 -247367 -392139 -376377 -349938 -358257 -261454 -41826 60819 -94139 -268277 -166876
42598 -166876 108246 209662 67260 -37703 79101 267032 327551 302305 340569 441489
42588 441489 478890 397901 263842 150587 55925 -86899 -328366 -589826 -652688 -370371
42578 -370371 94124 369964 267613 -50043 -333119 -527427 -688379 -768687 -680044 -492151
42568 -492151 -377593 -373534 -364428 -302326 -274281 -315217 -318466 -214135 -106642 -127385 -237030
42557 -237030 -285306 -218724 -128861 -115034 -178885 -250020 -261288 -203549 -137339 -126787 -137101
42546 -137101 -48974 174985 389881 408426 211795 -49076 -235097 -324997 -363599 -398530
42536 -398530 -472228 -590176 -675233 -622789 -426952 -201681 -67018 -64002 -168854 -305492
42526 -305492 -336982 -150133 198922 496709 582749 494370 369778 282399 223417 173993 117260
42515 117260 21747 -121100 -271710 -394209 -487373 -532662 -488053 -386068 -346830 -411248 -451530
42504 -451530 -355348 -209266 -155785 -147547 -38339 115376 79267 -179839 -357218 -180956
42494 -180956 232416 538921 576749 463585 362243 319558 316330 319494 262493 98544 -90300
42483 -90300 -142021 -18312 131695 163548 101526 35767 -50189 -216665 -381073 -367786 -179270
42472 -179270 -52442 -138808 -262460 -165532 88685 184442 28768 -91699 57724 286514
42462 286514 243252 -78171 -341877 -334121 -177814 -58926 23488 129854 190544 106074 -59607
42451 -59607 -136267 -63504 57354 108919 73761 12711 -15554 -12718 -35032 -103465 -125516 16111
42439 16111 275269 442806 398640 273227 265187 367674 390658 223668 -33897 -204307
42429 -204307 -207803 -99648 2381 16593 -31538 -38272 44606 129764 98998 -36846 -148726
42418 -148726 -150930 -82589 -16938 47797 164925 328237 430157 367416 191427 96964 198187
42407 198187 352620 312402 52942 -168650 -123330 133404 369843 428308 296454 55405
42397 55405 -135828 -119077 67166 166293 16697 -211938 -258347 -146278 -110096 -209751 -270662
42386 -270662 -205697 -142755 -169989 -179319 -67894 84105 151716 138996 107807 56935 -24254
42375 -24254 -87105 -99387 -93421 -72264 11571 111516 66336 -166764 -392674 -422947 -322781
42364 -322781 -273219 -297765 -292906 -247615 -248944 -305394 -327741 -273525 -178922 -66590 53334
42353 53334 113356 46226 -101629 -224609 -295608 -334051 -288095 -107379 91558 113211 -41943
42342 -41943 -153774 -77273 84688 158407 116471 48536 23564 48819 78078 11420 -219008
42331 -219008 -516121 -671176 -602363 -439990 -325371 -248332 -160792 -119718 -190196 -296410
42321 -296410 -304054 -196672 -54948 80710 200924 235778 126812 -26863 -50273 63337
42311 63337 134831 64431 -23505 30915 209264 378470 466222 461911 327414 57840 -196674
42300 -196674 -228762 -33057 151202 122903 -40094 -97871 56869 309394 491562 540648
42290 540648 487832 380576 262863 184320 172904 195512 168349 29890 -173684 -289207
42280 -289207 -207056 -36264 -42860 -330048 -651193 -671777 -382625 -95959 -29810 -79557 -59325
42269 -59325 19115 35227 -24045 -100804 -210942 -372735 -465297 -354048 -126413 -9837 -52550
42258 -52550 -71188 53005 203944 222325 117640 6023 -42665 -9693 117306 298060
42248 298060 418864 403325 302231 222513 213312 251692 276514 209857 21425 -201149 -330271
42237 -330271 -365741 -415168 -481744 -417976 -162348 125708 278091 331984 393138 410149 274772
42226 274772 73336 21097 143509 215641 75169 -150903 -216204 -60219 140809 187521
42216 187521 58871 -96750 -142079 -96420 -73221 -96084 -69663 36758 96311 14474 -84670
42205 -84670 -8812 215396 366023 330696 233879 233505 329913 426111 455199 381765 184542
42194 184542 -72894 -228948 -178558 -8358 96224 59244 -30572 -59664 -22351 2989 -29972
42183 -29972 -85159 -113920 -137369 -214497 -337745 -418527 -389702 -266482 -96592 69000 137416
42172 137416 27826 -169029 -216026 -30072 162666 124989 -47741 -80577 68300 190978
42162 190978 189065 176378 199221 137527 -23508 -86481 50668 206189 199292 119330 122559
42151 122559 150049 73703 -32680 -19907 55190 37466 -21341 57916 242854 315337 231853
42140 231853 174790 215049 212632 125569 125249 271579 345890 197547 24984 77469 258958
42129 258958 293647 158354 65052 82548 71358 -9565 -20385 77897 122172 33296 -30132
42118 -30132 50258 127612 36264 -100826 -50229 141894 195433 10273 -211023 -287058 -272581
42107 -272581 -264519 -204476 -24238 161156 179817 39229 -114495 -204852 -240044 -178950 35870
42096 35870 316783 471712 437326 335836 272116 215174 125848 57286 49590 46875 11994
42085 11994 17925 119882 226470 217535 124454 69910 74384 51084 -25682 -69632 -7233 144459
42073 144459 331670 503148 584712 512948 334259 197372 198177 274922 292951 200393 72753
42062 72753 30006 129162 313091 445623 417537 242315 49354 -22189 69179 246687 392676
42051 392676 457203 487567 535256 563104 505042 399879 363603 404962 383539 216903 18972
42040 18972 -68408 -79854 -121829 -140519 23233 361829 663368 781288 790217 818157 861095
42029 861095 847695 780442 712455 648919 557092 431927 287713 125917 -31726 -118726 -91533
42018 -91533 4595 83889 112125 117242 134845 172358 203315 182340 101351 38358 92836 248981
42006 248981 362307 315915 137402 -65988 -218087 -278520 -221760 -92446 -19537 -73961
41996 -73961 -143973 -60662 153423 270627 133590 -141660 -307120 -271900 -159643 -96842
41986 -96842 -58573 28230 132271 183128 230064 373958 536246 486876 192625 -41166 55960
41975 55960 336261 436798 279998 117529 100284 91407 -26699 -128617 -73695 50298
41965 50298 84197 44164 37489 52065 2712 -101804 -193949 -268479 -326223 -290439 -133935
41954 -133935 6062 11688 -15422 59060 108343 -99105 -478867 -651784 -441164 -101056
41944 -101056 48276 -5242 -90746 -171239 -345267 -616001 -830433 -853591 -719349 -595005
41934 -595005 -608034 -684842 -585953 -178265 343062 611200 474696 126014 -152470 -236917
41924 -236917 -147412 42711 211424 243855 171092 142652 200406 218078 138914 104559 218201
41913 218201 332833 250907 28174 -106406 -62780 58852 175153 285780 349742 287111
41903 287111 135682 52317 107845 191292 157312 -17948 -245854 -406312 -416723 -309180
41893 -309180 -235303 -299450 -399110 -342364 -114269 102237 171356 128161 46949 -48391 -100769
41882 -100769 -25577 112453 95550 -145955 -367919 -301576 -2992 249726 324358 318543 329989
41871 329989 343040 344166 365045 375186 292854 150798 94879 148171 130969 -75696 -317976
41860 -317976 -360121 -190121 24355 214554 445287 672066 677549 359934 -47658 -193568
41850 -193568 -4647 246541 267578 46187 -199061 -291815 -255921 -218077 -221831 -192965 -82950
41839 -82950 23879 10196 -96346 -137035 -34786 95128 104298 8165 -59969 -37739 30596
41828 30596 116909 234830 328086 272040 57502 -134104 -136771 -7719 73113 50338 15562
41817 15562 18892 7845 -30354 -11987 93472 176428 143440 70462 88627 181499 225640 198564
41805 198564 197535 239506 194426 -12140 -247817 -324061 -220390 -60088 68686 149568 150805
41794 150805 54274 -35228 31909 225919 340338 284395 221969 308327 431632 389853 224174
41783 224174 150821 190765 119839 -150625 -381306 -339693 -142299 -59058 -101226 -55455 116373
41772 116373 193276 75961 -8177 148545 369582 318046 1818 -209006 -90361 153465
41762 153465 220742 122454 82081 159724 207073 158212 131065 190276 209060 78762 -88042
41751 -88042 -103473 34117 160319 174313 124801 102123 159340 307064 463843 442219 137525
41740 137525 -259862 -397512 -160496 188874 332134 232119 69621 -30056 -73617 -81598
41730 -81598 -50158 -20431 -57501 -135268 -137596 -16600 114745 102758 -57542 -199127 -162758
41719 -162758 18705 151899 115632 16614 49868 232911 384142 381840 324408 361269 464077
41708 464077 477624 343222 157053 32141 9649 93595 254236 371989 284338 -44044
41698 -44044 -445711 -694171 -700263 -543994 -350438 -179188 -27215 106396 198985 251322
41688 251322 315348 430884 552144 591528 524808 386627 185450 -59411 -196231 -34995
41678 -34995 350236 586549 428880 85654 -80586 -60049 -132721 -350103 -411145 -135993
41668 -135993 233625 379999 329461 314415 384996 408590 362618 368972 453106 498303 467667
41657 467667 467659 527899 500836 288421 32692 -49553 58888 185301 197322 112150 13863
41646 13863 -17914 94413 372754 686316 809297 651028 374359 214324 216712 233649
41636 233649 156144 50988 35678 95354 94702 -48409 -254014 -349819 -227183 69398 386405
41625 386405 586382 635777 587471 512421 464484 463293 455212 331685 74867 -140622 -114360
41614 -114360 104043 249873 198776 125732 212287 358352 348379 180608 32648 -19212 -33242
41603 -33242 -6958 120215 281544 331869 293097 314230 364237 240552 -42940 -177657 -20327
41592 -20327 158518 106982 8463 167687 485416 608008 487161 405933 470661 461838 263029
41581 263029 90997 148201 322221 412316 434444 501054 569345 525120 404837 329287 286508
41570 286508 169518 -7596 -101986 -42973 93922 208331 258005 236782 181975 188658 303899
41559 303899 419819 388805 236808 137913 176708 269605 333427 379804 401271 326400 173551
41548 173551 98856 169469 221862 105954 -35288 64552 390376 627253 563811 310102
41538 310102 58972 -158235 -353527 -407979 -226988 16969 18504 -273522 -568794 -577593
41528 -577593 -320754 -56745 -3697 -184979 -458394 -621355 -538301 -242659 84665 265513
41518 265513 257768 154137 79513 83294 102972 44985 -79472 -147778 -100960 -52208 -122929
41507 -122929 -235756 -217407 -78054 -15013 -123905 -281524 -360076 -379760 -375613 -294719 -137943
41496 -137943 -37571 -56846 -63258 47260 154718 131854 108516 271730 498943 477219 171078
41485 171078 -102600 -108128 40984 119157 80147 10412 -33628 -27094 55908 180276 259732
41474 259732 291209 361166 465274 467015 311954 135763 62540 39121 -14728 -30662 87922
41463 87922 277654 396740 412417 373015 283998 161582 122397 243169 391912 384214 265735
41452 265735 239207 329373 349504 241867 220743 454814 778518 878764 671236 345074
41442 345074 97493 -28697 -68005 -41697 14173 24426 -56613 -181601 -250296 -203218 -67238
41431 -67238 73701 146554 147627 143961 203327 316530 405125 413988 373837 350061 347290 301460
41419 301460 166716 -24620 -194244 -272728 -218574 -44209 145237 207846 127321 66911
41409 66911 174195 374672 473447 439982 444593 581369 704044 629310 400063 234659 266275
41398 266275 421747 524373 453256 243558 80047 128658 320657 393136 222337 5986
41388 5986 -15109 89549 60011 -134309 -230417 -62538 197970 293034 202062 88928 49662
41377 49662 59438 94479 156169 195891 139257 -2496 -124117 -142767 -79351 -27209 -61524
41366 -61524 -148080 -129618 117639 468806 599283 353590 -27172 -190740 -108462 -28831
41356 -28831 -40954 45628 317306 524570 423054 154132 42859 134385 202217 166380 201897
41345 201897 382396 497925 368222 124157 566 7525 5325 -6733 100732 332361
41335 332361 526908 579228 540708 481867 402181 305769 234851 187400 110764 11313 -30347
41324 -30347 18403 101135 169104 212105 184168 34147 -157286 -216004 -109015 -4946 -31410
41313 -31410 -110508 -120748 -79632 -54115 -27829 3476 -68597 -297177 -506507 -478868 -262863
41302 -262863 -108429 -123607 -184647 -182490 -160215 -162395 -127843 -20128 66545 30936 -89120
41291 -89120 -174396 -165152 -80998 37906 137930 142433 11620 -188342 -318237 -282468 -114608
41280 -114608 44890 67448 -44020 -161850 -179482 -131119 -136657 -247012 -378131 -387276 -198912
41269 -198912 114145 359207 382919 227134 70289 1597 -46772 -110295 -86373 73303
41259 73303 206263 146147 -13081 -57801 6638 -17528 -177022 -289683 -244610 -156452 -146507
41248 -146507 -170671 -163324 -167805 -197255 -127718 109363 339218 314571 22189 -305928 -444685
41237 -444685 -341245 -86742 161760 258748 169158 -10194 -168971 -275653 -306797 -177804
41227 -177804 137055 460285 527915 282644 -37135 -150765 -34277 82793 8400 -180046
41217 -180046 -241927 -85651 121990 193632 152883 121333 76944 -91107 -321622 -385572 -193590
41206 -193590 74744 210129 186567 74121 -91221 -252739 -300123 -211399 -109902 -77265
41196 -77265 -33916 88525 192240 162475 52416 -15189 -16585 31772 160709 313993 273308
41185 273308 -63125 -436376 -509891 -329943 -238777 -353412 -416945 -219588 95895 267925
41175 267925 255410 199944 187945 200426 224924 286177 379044 443075 408809 260581 73698
41164 73698 -31700 -23389 -12758 -105385 -234060 -246943 -141042 -79890 -166565 -320703 -412764
41153 -412764 -409795 -343609 -235679 -117399 -52021 -67473 -99876 -46778 131184 358744 479572
41142 479572 382680 147385 14660 132293 363605 439713 269305 -2978 -211087 -314152
41132 -314152 -340628 -319448 -290478 -286294 -292807 -305463 -389307 -564714 -672180 -518728 -166212
41121 -166212 95055 99867 -15690 -38231 70343 205253 265649 196242 5637 -179958
41111 -179958 -189220 -3580 214190 341003 424952 531835 591060 498239 279592 57940
41101 57940 -77881 -103879 -44160 10253 -45680 -184459 -230857 -64214 232356 474256 544258
41090 544258 421316 156328 -114811 -245644 -242291 -246648 -291708 -214267 79402 395522 455557
41079 455557 234856 -46490 -207739 -237588 -185200 -78222 36110 78691 9556 -123567
41069 -123567 -212314 -164609 -1984 119005 66594 -66654 -28431 284923 679385 864578
41059 864578 715662 325944 -67358 -196469 14452 285246 231452 -145412 -433132 -369758
41049 -369758 -172254 -142014 -212011 -142994 46321 150028 125193 65829 -53777 -293184
41039 -293184 -491971 -433942 -221796 -163538 -300303 -368596 -241183 -78641 2453 87558
41029 87558 202810 199224 27026 -130884 -138200 -103719 -176214 -332477 -474722 -553520 -511073
41018 -511073 -309166 -100326 -143815 -438898 -665298 -612194 -439506 -377416 -411294 -439804
41008 -439804 -499325 -600741 -556521 -244494 107057 174360 -21555 -184735 -175192 -116948 -124137
40997 -124137 -165829 -198352 -224125 -211466 -126767 -40195 -41715 -73747 -13655 99001 101269 -22539
40985 -22539 -89935 21436 215698 330867 331399 298771 316563 400551 481450 450219 277825
40974 277825 74080 -32170 -35016 -7663 20588 47219 21704 -84246 -174391 -131012 2761
40963 2761 70602 14034 -84954 -145632 -141033 -33530 191166 422529 496740 384807 195211
40952 195211 1758 -193526 -337226 -334265 -213414 -131618 -165254 -227944 -235877 -215078 -189678
40941 -189678 -107539 32541 92844 -53636 -340653 -554425 -535766 -308308 -47228 68384
40931 68384 18952 -46539 -10304 59580 43676 -17420 -5670 31851 -66327 -279127 -380742
40920 -380742 -268837 -100234 -15261 61374 222815 377894 403008 342740 305622 295671 291581
40909 291581 345027 434733 375835 81357 -214890 -233247 -50150 33835 -33675 -12312 188052
40898 188052 319247 171374 -86037 -118460 129802 368241 312858 6579 -230844 -143727
40888 -143727 192405 476134 537351 485162 462830 417374 256745 96072 120070 269075
40878 269075 310909 205571 134683 142959 34295 -276729 -571517 -637352 -549030 -464428 -341737
40867 -341737 -85812 172342 194553 -36019 -318467 -514936 -633853 -684241 -657939 -641798
40857 -641798 -746261 -907158 -931322 -754957 -497065 -254074 -23935 145851 139764 -24138
40847 -24138 -153823 -140155 -100219 -160846 -245413 -208462 -71981 10338 -48699 -220279 -433615
40836 -433615 -587519 -561306 -338898 -74364 70443 97511 85074 18149 -145480 -308424
40826 -308424 -319993 -218200 -208581 -377112 -579082 -650036 -580636 -433807 -237952 -44868
40816 -44868 34799 -34630 -125029 -89306 56650 171179 155704 25236 -134152 -219851 -183127
40805 -183127 -101144 -115460 -245899 -344110 -292807 -152643 -26641 102935 264490 330912
40795 330912 164285 -116899 -233230 -123155 -13438 -48624 -65520 123302 393222 458261
40785 458261 274151 81647 59024 124719 134194 104711 131962 190206 161242 33148 -62431
40774 -62431 -35128 47083 77312 57172 40132 -3554 -136388 -285264 -274226 -76676 98738
40763 98738 76207 -36521 -7193 170947 258372 102713 -166500 -327133 -313593 -198883
40753 -198883 -45030 111513 195750 147111 26121 -30262 33547 153070 266275 392736
40743 392736 556035 687902 669722 461588 158971 -81388 -163146 -110819 -33061 -30096 -115150
40732 -115150 -204538 -191809 -57218 97075 152440 115599 105508 183216 265485 257505 195504
40721 195504 166442 149782 72912 -7098 51773 217898 243986 -14641 -362305 -468906 -241957
40710 -241957 115212 352286 365382 199055 -6556 -82553 32571 208567 262286 180448
40700 180448 113217 147479 196095 144376 10121 -100385 -133041 -122989 -124788 -153597 -183915
40689 -183915 -179585 -128077 -51910 16309 59886 73778 60890 45998 56167 70270 42504 796
40677 796 38495 152083 186429 41462 -161296 -256917 -294122 -423298 -583156 -547514 -308347
40666 -308347 -151921 -246196 -385524 -317812 -138100 -132766 -347878 -548168 -554246 -401355 -180374
40655 -180374 60275 226823 202579 39686 -33338 104855 301633 344565 227838 91191
40645 91191 1044 -50043 4759 249423 555794 606453 269073 -166650 -281160 -14754
40635 -14754 284122 304650 108360 -50224 -85481 -106246 -159553 -153030 -60251 -26917 -167910
40624 -167910 -362096 -369662 -116162 229195 440558 436033 308613 215127 235477 318928 379309
40613 379309 424436 515294 594254 485922 149311 -187907 -280150 -173709 -114627 -192366 -248694
40602 -248694 -145196 51141 203413 282060 324165 326140 278072 237355 269506 343212 359557
40591 359557 282456 196938 230793 419638 639897 706772 586947 473250 554780 741597
40581 741597 759719 536942 325796 356739 522821 556272 410510 280582 288025 340729 328809
40570 328809 283276 257021 178162 -53540 -380015 -608625 -618431 -463105 -262668 -72874
40560 -72874 96552 198231 170170 39592 -80338 -134321 -191828 -301816 -349458 -185587
40550 -185587 112150 257407 100479 -157333 -199939 15921 219762 153293 -156000 -448861
40540 -448861 -491697 -274574 -7556 74886 -52939 -175512 -76584 205231 418173 387401
40530 387401 196763 63527 89532 182196 203085 145224 127237 215039 306824 257147 85072
40519 85072 -42529 -46333 -33528 -105429 -189855 -173444 -99037 -83313 -103993 -41052 94801
40508 94801 157339 109138 97436 227059 406756 498148 484082 399451 225860 -19003 -187906
40497 -187906 -150199 17827 122065 99517 52688 58300 82871 100773 152508 224577 191111
40486 191111 -18347 -259432 -306395 -141344 4155 -52662 -193541 -148682 132990 396384
40476 396384 409151 257382 197861 291090 343727 209744 -19760 -180403 -237025 -229325 -148458
40465 -148458 -3845 85094 29122 -54518 16214 190214 223407 47773 -106263 -58789 35545
40454 35545 -67930 -303181 -376130 -214292 -77794 -152330 -263856 -165613 58188 113407
40444 113407 -51627 -181278 -128043 -71204 -192821 -354256 -307571 -91772 30096 -31683
40434 -31683 -117332 -140954 -222801 -414762 -535170 -433941 -243478 -180857 -228272 -208642 -92231
40423 -92231 -14323 -21738 -11963 56967 80938 -10831 -136999 -192345 -182201 -166957 -170057 -198702
40411 -198702 -262625 -312666 -256712 -113953 -66077 -254532 -581845 -811062 -824391 -691902
40401 -691902 -522930 -370192 -284585 -337966 -517923 -663216 -590332 -292254 21944 98674
40391 98674 -140406 -521474 -746238 -625939 -230294 182724 389119 350496 164059 -73748
40381 -73748 -300683 -431231 -379860 -181992 -4280 44319 54078 170326 347652 380195 191420
40370 191420 -37020 -88665 37055 179528 240418 248395 250122 248843 242585 233598 195884 105020
40358 105020 2174 -42656 -42641 -101381 -276185 -476529 -536756 -384384 -125033 44959 24750
40347 24750 -92984 -136862 -61948 17829 9360 -35625 -27174 12452 -10549 -115761 -223108
40336 -223108 -249794 -179242 -64340 5424 -2002 22297 209917 467808 510592 258999 38160
40325 38160 179778 555819 758721 667441 549000 612534 758612 822965 794733 700144 518596
40314 518596 330543 316497 470365 527768 333724 79772 4984 58074 57596 7496 17010
40303 17010 48351 -3619 -80918 -58146 11663 -5609 -50802 36210 186224 151978 -90152
40292 -90152 -269922 -226351 -127074 -170929 -288782 -291976 -161274 -31622 10716 -13808 -51283
40281 -51283 -47908 23771 99971 70550 -37067 -22512 224045 502201 491399 142261 -249747
40270 -249747 -379979 -240576 -46504 58563 124984 237687 341065 309285 157977 69580
40260 69580 161590 317883 334291 177553 5074 -43342 20254 90050 68353 -80647 -285045
40249 -285045 -373539 -228166 51175 219045 147836 -47315 -158885 -87767 120619 354787
40239 354787 506904 520761 419384 273843 145347 77580 107731 221074 317689 299038
40229 299038 181381 65500 17279 39161 115101 199300 210598 144324 136042 278543 422911
40218 422911 333527 23826 -250686 -343687 -358231 -392644 -365972 -205038 -20017 51547 43113
40207 43113 62263 102207 85650 15495 -41318 -59766 -52713 -27897 -22922 -94728 -202713 -216611
40195 -216611 -125472 -96599 -204164 -256915 -84080 134824 69585 -285674 -583889 -578150 -376378
40184 -376378 -197037 -88694 -3193 21916 -81852 -249750 -320323 -236658 -123094 -138428
40174 -138428 -293524 -434992 -397025 -159548 136146 309074 270361 70679 -139160 -211716
40164 -211716 -119909 33168 156821 280064 440921 532468 408879 127856 -89121 -163029
40154 -163029 -238931 -408596 -551094 -545598 -450806 -352866 -227063 -89866 -79126 -201321 -214583
40143 -214583 1172 166292 -6621 -317863 -339241 -57186 136840 57915 -75862 -84054
40133 -84054 -59421 -71264 -7554 150505 237812 242080 392403 723322 889170 663342 317911
40122 317911 209521 252345 142896 -104002 -222394 -162670 -116041 -142958 -131037 -91658 -158418
40111 -158418 -284478 -262787 -81395 44755 46163 99150 271848 369174 261588 100455
40101 100455 45997 19514 -89277 -178411 -108470 42862 112130 100519 85520 12544 -189069
40090 -189069 -381080 -367493 -217637 -171928 -240674 -183101 64027 223572 78907 -197220
40080 -197220 -302874 -222428 -160937 -172329 -100898 120395 332909 373090 277987 190219 157523
40069 157523 109848 -14831 -183490 -287445 -231940 -41215 123465 107312 -62757 -202793
40059 -202793 -186090 -70458 7906 -2015 -43835 -36607 54158 179158 225810 145339 61396
40048 61396 138413 316983 335946 99969 -143660 -143774 -5059 8489 -86656 -39295 179361
40037 179361 281364 101918 -152251 -239389 -216963 -237636 -225901 -35100 200316 180393
40027 180393 -111278 -352206 -318258 -135074 -14628 28901 61883 27704 -128856 -243926
40017 -243926 -76537 340750 690645 753152 636008 550874 513969 412207 271962 266032
40007 266032 437190 580087 489052 226068 34832 38788 135178 175519 140192 101508 96764
39996 96764 98199 71466 13389 -57670 -119031 -151500 -138905 -62988 79164 231030 285027
39985 285027 196577 80046 115740 338265 574725 621322 438052 155620 -50115 -71256
39975 -71256 62378 171377 53844 -295050 -627474 -682360 -458938 -185520 -43104 -6814
39965 -6814 41837 143644 245901 292109 266972 178797 49281 -81530 -175377 -228279 -262296
39954 -262296 -279116 -244011 -135275 2319 82950 64871 -15223 -104440 -196650 -300993 -377466
39943 -377466 -365122 -279933 -228189 -289495 -417397 -491996 -457968 -375913 -331352 -318793 -244762
39932 -244762 -52635 179958 301187 242118 85175 -24756 -4841 121539 244603 227005
39922 227005 28905 -186336 -161184 167600 560115 731537 645586 459158 269774 72817
39912 72817 -85626 -105343 -241 86109 71655 16838 -10737 -19179 -7266 62120 149400
39901 149400 132270 -17433 -165448 -194227 -148319 -137682 -193981 -275471 -310643 -198265 100766
39890 100766 417075 477319 247194 18566 43078 228984 335095 310835 264981 226093
39880 226093 154103 118339 236345 443021 515229 356864 115760 -12590 16081 112144
39870 112144 166265 119446 -5386 -115150 -128328 -49297 47122 70789 -35976 -219857 -287525
39859 -287525 -93539 212913 303697 102950 -98703 -72507 40552 39229 42135 265970 589567
39848 589567 685831 519744 379189 417937 482901 433325 344127 314318 308956 272339 210223
39837 210223 114613 -10140 -36346 154780 415914 453428 242477 68639 98737 180142
39827 180142 159396 124647 186385 261977 253198 234175 279692 275214 83127 -225181 -457499
39816 -457499 -516773 -415409 -196112 51314 210924 269258 308577 330666 261718 173371 255655
39805 255655 475441 534308 323398 144900 259020 463186 404772 114553 -87131 -85923
39795 -85923 -61960 -153845 -315661 -472423 -577986 -553405 -382924 -226029 -228754 -283461 -190404
39784 -190404 8303 93182 16012 -64023 -67991 -74034 -107016 -88299 -18724 -989 -51809 -76443
39772 -76443 -42109 1625 70340 224630 410779 514295 557385 639562 708132 624592 444684
39761 444684 364305 374940 268418 37340 -47455 120618 270498 172168 8936 89277
39751 89277 373483 550900 488865 364514 378305 518848 620155 540984 288105 24826
39741 24826 -66400 36155 193730 283777 282637 183117 -10634 -169142 -97179 204452 489576
39730 489576 570374 519413 481189 466933 465468 561254 751238 812501 588052 283016 218190
39719 218190 366019 409205 238308 101514 201828 401488 450392 323770 193610 187819
39709 187819 302291 460948 552384 482459 297344 190937 278832 415073 361079 117185
39699 117185 -54592 30298 244871 334264 235064 91192 5911 -64826 -152996 -169464 -49989
39688 -49989 98319 128402 73271 93917 228133 336860 319018 244640 229714 300603 441733
39677 441733 653886 871373 928519 739393 451072 287493 273088 244892 131992 72178
39667 72178 193759 402320 492875 417591 325345 336338 386454 350347 244534 212013 317767
39656 317767 450968 462568 337837 187865 112106 117015 147011 156608 159741 212640 315786
39645 315786 346712 176296 -127064 -313675 -229647 21212 257446 434787 569298 580100
39635 580100 393141 125722 -28698 -61481 -107314 -182859 -187538 -149053 -207084 -308032 -193698
39624 -193698 179543 461035 344201 2632 -141869 26269 231107 225736 67205 -53099
39614 -53099 -63242 -13920 50250 121055 176443 182401 146488 121863 138222 157022 129488 79521
39602 79521 70722 98829 109201 140470 322794 659267 940039 991519 890327 795016 710629
39591 710629 606810 608456 798642 965618 889704 797643 1121103 1811248 2346257 2497794
39581 2497794 2617534 3011612 3547030 4153050 5162903 6648942 7812916 7683671 6294726
39572 6294726 4629880 3462793 2758717 2200855 1736243 1420092 1157028 868042 667165
39563 667165 670813 803559 920051 955259 868898 630413 357418 283123 462096 653335
39553 653335 612133 384850 217071 264778 478163 694546 781586 738294 677844 671318 646161
39542 646161 515739 342800 251597 242659 245043 285294 418361 544195 509945 368472 305459
39531 305459 316475 208153 -46606 -209108 -111676 122864 290629 347505 351646 334886 318169
39520 318169 315620 272518 140724 26434 80381 236434 283618 216832 251893 436218 533175
39509 533175 404740 233043 213536 279052 289800 260185 226844 122513 -36622 -60733 130570
39498 130570 358199 500659 703563 1042108 1245218 1066510 714741 579458 701659 859651
39488 859651 1016828 1288587 1566402 1592403 1384963 1205103 1098977 861954 496443 304706
39478 304706 411833 561533 550912 543211 739753 1015063 1122077 1057176 978497 913710 789068
39467 789068 645498 592742 594912 501087 281815 81317 27846 105572 216849 281521 278858
39456 278858 269332 370204 641574 996652 1272736 1378830 1331457 1176261 947726 708931
39446 708931 560279 558662 640715 667433 570960 443094 437886 581614 730682 739862 608804
39435 608804 420658 219463 37299 -31517 78504 265167 352619 324509 317758 367216 331677
39424 331677 152602 19297 125567 364757 442669 258202 6030 -108623 -100424 -89601
39414 -89601 -89376 -24311 102568 190014 191839 192381 288872 459893 599275 646265 639546 661827
39402 661827 758027 884137 923795 809050 651598 671309 925813 1198199 1262173 1172146
39392 1172146 1125656 1104269 893359 483284 189862 245154 475357 565831 489892 460840
39382 460840 560516 653486 642016 582844 518296 380766 147599 -39755 -19119 181327 356809
39371 356809 352715 240430 233273 410841 576236 478051 159311 -53753 44441 289082 384923
39360 384923 261088 70567 -40255 -21441 112770 254787 243299 91980 66711 338428
39350 338428 666459 680471 418829 301249 552817 928528 1078525 943932 686006 436573
39340 436573 266282 251321 415027 666225 879362 979266 923185 708585 441688 285255
39330 285255 281688 318854 303367 261752 238581 212451 160371 103798 53871 6649 8121 112402
39318 112402 268040 373990 448324 583818 728888 708225 511521 363089 413941 539445
39308 539445 545635 418440 264204 157982 161494 333848 592358 708216 589839 445499
39298 445499 505530 687299 706768 457293 119158 -76699 -69996 26377 60661 -2779 -29162
39287 -29162 126919 397309 553707 513741 435168 441983 444989 354711 286529 374219 522546
39276 522546 550120 481105 487469 598959 668841 606878 474773 353118 260874 217893 266011
39265 266011 399407 542594 608957 560424 451153 427891 604332 909664 1168175 1348093
39255 1348093 1571127 1824929 1873045 1577470 1130298 813632 692614 699644 836424 1084972
39245 1084972 1274033 1263392 1144529 1054008 929107 682956 476063 523104 722515 773905
39235 773905 612202 448064 417127 460736 523507 599074 603657 474349 372969 516159 816323
39224 816323 972385 903308 791647 708332 540879 334138 338853 607349 858436 879032
39214 879032 778812 717473 659923 551382 473502 465939 429140 351733 395181 603846 778668
39203 778668 800677 825577 974294 1092533 1041362 979689 1096324 1279452 1348858 1440892 1826522
39192 1826522 2427350 2816485 2694455 2154440 1507491 1032646 859579 914646 992464 994841
39182 994841 1037663 1220252 1410580 1413844 1247025 1077681 983156 938000 950811 1038009 1129158
39171 1129158 1153043 1151538 1179937 1187810 1127371 1066344 1058884 1037836 982220 1040692 1319522 1700568
39159 1700568 2042821 2392479 2807819 3179878 3448999 3782235 4295361 4866286 5519484
39150 5519484 6645705 8369826 10019985 10884445 11327788 12370121 14080568 15154153
39142 15154153 14407430 12145965 9719927 8169437 7618983 7621572 7803496 8444632 10446645
39133 10446645 14107747 17778605 18684643 15808669 11305571 8202968 7216210 6828851
39125 6828851 6024356 5442605 5718047 6216564 6202357 6134242 6780366 7878680 8926561
39116 8926561 10755995 14690761 19906369 23092637 21676173 16656528 11404962 8155943
39108 8155943 6573469 5400558 4264529 3503374 3149088 2854958 2496777 2231956 2062211
39099 2062211 1794981 1416198 1132452 1024295 962470 892904 913658 1014759 1020283 884506
39089 884506 797043 869915 940008 831904 633441 546632 608606 716269 803711 845462 801136
39078 801136 711150 737362 944605 1143171 1127238 981554 953382 1090016 1230488 1325677
39068 1325677 1509548 1803814 1990147 1904326 1693724 1630934 1769979 1939301 2029952 2138809
39058 2138809 2400064 2786399 3160509 3493833 3952819 4728306 5809601 6975568 8001877
39049 8001877 8822079 9465984 9884946 9881804 9232196 7919397 6289106 4902626 4105131
39040 4105131 3730051 3337770 2740817 2146077 1773725 1560433 1348195 1154754 1065353 1012484
39030 1012484 894326 813121 948129 1233464 1401876 1347738 1225150 1165840 1114152 987020
39020 987020 799735 576946 329207 180418 316172 704866 1050393 1137226 1060477 1000693
39010 1000693 951475 827815 678379 586132 476816 246488 4355 -37888 111453 228970
39000 228970 204821 155007 168792 153645 29805 -86138 -29710 175464 360144 436853 468219
38989 468219 522810 564077 516386 398181 353730 538339 954651 1404141 1633673 1550679
38979 1550679 1284821 1044871 945410 965066 1014783 1016781 955091 888411 903803 1040811 1267076
38968 1267076 1515206 1703796 1731783 1530069 1160180 806249 614562 574590 597138 653228
38958 653228 769182 939331 1139028 1383308 1652536 1788522 1633030 1298257 1111370 1189376
38948 1189376 1246663 996369 598236 461463 667634 869940 791026 544840 361418 251290
38938 251290 132149 87195 241715 483741 563241 448635 366451 467430 636932 679949
38928 679949 549265 347826 225366 300426 562163 815794 838965 626242 382282 270553
38918 270553 293565 418218 646798 919172 1114680 1224019 1360572 1520347 1505057 1207095
38908 1207095 813446 573287 494742 440268 402241 474241 614586 656094 550624 428458
38898 428458 393513 399154 353201 237468 104738 40171 121425 342763 603565 835632 1068414
38887 1068414 1272919 1255401 888709 379049 83235 77272 123426 68577 31553 136611
38877 136611 299919 396610 443601 486181 476034 404096 397399 525253 646225 617783 536961
38866 536961 586046 737665 813507 763713 679033 573987 381584 154693 50427 83515
38856 83515 97893 31964 13861 119616 229747 232037 189432 176111 117034 -36926 -120934
38845 -120934 34014 289765 339890 136073 -54086 -30852 120660 247928 336916 394314
38835 394314 335730 158467 68277 245074 588828 869509 1019668 1097058 1100879 1096135 1405955
38824 1405955 2289784 3390276 3888078 3389305 2379136 1607304 1294207 1177205 1062209
38815 1062209 961591 835044 590909 333404 284702 434977 545402 520891 497397 514346
38805 514346 406813 143732 -1279 197114 580952 804349 728333 477605 235830 128639
38795 128639 194645 328672 342219 197029 84812 170825 370214 494910 502838 461170 373114
38784 373114 211937 59992 48443 181546 338124 419270 408474 339439 287015 321736 396439
38773 396439 368980 217629 112419 165578 249543 209611 123457 162207 296044 341601 239633
38762 239633 103199 47102 130447 378167 673162 735743 450190 127662 170439 525943
38752 525943 770102 707952 553614 477639 346318 61512 -163217 -101183 137655 305099
38742 305099 409655 654394 1050819 1337406 1308347 1063574 873267 874424 958634 941888
38732 941888 797043 664642 634373 617224 507967 377815 381973 544850 765376 956010
38722 956010 1028702 850986 431437 64192 28734 194689 205474 17027 -79749 17640
38712 17640 57193 -111781 -280756 -245059 -103937 -7095 104526 295587 448767 506859
38702 506859 646541 968844 1250898 1252986 1052039 828458 560844 207921 -40120 -7116
38692 -7116 164114 250650 290710 380301 369699 143120 -21310 177702 500435 464802 103933
38681 103933 -93525 42382 189737 169115 200315 391223 481511 313036 123954 130826
38671 130826 188672 115350 21925 63484 155636 192984 277024 466976 558097 386167 136661
38660 136661 72219 135308 94994 -63520 -156040 -81760 135457 454373 751334 799724 549239
38649 549239 286464 278670 399374 366729 211124 194141 353398 461979 420379 373183 400745
38638 400745 374361 196184 -37993 -198434 -267271 -256860 -146964 15701 89041 -2847
38628 -2847 -160181 -221457 -137284 -7896 9570 -160195 -415740 -548043 -452754 -230336 -36491
38617 -36491 78643 120645 69088 -33201 -29392 151148 336898 334313 216601 190929 251050
38606 251050 201978 995 -181313 -259814 -343325 -478813 -520626 -365832 -128116 51047
38596 51047 204134 407447 577873 564177 377412 193667 156325 272229 470283 666290
38586 666290 780475 773298 683582 596822 570611 604280 666062 728086 778567 811058 812695 786822
38574 786822 793362 922925 1190923 1481382 1634137 1577919 1368390 1132323 983120 933526
38564 933526 878690 737011 607525 667450 892645 1044868 1003798 920633 923399 887095 701258
38553 701258 564714 717885 1008502 1060061 823821 623367 640734 695919 603218 426761
38543 426761 271220 111083 -36882 -46701 57308 44158 -140026 -203443 48051 360219
38533 360219 412964 323886 405935 582171 478045 73703 -170136 43857 431199 548620
38523 548620 376672 235175 277104 335907 241783 65455 -8405 85148 258211 395312
38513 395312 437298 372613 220412 40902 -80815 -98895 -46715 7328 32452 45632 71889
38502 71889 127608 220620 318287 331436 193583 -38258 -215358 -238394 -124878 52822 230725
38491 230725 352906 382196 338413 282343 253081 255151 281784 292825 211587 35231 -94070
38480 -94070 -53909 54000 29125 -95215 -38161 343095 826827 1089994 1061445 902541
38470 902541 755343 637939 514252 361188 212524 180741 344140 577448 633333 451907
38460 451907 226109 82706 -89218 -347006 -464371 -246087 92224 167238 -29329 -150022
38450 -150022 -42503 46574 -96401 -303405 -281843 -32764 184847 217178 165413 184428
38440 184428 265849 279801 184511 115025 215534 424500 529225 441288 287148 178814
38430 178814 58315 -120274 -226491 -153682 -40166 -57909 -90685 94334 413019 528804
38420 528804 374020 273707 438784 641179 582966 343513 214034 247006 234411 69837
38410 69837 -104987 -129517 -29893 55109 56171 29846 65405 162140 221282 189379 171021 308147
38398 308147 561408 733110 722150 623357 542360 465554 379183 355338 407368 398498 233520
38387 233520 34591 -20662 45261 62227 -40988 -183172 -274274 -276682 -167787 15743 127619
38376 127619 57463 -76945 -28186 264988 580673 668525 505298 263492 115431 116280 214326
38365 214326 314881 347643 298233 187569 53709 -33509 -2301 122069 199444 126814 -28892
38354 -28892 -117611 -82285 27639 164195 292019 322850 169076 -119003 -363501 -426286
38344 -426286 -304237 -82854 106387 108707 -126060 -408266 -442670 -170488 133674 193067
38334 193067 60610 6250 138339 282190 244084 71593 -24442 48076 151361 106047
38324 106047 -76768 -217680 -197286 -72608 48123 138532 196362 162738 29650 -43814
38314 -43814 104473 375412 492698 380375 262725 304844 353316 203884 -21698 -2155
38304 -2155 329179 688696 827534 807053 806332 826176 729083 480562 200084 -1209 -112432
38293 -112432 -154421 -127646 -58079 -12514 -18939 -20333 47583 165996 261022 293623 274311 207938
38281 207938 88031 -39372 -62937 90841 353303 558538 609998 575641 589864 679429
38271 679429 738930 693500 621919 647746 740109 731272 559964 388199 389152 493845 470988
38260 470988 232889 -62062 -217874 -191603 -49459 138811 292051 313120 195527 70801
38250 70801 56050 102997 83200 -28043 -144930 -198714 -172194 -60041 81597 94028 -112668
38239 -112668 -359306 -355374 -96698 83778 -45807 -306558 -387720 -287754 -261358 -394171
38229 -394171 -471862 -308277 -2398 232989 358197 486446 648469 720888 600049 357020
38219 357020 181243 202789 384696 566336 604866 496755 373156 364987 465813 536532
38209 536532 450945 229946 27099 -12556 123361 315369 415275 353549 181074 32024
38199 32024 25475 162112 312358 335013 215250 65373 -4177 21252 87468 133762 117557
38188 117557 43912 -1941 73771 223274 264742 118845 -47557 -31451 124627 218744 213286
38177 213286 272156 461866 632344 670494 664365 693757 661197 510608 431754 607491 894518
38166 894518 1036461 1100036 1365855 1806316 2040057 1885452 1606959 1457912 1319337 1033797
38156 1033797 788164 815779 929817 759859 356816 143492 250618 309287 35763 -317752
38146 -317752 -319173 60276 457530 588701 493702 362135 294259 253241 160409 9718 -102153
38135 -102153 -82815 34660 141742 199007 229920 206981 103483 46646 207947 495859
38125 495859 588412 377023 151554 185038 345101 330099 115427 -88050 -190513 -260743
38115 -260743 -286548 -185062 -27754 18188 -19857 46164 210580 230924 26104 -141491
38105 -141491 -26644 259360 433707 411883 325381 280853 264311 225166 132743 -7252 -113778
38094 -113778 -75277 91924 206472 120296 -116068 -341692 -440896 -353141 -65942 289508
38084 289508 458436 326336 83670 -5535 79656 167240 167646 124021 51411 -71048 -158512
38073 -158512 -68414 172005 346212 311674 159738 65532 87529 162551 203629 155444 26795
38062 26795 -99796 -146016 -116802 -33963 152661 451764 678845 627927 408246 369857 607991
38051 607991 784456 607136 272085 185488 388314 540549 420784 158133 -48349 -174719
38041 -174719 -255459 -249244 -155290 -101496 -172846 -264502 -235888 -115384 -22500 24983 79562
38030 79562 110707 51458 -38756 -37390 18042 -39776 -215519 -289184 -148716 1062 -67750
38019 -67750 -247903 -264866 -124897 -109216 -291287 -358315 -77664 291066 308622 -38914
38009 -38914 -331726 -290852 -80920 25563 26694 77620 186449 228830 171409 94337 40677
37998 40677 4783 28839 142830 229505 125421 -130611 -313148 -300134 -188908 -92424 -488
37987 -488 90561 100965 37859 70075 274100 448678 373700 143840 25754 57176 40835
37976 40835 -77030 -97940 81555 258954 220013 73402 97147 337452 549911 524696
37966 524696 315858 122491 61691 113881 213763 319262 411510 484807 549803 617290 662623
37955 662623 636051 548841 526331 691724 969538 1096038 909139 568976 383119 441199
37945 441199 540544 476650 292437 207459 387287 807821 1263966 1493133 1383835 1093870
37935 1093870 881828 812916 740020 583747 470095 517979 638890 664089 563416 422793
37925 422793 300839 229207 264220 396593 476353 372624 163621 32784 20834 27059 20946
37914 20946 80337 206899 261995 143990 -70616 -208942 -162242 40967 253616 314015
37904 314015 209004 109144 153888 247737 197056 10909 -102639 -39876 81359 145527 192664
37893 192664 262830 261547 116447 -59475 -116955 -100520 -171095 -345013 -473831 -484782 -483787
37882 -483787 -559341 -604732 -449196 -123825 121471 101561 -77493 -140709 48685 386520
37872 386520 705436 930050 1027447 946790 711655 469809 323257 183755 -65229 -332213
37862 -332213 -413858 -289194 -131127 -31459 86245 249667 339005 286625 201520 194094 226645
37851 226645 244099 305408 447106 536658 424118 171985 -12638 -36883 11086 28517 19200
37840 19200 50009 164329 338590 481641 499553 393903 261449 179575 150652 167337 234492
37829 234492 298397 277034 218671 295781 545584 743763 668510 396086 194889 196736 311256
37818 311256 409187 445426 425704 375828 337695 317223 274146 228129 286740 464859 576955
37807 576955 456075 198428 23071 -39448 -118558 -210352 -151161 88642 302530 317938
37797 317938 200501 106537 79882 89917 143472 243618 320902 312324 261254 260474 331996 419421
37785 419421 463817 443589 373537 296352 240071 165261 3057 -227607 -386181 -330809 -57219
37774 -57219 289550 526486 574724 524136 532792 631211 681268 585819 455220 445045 492217
37763 492217 388607 114556 -90826 -55972 90042 117376 4020 -89209 -75256 -25767
37753 -25767 -15618 -11092 46449 122049 118261 10086 -110393 -161161 -202846 -352795 -553428
37742 -553428 -554734 -232439 174040 307870 141718 -9309 62467 198608 159695 -7725
37732 -7725 -58327 90249 265137 296809 217219 152999 123388 29544 -179799 -402095 -473353
37721 -473353 -344021 -115309 106880 328330 580378 773963 753730 512667 255718 191231
37711 191231 306652 402570 326813 132810 2490 30476 109389 58916 -141975 -317669
37701 -317669 -312235 -160943 6222 134286 215979 185836 639 -207613 -225680 -23644
37691 -23644 210565 323955 354857 403815 480568 541104 572089 571025 519837 433931 376873
37680 376873 387662 442173 494765 497969 396811 194741 14218 -13113 90109 199102 274943
37669 274943 361373 422605 368973 248795 211765 250459 199759 55627 50346 288867 539169
37658 539169 549312 372958 196187 35299 -164873 -295729 -220129 -46986 -5688 -99813
37648 -99813 -137733 -77403 -82082 -217098 -330923 -292546 -148199 14370 172065 273047 221179
37637 221179 49837 -42530 59651 228515 287745 254849 262166 327228 357117 343234 389254
37626 389254 516104 574452 440535 222672 154012 289710 431487 399596 263574 194433
37616 194433 185481 107201 10651 135558 529846 876181 871119 629282 500597 575442 607749
37605 607749 413798 115996 -69200 -102680 -83984 -69409 -42851 -1987 24741 30448 45292
37594 45292 103582 208918 315643 352064 298041 231726 252270 354897 424286 353944 142695
37583 142695 -111343 -275579 -267534 -128573 531 22494 -19883 -32202 -8428 -9203 -35630
37572 -35630 -19150 70130 192810 320298 459806 586133 631715 574335 468035 356714
37562 356714 219793 44884 -96867 -106793 20411 169325 207629 113496 -807 1304 141667
37551 141667 304779 352934 247033 60102 -91797 -129036 -66848 -10319 -46622 -131193 -139086
37540 -139086 -45151 24023 -40421 -179195 -240493 -150834 40553 230011 317738 259469 128651
37529 128651 81856 199892 398136 532420 536963 424846 245948 110321 149416 345880
37519 345880 483136 392627 194277 150069 308945 451342 402841 259748 233703 366397
37509 366397 495631 477424 350619 243439 177103 63660 -90461 -111357 105502 385816
37499 385816 470248 364860 305160 391903 487971 499074 505116 530748 437585 187625 -3729
37488 -3729 51671 258221 416598 478783 464917 329737 110927 17038 141008 262691 174890
37477 174890 26936 73349 249694 307803 236500 218299 272620 281820 290527 425950 576741
37466 576741 518182 330426 313899 482542 531162 356734 222644 305923 449940 496376
37456 496376 509920 517210 373230 95897 9738 288911 614593 582248 268310 98518
37446 98518 265342 551580 687168 644430 563395 552972 616110 688851 713417 685347 631039
37435 631039 566546 513999 508581 525275 471066 342202 290422 396977 492110 384037 161979
37424 161979 48976 52150 19284 -46457 -29786 11124 -54748 -89911 163535 586811 751108
37413 751108 551855 360281 420746 516809 426420 309616 377612 503725 461031 305989
37403 305989 250926 339029 475201 615279 729931 734906 620451 507938 469530 455561 457995
37392 457995 521994 554165 411845 241073 371171 767245 976346 777611 485084 404335
37382 404335 410425 328592 309848 486831 632049 535690 397164 462434 583726 534897 462045
37371 462045 589780 751064 666810 462071 436080 519302 443800 289620 354777 583478
37361 583478 627627 444405 364827 549113 787111 886707 907216 951978 1016982 1079424 1104563
37350 1104563 982420 671805 345680 183785 122293 21440 -68478 -50970 -11613 -18424
37340 -18424 113194 523557 951478 1035725 831513 672662 666515 695712 769067 954306 1071598
37329 1071598 883506 537470 425495 634932 893095 1026824 1159002 1485156 2108919
37320 2108919 2986938 3787189 3994473 3463841 2668701 2099319 1692522 1207293 795951
37311 795951 697435 699123 508569 382007 708982 1191064 1180424 721385 492459 730612
37301 730612 959972 852553 650635 605807 636844 691547 873363 1079148 1048384 866278
37291 866278 883667 1071708 1018035 641570 344873 363455 510254 643429 840426 1041541
37281 1041541 1066533 1028386 1182424 1375888 1257113 1002479 1141428 1643895 1912281 1732508
37271 1732508 1483308 1336112 1052210 700227 746898 1227611 1604713 1661402 1775462 2107067
37261 2107067 2297310 2193392 2102475 2118898 1979039 1763944 1919536 2392373 2599108 2428680
37251 2428680 2375636 2527370 2418652 2082104 2160747 2709091 2990314 2778696 2739542 3187429
37241 3187429 3628304 3863024 4315522 4926658 5041588 4765908 5035758 5964515 6634097
37232 6634097 6904681 7725571 9198153 10231191 10709339 11987606 14597027 17653870 21110660
37223 21110660 25878512 30911955 33437147 33440201 34469472 38411276 43589684 50098769
37215 50098769 61878278 80475854 103505711 134752540 186941646 261585629 329481928
37208 329481928 347553092 301172147 220271562 148228319 103530277 77619416 59050430
37201 59050430 46137151 39454855 35638927 32089049 30126136 30247040 29415790 25582608
37193 25582608 20749163 17309084 14742383 11901766 9542640 8536868 7990070 6983425
37185 6983425 6195073 6214010 6074341 4971078 3815167 3651434 3935484 3701560 3179402
37176 3179402 3001766 2926429 2528705 2195213 2354420 2578884 2398915 2183128 2345729 2499340
37166 2499340 2236495 1959179 2096976 2250596 1945616 1544545 1576738 1780076 1628105 1277623
37156 1277623 1213478 1404466 1521187 1582268 1738637 1804759 1602322 1402504 1481191 1598897
37146 1598897 1429156 1134241 1029530 1041896 969019 918089 1038157 1162575 1131778 1119770
37136 1119770 1260974 1338595 1215813 1150821 1287103 1284873 909529 541473 596465 838770
37126 838770 800149 531263 399112 439743 445524 441559 564142 684290 628008 560555 699012
37115 699012 860941 757357 525567 502248 652357 693832 627956 673172 802817 816020
37105 816020 768659 880329 1094196 1188300 1281734 1763480 2675271 3563347 4014843 4010130
37095 4010130 3690641 3118678 2395334 1758080 1398685 1302430 1331321 1360286 1310021 1157115
37085 1157115 945506 736809 565162 466802 477180 550598 572258 501281 413249 376300 395863
37074 395863 480653 612091 661536 533075 372924 397382 529067 503609 342162 351203 588700
37063 588700 735155 631300 530833 615658 665064 478490 259250 257077 341251 266761 102484
37052 102484 60016 119359 140819 149107 216308 262117 241241 312373 549570 721643 648023
37041 648023 530122 616924 787800 809048 762812 839326 917849 771662 529438 512856 723014
37030 723014 879855 886832 888383 940417 973775 1017166 1124911 1154791 939906 608123 422615
37019 422615 397211 380593 399761 561567 719180 632212 398904 332035 431872 382259 89973
37008 89973 -152838 -108756 128681 366578 534613 613993 596835 567839 618484 677248 626410
36997 626410 537802 555920 614027 542442 403224 418196 597887 742423 785775 831210 857720
36986 857720 709999 403210 150162 61256 71712 149495 298664 383870 258658 61934
36976 61934 80184 314554 489043 483140 439417 446826 453438 500497 691659 904135 885462
36965 885462 670691 537895 516767 352507 34805 -80856 158533 424734 414001 273610
36955 273610 282783 420491 510566 540807 582796 598085 549527 531712 601857 645976 569564
36944 569564 448517 356224 233577 63407 -31942 -2940 32482 41783 182228 482795 671745
36933 671745 546829 308747 277014 435330 515040 420685 324832 382274 539742 622146 504962
36922 504962 238174 47141 115796 331641 390783 208617 43569 123093 341623 467476
36912 467476 478754 522268 652847 775363 791060 701985 610841 640440 773662 800926 574617
36901 574617 277935 223795 400215 482072 317879 104783 15748 -19155 -43059 73155
36891 73155 320529 415041 210456 -22717 11824 202752 256034 145364 59551 70276 122506
36880 122506 213720 331696 347146 202844 70373 91242 123837 1329 -128232 -23409
36870 -23409 221286 298809 165920 69001 126921 204850 213143 232073 284671 253402 119159
36859 119159 64507 210854 403061 392970 166468 -25938 35537 278844 428074 351686
36849 351686 225881 259771 363360 286785 35118 -121876 -66204 40865 113120 284494
36839 284494 554802 637242 399016 152773 219451 455433 525870 417594 335254 287154
36829 287154 161271 74102 239844 554939 685517 549519 382687 336942 325793 274600
36819 274600 234830 224656 197004 170766 187006 180811 111687 126709 326970 476394 276807
36808 276807 -125166 -263889 16591 397324 557494 474989 232219 -118211 -413219 -435027
36798 -435027 -225769 -80662 -138774 -234171 -218259 -154037 -106444 -7384 172587 350986 495263
36787 495263 623835 627386 382281 71514 49598 315106 479481 366736 254573 358671
36777 358671 487424 455765 453574 669246 868268 735985 411945 287365 422042 542986
36767 542986 526594 511698 565742 579578 521588 511495 582937 599719 476058 303835 198732
36756 198732 158709 129880 105963 114330 170669 267815 365255 404305 379450 362544 409534 486289
36744 486289 531890 539750 526193 477505 380489 257276 140808 71663 112812 264171 370495
36733 370495 269533 55530 10571 210351 398346 360499 220962 199678 256385 198619
36723 198619 29065 -55797 23511 130209 137322 91505 104036 175293 181679 21849 -228201
36712 -228201 -336736 -163374 140200 294372 237771 141090 80871 -54048 -255293 -267818
36702 -267818 50552 460998 650896 635707 631589 689727 716599 731213 812023 855197 676795
36691 676795 348650 172995 295603 567793 831819 1130578 1545337 1969041 2141140 1874149
36681 1874149 1252643 644183 424685 595031 767651 651470 413500 380015 531698 575590
36671 575590 432953 324001 357199 359164 210000 76447 161053 404606 576423 538997
36661 538997 341179 165835 221691 534283 813007 713474 284034 -54270 -45164 115328
36651 115328 143951 77191 116698 265889 368387 389427 414267 431187 344788 182402 86457
36640 86457 101900 143240 170505 225614 283707 247977 140190 137597 344180 641280 830096
36629 830096 821158 637596 358435 129180 92682 198886 202236 -15069 -226389 -144393 161793
36618 161793 359963 336729 318977 456270 558664 418321 171948 103402 221472 291102
36608 291102 210187 94666 18965 -58387 -90517 64235 363781 538900 444851 253537
36598 253537 180715 226992 321564 500796 751088 866423 699290 418184 281653 271330
36588 271330 195185 54659 24376 110505 121834 1307 -78903 -15105 63435 14454 -117124
36577 -117124 -208922 -225159 -197073 -164684 -190772 -309483 -421094 -368718 -161877 3211 -14283
36566 -14283 -154605 -271363 -262281 -90378 160955 256778 41094 -276323 -299258 26675
36556 26675 321690 312685 182193 191427 236298 79598 -167017 -156636 160432 454330 483833
36545 483833 353811 242259 143503 17338 -22869 131849 348539 360984 98821 -220500
36535 -220500 -343075 -236759 -71279 -1421 -25369 -48683 -31731 -27360 -87945 -191297 -272016
36524 -272016 -279715 -191295 -20853 155316 242022 235079 237255 321459 428443 445348 333458
36513 333458 136135 -71242 -187266 -132376 19664 47344 -154266 -381185 -344431 -46156
36503 -46156 238289 339605 357677 410035 430371 332744 204063 171521 196020 168775 125115
36492 125115 170523 249049 205173 78464 107433 368135 616593 621952 492223 500647 704110
36481 704110 920837 1014872 1004019 910606 703482 416430 164934 8604 -72560 -59167
36471 -59167 84935 251198 246457 79335 -18205 43146 40769 -199892 -481771 -506913 -319210
36460 -319210 -201263 -218239 -163496 56930 280722 384094 458404 588264 670036 588138
36450 588138 412003 280300 209234 142327 90375 93082 113339 95422 90413 211774 465664
36439 465664 699029 737958 557342 303587 136039 47918 -96029 -316842 -427290 -286214
36429 -286214 -40158 63385 31431 72932 223346 291054 222385 238742 474411 712166
36419 712166 668675 377128 92040 -63690 -159661 -244956 -265791 -180687 -28150 118158
36409 118158 198196 208928 234039 348087 465346 417531 227171 126661 213969 283605 143991
36398 143991 -82158 -159778 -81190 8134 83814 204815 307544 287921 221797 262736 366854
36387 366854 351579 194121 47758 -8009 -12707 42305 190959 333302 346910 328424 447888
36376 447888 578085 394929 -104251 -515781 -572715 -456625 -409257 -338752 -51352 355339
36366 355339 602829 601702 483199 364641 283651 273349 310858 266341 80264 -81974 -31359
36355 -31359 152187 214571 76891 -89296 -118471 -12538 155024 332115 452408 441937
36345 441937 315178 180357 119329 132038 207778 363019 572846 727125 704791 488135
36335 488135 202005 34718 77934 226640 288243 209655 121424 127358 163366 145610 141758
36324 141758 252183 393685 373108 164281 -43839 -97573 -45538 -17573 -52959 -108556 -150190
36313 -150190 -166077 -140045 -70136 6899 38347 -9650 -132224 -264042 -295049 -175607 -9374
36302 -9374 33881 -75747 -178663 -127620 17397 67021 -42496 -147412 -47974 231541 439665
36291 439665 381293 149640 -1877 6426 336 -151445 -296198 -185332 168104 480901
36281 480901 542029 417856 293266 253985 292136 400014 547488 639039 601212 475422
36271 475422 339455 182731 -35414 -231604 -235752 -18184 219903 246205 32010 -260916
36261 -260916 -469678 -537663 -476429 -323260 -158619 -91360 -165951 -298796 -344899 -234816
36251 -234816 -37119 109715 120676 28543 -63102 -86992 -66350 -61349 -88007 -121305 -158831
36240 -158831 -222967 -290301 -280338 -153682 18944 128760 142992 111516 91475 108188 161134
36229 161134 215910 206987 98041 -67410 -206970 -268760 -232543 -92649 99904 222493
36219 222493 190260 61760 -32012 -34734 30277 150952 309253 404570 333812 157391 57014
36208 57014 103432 183827 184405 122116 64402 48056 116214 293542 466765 436803 171549
36197 171549 -126431 -281502 -324770 -325344 -228685 -17748 130879 56501 -133734 -226593 -219756
36186 -219756 -259731 -345593 -344177 -263829 -255439 -328761 -309667 -126929 71893 148406 124049
36175 124049 50111 -76177 -200999 -214156 -134561 -102983 -117683 -1265 260560 393715
36165 393715 230258 12156 65794 333024 483342 385057 201773 83606 26059 17717
36155 17717 75808 112797 -3687 -213060 -293571 -190845 -109420 -187837 -278335 -184771 35529
36144 35529 171400 161433 135312 196745 303690 355926 302323 165604 35436 23809 154723
36133 154723 307512 339990 265367 236047 339839 483880 525609 471061 466797 588548 717508
36122 717508 700752 593858 616907 833565 1009360 904844 608476 407441 382429 345409
36112 345409 189009 51758 32833 -26973 -281513 -555779 -536682 -224909 44553 34916
36102 34916 -155022 -321702 -413453 -460854 -427595 -284237 -133952 -108878 -169125 -131827 81496
36091 81496 312172 328845 100959 -139595 -145059 54976 184274 81463 -70741 6500
36081 6500 290262 490981 468297 389058 407523 416960 277221 108294 128144 289036 318800
36070 318800 120709 -81962 -58842 130917 243449 151214 -48767 -178500 -162608 -76070
36060 -76070 -37144 -69232 -99075 -88027 -83387 -97797 -41072 130202 282527 254745 73237
36049 73237 -120080 -286034 -459154 -554714 -430861 -153172 26327 7084 -47507 911
36039 911 79635 105042 149922 263950 319647 215479 70844 26355 -3040 -153394 -310083
36028 -310083 -238449 42093 267503 299750 251788 228461 177819 62215 -31102 -50694 -89780
36017 -89780 -221244 -345330 -319651 -162610 -20127 29140 49224 137455 293217 410075
36007 410075 395160 285093 202362 189905 169017 99079 63283 104129 103015 -20787 -106975
35996 -106975 32317 269255 292723 71109 -97740 -47020 32148 -62246 -231055 -281132
35986 -281132 -230114 -199383 -165851 -41803 100828 91690 -106060 -372515 -569074 -577593 -321257
35975 -321257 86150 325231 209274 -42625 -79337 105880 206396 66715 -144758 -240966
35965 -240966 -238143 -205122 -119304 16519 93874 60717 32104 124389 280591 358004 302810
35954 302810 157063 -22249 -172528 -228464 -184520 -96112 11771 149715 259925 240596
35944 240596 122295 68070 117199 95226 -91066 -232033 -85715 235284 372680 182511
35934 182511 -122132 -289724 -294964 -248088 -221574 -248484 -356856 -507888 -584342 -517611 -366730
35923 -366730 -225916 -125378 -64346 -56013 -80955 -73544 -17352 21189 18925 66118 212605
35912 212605 322037 216724 -61798 -275224 -279810 -169137 -93268 -60719 226 77304 90355
35901 90355 42481 41974 146058 259122 242235 92036 -47176 -53822 34213 82751 33612
35890 33612 -37091 -37210 18497 43415 8730 -13832 56304 204061 313879 262222 33940
35879 33940 -232560 -343041 -228293 -8286 159201 255083 361182 489818 562649 554744
35869 554744 529027 488876 331976 40868 -192750 -162296 101791 400672 632948 844178
35859 844178 1036669 1101723 982501 770276 578937 430332 323177 307902 403068 513060
35849 513060 527664 466001 442000 509812 605562 625085 516334 321757 164148 146863 223889
35838 223889 220590 43618 -177869 -231638 -60397 218617 484242 684828 757770 624146
35828 624146 328501 81257 58874 195659 257003 113297 -126060 -260084 -213700 -73506
35818 -73506 42234 80558 35540 -79283 -199169 -215474 -90146 67214 114351 56302 33269
35807 33269 133931 304376 443141 489115 405481 199123 -2098 -23435 126030 220918
35797 220918 123720 -3356 57255 227550 235757 29289 -140777 -84281 81423 139664 66389
35786 66389 -14721 -58229 -126038 -228267 -265675 -153817 61447 236334 255145 126465 -29071
35775 -29071 -92616 -56328 -12593 -44425 -147590 -246722 -258256 -154910 -1541 101018 147910
35764 147910 255003 479861 677387 655388 443914 263930 229937 252171 267419 366534
35754 366534 576493 690985 509549 150389 -79674 -93949 -99949 -238860 -350351 -211318
35744 -211318 121441 367789 383701 306108 300313 301397 137750 -146362 -274360 -106758 119945
35733 119945 69004 -255924 -518611 -488728 -293959 -179866 -177432 -129730 37292 198879
35723 198879 176678 -64447 -361916 -485408 -356776 -138055 -40630 -64198 -30959 122268
35713 122268 233936 151792 -59479 -221376 -232836 -84559 183325 438459 501321 355308
35703 355308 203723 206081 278966 276881 223565 206861 193435 144258 172367 344960 447841
35692 447841 238480 -124116 -204339 151888 651356 954546 976334 777038 454983 209401
35682 209401 215553 339146 252566 -57846 -198997 60479 428239 515951 369341 301982
35672 301982 398573 469916 368400 87787 -332514 -746304 -859860 -541465 -104812 4228
35662 4228 -221373 -363686 -162803 185532 357960 280683 95125 -50936 -75476 27516
35652 27516 158349 190196 123260 69813 80557 102517 106539 116959 108890 26076 -84397 -111250
35640 -111250 -72644 -101758 -204775 -218708 -81209 37160 -22184 -180063 -265702 -267899 -295822
35629 -295822 -361544 -340826 -139369 179526 427417 431361 192624 -76132 -139450 13127
35619 13127 176204 189422 91857 4056 -21510 10821 84663 143373 111951 3584 -77693
35608 -77693 -78044 -47568 -29325 -6240 11799 -27992 -112798 -167220 -195442 -270293 -345401 -263660
35596 -263660 -24867 147635 111419 -9276 -58847 -75229 -133227 -164161 -122228 -148111 -341351
35585 -341351 -521872 -463443 -242156 -97956 -53064 56999 244520 351339 342615 341292 367912
35574 367912 313734 198976 195805 331145 399472 258444 24293 -104805 -63787 90527
35564 90527 251039 285039 141917 -40152 -88682 -54989 -137840 -360721 -540281 -578248 -547420
35553 -547420 -475024 -308684 -133889 -128118 -224434 -134789 178448 385078 302055 178822 231848
35542 231848 233976 -95433 -558088 -729874 -576853 -422825 -408052 -381487 -293331 -291682 -376598
35531 -376598 -317282 -36920 202857 154452 -81921 -219040 -128552 95744 306663 424966
35521 424966 457633 466148 484093 463773 361149 239476 189527 177440 94002 -60515 -167347
35510 -167347 -160398 -88090 -11292 45834 57011 20701 4746 54019 99181 79554 77599 164045
35498 164045 203835 52611 -123707 -28118 274998 383228 142339 -132644 -163901 -97426
35488 -97426 -151698 -187760 34480 375669 473689 295195 168688 272423 426801 459184
35478 459184 461808 544402 587257 448295 245052 196266 270492 231977 30101 -83564 94661
35467 94661 428825 632542 630775 568786 527576 429777 241753 75753 6672 -59191 -215032
35456 -215032 -373983 -396501 -306475 -231556 -195568 -129812 -49608 -55267 -164017 -279589 -325756
35445 -325756 -295598 -200062 -95195 -109076 -281285 -423542 -326185 -60106 140247 246719
35435 246719 410830 572529 441137 -21524 -418105 -409121 -139822 35812 39493 35768 83772
35424 83772 83374 -20108 -186993 -364763 -457036 -326938 -15287 166657 -18419 -385030
35414 -385030 -537446 -360269 -84541 66535 66609 -34629 -178797 -242952 -130577 56524
35404 56524 109036 -18211 -181142 -277922 -335278 -376856 -386046 -402978 -488138 -584713 -577338 -481093
35392 -481093 -409408 -375276 -307847 -246560 -310986 -477494 -598142 -648526 -729166 -800950 -676124
35381 -676124 -343799 -63446 -30498 -153719 -258731 -305637 -304825 -232981 -157142 -234288 -448072
35370 -448072 -548755 -409731 -239806 -257198 -349749 -285096 -94219 13265 7251 49597 201982
35359 201982 350610 394435 317686 119363 -134958 -241137 -57821 238544 322305 148133
35349 148133 -10119 22134 101070 51561 -44083 -225 169790 276289 219172 95085 50970
35338 50970 119485 206756 200844 89825 -21171 -27710 52058 113943 105310 59122 5270 -62495
35326 -62495 -128098 -163742 -221872 -402862 -673665 -826398 -713499 -450806 -280367 -280412 -326857
35315 -326857 -314513 -278331 -270417 -248832 -172878 -122207 -205017 -373830 -444587 -321526 -117859
35304 -117859 -9917 -39327 -120485 -189322 -255058 -320376 -343933 -305556 -236730 -151832 -14895
35293 -14895 172049 304589 283278 165164 117175 200430 285952 240847 130176 133756 281927
35282 281927 392695 310610 102867 -59181 -117408 -104983 10244 271134 533323 540484
35272 540484 271105 17976 1675 77876 -7130 -222694 -332519 -265248 -161761 -97055
35262 -97055 -6089 103812 107273 -16681 -124277 -138807 -149692 -197345 -150859 79311 361897
35251 361897 506140 482412 374893 240625 133706 150249 311270 482941 528423 461033
35241 461033 351043 184878 -58387 -280228 -353033 -284554 -179540 -94007 -32772 -27744 -100651
35230 -100651 -189730 -213802 -174431 -123425 -87230 -87850 -153211 -228196 -174921 38379 243375
35219 243375 273447 168910 77307 52051 64109 101442 125562 42731 -137577 -232662 -133495
35208 -133495 923 -24451 -141832 -165760 -115204 -135131 -185175 -92112 120684 230737 141447
35197 141447 -36496 -213530 -370120 -393486 -169054 133473 177628 -58166 -218900 -104214
35187 -104214 41460 -62299 -305030 -384666 -226286 18096 222883 327088 258451 43779
35177 43779 -94964 40513 361856 607068 650735 551122 367344 118611 -98887 -132592
35167 -132592 48803 295144 417457 343283 146740 -25917 -78077 -39727 1270 33101
35157 33101 107623 202039 215909 132203 48722 5819 -71684 -195981 -235640 -111918 64514
35146 64514 162293 201388 241211 238034 156730 91933 106022 57585 -206677 -552637 -658619
35135 -658619 -411536 -37407 180815 182440 98829 54384 56867 47192 13998 21308 93067 132621
35123 132621 65408 9022 119152 280820 199678 -140452 -383757 -299070 -98344 -57074
35113 -57074 -79636 66344 284534 273714 24711 -141937 -19947 270800 506109 557627
35103 557627 397455 131439 -1195 121672 305677 309114 212793 238458 301360 119066
35093 119066 -262387 -461561 -335116 -161715 -151129 -164375 -79672 -49194 -165720 -220644
35083 -220644 -61598 115251 120726 129546 338656 522937 345358 -51483 -201944 -2900
35073 -2900 178962 103205 -36609 -858 141162 209906 211063 238072 252025 149766 -40691
35062 -40691 -179515 -178902 -58260 101450 183403 90445 -131403 -280275 -209887 -26377 25527
35051 25527 -123825 -264366 -163116 140447 381091 390961 267569 177206 107807 -51044
35041 -51044 -245169 -263189 -41096 209477 265129 149459 25719 -42194 -83667 -78757 7170
35030 7170 96962 75857 -23348 -55415 22173 106514 121250 90430 29463 -88923 -223603
35019 -223603 -265489 -210177 -192750 -263315 -258067 -27707 293507 412346 251898 46080 20228
35008 20228 112094 110489 -14907 -74463 48917 222855 269863 229598 258302 324665 218724
34997 218724 -95304 -344418 -294810 -76163 14824 -80031 -177460 -184102 -189520 -226701 -182389
34986 -182389 -25252 75972 -17258 -210719 -329305 -353393 -370597 -383454 -311356 -138379
34976 -138379 66777 255383 421957 542180 575520 519672 405758 275326 210597 306165
34966 306165 517107 618809 455997 175806 56040 139561 224092 207138 221243 366957
34956 366957 526287 566621 552860 592730 609062 462443 218662 93024 157595 278590
34946 278590 329570 299277 193489 7590 -176120 -224864 -129595 -4658 102281 231786
34936 231786 324993 235717 10111 -78784 79611 229838 138373 -13588 102336 439419
34926 439419 639268 562907 436483 452364 534711 574584 607625 630683 498542 174136 -125262
34915 -125262 -213437 -189369 -219690 -245847 -147279 -55409 -206516 -524976 -645835 -399202 -35222
34904 -35222 120413 46511 -49217 -42528 3583 -28458 -185436 -415859 -593957 -599146 -426772
34893 -426772 -196714 -17148 118714 251899 320176 196167 -114105 -383572 -357093 -37840
34883 -37840 285910 346328 181150 41759 55646 103170 42847 -88013 -181823 -242042 -314427
34872 -314427 -318948 -131066 178799 362023 300302 158800 143440 206507 117634 -201987 -532844
34861 -532844 -587315 -333437 -29675 61600 -58321 -176742 -139278 13176 157626 224717
34851 224717 190542 49745 -128936 -217814 -192742 -191789 -305816 -402976 -303083 -52123 145736
34840 145736 219578 263842 301534 236302 80624 20725 158623 353553 421826 350206 205160
34829 205160 -22688 -336415 -599517 -642363 -452836 -148503 177181 465144 619666 579991
34819 579991 440902 366616 380071 344745 162812 -100240 -297455 -333825 -222481 -79655
34809 -79655 -51941 -169129 -276072 -191347 68024 298874 347940 253066 143091 87723 77964
34798 77964 81044 68430 30972 -5270 -11254 -11559 -60935 -148918 -179563 -80622 95130 207582
34786 207582 164971 20861 -60676 38350 247478 358694 257571 58648 -47744 -29772
34776 -29772 400 -5862 21574 111995 187221 214791 295426 491010 657417 582604 259344
34765 259344 -93301 -274205 -271318 -189658 -110048 -56456 -28536 -7939 36135 106329 161516
34754 161516 171469 164684 182326 196537 128915 -28254 -156756 -134730 3047 99817 84340
34743 84340 55736 103097 129947 -16686 -282074 -426694 -339909 -182442 -146764 -212693 -250599
34732 -250599 -245927 -262413 -258899 -131338 76160 180359 107188 -23511 -103517 -169529 -253885
34721 -253885 -250287 -61026 204688 309190 136405 -211112 -522882 -629295 -506496 -308686
34711 -308686 -234795 -294366 -288514 -104263 89776 82796 -49235 -54904 106736 220213 158889
34700 158889 48290 29758 75127 128833 232460 374034 390031 189008 -58305 -129553
34690 -129553 -45418 29822 85932 242325 471920 586823 518557 399103 309837 152305
34680 152305 -131799 -386926 -436543 -335246 -271435 -283903 -236300 -61722 118799 170084
34670 170084 127051 120184 166774 132959 -79322 -371687 -526037 -423451 -147259 118791
34660 118791 246910 223890 118627 23832 -5881 15411 52665 114138 215401 299442 290440
34649 290440 233345 256898 361732 390027 283233 213129 323556 485082 490667 387675 396648
34638 396648 560077 700168 705365 635067 538101 395391 269151 276676 361853 322127 135456
34627 135456 22354 79581 100718 -81631 -304234 -325209 -175188 -30653 100670 310135
34617 310135 517629 542087 388837 220575 75368 -143007 -400800 -507277 -396413 -227811
34607 -227811 -143768 -100328 -7622 113172 187531 186413 113707 -4357 -90716 -88816 -74449
34596 -74449 -164587 -301901 -292295 -102253 48600 -26277 -246806 -411845 -443469 -377458 -235375
34585 -235375 -46043 87102 79559 -11250 -58144 -20450 54508 130731 189205 183014 90689
34574 90689 -13885 -36249 18772 83136 144832 234752 323393 341983 302386 288651 316220
34563 316220 300532 193678 59167 -31531 -93499 -163777 -215905 -214102 -200638 -239378 -295719
34552 -295719 -270795 -168200 -130938 -253062 -419398 -422512 -220476 16426 136150 187712
34542 187712 303347 465167 509096 369012 207304 231276 433622 598952 559296 364997
34532 364997 173002 29449 -162146 -465147 -778022 -918256 -797913 -476947 -87071 230258
34522 230258 345948 215595 -40321 -212574 -205353 -102541 -6353 97447 251997 400610
34512 400610 448652 398421 322420 248916 178675 167646 258161 344175 251339 -19692 -249945
34501 -249945 -247639 -49709 148509 171913 -46921 -437150 -779721 -825825 -521216 -77754
34491 -77754 226388 278147 145871 -46940 -203685 -278468 -293045 -300429 -293058 -194603 17827
34480 17827 238560 329013 245545 40878 -197106 -362215 -358376 -188603 20280 139262
34470 139262 152248 114346 54293 -23869 -94218 -132713 -155293 -181473 -199502 -211585 -256232
34459 -256232 -327925 -337655 -229012 -77511 9837 39328 75337 90805 4596 -142939 -189591
34448 -189591 -63946 108499 167432 103803 17008 -49374 -132445 -221122 -202713 -6118 238748
34437 238748 283059 43561 -265032 -363922 -233285 -93378 -85126 -118569 -74851 -2391 -11274
34426 -11274 -89787 -149125 -166705 -162586 -109379 -2651 40713 -91124 -314031 -435065 -408327
34415 -408327 -345250 -283125 -132605 106451 262073 214800 63756 -36801 -92176 -197865
34405 -197865 -338304 -390613 -303562 -164880 -83737 -72949 -57708 34335 194982 339661 406969
34394 406969 440889 515750 583879 497976 230211 -29324 -81745 41239 153547 185897 247810
34383 247810 410022 557263 533831 358295 197325 154013 176956 186107 189089 214506 210929
34372 210929 119295 8852 8412 93507 90575 -46503 -119640 27736 241523 259798 98180
34361 98180 4275 58586 84443 2389 -2516 184373 339381 199124 -118267 -249790 -85978
34350 -85978 114771 110622 -54498 -218421 -333512 -426779 -476446 -454902 -405031 -364997 -284442
34339 -284442 -114333 79152 195713 250633 326999 401918 355542 178348 38838 60867
34329 60867 122741 2069 -302219 -520491 -430008 -129966 82952 61471 -74599 -156001
34319 -156001 -172599 -204251 -245552 -221655 -145656 -128151 -201003 -242701 -150909 -11578 3648
34308 3648 -124883 -235706 -204016 -93957 -48347 -95723 -136332 -88406 20021 100559 88306
34297 88306 -31792 -227659 -416125 -487157 -375482 -116675 176088 391412 485642 498126
34287 498126 511778 570728 613792 516318 241740 -59555 -167092 -38315 112486 53053
34277 53053 -168618 -261282 -59519 242364 322820 135974 -62912 -87364 -38297 -77332 -150302
34266 -150302 -105627 8451 -20766 -238653 -419565 -357419 -118696 68759 66699 -106023
34256 -106023 -346512 -514498 -493571 -310172 -136955 -94446 -104888 -20473 167098 332390
34246 332390 371947 266309 53530 -154373 -193516 -15122 211108 286184 231518 209628
34236 209628 243535 207626 98578 92884 250916 359767 220030 -48994 -173739 -119965
34226 -119965 -116910 -281845 -417859 -291984 9960 170456 61359 -83288 14430 304270
34216 304270 486431 404942 202339 82123 90292 189640 376219 598515 698265 590282
34206 590282 409244 322708 284412 149334 -40655 -97654 16317 147909 207712 256404
34196 256404 312931 290432 180480 105772 117396 118383 58005 16432 16878 -49490 -207580 -304657
34184 -304657 -258328 -199305 -213233 -146620 116887 361738 288317 -45153 -294809 -301638 -242193
34173 -242193 -312328 -484797 -616067 -613626 -456887 -200167 11782 57905 -10886 -51400 -43876
34162 -43876 -85719 -180610 -212982 -166066 -185100 -343408 -497394 -482636 -341323 -238196 -230978
34151 -230978 -245292 -228403 -199068 -145015 8228 260294 434280 322950 -34257 -305867
34141 -305867 -194476 218999 561640 594052 420157 250236 131366 24217 -10115 108889
34131 108889 288685 343434 245373 134354 88532 48094 -21344 -45257 37089 181596 304402
34120 304402 347024 272821 101530 -54715 -98851 -83009 -119699 -188601 -185994 -142561 -188105
34109 -188105 -277456 -181118 160022 481356 538153 431726 421539 545161 625043 577371 505351
34098 505351 489188 458910 326101 130798 -3370 -9163 65018 113200 77118 417 -29475
34087 -29475 15025 91659 169470 252019 318249 333580 347903 475787 713878 874543 794457
34076 794457 536436 282616 91675 -108376 -317228 -404892 -299051 -118746 -42052 -92702
34066 -92702 -134869 -66697 51615 90328 23729 -46073 -27192 68666 188628 317183 437562
34055 437562 485373 430556 358265 360429 372817 242929 -35554 -277330 -324920 -211310 -70620
34044 -70620 14389 34007 12897 -391 22735 27611 -61589 -194733 -216679 -78392 79514
34033 79514 113787 51587 12150 48895 140755 255197 348216 382538 411327 550460 789143
34022 789143 928558 818179 575839 447800 490665 511731 325241 -17110 -276882 -286316
34012 -286316 -143166 -110630 -282951 -431621 -315148 -67729 -48235 -303813 -473625 -325114
34002 -325114 -85827 -42414 -82783 67699 353241 481766 406230 354183 405879 388674 227582
33991 227582 82284 49073 6685 -127391 -237691 -244087 -268953 -406448 -513013 -414189 -181111
33980 -181111 -17509 23209 29214 21737 -52181 -145809 -104062 142656 477460 705091 698639
33969 698639 465590 154254 -24428 19396 138490 98324 -135704 -332581 -256089 57760
33959 57760 331057 331611 91782 -152672 -203765 -69017 81446 96667 -4569 -43742 135368
33948 135368 464577 670964 567673 293650 156227 243817 342687 276068 146898 126137
33938 126137 163162 99525 -32113 -51799 56686 104530 -5417 -139306 -150546 -70012 -2738
33927 -2738 21136 8061 -59320 -149969 -156666 -37585 94722 109466 8207 -132237 -275741
33916 -275741 -389735 -377758 -182721 75332 189915 105371 -27988 -53797 13083 46351
33906 46351 -11094 -88660 -101058 -60302 -40477 -69877 -123906 -209546 -356818 -496031 -457627
33895 -457627 -183389 147312 310911 291002 220872 154845 61614 -6432 58300 213746 290583
33884 290583 261233 290120 435677 492094 264726 -131761 -399109 -394638 -215544 -13678
33874 -13678 138106 222303 236605 195725 125657 57818 35881 81972 144947 149710 113885 130692
33862 130692 210599 241286 153897 32466 -3741 58795 162717 264744 319215 268184 129170
33851 129170 14271 -21719 -81049 -281569 -570459 -765656 -748535 -552313 -298526 -104069
33841 -104069 -18455 -7123 -15160 -45771 -120076 -177472 -123439 10732 72200 -18976 -188597
33830 -188597 -338092 -419503 -359263 -85751 290831 493063 380950 114278 -77770 -148734
33820 -148734 -165151 -144755 -91213 -56376 -46825 4535 75403 28442 -132397 -176271 13306
33809 13306 202823 130914 -98953 -196481 -125424 -97726 -209926 -349663 -424009 -447434 -431688
33798 -431688 -393551 -429592 -583193 -692112 -576060 -316572 -133802 -51087 78877 270399
33788 270399 384253 374252 299772 130304 -186180 -482807 -504036 -299052 -197734 -348765
33778 -348765 -549300 -581607 -454377 -256146 -34688 110215 66752 -88087 -160225 -140155
33768 -140155 -169195 -199095 -27694 269362 327574 50520 -191681 -103707 147398 298092
33758 298092 384423 499394 490066 241033 -2027 44367 250446 291316 145625 28711
33748 28711 -22666 -129949 -240536 -190422 -54458 -84720 -302097 -459321 -422229 -305225
33738 -305225 -210119 -97432 50260 173141 266108 351623 327583 80266 -252370 -387376
33728 -387376 -288365 -193814 -224153 -239502 -156385 -113871 -191247 -223153 -80129 79901 57241
33717 57241 -47917 21708 277616 464042 440673 378253 485634 676936 658865 331190
33707 331190 -40732 -134957 34348 172251 112165 -20349 -81054 -119969 -200786 -216093 -78258
33696 -78258 62647 16797 -143661 -205335 -130201 -15159 148648 388643 517992 331047
33686 331047 -9253 -141412 -60922 -111959 -374091 -494058 -280761 -38703 -57797 -156880
33676 -156880 -67700 52569 -96922 -392082 -442987 -208880 -22724 -32546 -32610 98232 174118
33665 174118 55496 -84421 -33351 140853 232208 193374 106407 -16369 -202813 -358907
33655 -358907 -332260 -140461 17141 10207 -79936 -121379 -129291 -204746 -337196 -397974 -338702
33644 -338702 -272894 -296224 -324648 -218747 -10645 120081 80325 -45519 -135790 -142133 -55175
33633 -55175 100588 203708 112121 -128781 -280891 -198249 -5104 93210 58598 -22348 -110891
33622 -110891 -211019 -277286 -267214 -231465 -237128 -261116 -264344 -288829 -357309 -370926 -262713
33611 -262713 -161652 -209672 -284635 -136136 227675 531250 620721 608468 578901 426443
33601 426443 119133 -124010 -119022 2058 13406 -48227 3298 138112 147642 26880 25964
33590 25964 250170 464516 435037 264989 209565 294367 328718 231416 128539 122246 151348
33579 151348 140041 137893 224364 375365 512873 610814 665553 628376 468566 263588 127721
33568 127721 69702 4880 -113621 -265220 -441987 -651827 -840339 -914976 -862948 -744800
33558 -744800 -558073 -236111 167773 431938 410689 234119 137646 149737 89734 -136570
33548 -136570 -381883 -445827 -320030 -169193 -115489 -123465 -103254 -61371 -91789 -227369 -364293
33537 -364293 -373917 -251262 -98883 6294 55000 30759 -103038 -306125 -434446 -372315
33527 -372315 -153695 81709 212287 195529 68813 -70352 -133545 -125517 -116688 -119713 -67715
33516 -67715 55659 152348 132664 28894 -72176 -136281 -156089 -99983 19302 81937 -27928
33505 -27928 -265502 -452654 -446649 -238567 69189 323100 401959 310886 170744 79983 35280
33494 35280 13448 43591 144295 279425 433381 619635 746308 626860 259218 -49073
33484 -49073 -25607 196958 268173 107795 -34040 15006 138871 188273 220850 362709 571768
33473 571768 666092 529632 225846 -52391 -136625 -45286 25503 -53819 -164481 -116838 56371
33462 56371 157382 135395 130051 196860 216399 136999 93222 179316 282326 256259 116372
33451 116372 -44872 -193023 -294601 -266538 -109524 26519 36029 13564 97441 259318
33441 259318 375082 414380 426364 404962 296674 104169 -108446 -269106 -298943 -148171
33431 -148171 88816 188818 36061 -221448 -336211 -217139 38058 268316 333354 183390
33421 183390 -59612 -185840 -144669 -100378 -170418 -256621 -238577 -167147 -122554 -47131 97335
33410 97335 158317 2039 -216796 -229525 -28815 147210 149727 32835 -111812 -226564
33400 -226564 -238515 -133493 -29237 3561 96473 341401 516861 355023 -2113 -161409
33390 -161409 -60953 -15398 -157115 -241871 -120318 961 -36108 -39000 172390 405000
33380 405000 400368 264366 255835 317676 175863 -173298 -414771 -361739 -176400 -96515 -155156
33369 -155156 -234601 -232702 -104096 144908 425744 587922 521182 244312 -79801 -222393
33359 -222393 -77009 184461 249040 32902 -191514 -139245 124529 305237 279824 204414
33349 204414 240052 328159 287479 61052 -177544 -175883 105648 381748 331431 -1690 -257730
33338 -257730 -241719 -145035 -184479 -257661 -161288 39369 123964 77087 56854 75821 -4289
33327 -4289 -182807 -296601 -301535 -330172 -433879 -495449 -444620 -348405 -239967 -67933 130599
33316 130599 220051 196056 213439 309044 320297 183192 80223 139678 196725 48394 -215881
33305 -215881 -348728 -294405 -199572 -159743 -157395 -197261 -298601 -363952 -242757 41523 269297
33294 269297 274939 119775 -18488 -41830 24935 117459 192217 217891 161504 28214 -86323
33283 -86323 -51813 126173 244100 113122 -189395 -402066 -406012 -326770 -296155 -280737 -207597
33272 -207597 -100932 -4432 94049 174383 165157 101917 137847 282973 319833 136379 -53418
33261 -53418 -37324 34772 -88516 -274751 -147667 309638 653496 562891 222013 -9329
33251 -9329 -56355 -90562 -210842 -343409 -366274 -215581 52494 238317 149778 -150834 -369272
33240 -369272 -321790 -129544 2398 47473 84994 109492 69925 6263 -3382 29942 56108
33229 56108 97610 190467 282016 312714 328343 372051 337724 103605 -228540 -412054 -369046
33218 -369046 -251128 -178472 -109954 -24075 -31027 -180704 -307093 -228804 -26836 43123 -106900
33207 -106900 -294502 -328722 -240207 -181072 -196899 -211712 -198119 -233697 -360753 -491356 -515973
33196 -515973 -438850 -336074 -243627 -177510 -200581 -334562 -440792 -357704 -166021 -128630 -308715
33185 -308715 -446908 -333861 -109635 -11669 3759 136827 350475 401718 252068 153240
33175 153240 260557 416271 422179 306547 189767 80521 -37977 -83007 -5052 84719
33165 84719 83746 68508 123318 135869 -13927 -170360 -75895 219914 405499 363768 297451
33154 297451 341881 343494 160705 -64499 -128331 -72384 -61439 -96634 -71528 -13070 -33209
33143 -33209 -91236 -32591 141826 253425 213008 118502 48215 -52323 -198732 -251917 -96243
33132 -96243 170105 334343 298430 134363 -29691 -111885 -112649 -96977 -106689 -89188 16513
33121 16513 142958 170234 136318 196689 334701 324234 90111 -109048 -40187 145273 149430
33110 149430 -11795 -67362 61336 170019 127230 35492 -13272 -79078 -177505 -177495 -24962
33099 -24962 121233 112701 13217 -52738 -103669 -207307 -305516 -286358 -152164 4268 117424
33088 117424 151409 80454 -38730 -77046 -4531 66682 95468 202813 418767 521172 328967
33077 328967 10823 -133423 -88250 -64176 -109841 -77611 43487 63081 -85359 -214868
33067 -214868 -177600 -74523 -59393 -104256 -82284 36993 178609 263589 255308 179217 120437
33056 120437 115599 62014 -134465 -343659 -329935 -101448 70772 41352 -18752 73966 224136
33045 224136 226305 74216 -67546 -103265 -69328 -26713 -14751 -66344 -181380 -321426 -462562
33034 -462562 -580543 -585496 -411733 -191257 -154965 -304465 -380819 -246192 -84357 -100288
33024 -100288 -235503 -334885 -382304 -390002 -272676 -52403 23940 -163611 -331941 -171165
33014 -171165 175755 352542 358072 464335 647309 567612 168937 -142867 -74480 152582
33004 152582 167729 -55678 -273707 -327139 -236132 -99823 -53868 -190719 -406655 -470485
32994 -470485 -337079 -227550 -301611 -435568 -450310 -378758 -351410 -365362 -329610 -228699 -103314
32983 -103314 30663 130010 105612 -29211 -104647 -514 198605 343568 390893 350881
32973 350881 222198 79671 57507 126792 73519 -163959 -341374 -271468 -127593 -150563
32963 -150563 -249710 -190020 -25704 -9056 -147704 -200673 -102373 -54643 -151260 -222188 -151223
32952 -151223 -79283 -147474 -244259 -171742 68132 294556 374928 330344 270620 290991 392206
32941 392206 470411 420208 244093 24820 -161999 -247951 -171309 11122 96068 -34397
32931 -34397 -225016 -257162 -170428 -169617 -271366 -291193 -166853 -32827 51749 183477 359431
32920 359431 401808 243953 61377 -3523 -34004 -124168 -178712 -88716 67025 164343 230474
32909 230474 335792 419343 384089 260455 139083 51196 32117 157413 371507 434239
32899 434239 218821 -67689 -149689 -44449 45241 77769 166226 303757 359210 330160 362885
32888 362885 503585 629077 642398 559944 402495 188153 40832 98986 274586 299185
32878 299185 78577 -170363 -211762 -59952 125734 258735 327730 313115 234612 199417
32868 199417 279525 389544 388561 273501 185815 234583 368155 421343 274375 -13596 -230948
32857 -230948 -221913 -71462 -18972 -177523 -414896 -538293 -512012 -435399 -373221 -294374 -165740
32846 -165740 -38001 -3651 -76762 -144463 -81160 86319 195489 166790 121467 199787 344871
32835 344871 400544 369953 403083 527015 572587 431665 235565 182783 294528 428605
32825 428605 453018 333976 134719 -4748 27279 160989 191434 54503 -53740 56900
32815 56900 288265 379760 239269 -12242 -265012 -486630 -572000 -362913 80556 408112
32805 408112 347056 54579 -64828 137592 402087 436251 279299 182841 238832 295486
32795 295486 226372 108672 61834 42132 -73062 -266569 -391786 -384302 -323723 -265330 -146546
32784 -146546 72920 284222 339784 236680 106213 51092 61973 75185 50396 -5243 -49958
32773 -49958 -50802 -34596 -64242 -134089 -134262 19597 242853 335121 185312 -117551 -381178
32762 -381178 -479934 -426103 -317879 -245224 -228563 -222644 -176000 -92132 -26981 -15084 -6226 88714
32750 88714 265072 376962 291764 85786 -5824 128031 329787 381966 282733 209558 257579
32739 257579 333563 297254 105173 -178686 -420626 -481781 -350367 -195819 -180522 -240298
32729 -240298 -187517 -10991 102978 61690 -17731 -38837 -75481 -191772 -290244 -269187 -185926
32718 -185926 -133645 -93129 -43307 -79229 -255705 -430958 -441303 -337529 -278220 -279609 -248453
32707 -248453 -175899 -108558 -6070 168343 283037 182573 -50480 -196916 -216744 -229533
32697 -229533 -232086 -123736 -1692 -100905 -372411 -445765 -146098 241676 393418 355792
32687 355792 322521 258421 37734 -219026 -266305 -106517 47613 133035 268285 430939
32677 430939 404765 132862 -128225 -149675 -44449 -73039 -249354 -322058 -123360 207735
32667 207735 384326 274952 5892 -200286 -235213 -144558 -6097 155041 305854 339964
32657 339964 172593 -103392 -249435 -120161 167848 349417 279489 60755 -86391 -47875
32647 -47875 102146 220880 260922 293365 382586 478290 460663 287913 68905 -42890 -28958
32636 -28958 -31862 -157183 -293287 -232817 17439 178148 30215 -295434 -478779 -391248
32626 -391248 -179220 -15253 71364 116428 129682 119773 92843 2550 -183989 -363107 -380408
32615 -380408 -262362 -201035 -259656 -264875 -75192 205909 390313 426258 338197 101249 -257127
32604 -257127 -543021 -566256 -371438 -164873 -73785 -93955 -182789 -258850 -194648 27673 219871
32593 219871 202548 47068 -55413 -78572 -119777 -155875 -82489 36635 17575 -128959 -177001
32582 -177001 -32293 128691 141362 55793 -45313 -222912 -524074 -797718 -828533 -578062
32572 -578062 -193928 136273 269611 163496 -55795 -175218 -131604 -76242 -137369 -237088
32562 -237088 -232341 -116706 25201 150303 223358 158405 -62586 -289116 -359868 -304817 -265935
32551 -265935 -277157 -257737 -178734 -98870 -56297 -39302 -41135 -44360 5915 102096 102819 -93901
32539 -93901 -339379 -358647 -91553 237876 408174 406616 317748 171787 -5988 -121991
32529 -121991 -110616 -36424 -2723 -12878 -17895 -51957 -194973 -398795 -473330 -307835 -33540
32518 -33540 111557 46675 -94378 -143252 -38877 207371 551512 849286 877466 576667
32508 576667 212274 117932 284592 379461 200347 -78192 -193681 -150697 -142800 -245031
32498 -245031 -353279 -371095 -313429 -251545 -257756 -367539 -508611 -521772 -343663 -107716 26039
32487 26039 58043 58706 -2213 -173173 -345388 -348861 -188253 -6502 151145 337658 484026
32476 484026 410057 112558 -151706 -161645 29319 221168 303852 295309 260757 268629 339369
32465 339369 391813 324638 167836 48998 4423 -49033 -152370 -264906 -386981 -539668
32455 -539668 -608213 -427642 -82509 110557 15023 -162053 -236942 -323288 -549971 -739751
32445 -739751 -630111 -263274 93893 302633 389630 348466 169499 -1396 6852 130632
32435 130632 161307 54245 -64555 -144436 -227814 -272255 -211957 -165498 -307843 -541385 -579730
32424 -579730 -379555 -197117 -171107 -156171 -54793 -375 -68502 -91605 59676 251231
32414 251231 318331 298064 254954 114420 -119805 -216040 -38927 172696 128588 -78760
32404 -78760 -156063 -81464 -68325 -153777 -171406 -100996 -99833 -155115 -26847 371298 793963
32393 793963 973399 902404 721214 511948 298157 93580 -118307 -318207 -352724 -97591
32383 -97591 253296 307860 -13119 -306546 -174556 289354 643852 584038 155185 -365512
32373 -365512 -654261 -541196 -184015 52217 7246 -96336 2320 235921 353427 291493
32363 291493 190556 124958 33837 -103065 -196142 -155216 38201 325071 542697 499184
32353 499184 204626 -68594 -101003 3969 20508 -66790 -139333 -212205 -348014 -406701 -208113
32342 -208113 100515 183577 24035 -65514 26911 68954 -19569 52266 438044 793304 737161
32331 737161 396681 155535 86096 1642 -89872 9056 285610 493125 530120 521053 504677
32320 504677 364102 128163 37520 191860 373360 347235 142012 -75481 -211682 -219450
32310 -219450 -48061 236038 421558 379728 210062 69137 -7344 -20286 79560 250649
32300 250649 293692 107710 -111900 -125688 2022 21964 -104371 -164693 -37959 149841
32290 149841 246837 255895 232705 174967 102000 108803 234330 363531 354820 208940 40593
32279 40593 -68056 -119064 -135535 -105146 6204 183565 302422 203758 -91104 -301009
32269 -301009 -165385 208726 450047 398185 278035 319211 420701 372738 235623 239306
32259 239306 387884 439099 284207 101060 66888 127615 144556 95343 23031 -64430 -131437
32248 -131437 -87776 56580 139252 76383 11183 75348 140562 22445 -171404 -165356 43121
32237 43121 149344 -5193 -211901 -238614 -159526 -172319 -264436 -269284 -150749 -26244 48810
32226 48810 137363 268887 385140 452935 503519 532105 467521 286149 75340 -65395 -131787
32215 -131787 -176753 -199962 -133186 45446 210546 169525 -102942 -356247 -298370 54093
32205 54093 375425 410794 226785 28919 -104429 -180346 -142443 30721 167996 75738
32195 75738 -158116 -244274 -84071 125075 203996 193448 169383 74951 -121336 -265461 -194184
32184 -194184 19455 157898 147029 115384 192520 366447 532239 583758 459327 188868
32174 188868 -81355 -178222 -61744 117316 146993 -34782 -249714 -236989 55467 376266
32164 376266 441868 269633 128423 167384 243155 164812 -34810 -175816 -174676 -85337 43722
32153 43722 224044 443392 620437 667191 563704 374217 205446 126016 114222 109394 101554
32142 101554 117655 141971 136810 125078 136577 83125 -150690 -460899 -557199 -341519 -87716
32131 -87716 -103193 -341508 -510026 -461279 -301981 -174135 -105161 -66579 -41832 -19050 923
32120 923 -7029 -47637 -91135 -143610 -250296 -376010 -392713 -264396 -122443 -62742 -9538
32109 -9538 97124 141277 33899 -70571 25835 261302 427791 475560 464070 325742 -18352
32098 -18352 -371608 -423138 -200107 -44007 -100609 -149338 -17367 147948 155920 57394 -7580
32087 -7580 -34826 -72395 -84365 -34588 38057 121037 245636 337773 253814 46109 -36979
32076 -36979 73781 135019 -27277 -250953 -332226 -344065 -437146 -538242 -499827 -373289 -279442
32065 -279442 -173734 -8495 38624 -181776 -433321 -346151 26294 255839 148177 -39340
32055 -39340 -46568 47897 60134 5372 -4609 18697 -4312 -63614 -95301 -94091 -86603 -59082
32043 -59082 8071 89306 152847 194010 192586 107079 -45365 -170096 -207475 -215707 -291766 -435134
32031 -435134 -528152 -456837 -253284 -107288 -186998 -430545 -584557 -492493 -265964 -105405
32021 -105405 -46274 2886 46710 -11319 -175258 -292655 -236255 -72795 4301 -103206 -265161
32010 -265161 -243824 16069 274175 282388 136171 143500 345317 433913 236924 -13149 -74478
31999 -74478 -65657 -161136 -181864 126998 583568 765392 639307 560187 654032 653422 424216
31988 424216 220358 244334 324570 246771 97798 36911 -24632 -252298 -570685 -759586
31978 -759586 -754149 -657295 -551007 -459076 -414837 -428513 -445466 -413991 -321177 -145958 83966
31967 83966 188259 2438 -314374 -398926 -188357 -15763 -77588 -131646 58130 287334
31957 287334 229997 -42917 -206395 -180649 -143355 -151942 -98538 5254 14904 -81304 -151798
31946 -151798 -168870 -210220 -219996 -36797 303819 539217 519100 374784 280750 222993 89752
31935 89752 -134612 -345008 -415471 -296904 -67585 131283 255091 379673 508242 490563
31925 490563 262367 23678 -5021 115146 190411 228110 368894 570003 638965 550337
31915 550337 458469 413636 338990 278342 367414 536115 549162 399803 345214 454062 450063
31904 450063 172777 -115192 -121749 20796 -13047 -213991 -251545 30654 403331 576931
31894 576931 546689 522094 612353 691089 583244 319129 113796 87527 133076 138680 192529
31883 192529 391624 570220 473448 156229 -58156 -21358 100349 149803 155855 123759 -52139
31872 -52139 -341081 -507828 -440659 -308310 -243974 -127285 134407 355031 335526 184051
31862 184051 126714 156731 113235 -18962 -122269 -159740 -169133 -136476 -57223 -18594 -51394
31851 -51394 -27364 120654 226531 136223 -35319 -114299 -163969 -309905 -437344 -372555 -230623
31840 -230623 -244598 -353194 -320930 -193151 -233919 -430197 -469604 -260497 -84522 -141904
31830 -141904 -310877 -467686 -674298 -892880 -876403 -560908 -256684 -215451 -288484 -260704
31820 -260704 -240427 -403921 -585940 -495360 -204803 -60042 -155585 -237118 -131215 31019
31810 31019 77387 26868 -39082 -143255 -328126 -518851 -574890 -432226 -152165 132556
31800 132556 313353 388331 437786 491541 483321 390260 318885 340833 335573 159872 -83605
31789 -83605 -142554 26512 196699 205948 154061 175583 204857 126797 29352 98478 305325
31778 305325 404624 282261 128892 161974 296650 253416 -40881 -327162 -341195 -138402
31768 -138402 10012 -39563 -197650 -336738 -425151 -438850 -305803 -46809 135186 49347
31758 49347 -230617 -424215 -354564 -114398 79977 115881 43218 -24872 -27236 3740 -6161
31747 -6161 -74190 -130986 -118519 -89789 -148055 -288455 -372611 -295809 -127029 -24283 -28345
31736 -28345 -8130 154941 369413 398029 146325 -181526 -299220 -183389 -87959 -189453
31726 -189453 -345691 -304790 -61945 140492 145771 65012 89652 240881 375096 358994 170667
31715 170667 -105514 -306538 -273485 -11588 257054 306717 173166 99593 204685 337857
31705 337857 334229 277187 350392 499028 449322 108887 -234182 -238794 67363 338920 338108
31694 338108 159990 27990 7454 -3140 -77368 -157362 -147942 -61434 -28646 -148435 -344012
31683 -344012 -425480 -318939 -166896 -138262 -200127 -183137 -41950 83907 90832 63973 136460
31672 136460 283882 355231 276582 145207 113253 212645 310231 248104 39243 -113262 -40795
31661 -40795 185712 357297 399681 416998 459269 407371 173986 -103345 -196635 -62887 114533
31650 114533 132555 -52429 -317168 -478164 -435299 -263138 -132401 -109983 -90641 36316
31640 36316 225220 337823 306064 172998 33361 -15652 59765 159904 138367 14738
31630 14738 -21621 100421 196825 113165 -14850 16109 132096 115717 -6315 -6526 145121
31619 145121 246305 251067 351032 562425 575809 226413 -175325 -263067 -147650 -204311 -460817
31608 -460817 -557627 -300900 71423 242264 172907 9048 -153098 -271204 -281564 -163792
31598 -163792 433 124067 190412 173945 10505 -248779 -369900 -178744 179736 371121
$$ [...]
##END NTUPLES=NMR SPECTRUM
##END=
