##TITLE=31Pdec_ANY-165B-1
 CDCl3, 24 sc
 4.4.2019
##JCAMPDX= 6.0         $$ Bruker NMR JCAMP-DX V2.0
##DATA TYPE= NMR SPECTRUM
##DATA CLASS= NTUPLES
##ORIGIN= UXNMR, Bruker Analytische Messtechnik GmbH
##OWNER= root
$$ XWIN-NMR		Version 3.5
$$ Thu Apr  4 14:18:53 2019 Russian Standard Time (UT+4h)  she@DPX200
##.OBSERVE FREQUENCY= 81.013821
##.OBSERVE NUCLEUS= ^31P
##.ACQUISITION MODE= SIMULTANEOUS
##.ACQUISITION SCHEME= undefined
##.AVERAGES= 24
##.DIGITISER RES= 17
##SPECTROMETER/DATA SYSTEM= spect
##.PULSE SEQUENCE= zgpg30
##.SOLVENT NAME= D2O
##.SHIFT REFERENCE= (INTERNAL, D2O, 0, 182.463)
##AUDIT TRAIL= $$ (NUMBER, WHEN, WHO, WHERE, WHAT)
$$ ##TITLE= Audit trail, XWIN-NMR		Version 3.5
$$ ##JCAMPDX= 5.01
$$ ##ORIGIN= Bruker BioSpin GmbH
$$ ##OWNER= she
$$ F:/spectra/data/she/nmr/P31/1/pdata/1/auditp.txt
$$ ##AUDIT TRAIL=  $$ (NUMBER, WHEN, WHO, WHERE, WHAT)
(   1,<2019-04-04 14:17:52.31 +0400>,<she>,<DPX200>,
      <created by zg, POWCHK disabled, PULCHK disabled
       configuration hash MD5:
       00 E9 B6 7A A2 85 ED C7 34 08 36 98 17 FE 4E 26
       data hash MD5: 32K
       B6 8F B3 B6 76 31 7F 29 B2 F8 CD E6 38 E2 7E 36>)
(   2,<2019-04-04 14:17:54.50 +0400>,<she>,<DPX200>,
      <Start of raw data processing
       efp BC_mod = 2 LB = 1 FT_mod = 6 PKNL = 1 PHC0 = -1825.383 PHC1 = 56.99897 SI = 64K 
       data hash MD5: 64K
       B7 4F EE 50 FA 9E 2B 65 C6 49 CE 33 69 FC 17 31>)
(   3,<2019-04-04 14:18:08.18 +0400>,<she>,<DPX200>,
      <pk PHC0 = 23.34497 PHC1 = 0 
       data hash MD5: 64K
       1C 5E 21 06 94 30 87 8C AA 23 C9 B5 0C 34 BB 9D>)
(   4,<2019-04-04 14:18:11.28 +0400>,<she>,<DPX200>,
      <abs ABSG = 5 
       data hash MD5: 64K
       7F 50 5F F9 4E A8 D1 D2 0E 7F 5B 5B 0F 1E 41 06>)
$$ ##END=
$$ 
$$ hash MD5
$$ 8F 0B 0B 2F 6B 46 1B 7E 6C D8 D9 E7 EA B2 1F 55
##$RELAX= 
##$RELAX= 
##$RELAX= 
##$RELAX= 
##$RELAX= 
##$RELAX= 
##$RELAX= 
##$RELAX= 
$$ Bruker specific parameters
$$ --------------------------
##$DU= <F:/spectra>
##$EXPNO= 1
##$NAME= <P31>
##$PROCNO= 1
##$TYPE= <nmr>
##$USER= <she>
##$AMP= (0..31)
100 100 100 100 100 100 100 100 100 100 100 100 100 100 100 100 100 100 
100 100 100 100 100 100 100 100 100 100 100 100 100 100 
##$AQSEQ= 0
##$AQ_mod= 1
##$AUNM= <au_zg>
##$AUTOPOS= <>
##$BF1= 81.014009
##$BF2= 200.13
##$BF3= 200.13
##$BF4= 200.13
##$BF5= 200.13
##$BF6= 200.13
##$BF7= 200.13
##$BF8= 200.13
##$BYTORDA= 1
##$CFDGTYP= 0
##$CFRGTYP= 5
##$CHEMSTR= <none>
##$CNST= (0..31)
1 1 145 1 1 1 1 1 1 1 1 1 1 1 1 1 1 1 1 1 1 1 1 1 1 1 1 1 1 1 1 1 
##$CPDPRG= <waltz16>
##$CPDPRG1= <>
##$CPDPRG2= <waltz16>
##$CPDPRG3= <>
##$CPDPRG4= <mlev>
##$CPDPRG5= <mlev>
##$CPDPRG6= <mlev>
##$CPDPRG7= <mlev>
##$CPDPRG8= <mlev>
##$CPDPRGB= <>
##$CPDPRGT= <>
##$D= (0..31)
0 1 0 0 0 0 0 0 0 0 0 0.03 2e-05 3e-06 0 0 0 0 0 0 0 0 0 0 0 0 0 0 0 0 
0 0 
##$DATE= 1554373071
##$DBL= (0..7)
120 120 120 11 120 120 24 19 
##$DBP= (0..7)
150 150 150 150 150 150 150 150 
##$DBP07= 0
##$DBPNAM0= <>
##$DBPNAM1= <>
##$DBPNAM2= <>
$$ [...]
##$SUBNAM3= <"">
##$SUBNAM4= <"">
##$SUBNAM5= <"">
##$SUBNAM6= <"">
##$SUBNAM7= <"">
##$SUBNAM8= <"">
##$SUBNAM9= <"">
##$SW= 369.568048894756
##$SWIBOX= (0..15)
0 1 3 0 0 0 0 0 0 0 0 0 0 0 0 0 
##$SW_h= 29940.119760479
##$TD= 32768
##$TD0= 1
##$TE= 0
##$TE2= 300
##$TE3= 300
##$TEG= 300
##$TL= (0..7)
0 120 53 12 22 120 120 120 
##$TP= (0..7)
150 150 150 150 150 150 150 150 
##$TP07= 0
##$TPNAME0= <>
##$TPNAME1= <>
##$TPNAME2= <>
##$TPNAME3= <>
##$TPNAME4= <>
##$TPNAME5= <>
##$TPNAME6= <>
##$TPNAME7= <>
##$TPOAL= (0..7)
0.5 0.5 0.5 0.5 0.5 0.5 0.5 0.5 
##$TPOFFS= (0..7)
0 0 0 0 0 0 0 0 
##$TUNHIN= 0
##$TUNHOUT= 0
##$TUNXOUT= 0
##$USERA1= <user>
##$USERA2= <user>
##$USERA3= <user>
##$USERA4= <user>
##$USERA5= <user>
##$V9= 5
##$VALIST= <valist>
##$VCLIST= <CCCCCCCCCCCCCCC>
##$VD= 0
##$VDLIST= <DDDDDDDDDDDDDDD>
##$VPLIST= <PPPPPPPPPPPPPPP>
##$VTLIST= <TTTTTTTTTTTTTTT>
##$WBST= 1024
##$WBSW= 4
##$XGAIN= (0..3)
0 0 0 0 
##$XL= 0
##$YL= 0
##$YMAX_a= 40111
##$YMIN_a= -46182
##$ZGOPTNS= <>
##$ZL1= 120
##$ZL2= 120
##$ZL3= 120
##$ZL4= 120
##$ABSF1= 182.463
##$ABSF2= -187.1042
##$ABSG= 5
##$ABSL= 3
##$ALPHA= 0
##$AQORDER= 0
##$ASSFAC= 0
##$ASSFACI= 0
##$ASSFACX= 0
##$ASSWID= 0
##$AUNMP= <proc_1d>
##$AZFE= 0.1
##$AZFW= 0.5
##$BCFW= 0
##$BC_mod= 2
##$BYTORDP= 0
##$COROFFS= 0
##$CY= -3
##$DATMOD= 1
##$DC= 0
##$DFILT= <>
##$DTYPP= 0
##$F1P= 0
##$F2P= 0
##$FCOR= 1
##$FTSIZE= 65536
##$FT_mod= 6
##$GAMMA= 0
##$GB= 0
##$INTBC= 1
##$INTSCL= 5.30512e-09
##$ISEN= 30
##$LB= 1
##$LEV0= 0
##$LPBIN= 0
##$MAXI= 10000
##$MC2= 0
##$MEAN= 0
##$ME_mod= 0
##$MI= 50
##$NCOEF= 0
##$NC_proc= -3
##$NLEV= 6
##$NOISF1= 182.463
##$NOISF2= 159.3651
##$NSP= 0
##$NTH_PI= 0
##$NZP= 0
##$OFFSET= 182.463
##$PC= 4
##$PHC0= -1802.038
##$PHC1= 56.99897
##$PH_mod= 1
##$PKNL= yes
##$PPARMOD= 0
##$PSCAL= 0
##$PSIGN= 0
##$REVERSE= no
##$SF= 81.0140089999434
##$SI= 65536
##$SIGF1= 159.3651
##$SIGF2= -187.1042
##$SINO= 113.3802
##$SIOLD= 16384
##$SREGLST= <1H.CDCl3>
##$SSB= 0
##$STSI= 65536
##$STSR= 0
##$SW_p= 29940.119760479
##$SYMM= 0
##$S_DEV= 0
##$TDeff= 32768
##$TDoff= 0
##$TI= <>
##$TILT= no
##$TM1= 0
##$TM2= 0
##$TOPLEV= 0
##$USERP1= <user>
##$USERP2= <user>
##$USERP3= <user>
##$USERP4= <user>
##$USERP5= <user>
##$WDW= 1
##$XDIM= 65536
##$YMAX_p= 503635010
##$YMIN_p= -2684938
$$ End of Bruker specific parameters
$$ ---------------------------------
##NTUPLES= NMR SPECTRUM
##VAR_NAME=  FREQUENCY,     SPECTRUM/REAL,   SPECTRUM/IMAG
##SYMBOL=    X,             R,               I
##VAR_TYPE=  INDEPENDENT,   DEPENDENT,       DEPENDENT
##VAR_FORM=  AFFN,          ASDF,            ASDF
##VAR_DIM=   65536,         65536,           65536
##UNITS=     HZ,            ARBITRARY UNITS, ARBITRARY UNITS
##FACTOR=    0.456856943014862, 1,           1
##FIRST=     14782.0589164792, 0,            0
##LAST=      -15158.0608439998, 0,           0
##MIN=       -15158.0608439998, -2684938,    0
##MAX=       14782.0589164792, 503635010,    0
$$ Real data points
##PAGE= N=1
##DATA TABLE= (X++(R..R)), XYDATA
$$ [...]
40306d53071K03382N1352j85861j91424O5209K83550K69609J50982Q8357L1174
40296C13259j09043k43872k26463o5725R7949J47233N0896j27462k30336j27483
40286e21047J10529K66930K43676J50528J01671P6004L3224R490J5723j5546r3277
40275C77905j13686l5063K8988m815m4405J2426Q7838M6335p9537j37438p9353
40264E9195j822J2253k1399n0467m4808J007O1595Q9225O8012L0665n789o4256
40252A33411j29772j21719j0007J04152J07107L1050M785O3588R9076K0965j02330
40241B00306j28980m9506j9073j29659k28729j04875J65764K59312O1219j36391
40231a10612o1841J20426Q9777r3454r4919J07188J62081n0330j71021O8373L68644
$$ y = [-453071, -249689, -198337, -384198, -575622, -510413, -226863, 42746, 193728, 282085, 313259, 204216, -39656, -266119, -331844, -233895, -86662, -35766, -163228, -393564, -521047, -410518, -143588, 100088, 250616, 352287, 428291, 461515, 471005, 486728, 471182, 377905, 264219, 229156, 258144, 253329, 208924, 221350, 309188, 355523, 275986, 138548, 59195, 57373, 69626, 48227, -2240, -47048, -46041, 15554, 104779, 172791, 203456, 197667, 133411, 3639, -118080, -128087, -23935, 83172, 114222, 119007, 182595, 281671, 302636, 200306, 71326, 21820, 2747, -126912, -355641, -460516, -294752, -35440, 25779, -110612, -172453, -52027, 37750, -55704, -150623, -43435, 118646, 68316, -102705, -34332, 334312]
40220C34312K74826j45675l82735j62900K49723M35084K67212o1925k97911l27619
40210A82392k13410q6463m998O4589J35377J53322R4367J6666l3063p5848j15006
40199A17925r6050j2212N0474L6532q444m1244p6841q8002N240J66105K14777
40188B68260Q0400o4943m9630N3912O6239l9260j54823k07735j76609n0008R7191
40177a77006J06721m3190j52780q8123J831m9493j04895O5888L59237M24262J55651
40166D98103j73599k92519k04680m5115J03662J79115J16978l8181j32864r3241
40156h2341j4067j0325p2754j10139o2211M8336J24515Q1248k1158o918J56265
40145C0451K38873N6777k00909j85088J09391L13305J91006o7182j53224l4719
$$ y = [334312, 609138, 463463, 80728, -82172, 167551, 602635, 869847, 807922, 510011, 182392, -31018, -117481, -122479, -57890, 77487, 230809, 325176, 341842, 308779, 232931, 117925, 21875, 9663, 60137, 96669, 88225, 46981, -29860, -117862, -112622, 53483, 268260, 348660, 283717, 234087, 287999, 354238, 314978, 160155, -47580, -224189, -274197, -177006, -70285, -113475, -266255, -354378, -352547, -402040, -506935, -441047, -81810, 342452, 498103, 324504, 31985, -172695, -217810, -114148, 64967, 181945, 143764, 10900, -82341, -96408, -106733, -179487, -289626, -351837, -303501, -178986, -97738, -118896, -125814, 30451, 269324, 326101, 125192, -59896, 49495, 362800, 553806, 486624, 333400, 298681]
40135B98681R2749R6750P212q9083j31140r9262k3377M2356P3644P0612J5569
40124C54711r1788j75084j51871n6826J399k822m67L7739O5612N3068O008q6608
40112d6929k08654k51593j35000L6908J00596Q4234J38042K33665J80947j8843
40102A13373j08166K5918J40897J1584j92971j44241J55964L67022K54577o0111
40092E63846l01273l24133j69235L4298J55871J28443q085j39473j72170r8714
40082c30625J4357Q8603R6453P3647O4562O7385N2183J1120m1438r3486j24384
40071a21623j04039m2716P440M3512J24544K26589J98493j2095k00084j53512
40061c3491K0583M6846q7795j22712L5935J44778J957k37690k82835p9641J82189
$$ y = [298681, 391430, 488180, 495392, 406309, 275169, 175907, 152530, 194886, 268530, 339142, 354711, 262923, 87839, -64032, -120858, -119459, -122281, -122748, -85009, -19397, 33671, 39679, -46929, -255583, -507176, -642176, -605268, -504672, -420438, -282396, -48731, 132216, 113373, 5207, 31125, 172022, 183606, -9365, -153606, 2358, 369380, 623957, 563846, 262573, -61560, -230795, -196497, -40626, 87817, 79732, -59741, -231911, -330625, -316268, -227665, -131212, -57565, 6997, 74382, 126565, 137685, 96247, 2761, -121623, -225662, -268378, -260938, -217426, -92882, 133707, 332200, 320105, 120021, -33491, -12908, 33938, -53857, -176569, -140634, 4144, 6101, -231589, -514424, -594065, -411876]
40050d11876L18492K80559J32393R11k6222o209n0500j20768p8173M5121M9924
40039A33652q3631j13923N9304J78416L1002j75398j33724N6475N5331j49552
40029a42048k24276m0554J18679J2339j94030j86925O6101L18949L64214K08900
40019C01349M212r6617n5650J4652k0150j33449j68288p3274J2893k5835j08452
40008c48609r7765j3464L1880M1653J15478K34712K39437P0195j12150j42158
39998A9209p5733p8016j60796j80745p3269O1585J18829R8305L1343o1831j03188
39987d04307n61J73074K05844M7382q6507l6326N7186J2715o6040K5086K10474
39976A38020K28683M0604j40835j93883j82025j31040n356J01186N6424k6367
$$ y = [-411876, -93384, 187175, 319568, 320479, 294257, 288048, 237548, 116780, 38607, 83728, 133652, 50021, -63902, -4598, 173818, 204820, 29422, -104302, -47827, 7504, -142048, -366324, -406878, -288199, -275860, -469890, -656815, -590714, -271765, 92449, 301349, 305561, 208944, 153294, 167946, 147796, 14347, -153941, -227215, -214322, -240157, -348609, -446374, -459838, -427958, -386305, -270827, -36115, 203322, 273517, 161367, 19209, -56524, -134540, -295336, -476081, -549350, -487765, -368936, -270631, -239288, -301119, -404307, -404868, -231794, -25950, 21432, -65075, -101401, -44215, -31500, -97540, -72454, 138020, 366703, 407307, 266472, 72589, -109436, -240476, -245832, -144646, -88222, -114589]
39966a14589P5933K68143K23177n5334j83834k5670R1140k7574j07969L7536J02522
39955B83481j57252l91509j95320J68274J82168m5453J0083L32796L50202p8463
39945D59007l72124j46473K00279J63745j10157j70982N751J01459L9086K3745
39935A93336R7211O6329j14313k22685j07070R8436J87614J34336L5484o2276
39925C06402j57346j87656o6614J57887K79570J53133r6184j90658m8911J03210
39915B52833M7255j21007j42506K4943J62757J17682q599m2318L0353Q5535L0491
39904D37419j04183j95007j40445J0504Q2150m409j00022l9363Q8591O0030j28903
39893c3638k38623j40158J3889M1070k8972o0886j5201O1926J35853J70766J14309
$$ y = [-114589, -38656, 229487, 452664, 397330, 213496, 187826, 278966, 251392, 143423, 180959, 283481, 126229, -265280, -460600, -292326, -110158, -155611, -145528, 187268, 537470, 459007, 86883, -59590, 140689, 304434, 194277, 23295, 29046, 130505, 169591, 193336, 290547, 356876, 242563, 19878, -87192, 11244, 198858, 333194, 368678, 306402, 149056, -38600, -105214, 52673, 332243, 485376, 389192, 198534, 149623, 252833, 300088, 179081, 36575, 61518, 224275, 341957, 333358, 291040, 321393, 406928, 437419, 333236, 138229, -2216, 8288, 90438, 86029, -13993, -53356, 35235, 95265, -33638, -272261, -412419, -398530, -357460, -386432, -447318, -462519, -400593, -264740, -93974, 20335]
39882B0335j3561r5655o4376l526k3419r1649p3042Q0465K40162K20369o548k29943
39870d0388k06072L0176J70700L1885j89820k08224n4590L0685O748L7344J26744
39859b64812Q5874r1400j50909M790J31381M8376n3738N4188K34893J98914k7930
39848A69627j51761o0142N2462J6138q6439q8902J1471O2709l9700k11007k50435
39837e75979p3641J60543K33081J41124N7389L4384m6707j92457k04573J081K00490
39826b65265J70922J8899j4167O5929N9972p3274j63900j06509J6591R1672R0549
39815a08581L0677m5546o1873L567N2525L647o2743l3138L5723J4566n3514j2154
39803b36844J23306J62398M9827l8384J5012P8481o301j65154k04755r0977L6397
$$ y = [20335, 6774, -88881, -153257, -156783, -180202, -271851, -344893, -264428, -24266, 196103, 189555, -40388, -246460, -216284, -45584, -13699, -203519, -411743, -466333, -435648, -428900, -391556, -264812, -178938, -270338, -421247, -416457, -285076, -236700, -290438, -236250, -1357, 197557, 169627, 17866, -42276, 10186, 26324, -60115, -149017, -137546, -74837, -114537, -325544, -575979, -649620, -489077, -255996, -114872, -57483, -23099, -69806, -262263, -466836, -465755, -265265, -94343, -75444, -89611, -23682, 36290, -36984, -200884, -307393, -290802, -199130, -108581, -77904, -123450, -185323, -181756, -129231, -125584, -188327, -221465, -185742, -171176, -224690, -236844, -113538, 48860, 98687, 60303, 75315, 153796, 147495, -17659, -222414, -313391, -276994]
39792b76994P9263P0617N8414L0906r062l516N6410O1646p7837k61031k81447
39781e52631r7517J04233J62237J25997J04835P5030j0628m5486Q3578K43736
39771A93384J98604j5100j10978J9021J58375J15714k8838j25714j67013j75059
39761F2396j04432J1487L0143n1765m3581J07648J82752N7348o8934k7424J5359
39750A70997j12778k22886p4714J64336J61896l2037q8541M7707J21280L7506
39740A72766l2048k1797o9870j96068k23602r3877L2914N5098N0240Q2052J26942
39729a17250J92980K68273J99002r0951l30971k12062R4303J43161q8013j91073
39719a32601l8966L4713j16728j89411k6814P2639n4215p4451K19821M31247J88873
$$ y = [-276994, -197731, -127114, -68700, -37794, -46856, -50372, 6038, 67684, -10153, -271184, -552631, -650148, -545915, -383678, -257681, -152846, -77816, -88444, -133930, -50352, 193384, 391988, 376888, 265910, 284931, 443306, 559020, 530182, 404468, 237455, 62396, -42036, -30549, -406, -52171, -95752, 11896, 194648, 251996, 183062, 155638, 170997, 58219, -164667, -239381, -75045, 86851, 54814, -33727, 13980, 135260, 172766, 140718, 118921, 49051, -147017, -370619, -464496, -431582, -376484, -326244, -244192, -117250, 75730, 344003, 543005, 452054, 121083, -90979, 3324, 146485, 58472, -132601, -171567, -136854, -253582, -442993, -469807, -397168, -451383, -525834, -306013, 125234, 314107]
39708C14107j71265j28834J57932J50177j38130j90531J06691K86539R7414j32580
39698C51520j05058j934o7959j64299n6562J45300J60756j8362j41029o9114Q3725
39687A16984J50348Q4671n5884j85522k25004j27779P6305K52358K26013k6761
39677B85729k57375j61879K12708M44721K47441j57110l45839k21555j0025J31172
39667A67988K14406K09002M0634j91249k72585j83412j04547r8739m6474O5888
39657a99088P7262m6371j10983j2612R1628P1234M6675J45701K30824Q6459k36589
39646A44140m54490l72134m9482K88617M18325K72238R350j41852j43781j39707
39636a68776j73466j16599N4439J37303J2514j26353n5378J20851J30190m2833
$$ y = [314107, 142842, 14008, 171940, 322117, 183987, -6544, 100147, 386686, 484100, 351520, 246462, 244528, 176569, 12270, -44292, 101008, 261764, 243402, 102373, 33259, 116984, 267332, 352003, 296119, 110597, -114407, -242186, -165881, 86477, 312490, 285729, 28354, -133525, 79183, 523904, 771345, 614235, 268396, 46841, 36816, 167988, 382394, 591396, 632030, 440781, 168196, -15216, -119763, -218502, -264976, -199088, -121826, -168197, -279180, -291792, -200164, -128930, -82255, 63446, 294270, 380729, 144140, -310350, -682484, -731966, -443349, -25024, 247214, 256564, 114712, -29069, -168776, -342242, -458841, -404402, -267099, -254585, -380938, -436316, -315465, -185275, -228108]
39626b28108j43383l1965J43083J93570J32580R1245J07148R0645k4083j60317
39616A70415j77160o6828Q294n0327j00682K5784K10282J87260k0203j03222L7435
39605A21048J26930j2585j61430r9261J2533m9939j46886m0423J32818Q2083r1380
39594a26492l1460K51658L66369J67105m5909l5121P0987R8342Q2344P0791J0795
39583H79409l8507Q9672L31075L98139K43803J47635K36441L82866P18564J605217
39573D994314K710181K783032J088373j325935k607912k207732j247488q41973
39565C344860q96171p78735l99759j17629o1999q2090j22224k18754k66722j36030
39555B64747O8006J30361L8816m6866n7737m8578m4032l6952p2514j62876j85175
$$ y = [-228108, -371491, -403456, -260373, -66803, 65777, 157022, 264170, 354815, 330732, 170415, -6745, -73573, -65279, -115606, -216288, -190504, 19778, 207038, 186835, 83613, 121048, 247978, 235393, 73963, -25298, -12765, -62704, -209590, -250013, -117195, -35112, -126492, -157952, 93706, 460075, 627180, 581271, 546150, 617137, 715479, 797823, 868614, 879409, 840902, 930574, 1261649, 1659788, 1903591, 2051226, 2287667, 2670533, 3389097, 4994314, 7704495, 10487527, 11575900, 10249965, 7642053, 5434321, 4186833, 3344860, 2448689, 1669954, 1270195, 1152566, 1090567, 1008477, 886253, 667499, 400777, 264747, 332753, 463114, 501930, 455064, 397327, 348749, 304717, 267765, 195251, 32375, -152800]
39544a52800l7171J57805J73960j0884j83871j73507l8117M0497k2599j24611
39534c71298r6513O8324J54529k471k31236k06740P1548K34554P2778j49963r7820
39523e54308J46227K43860J00968p3325j22413q9357l6680M4420J31012J53561
39513e6035R9431J1826q0398j25155l0386J75080K79936J68074L0748P9241J77495
39502G29857M9854k39429l53354j99802l2602j0182l865P4687R6209l60m8979
39491F2034M8830J34680P4961j1665K470J3502r3367j81790o5950J69376K82442
39480D35523K04303N4378p4316j53902j38566l1114M6562K0614J2423J41841K82937
39469H00683K24852L935j45137j30344p9460r2279j25540j38086j58224j71309
$$ y = [-152800, -189971, -32166, 141794, 130910, -52961, -226468, -264585, -224088, -246687, -371298, -467811, -399487, -244958, -247429, -478665, -685405, -613857, -379303, -306525, -456488, -554308, -408081, -164221, -63253, -136578, -258991, -348348, -385028, -340608, -209596, -56035, 43396, 55222, -25176, -150331, -180717, -5637, 274299, 442373, 473121, 552362, 729857, 779711, 540282, 186928, -12874, -45476, -55658, -59523, 15164, 111373, 111013, 62034, 110864, 245544, 320505, 308840, 311310, 324812, 231445, 49655, -16295, 153081, 435523, 639826, 694204, 619888, 465986, 327420, 296306, 342868, 363482, 375905, 517746, 800683, 1025535, 1029470, 884333, 753989, 674529, 582250, 456710, 318624, 160400, -10909]
39459a0909j07401J5682Q2969N8598L5134O1160N6212l2406j07498n4941P6137
39448G2737J27305L4490j07074j80082j72994j35904o7465O5288J98203J82790
39438A7294J804j39537p2677P5823P5615k4785L0227K47928L15467Q5305j72575
39427D39889j88074q6168j16217k18794j67896J9778J40838J59291J82499J67353
39417C32499n873k05837j58174R5521J99021J7201j65762j08716M1818N1423k9851
39406F3270k6436L5392J3886o1239l6256Q8030J40894M2983q4064r8450j2264
39395F5746N7710M4009j2417l6077j5132j740k0512l0795j0802j2691o9260j11044
39383a53005o4019L0895R3113J25048J43609Q0290q8744j99016r3482R6317J08020
$$ y = [-10909, -118310, -102628, -19659, 38939, 74073, 135233, 191445, 159039, 51541, -3400, 72737, 200042, 234532, 127458, -52624, -225618, -361522, -428987, -363699, -165496, 17294, 19098, -120439, -193116, -117293, -41678, -66463, -36236, 211692, 527159, 612464, 439889, 251815, 165647, 49430, -169364, -337260, -317482, -176644, -17353, 165146, 332499, 326626, 120789, -37385, 58136, 257157, 274358, 108596, -120, 41698, 93121, 63270, 36834, 72226, 86112, 24873, -11383, 76647, 217541, 260524, 176460, 78010, 65746, 123456, 167465, 155048, 118971, 103839, 102099, 81587, 50792, 39990, 27299, -41961, -153005, -217024, -186129, -93016, 32032, 175641, 255931, 167187, -31829, -125311, -28994, 79026]
39372G9026l6991n1114J58672L32069K47979J6209j49533k16337k37354j80408
39362c7782l1606Q7926Q0435K2566J8336L2031K354j7065K1420L3734m2836r7154
39350G2359j3549J16088J21526N448r6546j23049r8264k2084Q9448J30147L3145
39339B14669q9977r2543p738L4413L2735Q2948J70200J71068M4540j25291k53247
39328A81777k89900j82896M6253K25206J95721M1330p729J03737J86090Q4145
39318E83734j11935j93900q7612P8656J24972J3367j13246j05992M42N0566l43
39307B38709n0824n3477p1742r2876K950J89630K35186M5361j44752j06912N4704
39296B45957J25412J25283J76746K05870P0639j40295k23395j69909r8629q898
$$ y = [79026, 42035, -9079, 149593, 481662, 729641, 745850, 596317, 379980, 142626, -37782, -69388, 18538, 98973, 121539, 139875, 171906, 174260, 157195, 178615, 212349, 169513, 72359, 58810, 174898, 296424, 301872, 205326, 82277, -15987, -38071, 51377, 181524, 214669, 124692, 32149, 24411, 58824, 91559, 174507, 344707, 515775, 560315, 435024, 181777, -108123, -291019, -244766, -19560, 176161, 217491, 209762, 313499, 499589, 583734, 471799, 277899, 190287, 268943, 393915, 407282, 294036, 188044, 188486, 239052, 238709, 187885, 134408, 62666, -30210, -27260, 162370, 397556, 442917, 298165, 191253, 245957, 371369, 496652, 673398, 879268, 949907, 809612, 586217, 416308, 317679, 308781]
39286C08781J23317J55613K291j07578M7156K52972J66684r5841j49134n811j3003
39275F85447j70333j13568J71706K41301n2095k88312j80702J5006M8830Q3434
39265D40714K51179L34837K25194J82467L01097K66365J8789L3605M72436P77519
39255C304202P55477J241271K643350L505510J995158j310106l621598l258095
39247E255169j485911m86055o64174q93757n52491j13126k8082j10820j05595
39238H15158j00429j72193j52446L6226J77539R4013o9898p3375P2211J34636
39228G61442k3104k60801l12659j03672J41137J73006M1117j5931M6135M1915
39218D88585p8129j16325J6838J24610O3479j2251M9446J13526K2983q8043l6839
$$ y = [308781, 432098, 587711, 590002, 482424, 529580, 782552, 949236, 853395, 704261, 698450, 685447, 515114, 401546, 573252, 814553, 762458, 474146, 293444, 308450, 357280, 440714, 691893, 1026730, 1251924, 1434391, 1735488, 2001853, 2020642, 2054247, 2526683, 3304202, 4059679, 5300950, 7944300, 11449810, 13444968, 12134862, 8513264, 5255169, 3769258, 3283203, 2619029, 1725272, 1172781, 1059655, 1031573, 920753, 815158, 714729, 542536, 390090, 426316, 603855, 697868, 627970, 554595, 626806, 761442, 738338, 477537, 164878, 61206, 202343, 375349, 416466, 400535, 446670, 488585, 410456, 294131, 310969, 435579, 499058, 486807, 536253, 649779, 672762, 584719, 547880]
39207E47880N5671k1692j67430j23222Q2231J92730J46292R0225L9405j08050
39197G34040k38377j02732K24778L53602J41819j03519j25479n8765p2586j6502
39187G36279K68538N33518L92148q8689m16063k99325L4771K29477K52527K91729
39177A934910L47793J85078k77160p25451p71465m35523j16712p1967j34152l9788
39167a04437J69008K57307J71812P2725N3853M9592N355m9025r6711j42223j29835
39156B57421p969J37675J65460P6480l019k72P0217J77194K45388J83306Q8731
39145A390612K16535N10776M61446j69889p67206n93828P7077L06775q0437k91963
39135A059898N1962L25091J55905K87922J302295K225271J585574m29116k021019
$$ y = [547880, 603551, 581859, 414429, 291207, 373438, 566168, 712460, 802685, 842090, 734040, 495663, 392931, 617709, 971311, 1113130, 1009611, 884132, 825367, 752781, 736279, 1004817, 1538335, 1930483, 1841794, 1425731, 1126406, 1161177, 1390654, 1643181, 1934910, 2282703, 2467781, 2190621, 1465170, 693705, 258182, 141470, 69503, -64649, -104437, 64571, 321878, 493690, 566415, 620268, 669860, 675215, 626190, 529479, 387256, 257421, 249452, 387127, 552587, 629067, 626048, 625776, 695993, 873187, 1118575, 1301881, 1390612, 1607147, 2117923, 2579369, 2409480, 1642274, 1048446, 1125523, 1432298, 1351861, 1059898, 1111860, 1436951, 1592856, 1880778, 3183073, 5408344, 6993918, 6564802, 4543783]
39126D543783k020265j069064l71821k10003j56145k4692L1423j0967k6289j5257
39116F70703m2053n0313L84j1160j54439k72517k23925j04328l1596O9589K43099
39105I3444K89405O4378j92299j53679Q2739J22165j20044k77419p5442K62022
39095I5270L19530M6923j92949j12383J40214K12456M9097m2050J24470K88211
39085I28789J16305k54030l64178r3641J71911J09374j27022k20959j46529p7734
39075D2286n0201K6196J30686J46108O3346r565j3406K1432O3689R9066R7203
39064F16840N1635J5526L4377Q6535J21384R5781j9506j66335j68479N5310K81118
39053A004186K23710j1747k7313K63360M83732L83902J99835J85411J56809j41781
$$ y = [4543783, 2523518, 1454454, 1082633, 872630, 716485, 691793, 723216, 712249, 685960, 670703, 628650, 578337, 578721, 567561, 413122, 140605, -83320, -187648, -219244, -149655, 93444, 382849, 447227, 254928, 101249, 183988, 306153, 186109, -91310, -166752, 95270, 414800, 461723, 268774, 156391, 296605, 509061, 558158, 516108, 640578, 928789, 1045094, 791064, 426886, 333245, 505156, 614530, 487508, 266549, 120020, 42286, -7915, 18281, 148967, 295075, 358421, 348856, 335450, 356882, 420571, 519637, 616840, 668475, 684001, 718378, 804913, 926297, 1022078, 1002572, 836237, 667758, 723068, 1004186, 1227896, 1216149, 1188836, 1452196, 1935928, 2319830, 2519665, 2705076, 2861885, 2720104]
39043B720104n09739n50742k83684q0508j02204j82788k03952k14397k11923j47854
39033B32313j20065k37218l31622j54608J67509K48189L0286j20313J7384K22587
39023d5558K24796O6897p4143j49428j61494o4752R8469J58275N0160q0553j05361
39012h2692p0678n1640l3873j4703l3841m1449O5094K24089K53758J59654J36897
39001E10616K01320J19413j74584l95542l13177o9121R4926J59465J76010O8692
38991C78018j56821k48563m6688K03494J76587n0372j46581l6567N7058R711p1861
38980F7415r4239r2020r2047p6595p7489j21744j11417N5297K76580L49178K45439
38969C28358J05631j101j08329j84699j51273n2979q945m754O1573J46433J05485
$$ y = [2720104, 2210365, 1659623, 1375939, 1295431, 1193227, 1010439, 806487, 592090, 380167, 232313, 112248, -124970, -456592, -611200, -443691, -195502, -165216, -285529, -268145, -45558, 179238, 246135, 171992, 22564, -138930, -203682, -105213, 53062, 103222, 22669, -82692, -153370, -205010, -238883, -253586, -287427, -328876, -263782, -39693, 214065, 373719, 510616, 711936, 831349, 656765, 261223, -51954, -121075, -26149, 133316, 309326, 378018, 221197, -27366, -74054, 129440, 306027, 255655, 109074, 72507, 129565, 139276, 67415, -26824, -118844, -210891, -287486, -364975, -486719, -598136, -542839, -266259, 82919, 328358, 433989, 432888, 324559, 139860, -11413, -64392, -73337, -78091, -16518, 129915, 235400]
38958B35400k4432l6580J09227K05618J31408L2157M9866Q4027j6311j81870k25196
38947C63314j16721N908M9896M4473K7390k2158j16228j95979j73059k5784J48406
38936a0542J95972O1094j31562j94705p5787J07526K13270J96581R6946k3282
38926D35511j14525j58654j56818q7610O9486K34306K42245N0434j56855j87167
38916A70353q4287j3175Q508O8473J20245L8410j01193p8279Q8370J10784r9507
38905B28702k31962m8529K10807J81075o0417j25777P2251K03522M2280k17403
38895B54549k83188j52945k4893O106o177j0380j5L8200R8751J17986N2850l7056
38883E3788o4960l6538j7991k1423j696N5730J13889J34746J00768J9243n0254
$$ y = [235400, 210968, 174388, 283615, 489233, 620641, 652798, 702664, 786691, 770380, 588510, 363314, 246593, 252501, 302397, 346870, 374260, 352102, 235874, 39895, -133164, -158948, -10542, 185430, 246524, 114962, -79743, -155530, -48004, 165266, 361847, 458793, 435511, 320986, 162332, 5514, -82096, -12610, 221696, 463941, 514375, 357520, 170353, 86066, 72891, 81399, 149872, 270117, 308527, 207334, 129055, 217425, 328209, 228702, -3260, -51789, 159018, 340093, 279676, 153899, 226150, 429672, 471952, 254549, -28639, -181584, -206477, -200371, -206548, -216928, -216943, -178743, -79992, 37994, 90844, 53788, -11172, -47710, -65701, -87124, -88820, -33090, 80799, 215545, 316313, 335556, 285302]
38872B85302l1866M1561K0349j48202k86394k12685k8401J9841p0202n1349J50649
38861c11397K78764J41753p2646r4257P464k6155j79824j69730Q4663K95350K17084
38850A71069q193p8338M9650J48899O2752j13617j99045j51605p0562l0576O965
38839b12601R8351J94159J91819R7981K8842J6445n6752k42734l73968k71217
38829e29675j8021J44061J42119J12698J44127J74893J61973J59892J81107J38564
38819H11738o147j61634k26795j91757r8709q052K958o4128o0349J17503K95226
38808D09854K04548r6361k45650q5918J16322Q5734p2129q1233Q9099K25919J83460
38797G33645J8769j24152j49018o9009J6673O5018J76811M04445N35277L14348
$$ y = [285302, 253436, 294997, 315346, 167144, -119250, -331935, -360336, -340495, -410697, -462046, -311397, -32633, 109120, 36474, -57783, -50319, -76474, -256298, -426028, -341365, -46015, 171069, 162876, 84538, 134188, 283087, 345839, 232222, 33177, -118428, -188990, -219566, -212601, -114250, 79909, 271728, 369709, 398551, 414996, 358244, 115510, -258458, -529675, -547696, -403635, -261516, -148818, -4691, 170202, 332175, 492067, 673174, 811738, 805591, 643957, 417162, 225405, 126696, 118644, 121602, 57474, -2875, 114628, 409854, 614402, 518041, 272391, 186473, 302795, 388529, 316400, 235167, 324266, 550185, 733645, 752414, 628262, 479244, 410235, 426908, 491926, 668737, 1073182, 1608459, 1922807]
38787A922807j32309l99123l53481k47182k23956j32449L7460M341k65523l37316
38777a26731J2431L33077J74987j64996j29768J82084K31178l2533j49600M406
38767C34535N0205j55458k63354p9906J06861O9328n011N2827P7528l6374o3615
38756H7566J16087K15373K7397j44772M4318L74767L69776K2197k35304j89002
38746F88403m7782j629L4836J58360K59477K01420K7358j24501j91305j89670
38736H14967j41920p3558l2768n2326j04245j24183q8485n0655o9011j01094m1138
38725f4416J04976J83096J10865K1285N2059J04978J1610j46545j32065O2072
38715C07915J81451Q9174p0559j34720j09023l0231J19763K68996K45709K9135
$$ y = [1922807, 1790498, 1391375, 1037894, 790712, 566756, 434307, 471767, 476108, 210585, -126731, -114300, 218777, 393764, 228768, 99000, 281084, 512262, 479729, 330129, 334535, 384740, 229282, -34072, -113978, -7117, 62211, 57200, 110027, 187555, 151181, 87566, 203653, 419026, 446423, 301651, 345969, 720736, 1090512, 1112709, 877405, 688403, 640621, 638992, 673828, 832188, 1091665, 1293085, 1320443, 1195942, 1004637, 814967, 673047, 599489, 566721, 514395, 410150, 285967, 197482, 146827, 77816, -23278, -64416, 40560, 223656, 334521, 355806, 407865, 512843, 524453, 377908, 245843, 307915, 489366, 578540, 507981, 373261, 264238, 234007, 353770, 622766, 868475, 897610]
38705H97610j72343j94278j01756k7967o401l3826j13138j63936q0539O2798P0693
38694A36917n9534j16169j9781O9185N5730L4330K5056q8398k39328j58001J52815
38683b07178K97740Q6139j24170O897K47597K01654l2293p6207O2405M5378j74340
38672C33622k74872j10532R4186J48902J24425R7434O91j56573j94029k5757J75186
38661B12683J98975N3660q2318o9831O0694J25845k5543k75081k98409M075K91797
38650A96547K11430r7772k09635l3315J07016Q447j44204j38280m9914l5455m1474
38639b26609O9318K42231K84001J40982l2671q6708m9831n8556j61349k46292
38629a25484j77623K9006K12763K36068R9174q7168j75192p0084J47682K39717
$$ y = [897610, 725267, 530989, 429233, 401266, 394865, 361039, 247901, 83965, 3426, 66224, 136917, 77383, -38786, -58567, 10618, 66348, 100678, 125734, 37336, -201992, -359993, -207178, 90562, 176701, 52531, 59428, 307025, 508679, 476386, 400179, 462584, 507962, 333622, 58750, -51782, 42404, 191306, 315731, 413165, 413856, 257283, 63254, 37497, 212683, 411658, 465318, 383000, 313169, 373863, 499708, 474165, 199084, -99325, -95250, 196547, 407977, 310205, 100570, 67255, 174271, 182718, 38514, -99766, -149680, -185135, -226609, -157291, 84940, 368941, 509923, 477252, 390544, 340713, 282157, 120808, -125484, -303107, -274101, -61338, 174730, 273904, 186736, 11544, -58540, 89142, 328859]
38619C28859R1176q7724l9046J32940J12265j00413j75400j7003P5771m6623j13003
38608A61799N2608J63073m1797k99141k20914J01534L06689L23887K96744J85038
38598A029520q4771k68233j05098J70391J27896j65403k74429j31628p5518j76244
38588D6483j17066J70602L16213J17412j43742j75125m7556P1929J63167J69428
38578E71745l7387l31779l45423Q897L60159L97536K38308J18256N4214l391j548
38567A029587M4138n015j42032j79663r8021r2959j66796o4052K29338L50303
38557I04828J44739l3593J05774L14749K35280m5759k30016k93816l65937l70944
38547C65305j74050R9066K14166J44637j1950k16318l45548j56265L01937N31075
$$ y = [328859, 420035, 332311, 293265, 426205, 538470, 438057, 262657, 245654, 321425, 274802, 161799, 214407, 377480, 335683, 36542, -184372, -82838, 223851, 547738, 844482, 1029520, 944749, 676516, 571418, 741809, 869705, 704302, 429873, 298245, 222727, 46483, -70583, 100019, 416232, 533644, 389902, 214777, 167221, 239150, 402317, 571745, 534358, 202579, -142844, -133947, 226212, 623748, 862056, 980312, 1034526, 1031135, 1029587, 1073725, 1068710, 926678, 747015, 648994, 556035, 389239, 325187, 554525, 904828, 1049567, 1015974, 1121748, 1436497, 1671777, 1626018, 1396002, 1102186, 736249, 365305, 191255, 290321, 504487, 649124, 637174, 420856, 75308, -80957, 220980, 752055]
38537G52055K14706k65195l54138j16875k8034j74930k18716o1939Q780j15351
38527c59637j71395k1709Q8078m1307k14822j49255J03427K52618J58902l3639
38517c88739r4488M9959K40635K46402L8469j48811j02870J04160K42623K20873
38507D08213J14737j0449j37805k09496j60669k6935R1064J34930Q7274m7204
38497B43660j72112j31107P4735K25184J66523K9542J4638Q9468P5534o3724j93350
38486C58991j99697q5006O1284J05337r789j35852p7016Q7299Q2105r7833j31102
38475d1279Q4053K08128K6279j53614j5289K12296J53813o0295n1559J18743Q4522
38464E65798j25939j17248J54178K62019J4784k31461j50701Q3447J35977m993
$$ y = [752055, 966761, 701566, 347428, 230553, 202519, 27589, -191127, -253066, -244286, -359637, -531032, -552741, -464663, -505970, -720792, -870047, -766620, -514002, -355100, -388739, -483227, -433268, -192633, 53769, 92238, -56573, -159443, -55283, 187340, 408213, 522950, 512501, 374696, 165200, 4531, -22404, 68660, 203590, 290864, 243660, 71548, -59559, 15176, 240360, 406883, 436425, 451063, 540531, 616065, 552341, 358991, 159294, 74288, 135572, 240909, 231120, 95268, 18252, 105551, 187656, 89823, -41279, 42774, 250902, 277181, 123567, 108278, 320574, 474387, 414092, 362533, 481276, 565798, 439859, 322611, 476789, 738808, 753592, 522131, 371430, 454877, 590854, 585861]
38454E85861j24718j37730j20849j18478q8598K263J11828J43885N8257l2084
38444B79637J8175J41584J23892k7400n8517P6175J03577l2399J5031L31946M46665
38433A418366K04640L27571J270612K015348J156409r37262k274229j767745m75755
38424I37955J12243n9075j68945l4888q6743l39508l63503r5376R6169Q0529P4565
38413A53423J33142Q4423m5221l4982R5064Q7004j00695k31919k01694j41886
38403b03341j00172K6911J93159J80102l1431j64947m2674J67579K25295J33227
38393C83708M0997j1733r5367k04687k14255m1595K03301K89802J19861j29245
38383C40787j96272n1617R2363Q2274j8041r7967j49394j69088q6324R4766K21112
$$ y = [585861, 461143, 323413, 202564, 84086, -4512, -2249, 109579, 253464, 311721, 279637, 297812, 439396, 563288, 535888, 477371, 553546, 657123, 624724, 639755, 971701, 1418366, 1623006, 1950577, 3221189, 5236537, 6392946, 5455684, 3181455, 1413710, 937955, 1050198, 991123, 822178, 787290, 700547, 361039, -2464, -97840, -1671, 78858, 153423, 286565, 370988, 325767, 290785, 385849, 472853, 372158, 140239, -61455, -203341, -303513, -276602, -83443, 96659, 65228, -99719, -142393, 25186, 250481, 383708, 424705, 412972, 317605, 112918, -101337, -142932, 60369, 350171, 470032, 340787, 144515, 92898, 185261, 267535, 249494, 151527, 2133, -166955, -253279, -158513, 62599]
38372F2599J82647O7487K0260N0515P5779N4618l257o5924p0158J0673P6904K2437
38360D84580o6927k8952P8590N3587p8322q7368K3992j3067k22840k58245J5922
38349i9050K35908J23656m5932N9231K26116O2580k95743l64066n6856K35761
38339H1605K65822J73633J17992O3812j6004n8076p5960j45941k20062j94452
38329g631j23579j14523q5130P9211K13477O8708k24723k66929K3454K91559K66613
38318A20507O4469r7106j68286j64927p7719K9161O2579P5295J55735J75773k9409
38307A46072k59505j38854K54638M11449J65836l3676J40766L61188J97343j83861
38297A061396l13642j48463l4799j00358j38271n1133N067m3570n6913L1946P5543
$$ y = [62599, 245246, 312733, 332993, 383508, 459287, 513905, 510648, 444724, 374566, 385239, 462143, 484580, 417653, 388701, 467291, 520878, 442556, 355188, 379180, 366113, 143273, -114972, -99050, 136858, 260514, 214582, 273813, 499929, 562509, 266766, -97300, -154156, 81605, 347427, 521060, 639052, 702864, 686860, 628784, 552824, 406883, 186821, -7631, -131210, -245733, -330863, -251652, -38175, 30533, -194190, -461119, -437665, -146106, 120507, 184976, 87870, -80416, -245343, -323062, -293901, -231322, -156027, -292, 175481, 146072, -113433, -252287, 2351, 413800, 579636, 545960, 686726, 1047914, 1245257, 1061396, 747754, 599291, 564492, 464134, 325863, 274730, 279797, 236227, 179314, 211260, 286803]
38286B86803l3335j74517j75146k2804J71812K96017K65053O6937j55574j92964
38276C32282k1686J32180O8603j33596k37727j53679j974R1472J28098J46331
38266C50304J28830P0253L5104M4525j2452k11612l90792l06423j598J95808J17300
38255A9247k2051J6018J25001P5957o1627l1790J47777J75320n3233k64443k18446
38244i2270l6244M0312J278j0723K3325J4834k5485O68Q2817Q6263m1144j64002
38232a20371j14480R6779K67314K08799l4674k09391j36857O6811J44824L6535
38222B05289q0008q3646o6861j20535j36932J4813K23712K38020J1721k12140
38212f567j99970L520J62205J34377J940o7517k5068L1395J6654k0774J3199R3799
$$ y = [286803, 253468, 78951, -96195, -118999, 52813, 348830, 613883, 680820, 525246, 332282, 310596, 442776, 511379, 377783, 140056, -13623, -15597, 75875, 203973, 350304, 479134, 549387, 584491, 629016, 616564, 404952, 14160, -292263, -293861, -98053, 19247, -2804, 13214, 138215, 214172, 152545, 120755, 268532, 443852, 390619, 126176, -92270, -128514, -88202, -86924, -97647, -74322, -59488, -84973, -84305, -1488, 84775, 43631, -120371, -234851, -138072, 129242, 338041, 303367, 93976, -42881, 23930, 168754, 205289, 125281, 41635, -25226, -145761, -282693, -267880, -44168, 193852, 205573, -6567, -206537, -203017, -40812, 93565, 95505, 27988, 2920, 34315, 50969, 30195, 43394, 137193]
38200A37193R4618k5155j43259j26093J1095J45359J90024J42612M0909n7598
38190D09705q2268j0485Q2139R4421K3916m2546o8894j16725k03001j99086K565
38179a10259K52771K56083j5136j96899L357L52518L64476j4682l15128k14725
38169C62376L0163L3545j33568j39118K4754Q0371L4149K38123P52121J053904
38159B336820O71151j50360p24107p29991m43344k31762j49983q3774j4498J3114
38149D93266K0607L8244J7499o7143j15612m5578L2049m4642k05190k10370k1479
38138a08349J12749K8590j03461n8976R0032J18032J0848n6028k7316o747k8565
38127b9191l7731o6551j68683k05367k944K77070K77141L188j41612O386J21609
$$ y = [137193, 231811, 206656, 63397, -62696, -51601, 93758, 283782, 426394, 467303, 409705, 327437, 316952, 399091, 493512, 517428, 474882, 405988, 289263, 86262, -112824, -110259, 142512, 398595, 383459, 186560, 189917, 542435, 906911, 892229, 577101, 362376, 392539, 426084, 292516, 153398, 178152, 258523, 292672, 530795, 1282916, 2336820, 3007971, 2857611, 2133504, 1403513, 960169, 728407, 578424, 494650, 480152, 493266, 513873, 552117, 569616, 502473, 386861, 341283, 373332, 328690, 123500, -86870, -108349, 4400, 32990, -70471, -129447, -39415, 78617, 89465, 33437, 6121, -626, -29191, -66922, -133473, -302156, -507523, -510467, -233397, 43744, 46932, -94680, -88294, 33315]
38116C3315k3328j53765O284K18645J31694j08686j20828N7560P8557q1536j10706
38105g2794N4137J27898N540o6448M8701J47966O5905n8794n7151J2024L7213
38094B44197M9974R6482J09748L8720n4509j12956j49609j47708o2299M8893P0738
38083A31671J9909N945J6839m1227j11200m6026J02646J31235L0384o054N7587
38072B91709M0814r6287j58500o3056K5465M295k3534j0148n6475j38815o7025
38061b51557J54206K48906J01035o4120p9741o7848r5732J1909K76251L63467
38051E96776R4854j84227j06356J41486J39629j04505k39137j44132r780N7587
38041B42195J21309J59654P2178q1155j38745j06216j08128j25300m6090P2456
$$ y = [33315, 9987, -143778, -137494, 81151, 212845, 104159, -16669, 40891, 119448, 37912, -72794, -18657, 109241, 114781, 48333, 97034, 245000, 310905, 252111, 194960, 206984, 244197, 294171, 390653, 500401, 539121, 484612, 371656, 222047, 74339, 12040, 60933, 131671, 151580, 157525, 174364, 133137, 21937, -24089, 78557, 209792, 240176, 234122, 291709, 332523, 236236, 77736, 14680, 40145, 44440, 20906, 10758, -45717, -184532, -251557, -97351, 151555, 252590, 188470, 108729, 40881, -54851, -42942, 233309, 596776, 691630, 507403, 401047, 542533, 682162, 577657, 338520, 194388, 184608, 242195, 363504, 523158, 595336, 514181, 375436, 269220, 161092, 35792, -10298, 62158]
38031F2158O9945k2431k1454Q3535J03584l4048j70811j56021k2717J04611J41431
38020A37782Q0173K064J3364P9683K4155j88677l08242j21299K05134L27544J84447
38009D36128J8565k526M6064M3518j7960q6805j17333q0890j2023J200m2907k4650
37997A60381R6189J78281J19631K4630L348j9010j10139j38804n779J09896L938
37986D22562k00356k36333j09392l7036p3897q8931l6763K6921J19498K52594
37976C8867K84812J36610J8868J18597K07183k6571l72765l31615P6127K76918
37966D27031K2660k37334r1938J99425J55635j88685l89057k44349J8543J42858
37956a85211J34496J38251K02299K23493Q5831j49349k37458l7472K39139K43799
$$ y = [62158, 132103, 109672, 88218, 171753, 275337, 241289, 70478, -85543, -108260, -3649, 137782, 217955, 220019, 233383, 313066, 337221, 148544, -159698, -280997, -75863, 251681, 436128, 454693, 452167, 498231, 541749, 523789, 436984, 319651, 238761, 226738, 227938, 185031, 160381, 256570, 434851, 554482, 579112, 582460, 563450, 453311, 314507, 308728, 418624, 422562, 222206, -14127, -123519, -160555, -234452, -323383, -360146, -333225, -213727, 38867, 323679, 460289, 479157, 597754, 804937, 778366, 405601, 73986, 150113, 427031, 449691, 212357, 120419, 319844, 475479, 286794, -102263, -346612, -328069, -185211, -50715, 87536, 289835, 513328, 599159, 449810, 212352, 174880, 414019, 657818]
37946F57818m4345k75474j97782M1783J60595J16921Q4633J71071K91590K79168
37936A285978O3462k17741l03082r7421J60483J61700p3513k38700j68741j2613
37926E59812M5285J2058l9190j16313k16625k48508j63902n1639K21L0842J04042
37915h3917J72386J43839L1036m9749j8372P0128Q0775l0739j25696m6088J30770
37904B74373J52169m4692k17786j81398o9041n9169n9750P7415K19811J49681
37894B41613m1233r3486j7108k6029j01685j3228K29438L29120J62909n3730j34833
37883D81748j41208j59863j63154j53709j71889j24742R6103L16624K49064j6807
37873B12167q6044J14667K15799L5441j22579j2139J40938N3722j48106j97915
$$ y = [657818, 613473, 337999, 140217, 182000, 342595, 459516, 544149, 715220, 1006810, 1285978, 1349440, 1131699, 828617, 731196, 891679, 1053379, 979866, 741166, 572425, 559812, 605097, 617155, 577965, 461652, 245027, -3481, -167383, -219022, -218801, -187959, -83917, 88469, 232308, 263344, 213595, 195223, 265351, 346126, 315387, 189691, 143603, 274373, 426542, 381850, 164064, -17334, -86375, -145544, -205294, -127879, 91932, 241613, 200380, 106894, 89786, 63757, -37928, -51156, 178282, 507402, 670311, 616581, 481748, 340540, 180677, 17523, -136186, -308075, -432817, -336714, -20090, 228974, 212167, 126123, 240790, 456589, 492030, 369451, 357312, 498250, 551972, 403866, 205951]
37863B05951j21398p9917l6857R4047J81021P5989q7939r9628j5176j0647l5825
37852F9621P7180K60549K70825O3883j44156j77958o7159O7242J20195K6295j68209
37841C98308k80125j68060P9245K32202J78896K7295k7951Q9320K36283J85927
37831I51340p0097k42957j21983Q1974K1770k36341k89107j9444K38810K36216
37821E50181J20147P1759J7216r1712p4533J31688K42226M5802k13799j99902
37811E99073J116O5862m2834r1289m556N3464p444q3693p2358N912P4860P0220
37799E68333k4092j29785j40572p8467n7849p2358p859J04188R4783k4744m0504
37788A91074P9132R4110q2911k04949j00210O8202J35807J84498K50675J54095
$$ y = [205951, 84553, 4636, -32221, 61826, 242847, 318836, 230897, 131269, 116093, 105446, 69621, 146801, 407350, 678175, 742058, 597902, 419944, 352785, 420027, 540222, 566517, 398308, 118183, -49877, 29368, 261570, 440466, 467761, 439810, 529130, 765413, 951340, 881243, 638286, 516303, 598277, 620047, 383706, 94599, 75155, 313965, 550181, 670328, 742087, 759303, 667591, 593058, 724746, 966972, 1012774, 798975, 599073, 600189, 666051, 623217, 531928, 527372, 580836, 573392, 489699, 417341, 423253, 498113, 568333, 544241, 414456, 273884, 195417, 137568, 65210, 57351, 161539, 256322, 231578, 191074, 270206, 364316, 281405, 76456, -23754, 44448, 180255, 364753, 615428, 769523]
37778G69523j30522k96954j83361n8894j33861j73454M3549K70261K12447M3769
37768C62503N1837J12999M299r5114M7096J73095o2839m01189l24693Q4608K87126
37757B39728J55733M3206O3000j2522j48578l6337K46098K32277j34730l40646
37747C07229j31903R4621p426j95987j26886Q5547J42985L5656p7118j55121j69438
37736a97841O720L31177M76083K41586j31232k93997k30401j38821p6760K5750
37726A2264J32281J18603k3472j56076j50146p938J32248J17653k7953r9199j481
37715D6784P6589l3601j61941o9170J02149K5508k28646k44867P7363L49807K86725
37704B26700O8314l9682o0180j01619r8879J6986J32078J33261Q3671O0692R298
$$ y = [769523, 639001, 342047, 158686, 99792, -34069, -207523, -163974, 106287, 318734, 362503, 414340, 527339, 531638, 436524, 483620, 656715, 593876, 192687, -132006, -47398, 239728, 395461, 438667, 501667, 489145, 340567, 304230, 550328, 782605, 647875, 307229, 175326, 269947, 262521, 66534, -60352, 25195, 168180, 203836, 126718, -28403, -197841, -191121, 140056, 616139, 857725, 726493, 432496, 202095, 63274, -13486, 12264, 144545, 263148, 239676, 83600, -66546, -74484, 57764, 175417, 147464, 48265, 46784, 123373, 89772, -72169, -141339, -39190, -13682, -242328, -487195, -409832, -60025, 226700, 295014, 255332, 195152, 93533, -5346, 11640, 143718, 276979, 360650, 421342, 430640]
37693D30640j08287j95912j69071n7238R6561K52607K74122N5473k21221k38354
37683A19320J067J70438J28456Q8554J81229K16868N8710j09490j08045n5306
37673F91801j00878j32398p141J45454J18897l7205j18313o9538J3956P2473Q9794
37662F66902K6966r3138j34689j4866J68695K65775K22269M7447k14526m17315
37652E23520l89878j62454M7089J33746K04506L12959L17838J26786j06863j69720
37642H37529m3870J14748J42456k3852k73429l58704j67974P1711P1334r5385
37632B74564j19401L5132R7745j8045p5853M0596J17063j0915j95855k56690k21442
37621c33101j42091L2608K38695K48500K2542j57295p9733J18657K13900J73050
$$ y = [430640, 322353, 126441, -42630, -99868, -3307, 249300, 523422, 578895, 357674, 119320, 120387, 290825, 419281, 507835, 689064, 905932, 964642, 855152, 747107, 691801, 590923, 458525, 451384, 596838, 715735, 678530, 560217, 490679, 504635, 577108, 666902, 693868, 600730, 466041, 451175, 619870, 885645, 1107914, 1155361, 940835, 523520, 133642, -28812, 18277, 152023, 356529, 669488, 987326, 1114112, 1007249, 837529, 793659, 908407, 1050863, 1027011, 753582, 394878, 226904, 298615, 369949, 274564, 155163, 190295, 288040, 269995, 194142, 234738, 351801, 340886, 145031, -111659, -333101, -475192, -442584, -203889, 44611, 67153, -90142, -169875, -51218, 162682, 335732]
37611C35732M0828j67677l20685k14118Q3719K29621R8494l5642L4729J49350
37601B34351J28897O8141O3821M255j31342j22623Q0663J65367k9496j80001j2994
37590B69039J93272P0163j99149j87321O2623J48542k091o7194P9970J81980N7649
37579F07483j21427j23075L4609J65324J47998K1537o7620k4804M3176n9734k99589
37568C23878l75894j19320K46131L83810K37369O564j23160r8247J8523P9651
37558E79305J174q2316M895J51560Q7692j44737k07293k0265J01986O77p3810
37547C98868M5834J34903K2922o7123O1889K04205J31870K280L6847J22797R0018
37536A185310O2943J69907K19219N1672r1540L8138K27871J60435k6610N638K08115
$$ y = [335732, 376560, 208883, -111802, -325920, -242201, -12580, 85914, 50272, 85001, 234351, 363248, 431389, 495210, 499465, 368123, 245500, 326163, 491530, 462034, 282033, 269039, 462311, 532474, 333325, 146004, 208627, 357169, 355078, 287884, 367854, 549834, 607483, 486056, 362981, 397590, 562914, 710912, 732449, 664829, 640025, 683201, 623467, 323878, -52016, -171336, 74795, 458605, 695974, 702538, 579378, 481131, 499654, 579305, 580479, 498163, 503058, 654618, 742310, 597573, 390280, 370015, 472001, 472678, 398868, 444702, 579605, 602527, 535404, 597293, 801498, 933368, 935648, 972495, 1095292, 1185310, 1248253, 1418160, 1637379, 1689051, 1597511, 1635649, 1863520, 2023955, 1997345, 2002983, 2211098]
37525B211098K68040J49748P8014J21952J86957K80965M27174M66212K95515J42644
37515D628319K61258N27413O62919O65098O90213P25369P08335P47694Q98307
37506A0514925R73618R06988R84533J337108J543507J204114O01285K79070K31286
37497A8576434M1691l86920p83863j024070j186574j244777j153358j080157j133078
37488A0625328j078252p56620m95372o18412q54746p80763n38667n05478n56800
37479D440218l54304j00887k39591n79577n25722r2780J09686j03093k67088j30141
37469B156721L753p7147j68985j42120j64750k77743k69702j06766j0828k6583
37459I15850K8590J44540J16607k3727m9372N435q5325k50741k14428k8926J0076
$$ y = [2211098, 2479138, 2628886, 2706900, 2828852, 3015809, 3296774, 3723948, 4190160, 4485675, 4628319, 4889577, 5416990, 6079909, 6745007, 7435220, 8160589, 8868924, 9616618, 10514925, 11488543, 12395531, 13380064, 14717172, 16260679, 17464793, 18066078, 18345148, 18576434, 18618125, 18231205, 17447342, 16423272, 15236698, 13991921, 12838563, 11758406, 10625328, 9547076, 8790456, 8295084, 7676672, 6821926, 6041163, 5502496, 4997018, 4440218, 4085914, 3985027, 3745436, 3165859, 2640137, 2547357, 2657043, 2553950, 2286862, 2156721, 2160474, 2083327, 1914342, 1772222, 1607472, 1329729, 1060027, 953261, 942433, 915850, 944440, 1088980, 1205587, 1181860, 1132488, 1137923, 1052598, 801857, 587429, 558503, 568579]
37448E68579o9840J3019K14686K23826M8619k6390l72q1498j49398O1291L31282
37437A133804K08296j76027k71891n0874o578k21285k46156K0447J47290j3392
37427E23634j04553l778k3183k14732k23259O378J09044K5336R4178K92610J87924
37416F69599j91990k78879M3005K16091J7487r0049R5048J14350k25417l98967
37406b9722q3400K71510K62457J59599K35151K06737j27761l79173k20985N0780
37396C45193R3840P0613J74638J93389j1383j48380l4728N9613l6272p7356L6425
37385F65592J1744k03065k10653P2654J67718r1124j93159J22089L57814J51820
37375H51430r7966j6422R3352p7144k41890j47751q6593k30471j89185J96643
$$ y = [568579, 498739, 511758, 726444, 950270, 998889, 972499, 972127, 890629, 741231, 802522, 1133804, 1342100, 1166073, 894182, 843308, 836730, 615445, 369289, 389736, 537026, 523634, 419081, 415303, 392120, 177388, -45871, -39493, 69551, 94887, 189065, 481675, 669599, 477609, 198730, 241735, 457826, 475313, 385264, 480312, 594662, 369245, -29722, -113122, 158388, 420845, 580444, 815595, 1022332, 894571, 515398, 294413, 345193, 439033, 509646, 684284, 877673, 866290, 717910, 683182, 742795, 706523, 629167, 665592, 677336, 474271, 263618, 336272, 503990, 412866, 219707, 341796, 699610, 851430, 753464, 737042, 830394, 753250, 511360, 363609, 277016, 46545, -142640, 54003]
37365E4003L77980L5484k59277K03L66974K39830j26204j73938k516q777j07385
37354C96377l4324O0450j8295m0350J56276K33154j8901k00583k2645J26770p7136
37343E60793k57382o8549J16027p5318k82649j07002J32960N3739m4603J82493
37333B10509L85047J65389j58422j60829n6189j39370j35561J87240M24189K47447
37323I69450M2944J97556M85245P30927J172304J546353R31800o69888j754112
37314C652579j325647l74091k23822n51949l62344J32707J14027k12089j18665
37305G30706J75254R163l37663j78614K12255J20954k44774k19834K9653n0122
37295B46978k37192n9049J37311j14591l14111J12742N70297K82490k44754j45226
$$ y = [54003, 431983, 467467, 208190, 208393, 575367, 815197, 688993, 515055, 512539, 503762, 396377, 362053, 422503, 404208, 363858, 520134, 753288, 734387, 533804, 511159, 637929, 560793, 303411, 234862, 350889, 275571, -7078, -114080, 18880, 72619, 28016, 210509, 595556, 760945, 602523, 441694, 385505, 246135, 110574, 297814, 722003, 969450, 1012394, 1209950, 1695195, 2426122, 3598426, 5144779, 6076579, 5406691, 3652579, 2326932, 1952841, 1729019, 1177070, 814726, 947433, 1061460, 849371, 730706, 905960, 915123, 577460, 398846, 611101, 732055, 487281, 267447, 297100, 246978, 9786, -49263, 88048, -26543, -340654, -227912, 342385, 624875, 380121, 234895]
37285B34895K25493R0780j95429N6981L67041k650m56761r3992N01815K69266
37275I97439l48342k71184J75220N983m24328j58885L85704K13833k39499K8794
37265C64735N14515J59095m47663j01106O10612L37966m08070j96696N50572L79420
37255A763380l59749k49910L47055M7153o69215l10637N87645L80060m48705k00483
37245H86594O27702K91127o11063j68316R64074O44607n16136j94407J047824
37236B972006P12035o86867m49894J020352R13773m04859p317J709899J635270
37227G414398K18413Q38225L122802L722327L341435N208709P005915L595954
37219C4468178k177124k136563L150343N356641M692909J0101416K0636702K6229551
$$ y = [234895, 460388, 551168, 355739, 412720, 779761, 777111, 320350, 226358, 728173, 997439, 649097, 377913, 553133, 559116, 134788, -24097, 361607, 575440, 335941, 364735, 879250, 1038345, 590682, 489576, 1100188, 1438154, 1030084, 833388, 1383960, 1763380, 1403631, 1153721, 1500776, 1547929, 878714, 568077, 1155722, 1535782, 1087077, 886594, 1514296, 1805423, 1194360, 1026044, 1990118, 2634725, 2118589, 1924182, 2972006, 3684041, 2997174, 2547280, 3567632, 4481405, 4076546, 4069229, 5779128, 7414398, 7632811, 8471036, 11593838, 15316165, 18657600, 23866309, 30872224, 34468178, 32291054, 30154491, 33304834, 38661475, 43354384, 53455800, 74092502, 100322053]
37211A00322053L3509866O5107715J14847994J28354283O1493099n2207402j27434547
37204C23993061j21341482p1442133l5188846k5162719j9922638r757419l496588
37197C7681236l760648k470888J797732J650422l944090p255462n218353l033819
37189A5446130l480498l194212q66963O3493j432048j930655k53862N61121o33694
37180D278812j159577R874M59005o70527j045019J86942P99876j53174p22212
37171A984000q517L00671m86290p22111J92944N92889j86275o00417K2758L12760
37161A402412k82355m60330J90994L10452m63786o41055K73690P73917J38883
37152A242822l55920L3509K68364k24315m32220J17903L68501j55997l91686J58254
$$ y = [100322053, 133831919, 198939634, 313787628, 442141911, 503635010, 451427608, 323993061, 202651579, 131209446, 96020600, 70857881, 50935243, 41177824, 37681236, 33920588, 31449700, 33247432, 34897854, 30953764, 23698302, 18479949, 15446130, 11965632, 8771420, 7904457, 7967950, 6535902, 4605247, 4351385, 4912506, 4278812, 3119235, 3129109, 3588114, 2917587, 1872568, 2059510, 2859386, 2706212, 1984000, 1975483, 2276154, 1789864, 1067753, 1260697, 1853586, 1667311, 1066894, 1089652, 1402412, 1120057, 659727, 850721, 1161173, 697387, 56332, 330022, 1103939, 1242822, 886902, 920411, 1188775, 964460, 532240, 650143, 1018644, 862647, 470961, 629215]
37142F29215M38128r1998m15146N5524L79806n1281l99598q1088J68244j42100
37132D89706l08160N6522J99357k11852l25905K26796N05572o089l95732Q120
37122B38335M44918J71846k70697k01286N7105O0770P9852K58434J30909l06185
37112F64001k73115L54231N79407k4633n00264j67175K48437L1741k77486m1614
37102E93530K77248J21516j8812M82073J215892J422732J057060M09878m78845
37093E082272j321385j418425p30098k12847m02507o14313k36962K20605J67105
37084E33445j6518J55406L04265O479k93783j15625J27775o0173k94611o9321
37074B77339K48833J04875k27540k05449J7292K8444k4187J35595K28951m6066
$$ y = [629215, 1067343, 975345, 560199, 615723, 995529, 944248, 544650, 463562, 631806, 489706, 181546, 238068, 437425, 225573, -100332, 126464, 632036, 625947, 230215, 238335, 683253, 855099, 584402, 383116, 440221, 500991, 580843, 839277, 970186, 664001, 390886, 745117, 1324524, 1299891, 799627, 632452, 880889, 912630, 635144, 593530, 870778, 992294, 973482, 1455555, 2671447, 4094179, 5151239, 5561117, 5082272, 3760887, 2342462, 1612364, 1399517, 997010, 382697, 145735, 366340, 533445, 516927, 672333, 976598, 983077, 689294, 573669, 701444, 641271, 346660, 277339, 526172, 631047, 403507, 198058, 215350, 243794, 219607, 355202, 584153, 538087]
37064E38087l38651k35089J1885K2802j2186J60056K58325M6809j07704P1481
37054D15815J68879j41456l85340j04261K75902J80043j28037r7587J38905J46920
37044D69783J2280J5502J949j91484k22140J23447L55032P6419k48740j03337
37034B88711J46178l2209l06766j05837K89118K58268k6881J7498K84299K35018
37024A047397p6910j88086j24244k11499k96307n2730K32373Q2191k53008k02668
37014d3491R2968Q6152j23462r678L28837L28333R930j07307j5479j55256m29360
37003c7813k87339K00107L40260j8452k54184m9080J74129Q9829n4034k6464K5779
36992A02738K7616J51425L50661L03520r393k11772j45438o4091j24373j88323
$$ y = [538087, 199436, -35653, -23768, -966, -13152, 146904, 405229, 452038, 344334, 415815, 584694, 443238, 57898, -46363, 229539, 409582, 281545, 183958, 322863, 469783, 482063, 497565, 499514, 308030, 85890, 209337, 564369, 640788, 392048, 288711, 434889, 402680, 95914, -9923, 279195, 537463, 510582, 528080, 812379, 1047397, 970487, 782401, 658157, 446658, 150351, 97621, 329994, 412185, 159177, -43491, 49477, 135629, 12167, 2489, 331326, 659659, 669589, 562282, 546803, 391547, -37813, -325152, -125045, 215215, 196763, -57421, -106501, 67628, 157457, 103423, 76959, 102738, 130354, 281779, 632440, 935960, 926567, 714795, 569357, 505266, 380893, 192570]
36982A92570j94249k28290k01332M2116L02643K43497j411n147K01636J81862
36972E33895j01105j90163O7353K67918J42849q0757j69897k00395k20757j00538
36962e1597J22167J89694N4525n1806n4349j08801j93083r2312J43379J97529
36952A55346K4654o9145L8328J21752N8545n259j6945j01322k08788j24270R3851
36941c3253J27856o0582j42606L2935K27724K41595J52342M7981r3335j93622
36931C07035j25003n162o1339k00433j30600J04441J73879L9877m726R8585Q9291
36920B85845o9714q6958J13560K36599J26620k6000r5323j79231k55615j49570
36910i9787O0280Q0221o3133k7586K07885K55489J0454j34513K4006J49589k5070
$$ y = [192570, -1679, -229969, -431301, -389185, -86542, 156955, 155544, 150397, 352033, 533895, 432790, 242627, 309980, 577898, 720747, 639990, 470093, 269698, 48941, -51597, 70570, 260264, 314789, 262983, 208634, 99833, -93250, -185562, -42183, 155346, 180000, 110855, 149183, 270935, 329480, 324221, 307276, 205954, -2834, -127104, -33253, 94603, 34021, -108585, -75650, 152074, 393669, 546011, 593992, 500657, 307035, 182032, 176870, 115531, -84902, -215502, -111061, 62818, 102695, 97969, 196554, 285845, 216131, 129173, 242733, 479332, 605952, 579952, 484629, 305398, 49783, -99787, -39507, 40714, -22419, -50005, 157880, 413369, 423823, 289310, 313316, 462905, 437835]
36899D37835k43927j99189j8293M7401M3047J02370J44197P0676p082J1117K2109
36888D10261n5884j18836r3877n9620l2375P9362K11848J59239n5945j62537p4429
36877B07207J3211K7610J11539K30738J35574j60086l12339k05157j19470j91034
36867b62207j83930J872R4942l2208r5275P6190K10989J00899j4994R1358K14467
36856B02103J14100m8350m7812j5045j27734k02069m027K85875L15552Q0269j39160
36845D13702j89538j12845K8082J44205J13452j9923l7178J01777J49567j8074
36835E73227j74869j19658K0181O5564O2563P5077J2470j25502j52495m8734o2066
36824A25758k43506k69021K0298K96937K59443P6186K175m8058j87154k07199
$$ y = [437835, 193908, -5281, -23574, 23827, 66874, 169244, 313441, 384117, 377035, 388152, 410261, 354377, 235541, 141664, 82044, 49669, 129031, 340879, 500118, 444173, 281636, 207207, 220418, 248028, 359567, 590305, 725879, 565793, 253454, 48297, -71173, -262207, -446137, -444265, -349323, -381531, -476806, -400616, -189627, -88728, -103722, -12364, 202103, 316203, 267853, 220041, 204996, 77262, -124807, -128834, 157041, 472593, 552862, 413702, 224164, 111319, 139401, 283606, 397058, 377135, 339957, 441734, 591301, 573227, 398358, 278700, 298881, 364445, 427008, 502085, 514555, 389053, 236558, 187824, 125758, -117748, -386769, -366471, -69534, 189909, 266095, 268270, 220212, 33058, -174141]
36814a74141M3924K83160K10311l366n2422r829p6804j30696J3732J67170O9323
36803C40362j11037o0665J12630R1816o2228m3780J18929J22466n9493j53664
36793B95336p1698K419k0989m7365l4324q329P0564J80226J26961j32287k66119
36782I4395l1405K59874J67294j77965k82363n7442J31301J06865O7417J40264
36772D18235K06593J95088J60216O9577j26348k55638j27847R0392R3908n1206
36762F72970m7611P0648R604j92813j83833O3721J68985j17j14035J3422J08940
36751E69881m1452k02805j04279J17759J82742R0618J1696j7859m2205j9787O2480
36740F06789O9335q2933k36770j86689L6659K25062K53567J61592M3043m0812
$$ y = [-174141, -130217, 152943, 363254, 359888, 307466, 297637, 220833, 90137, 103869, 271039, 340362, 229325, 168660, 281290, 373106, 310878, 267098, 386027, 508493, 449000, 295336, 223638, 226057, 205068, 157703, 123379, 115050, 185614, 365840, 492801, 360514, 94395, 62990, 322864, 490158, 312193, 29830, -27612, 103689, 210554, 277971, 418235, 624828, 819916, 980132, 1049709, 923361, 667723, 539876, 630268, 724176, 672970, 625359, 696007, 705611, 512798, 328965, 392686, 561671, 561554, 447519, 460941, 569881, 528429, 325624, 221345, 339104, 521846, 612464, 624160, 606301, 564096, 544309, 606789, 676124, 593191, 356421, 169732, 206391, 431453, 685020, 846612, 889655, 848843]
36730H48843p6331q7973r7629r1931o0337l0456k2552k8302p0197j72858k33887
36719a23610r9753J47360K08464J4403j14489L1848J87667N3553j77371j39885
36709a1813Q0911J16551m4639q3482N8867J15655M813p6533p9786j50757k19065
36698b89278l9490K84318L29126L3840j56423j3396J11381q7340l43496k69516
36688d40274L7385K14522J86265J34037J14448N0936j7987K2629J39817J79686
36678F21464P4740j01620k17496j57324O1053K10277P6250k09589k90888q7153
36668b0286J00570O5619l1051O86Q0413Q6308R6545J77337J85719K7123j17085
36657F51898p2314K2321m6074j93646j86052k2810R1909P0428k385n8104q2694
$$ y = [848843, 772512, 684539, 586910, 494979, 434642, 404186, 381634, 353332, 283135, 110277, -123610, -223363, -76003, 132461, 146864, 32375, 64223, 251890, 305443, 128072, -11813, 69098, 185649, 141010, 57528, 116395, 232050, 236863, 160330, 80544, -70213, -289278, -328768, -44450, 284676, 318516, 162093, 148697, 260078, 172738, -170758, -440274, -402889, -188367, -2102, 131935, 246383, 297319, 279332, 301961, 441778, 621464, 696204, 594584, 377088, 219764, 280817, 491094, 567344, 357755, 66867, -20286, 80284, 145903, 114852, 115538, 195951, 282259, 378804, 556141, 741860, 768983, 651898, 579584, 601905, 555831, 362185, 176133, 153323, 245232, 315660, 313275, 255171, 172477]
36646A72477l9054O2948R7291o574j11929o3347O9447J12713N9563L2824N5158
36635D41517M5251r909m9036n9539o1406k2506P1618J26008N4184p4372j38704
36624C23106j44188j52030j15694L2179J85695J59727k5239j36475m5841R7233
36614A78473P8987r5063k17015j40356M6213J34319N8064k8309K3177J28081R0493
36603B57064q6526j80532p0812Q8269R9670j2151q5421o1492n330M9816J35728
36592A28283K31584K25226M2506k20606l47319k16334M4076J85184J32959M9248
36582B54807N2375L4457j10038k33389j37173P7969J35799J4970l2739R2469J88950
36571C38457J04687l0324m4468K1760L6460k1898j03368j82333k16902j44155
$$ y = [172477, 133423, 196371, 293662, 287088, 175159, 111812, 181259, 293972, 353535, 386359, 441517, 486768, 476859, 427823, 368284, 306878, 284372, 355990, 481998, 536182, 461810, 323106, 178918, 26888, -88806, -56627, 129068, 288795, 263556, 127081, 81240, 178473, 257460, 162397, -54618, -194974, -148761, -14442, 43622, 15313, 38490, 166571, 257064, 170538, -9994, -80806, 7463, 107133, 94982, 9561, -51931, -57261, -7445, 128283, 359867, 585093, 627599, 406993, 59674, -156660, -112584, 72600, 205559, 254807, 307182, 341639, 231601, -1788, -138961, -60992, 74807, 89777, 57038, 149507, 338457, 443144, 412820, 368352, 390112, 426572, 404674, 301306, 118973, -97929, -242084]
36561b42084P942J24194J57736J51155J00806k6815j47677j38132o1182p9289
36551a53346j43266n2999J49543J80833j3984j39665k9129J02844N6553m1776
36541h4392m0599m5411j39833j29009J29262L88413L35015N2396j44774j64594
36531A56474j29185q2600j6285l2684j67808j92063P7291L85254L24098n9178
36521B63314l06687j86282O7783J81636J69209J35848N1099j14548k22204j18689
36511g9521J23406K54493J28867j25318k40363j12696P1179P6424o4387j19468
36501h7384j8073O4703J8583l9138k855M9483M8373O9117J26917O7098j54312
36490A42512k96675j54508J30069K75865K13633N3396j00806j27496Q7584M02714
$$ y = [-242084, -234142, -109948, 47788, 198943, 299749, 272934, 125257, -12875, -74057, -153346, -296612, -349611, -200068, -19235, -33219, -172884, -202013, -99169, -42616, -84392, -124991, -170402, -310235, -439244, -309982, 78431, 413446, 465842, 321068, 156474, 27289, -55311, -71596, -104280, -272088, -464151, -386860, -1606, 322492, 263314, -43373, -229655, -161872, 19764, 188973, 324821, 375920, 261372, 39168, -79521, 43885, 298378, 427245, 301927, 61564, -51132, 20047, 96471, 32084, -87384, -105457, -40754, -22171, -61309, -64164, -14681, 33692, 102809, 229726, 296824, 142512, -154163, -308671, -178602, 97263, 310896, 364292, 263486, 135990, 223574, 626288]
36480F26288M50233J38969j54131j45594o5261j83195k78998m9682K51868J51349
36470G41846k56981m39483k49534m4406n663O7123K27950K23381O284r9059N9474
36459B30932J95819P4732j26380j65386r4393m6275K3533J52798K01548Q3279
36449E30207o4688j22242j64653k37841k10251l4545R0072K5519n9677K5049J63251
36438e9799J31053k9922r3128r931L9204o9145k33921k61508q2096J66607K60507
36427b42079J36379j3382J4077J49418J68678M1091n2184k9898l256l6716n6553
36416G5575m1658o9852j19688o2064Q9188J57160R6318N7083Q5450L2443j31879
36405A68076j95065m3978J22248R3939n0160j17971q9474o0373n6906m6386k539
$$ y = [626288, 1076521, 1215490, 1061359, 915765, 850504, 667309, 388311, 338629, 590497, 741846, 484865, 45382, -204152, -248558, -254221, -187098, 40852, 264233, 270517, 171458, 230932, 426751, 501483, 375103, 209717, 115324, 69049, 92582, 245380, 446928, 530207, 465519, 343277, 178624, -59217, -269468, -304013, -213941, -188422, -248099, -223050, -59799, 71254, 41332, -51796, -61727, -22523, -91668, -325589, -587097, -669193, -502586, -242079, -105700, -119082, -105005, 44413, 213091, 254182, 201998, 172100, 168844, 132128, 75575, 33917, -35935, -155623, -217687, -128499, 28661, 124979, 182062, 267512, 299955, 168076, -26989, -70967, 51281, 145220, 95060, -22911, -112385, -172758, -229664, -276050, -278589]
36394b78589J14772K87959L30402Q2240k61402l26720j19223l3015j94750k36925
36384f35251N5989L26424K11883n9662o8715J20161J58796M7195M8707J34129
36374C39656M8114j39359q8054J82894K42806n2709k87135j17017K14130K71481
36364F14807M7075j22068p3605L7179M1004l8800q5371l9064O8461J38465O1865
36353F49948j70035l98032m02235j25586K22241L37970J38093j37647j96096k5991
36343a07370J37113J50315J05418J06696R7611J0079p8146p6130m2533o8989j11617
36332A22447r1461n9192r2353j20361l7498P8407N8054q3326j53970o7048N4312
36321c91989O7917k9238j43538j69598m0649J89855L32584K49561M4622n0994
$$ y = [-278589, -163817, 124142, 454544, 536784, 275382, -51338, -170561, -203576, -398326, -635251, -579262, -252838, -40955, -100617, -169332, -49171, 109625, 156820, 205527, 339656, 387770, 248411, 160357, 343251, 586057, 533348, 246213, 129196, 343326, 614807, 661882, 539814, 466209, 503388, 544392, 505592, 420221, 381157, 449618, 588083, 649948, 479913, 81881, -320354, -445940, -223699, 114271, 252364, 114717, -81379, -107370, 29743, 180058, 285476, 392172, 489783, 499862, 421716, 345586, 303053, 234064, 122447, 30986, -28206, -120559, -240920, -278418, -200011, -141957, -225283, -379253, -446301, -391989, -324072, -353310, -496848, -666446, -707095, -517240, -184656, 64905, 109527, 58533]
36311E8533L1717J42919J30449r301j82468k74991j92689M1560K32734J94174
36301A72637j807q8755M6789K12960J67101q0194k93791k89112j09362N3483O9270
36290a40781j3260n8291k3160J0491j4783m4138j7448K2494O256m1185l8749L2471
36278c20083J15532J45809R0427k6748j10130q1195n752j8172q9195l5285J65563
36267a69229K63998R1897j54751j84089j5139J12137J19116J18936J29088L5914
36257C47878j43321k14772q5739J02548J77343J13327k8751j85722k68035j95430
36247c80674j2973J35265J76072J50058R2681P011m5678J2241J12920P9932j16214
36236B10641k76067k16558P458J92030K08275Q4730n8481j10584o0176m755k3020
$$ y = [58533, 90250, 233169, 363618, 354317, 171849, -103142, -295831, -254271, -21537, 172637, 170830, 82075, 128864, 341824, 508925, 428731, 134940, -154172, -263534, -210051, -140781, -154041, -212332, -235492, -225001, -239784, -283922, -301370, -278876, -272620, -313805, -352554, -320083, -204551, -58742, 31685, 4937, -105193, -186388, -192140, -210312, -299507, -334792, -169229, 94769, 186666, 31915, -152174, -167313, -55176, 63940, 182876, 311964, 347878, 204557, -10215, -95954, 6594, 183937, 297264, 268513, 82791, -185244, -380674, -393647, -258382, -82310, 67748, 160429, 167440, 121762, 134003, 246923, 326855, 210641, -65426, -281984, -274526, -82496, 125779, 210509, 152028, 41444, -18732, -23487, -46507]
36225d6507o0192k2535M7760J8706j14868j99497j35381N442J11029J55755J40944
36214i9344L4293j36818k21028r5895J35559K10662J4120k40225k22797J03752
36204e17721L91901L17007p844j92958j02689J8371j4069m7815Q6944K48001K14860
36193C93988N2026l6750n6152j21013j48625N057J91408J28640j14230j79701
36183A14648J0634J46601O3708j6762O7099J18360m0507k15759j54585L6300Q1845
36172B11582k8613q9460l8966k96l1298o3454n0038L009J02169K10176K00866
36161D25677K8598j38087j19817J2787N7052j3028m8882M641L9685j9840j19586
36150A09200j77401j51536k1033J65970K49719J20428q8768j34843L707J02270
$$ y = [-46507, -106699, -129234, -81474, -62768, -177636, -377133, -512514, -507072, -396043, -240288, -99344, -65051, -201869, -422897, -518792, -383233, -172571, -158451, -398676, -621473, -517721, -125820, 191187, 183343, -9615, -112304, -93933, -108002, -155817, -68873, 179128, 393988, 446014, 409264, 353112, 232099, 83474, 88531, 279939, 408579, 294349, 114648, 125282, 271883, 335591, 318829, 385928, 504288, 463781, 248022, 93437, 129737, 211582, 182969, 93509, 54543, 54247, 22949, -40505, -90543, -87534, 14635, 224811, 425677, 454275, 316188, 196371, 209158, 266210, 253182, 204300, 208941, 248626, 228786, 109200, -68201, -219737, -240770, -74800, 174919, 295347, 206579, 71736, 75443, 177713]
36140A77713K5781r7028j10019o1892o8657q1569K5219J99340K39936R9832j7284
36129C31372N3388J85284J38369q1286k12185r4969J24525K16247J50896N7418
36119H69059R671m040K0950P6309N6580j22408l36517l62208j86311l0622l0792
36108d0329p3184k4902N2356M0903k1193j7999M1004M3498m0955j24178j33933
36097b98912q6435k4156L8464Q7631Q3876P656p2503k6084J81504L68999K92203
36086E52243l0190k72684j97268L4786J10044J23q0149o4534r0021j73487j48575
36075c59712J5679J29265J07953R8796J62182J28865n7595j51276J5009K17167
36065C06333J71366l9797j52260j40409j49667j65939p4846N6143O8411P303K8172
$$ y = [177713, 203494, 106466, -3553, -65445, -134102, -215671, -190452, 8888, 248824, 348656, 331372, 384760, 570044, 708413, 627127, 414942, 319973, 444498, 660745, 811641, 869059, 878730, 874690, 895640, 971949, 1028529, 906121, 569604, 207396, 21085, -9537, -40329, -113513, -138415, -86059, -45156, -66349, -84348, -43344, 154, -40801, -164979, -298912, -385347, -409503, -371039, -283408, -199532, -191876, -264379, -290463, -108959, 260040, 552243, 522053, 249369, 52101, 86887, 196931, 197054, 116905, 52371, -37650, -211137, -359712, -344033, -214768, -106815, -8019, 154163, 283028, 225433, 74157, 89166, 306333, 477699, 437902, 285642, 145233, -4434, -170373, -245219, -189076, -120665, -113362, -85190]
36054h5190Q0907j627j55503j49597K6213J54055J56713J47928J20602n0168k53950
36043i617j89554J24190K70642M9886j98951j41712K6335n5310k87445k74473
36033f86009J4656J85715L6497j47954n0302K11169K73453L8110k15060j95770
36023e35495N8099K51554J82657l8113j35652k488J84041J94677K4109j33664
36013D9725j42799o6529m2735r5607j24485n6162N2110R4820P2208Q9120J79070
36002H736K13868P3370j45536k09805m3878J66659J99157L5948j56384k15769
35992g3634j11763N2637J28379O2228l0288K188J37505K02153J19173L228m5699
35981D46107r4698k12979k89356j83972J9512J05519M1364L753P2518R8992l2470
$$ y = [-85190, -4283, -5910, -161413, -311010, -284797, -130742, 25971, 173899, 294501, 244333, -9617, -199171, -74981, 195661, 245547, 46596, -95116, -68781, -124091, -411536, -686009, -671353, -485638, -449141, -597095, -647397, -436228, -162775, -124665, -339725, -535495, -477396, -225842, -43185, -81298, -216950, -219438, -35397, 159280, 183389, 49725, -93074, -159603, -202338, -297945, -422430, -478592, -426482, -331662, -259454, -170334, 8736, 222604, 295974, 150438, -59367, -103245, 63414, 262571, 298519, 142135, -73634, -185397, -132760, -4381, 57847, 27559, 29747, 167252, 369405, 488578, 491806, 446107, 351409, 138430, -150926, -334898, -315386, -209867, -168503, -164750, -92232, 6760, -25710]
35970b5710j79923j30274Q2220K05827R8947j08432k01634j21336L0954J43873
35960b05488J75444J24290J3909q3308q0742J6681Q5126K2281j04115j23237J2869
35949a46290J50580J28748j6987j19905j03546l6514J3051N5677Q9019M9083p5054
35938a2138j66747j13004M6441J82904K32733J95298M7376j96422l69188k73703
35928d26450M2096K81966K46759O0705l1496K2656Q9965Q2958M1958J8497L709
35917D33323k1131m8737o5819n2454J9032J24972J63031O0369j11975k06049j60702
35906A33860l5669Q3470J38244R4603j4648o8132J7890J46727J27765q1231l06340
35895B36539l54278k12378l7193J0631p8849j46345l3567K02297L24228K18595
$$ y = [-25710, -205633, -335907, -253687, -47860, 51087, -57345, -258979, -380315, -349361, -205488, -30044, 94246, 108155, 24847, -55895, -39214, 45912, 68193, -35922, -159159, -146290, 4290, 133038, 116051, -3854, -107400, -143914, -130863, -75186, 13833, 62916, -12138, -178885, -291889, -245448, -62544, 170189, 365487, 412863, 216441, -152747, -426450, -384354, -102388, 144371, 205076, 173580, 196236, 286201, 369159, 411117, 429614, 433323, 412192, 363455, 297636, 245182, 264214, 389186, 552217, 612586, 500611, 294562, 133860, 98191, 181661, 319905, 414508, 399860, 331728, 349618, 496345, 624110, 542879, 236539, -117739, -330117, -367310, -356679, -435528, -581873, -615440, -413143, -88915, 129680]
35885A29680M7763m72J7849n1367j64349j54778l5193K6981Q121M2454J30942
35874b369J13715j3399l7539J07174J80231J638k44614k67834o4853J33541J80037
35863H5728R4059o2762k09644k16619k4211K30680L30030K04336j7708j52120
35853B61769j13176K0662P8545K976m7815P3952K35617J89042k6457j22882k5769
35842E26464K3543q9786j60549p0611l2778j86655k80533p0196K35774K77313
35832A71986P6287q3728j27494j69948j78990m5882J04406N3921j14585j22459
35822d36486M8299J49653Q8111J1260l758j3565J6829J58053K54136Q4444k10096
35811A46880k53569k3740R5600o3707j98809n7957J73167K24211J44171J04719
$$ y = [129680, 177443, 176971, 194820, 143453, -20896, -175674, -210867, -183886, -175765, -133311, -2369, 111346, 97947, 60408, 167582, 347813, 349451, 104837, -162997, -227850, -94309, 85728, 179787, 117025, -92619, -309238, -333449, -102769, 227261, 431597, 413889, 261769, 148593, 169255, 247800, 250776, 202961, 276913, 512530, 701572, 675115, 552233, 526464, 550007, 460221, 299672, 229061, 196283, 9628, -270905, -341101, -105327, 171986, 248273, 164545, 37051, -132897, -311887, -357769, -253363, -199442, -314027, -436486, -388187, -238534, -150423, -139163, -142921, -156486, -139657, 18396, 272532, 356976, 146880, -106689, -130429, -34829, -98536, -297345, -355302, -182135, 42076, 186247, 290966]
35801B90966P9193j6954q7012k2485N2989l5270k02245k10767k9056J22000P1535
35790A2894r2602j45215M526J91897J79723k7370j60002n7974Q5569K6126j45610
35779a28038j76982p5098k5978L826J85187L90384K93304n2716k03932q694J62238
35768C63501M6137j12264m9665N6619m7733k26586k14165o2796K2141N2200J20901
35757e1710J25471l1431j66317q6789N1793J3252q0969L7294K86455L54661K11022
35746F62732R1075L9484j13963l29644l23457l2147K33133K09145j2883j97172
35736B26303k44876j75664l2713R7362J17366L7221m6324q8489j01566o5299K2386
35725b54293O2259r585o7175K7984J61287J08125r9144k00449r9432K7705M1464
$$ y = [290966, 370159, 353205, 266193, 243708, 296697, 261427, 59182, -151585, -180641, -58641, 12894, -79708, -224923, -220397, -28500, 151223, 123853, -36149, -94123, -8554, 17572, -128038, -305020, -380118, -406096, -402270, -217083, 173301, 466605, 413889, 209957, 201263, 363501, 409638, 297374, 247709, 304328, 256595, 30009, -184156, -246952, -224811, -172611, -51710, 73761, 42330, -123987, -210776, -158983, -145731, -226700, -189406, 97049, 451710, 662732, 753807, 793291, 679328, 349684, 26227, -5920, 227213, 436358, 423475, 226303, -18573, -194237, -226950, -129588, -12222, 24999, -21325, -109814, -211380, -276679, -254293, -192034, -201619, -268794, -240810, -79523, 28602, -70542, -270991, -370423, -342718, -301254]
35714c01254J1278K1216L1149J5970M5663J28853J44589L4598p4340m6562O9590
35703H0750J27822Q9359M2936M6304K9805j03419k96289l33607j06207J72328
35693b50218J81926o3395k07586n7207J53557J51450K3998k259M0761r194q4404
35682a22571n67J62701J46219n3938j68197q1681K8115K4490P7N9445J47269J69672
35670C11034J07956k3868j73218k11658p9889O8739O3324j4686J5115J01075O8330
35659B32254k7012M856R5689J7433j48832q4533J83901K50758J848j67290j4920
35648C44152J41101q938k19989j15847J72827K45117P7701k2619K1739J193j20606
35637E15831j13516R3174K38632J06016j73236l17755k37960p2541J4223j3384
$$ y = [-301254, -289976, -268760, -237611, -221641, -175978, -47125, 97464, 132062, 57722, 11160, 80750, 208572, 297931, 340867, 387171, 416976, 313557, 17268, -316339, -422546, -250218, -68292, -131687, -339273, -396480, -242923, -91473, -67475, -69734, -28973, -38167, -122571, -123138, 39563, 185782, 131844, -36353, -118034, -89919, -65429, -65352, -5907, 141362, 311034, 418990, 395122, 221904, 10246, -69643, -904, 62420, 47734, 62849, 163924, 232254, 205242, 210098, 305787, 323220, 174388, 89855, 273756, 524514, 526362, 359072, 344152, 485253, 476315, 256326, 140479, 313306, 558423, 636124, 613505, 635244, 636437, 515831, 402315, 495489, 734121, 840137, 666901, 349146, 111186, 38645, 52868, 39484]
35627C9484o6787n1499J5855L5785k5325r3004j14375j19379j06288l351J71221
35616c17663K50554J36696m2647j13818p6859k7620P190J9929m9357j65836j28841
35605e08272J37155L51546K07509j48142k73401n9277J29073K2907j53365n3686
35595c47953K51529L80687J84625q3010j45951l1511O2228N3059m035p3210j52609
35584I3849j76305o9745Q6845J12283j1150q7813n190Q7180L1052o4996k188J65420
35572A59242J99553M2350j19319j47785r4590l1730M5831J10913Q9771L245m5418
35561B12063m5801o7037p1641L6265J65174J00887j29555k35559r9250M5513J964
35550h6977j02301r1810l6461m6394j8749J45026K70429J53172p5927j30480j3402
$$ y = [39484, -27303, -78802, -62947, -27162, -52487, -145491, -259866, -379245, -485533, -488884, -317663, -67109, 69587, 26940, -86878, -163737, -191357, -184167, -164238, -213595, -379431, -508272, -371117, -19571, 187938, 39796, -233605, -292882, -163809, -140902, -294267, -347953, -96424, 284263, 468888, 385878, 239927, 208416, 270644, 323703, 319668, 246458, 93849, -82456, -152201, -65356, 46927, 35777, -52036, -57226, 29954, 61006, -3990, -6178, 159242, 358795, 401145, 281826, 134041, 39451, 7721, 53552, 164465, 254236, 257481, 212063, 166262, 99225, 27584, 63849, 229023, 329910, 200355, -35204, -134454, -88941, -86977, -189278, -281088, -317549, -363943, -382692, -237666, 32763, 185935, 110008, -20472, -33874]
35539c3874J8775j14529k16593j47048l69R3946J40669J82581J93650J43954P4335
35528C35497N0522Q6048J18730M6263j63523l70136l63882j33841P5821O5269
35518b53232p4820j24028l2773O8144P7100J1673n4586m4801P2544K12310K29368
35507H6899J07270j4575n1841o5987q3811k0490J13521J41485M792r3142p196
35496A16925J00730N1142l2875L0581J12507j9991k60902k89658p5613R3092P4998
35485i9064L3558Q8604J19086J4335j17661j15104J7588J40172J28580k8749k02113
35474b0768k14344n0784R6556R3214M3735O9133P4782m2826j29165k938J79310
35463I5905J28019r6103j69542l6322L7154m9036q5764J7855N4933q0008j60236
$$ y = [-33874, -15099, -129628, -346221, -493269, -493638, -399692, -259023, -76442, 117208, 261162, 335497, 386019, 472067, 590797, 637060, 473537, 103401, -260481, -394322, -318501, -253232, -328052, -452080, -484853, -416709, -339609, -327936, -382522, -427323, -354779, -142469, 86899, 194169, 179594, 127753, 61766, -22045, -42535, 70986, 212471, 217263, 124121, 116925, 217655, 268797, 235922, 266503, 379010, 359019, 98117, -191541, -267154, -174062, -99064, -65506, 23098, 142184, 156519, 38858, -76246, -58658, 81514, 210094, 181345, -20768, -235112, -285896, -189340, -96126, -52391, 16742, 91524, 48698, -80467, -83405, 95905, 223924, 127821, -41721, -78043, -40889, -89925, -175689, -157834, -102901, -182909, -343145]
35452c43145J25K23374K40065O5245j06209j95688k25186j56624L8383K37291
35442b22369K79365J77799Q8979J00958J48137J20418j333j21991j45672j11768
35432C12523j45589k38644k12810p733J57690R0550o5012n9802N9887P6862Q812
35421b3266M0698J27038M9919j44992j72751L469J11605N0548J5225O2116m935
35410A14674j83171j69421R0080K06815k8604k71069j88562J1208O123p0464N7342
35399d25049K37296J42940j14976j50587M9178J39581J9333o6006k1245m2191
35389b31726j93434k59235j33268n001j6041l1747Q3335K10780J77685L4545l0501
35378c94608N4185J91973K43443J38033o5618k00601j54827j9526K2123n0909
$$ y = [-343145, -343020, -119646, 120419, 185664, 79455, -116233, -341419, -498043, -459660, -222369, 56996, 234795, 323774, 424732, 572869, 693287, 691954, 569963, 424291, 312523, 166934, -71710, -284520, -292253, -134563, -44013, -109025, -168827, -108940, -32078, -23266, 17432, 144470, 194389, 49397, -123354, -119885, -8280, 42268, 57493, 119609, 114674, -68497, -237918, -147838, 58977, 30373, -240696, -429258, -418050, -411927, -482391, -425049, -187753, -44813, -159789, -310376, -261198, -121617, -102284, -168290, -189535, -231726, -425160, -684395, -817663, -822664, -838705, -870452, -787117, -576337, -398652, -364107, -394608, -340423, -148450, 94993, 233026, 167408, -33193, -188020, -207546, -185423, -236332]
35368b36332p5799M9370K20862K67983J48218l1942j35193j17237o3172q2770
35358e6012j56501j55603m2033O5784Q6732R4532J39763J11950o2272k23220j78664
35347c75544O319J28452J57417J90845J80499o531k65772k97104m0222J94413
35337a27228J53775j4096j2672J57604K11312m137k77552k85819k237K49589J87297
35326B35836o7043j48254M3617J92781J7090l17664m13387j53334J99642L56033
35316e4683K63775N6757q5499m3957J25370K06690Q3234p7600n0982J03731J22665
35305F49501q1168l16728l79630k33054M9065L18437L57356P9119k67269l24172
35295a48543q5299J04373M5901p8791n8379K9087J4192o1955n2053L0770N6162
$$ y = [-236332, -312131, -262761, -41899, 226084, 374302, 342360, 207167, 89930, 26758, -56012, -212513, -368116, -410149, -344365, -257633, -163101, -23338, 88612, 26340, -196880, -375544, -369225, -240773, -83356, 107489, 287988, 281457, 15685, -281419, -321641, -127228, 26547, 12451, -221, 157383, 368695, 364558, 87006, -198813, -201050, 48539, 235836, 168793, 20539, 64156, 256937, 274027, -43637, -457024, -610358, -410716, -54683, 209092, 265849, 180350, 136393, 261763, 468453, 551687, 474087, 423105, 526836, 649501, 568333, 251605, -128025, -361079, -312014, 6423, 363779, 442898, 175629, -148543, -233842, -129469, -83568, -162359, -220738, -191651, -177459, -239414, -291467, -260697, -204535]
35284b04535O053k1014O393K0928k846m179N2554J12083J00598J4491q3807j34241
35272a37522j26568q3505j9771M8647O7937p389j15403j29203m1376J0556k5749
35261e59346r239J45815K71590J96008N5173R4464K44504K05893o0028k53787
35251C31047k04921r4305r3950r2374L7290J61812J17234Q119J7353P0139l0128
35240B27316k23873k49714o1224Q9641L9070o3361k9929O2247J9495j31163j57616
35229d79111L7604K72695L37476K45308J32168K4293j27006k44196j76747K1060
35219D3544Q6763p9213k38478j57281N4693J42605R3221P9965J19527N8436j19611
35208H4171k28148j49073L2573J85999K44565J58455o1904k43748j97085J5153
$$ y = [-204535, -198482, -219496, -213103, -192175, -195021, -199200, -146646, -34563, 66035, 80526, -3281, -137522, -264090, -347595, -367366, -318719, -250782, -258171, -373574, -502777, -544153, -533597, -559346, -568585, -422770, -151180, 44828, 100001, 194465, 438969, 644862, 584834, 331047, 126126, 31821, -62129, -154503, -117213, 44599, 161833, 169952, 187305, 257444, 227316, 3443, -246271, -307495, -217854, -178784, -242145, -272074, -209827, -190332, -321495, -479111, -441507, -168812, 168664, 413972, 546140, 570433, 443427, 199231, 22484, 43544, 130307, 51094, -187384, -344665, -289972, -147367, -54146, 25819, 145346, 203782, 84171, -143977, -293050, -260477, -74478, 170087, 328542, 266638, 22890, -174195, -159042]
35198a59042J44785J03206K7203j852n3813j29884j11866m159K8332m5243m0776
35187b43109J20633K60969K37559J42817P8185k2734j90331k83812k31678j69144
35177c00645j63743o9263J42766K01435l1840k27405m1595L12960L60754P9748
35167B63172j15017l8462O3534R233m9411K5124R8045L4674m5651P025R4853K5789
35155C72908j74562k89743j99452m895J21279J27675J08119J48518J79769O0784
35145D50400j69716k62261q9770J24874J01850p9386j01951R9151K48818J56716
35135D78725m4073j64077k04789k08033r4740J53425L28154K34674m883j01939
35125C72444K142R6213L8860o7522q7159o0853j01694j88616j89721n8717R5865
$$ y = [-159042, -14257, 88949, 116152, 114300, 60487, -69397, -181263, -185422, -157090, -202333, -243109, -122476, 138493, 376052, 518869, 597054, 574320, 383989, 100177, -131501, -300645, -464388, -533651, -390885, -189450, -221290, -448695, -490290, -177330, 183424, 263172, 148155, 109693, 173227, 182460, 133049, 158173, 256218, 290892, 245241, 252266, 347119, 372908, 198346, -91397, -290849, -295744, -174465, -46790, 61329, 209847, 389616, 450400, 280684, 18423, -71347, 53527, 155377, 75991, -25960, 73191, 322009, 478725, 434652, 270575, 65786, -142247, -236987, -83562, 244592, 479266, 474383, 372444, 374586, 470799, 509659, 442137, 354978, 294125, 192431, 3815, -185906, -244623, -148758]
35114a48758J49709R9888L2575L029n704k5529n1872n2976n602P5055J25631Q1704
35102B77150l0889q7669q655J20346J50152O9273L78M181J2469k3262n2812m8548
35090C82114p1903j40141j50500l9638Q4762Q4264k0019j02303j02264m4077L1477
35079h8228N7926l4032j74949j57508P3654K55609J30967j54446k21823R875K27962
35068g4993J91400L0539k5182N101m1424j56401j60493Q571J77495J54979k9204
35057H0388j74460j59591o1080p638l101K5603O4318L0148n4073n9260L7602R8485
35045a82659N0667L180L6505M9981l5818r3409L752J34048J13945J1545J8405
35034A10142R7611M7057j26134j93428p9631L6670M3596M0006Q2891O2746m9739
$$ y = [-148758, 951, 100839, 133414, 136443, 130739, 105210, 53338, 362, -5240, 69815, 195446, 277150, 246261, 158592, 149937, 270283, 420435, 489708, 490086, 494267, 506736, 483474, 430662, 382114, 310211, 170070, 19570, -20068, 64694, 148958, 128939, 26636, -75628, -119705, -88228, -30302, -64334, -239283, -396791, -323137, -67528, 63439, -91007, -312830, -302955, -74993, 116407, 146946, 121764, 126865, 85441, -70960, -231453, -222882, -45387, 109592, 80388, -94072, -253663, -314743, -322381, -325482, -299879, -235561, -205413, -259486, -318746, -281144, -182659, -131992, -128812, -92307, -42326, -78144, -171553, -167801, -33753, 80192, 91737, 110142, 207753, 254810, 128676, -64752, -144383, -107713, -64117, -24111, 58780, 121526, 71787]
35023G1787q2506N3815J71089P6208j24132j81780n6295P4609Q1902N228n6079
35012C3846n0998N997N1951L2514k6894n6975n5765p3897q9565k9607O7877P1900
35000a19616j7638m1503N2890J07697K4817n4262Q440J04344P3699p234L2445
34989A64079J38371J15475j6841l1159J21295J93248J4088k30766k55937p8801
34979A33052K5486p0008j71729n8591J87621K80612J19257p8784q8003K0697K2316
34968C21926j07011j72336q3921J3556R63j8730Q7844K39838K50948J00484n9323
34957E74238j23922j24696j12909p9503o518Q3136J43785J34970M7895o0994j00705
34946C74777n0751J1494K7675L6577Q2447J20817Q7105r591j30168k58866l33111
$$ y = [71787, -10719, 43096, 214185, 290393, 166261, -15519, -71814, 2795, 84697, 89925, 33846, -17152, -11155, 40796, 73310, 46416, -10559, -66324, -140221, -229786, -259393, -191516, -119616, -137254, -178757, -125867, -18170, 6647, -47615, -39175, 65169, 138868, 131634, 164079, 302450, 417925, 401084, 369925, 491220, 684468, 698556, 467790, 211853, 133052, 158538, 88530, -83199, -141790, 45831, 326443, 445700, 366916, 278913, 299610, 321926, 214915, 42579, -41342, -27786, -26823, -45553, 42291, 282129, 533077, 633561, 574238, 450316, 325620, 212711, 133208, 126690, 209826, 353611, 488581, 536476, 475482, 374777, 324026, 335520, 363195, 399772, 482219, 603036, 690141, 680550, 550382, 291516, -41595]
34935d1595k29845M9282K74065K32171J6779j08472q3259q0805j76230k22880
34925c70789j19905J6651O1341P0516J25547J48227M8117p2061n7153L9677M3341
34914f6491n4709j16149j28263k00088k73622j30669K13634M09037K40909m5145
34904a51556j20611n1265r6951k16908j55250O7967J61271N8754O928R3640J02295
34893c01686l7779p2355J06537K14049O3079q5450P652J14505k4277j64258L4281
34882a45702L37687K65640r1263k10618j0316P9018p7559j27121L2566J8366k78452
34871b07754l58625O9236N08808L93326p0953k95629j85524q1889r4638m4201
34861c67843P9084J02752M5228P1930J40805P5987p2944j11470o3416q9934j32366
$$ y = [-41595, -271440, -222158, 51907, 284078, 300857, 192385, 109126, 28321, -147909, -370789, -490694, -474043, -412702, -342186, -216639, -68412, -20295, -92356, -149509, -109832, -66491, -121200, -237349, -365612, -565700, -839322, -969991, -756357, -347320, -106411, -151556, -272167, -323432, -420383, -637291, -792541, -724574, -563303, -504549, -497621, -403981, -301686, -339465, -411820, -305283, -91234, -28155, -113605, -105953, 8552, -15725, -179983, -145702, 191985, 457625, 366362, 155744, 145428, 224446, 146887, 19766, 52332, 70698, -207754, -566379, -497143, 11665, 404991, 334038, 38409, -147115, -229004, -323642, -367843, -288759, -186007, -140779, -68849, 71956, 147943, 74999, -36471, -99887, -189821, -322187]
34850c22187k3820J20197M5919j45180r7580J85633K89207L6587k34632k00221
34840c46077K3270J61296J66640J23232M1129m8186j9209J34225K06126O8833
34830E11279j20122j58980q4858o1574j26082j88500j71037m4990J51647K65552
34820b7665J49194j03265k18251j14887j1484o3683j26935l3696J11252J21175
34810c18245M1991M3320J12979R9360l133l6443N9393J48986R3818p9783k28217
34799f5974k29044p2127J28395K26021J84474R5172K8898n6940k10669l57913
34789c29707l56967j53316J57764L89899L89266J74975m1589p0487K5909L4555
34779B20302q3429j43526m9490M8087O190q5574q3997l7227o2443r6718Q057J91624
$$ y = [-322187, -346007, -225810, -179891, -325071, -422651, -237018, 52189, 88776, -145856, -346077, -322807, -161511, 5129, 128361, 169490, 121304, 102095, 236320, 442446, 511279, 391157, 232177, 147319, 85745, -40337, -228837, -399874, -444864, -293217, -27665, 121529, 18264, -199987, -314874, -326358, -390041, -516976, -550672, -439420, -318245, -276254, -232934, -119955, -20595, -23728, -60171, -778, 148208, 242026, 162243, -65974, -295018, -367145, -238750, -12729, 171745, 266917, 295815, 238875, 28206, -329707, -686674, -839990, -682226, -292327, 96939, 271914, 230325, 159838, 185747, 220302, 136873, -6653, -56143, -8056, -1866, -87440, -171437, -208664, -271107, -367825, -359768, -168144]
34767a68144K10876j2076k44915k26790J4705K18266K08949P3098K360L5922M2810
34756A55061m5366j07529k4219J06377R3516n7909j58376j18027l3713K2410J00107
34745f7668J99360J95593L4893j51643k23851j85713r0869M4148J49454J03967
34735G671n8590j18078K7738J91486J68372J7899p7001p2899k8407L6214P6855
34724A71260m529j51166j16403J41410K58108l6441m26969m16574p4515Q8832
34714e66987n8497j04159J63258L69355J70775j73570k11115K3962J42702L5656
34704b08620l8770N6429J45005Q7420N524L5206R4430N9426K814O5237J80128
34693D84229J29941j19478l13585k20430N7537K00887O6951j56099k12855q8993
$$ y = [-168144, 42732, 30656, -214259, -441049, -426344, -208078, 871, 73969, 76329, 112251, 155061, 109695, 2166, -22053, 84324, 177840, 119931, -38445, -156472, -190185, -167775, -67668, 131692, 327285, 362178, 210535, -13316, -199029, -289898, -245750, -96296, 7671, -50919, -168997, -141259, 50227, 218599, 236498, 159497, 86598, 58191, 94405, 171260, 166731, 15565, -100838, 40572, 298680, 262239, -164730, -581304, -655819, -566987, -625484, -729643, -566385, -197030, -26255, -199825, -410940, -386978, -244276, -208620, -247390, -190961, -45956, 41464, 46988, 82194, 176624, 236050, 238864, 304101, 484229, 614170, 494692, 181107, -39323, 18214, 219101, 286052, 129953, -82902, -171895]
34683a71895K3672L160p3371p1583K6671J30811J64213J31227Q3616N5430L2608
34672C34559j9568r6646j35427q0223L0584P5374k7376k09356k89564j47364J35570
34661d29437L31283K84250N4474j75287k87957k74864j46191Q0838K97666L37236
34651G2011J63851m9523j13726m1832L244n5651j17183n5201J00870J88559J08807
34640B04226m5323j02025l3770K0677k0407n7411N718P8533L8407l6306P547J10538
34628A70404Q9079k1840p909J20554R5067j39320k60576o9651J60964J07298j02450
34617A41620j31044K0898P7306k5073q4766k6026J1326k2532j6859K9836j9799
34606d5113j33858p6185J97408L74631J94791j70393l32304j64468J01900K00745
$$ y = [-171895, -148223, -145063, -218434, -290017, -263346, -132535, 31678, 162905, 246521, 301951, 334559, 314991, 218345, 82918, 2695, 33279, 108653, 81277, -128079, -417643, -565007, -429437, -98154, 186096, 240570, 65283, -222674, -497538, -643729, -562891, -265225, 72011, 235862, 186339, 72613, 30781, 34025, -21626, -138809, -194010, -93140, 95419, 204226, 158903, 56878, 23108, 43785, 23378, -34033, -28315, 50218, 88625, 52319, 59866, 170404, 259483, 237643, 229734, 350288, 445355, 306035, 45459, -24192, 136772, 244070, 141620, 10576, 31474, 108780, 83707, -1059, -27085, -15759, -38291, -55150, -25314, -45113, -178971, -255156, -57748, 316883, 511674, 341281, 8977, -155491, -53591, 147154]
34596A47154J09556M674J6504P3485J7207j43899k09737q1421O1980K5246r2099
34585g1350n6598J17559K00491J19984L1869J0646n2025j81673k18950q7158O5519
34574a21686J08564J10198J48644J32874l1050k37117k99912j90422l8166L0184
34564c87889j5682r6432o5745J30710L25882L02264J03143p813P4176J69027J24383
34553F56024K2274k6490o2647j19955j10894l0668n4414k36187l22509j07378
34543c92844K03897K62347P9176l3879M4893J21715N0297o4337r0192o6453p5241
34532C9379q4011l1811L7938M4696J3421M8136J67378K41547J42866o6001j72230
34521C81308p9882M8855J6293j24842j65616p3628k2486q2052j12928l5714K7440
$$ y = [147154, 256710, 261384, 277888, 351373, 368580, 224681, 14944, -66477, -4497, 20749, -71350, -127948, -10389, 190102, 310086, 341955, 352601, 300576, 118903, -100047, -187205, -121686, -13122, 97076, 245720, 378594, 347544, 110427, -189485, -379907, -418073, -387889, -403571, -500003, -565748, -435038, -109156, 193108, 296251, 288438, 362614, 531641, 656024, 678298, 651808, 589161, 469206, 358312, 327644, 273230, 37043, -285466, -392844, -188947, 73400, 152576, 118697, 163590, 285305, 335602, 271265, 181073, 114620, 39379, -44632, -76443, -38505, 6191, 19612, 67748, 235126, 476673, 619539, 553538, 381308, 301426, 350281, 366574, 241732, 76116, 2488, -19998, -102050, -214978, -250692, -223252]
34510b23252n490j1296J10070K33534K06434Q0927k3219j21378k39266k49517
34500b42453n8492J73392K28661J41433Q0469L4763j19751l12172l18276j02254
34490d94680J26876K10132J74897P2250r7769k55637k37968j2008K26111K39811
34480d7985o960k98584l38264m6619K82195K73115k5209j63060N4412K46357O0626
34469i976k24144j39374J71516J66261j72690k74367O8083L24214Q6826k55098
34459b58749j41724K69908L73083M3391k34318j29627J11668J09474j31771l19086
34449c07751k81142j06380L8999R0914Q9942Q3624P3042N1344M2774N7224M9789
34438a17621J579k730J10297K42772K25897P4248k6555q972j9059j56825k91191
$$ y = [-223252, -228742, -240038, -129968, 103566, 310000, 390927, 367708, 246330, 7064, -242453, -300945, -127553, 101108, 242541, 323010, 357773, 238022, -74150, -392426, -494680, -367804, -157672, 17225, 89475, -8294, -263931, -501899, -513907, -287796, -47985, -54945, -353529, -691793, -738412, -456217, -183102, -208311, -371371, -316959, -70602, -9976, -234120, -373494, -201978, -35717, -208407, -482774, -414691, -90477, -3651, -258749, -400473, -130565, 242518, 285909, 51591, -78036, 33632, 143106, 11335, -307751, -588893, -695273, -656274, -565360, -475418, -391794, -318752, -267408, -224634, -167410, -117621, -116042, -118772, -8475, 234297, 460194, 534442, 507887, 498915, 479856, 323031, 31840]
34427C1840k42681l1357J59306J84180L9444j50725k11132p6114J04766J31597
34417f0876K1410l7480J3973N3258L5599N6646R8707o501k39574l00801m8311
34406d13950K22547J81372o2105j60809m9414M2433L907l4261K5649J10144J35197
34395G10J05294K9544r3483j89463j55542j7463P7721M2618o2885j20522o4799
34384d48270O6686J47377Q7219k3511q155J18376J39484r476r8355K0770J20054
34373A12199o1623l56333l66008l6751K81563L25325J76798K4155o8091r8720
34363f7486o0186Q736N1589Q3386J17378O4679j12211k32371j21106P4384P4680
34352a18528q2889j07380N5445J54610Q8299N2261J40047J61874J2474j18728
$$ y = [31840, -210841, -242198, -82892, 101288, 140732, -9993, -221125, -297239, -192473, -60876, -39466, -76946, -62973, -9715, 25884, 82530, 181237, 174736, -64838, -365639, -413950, -191403, -10031, -72136, -232945, -282359, -239926, -236019, -270280, -244631, -134487, 710, 106004, 135548, 42065, -147398, -302940, -320403, -242682, -200064, -262949, -383471, -448270, -381584, -234207, -146988, -170499, -178654, -60278, 79206, 69730, -28625, -7855, 112199, 50576, -305757, -671765, -708516, -426953, -101628, 75170, 99325, 31234, -67486, -127672, -118936, -67347, 16039, 133417, 198096, 85885, -146486, -267592, -193208, -118528, -201417, -308797, -253352, -98742, -10443, 41818, 181865, 343739, 356213, 237485]
34342B37485q8883m2970j11307j60207p1313P732n7004j14740j2994R2483J6644
34331c05074q7994J1959J90204J55470m1375r2881L9869R1927j7538n7115Q7810
34320b4738K14419J51776Q243p0472j23299j94591j73937r868J07109o261k16730
34309c38349k27986J5037K56973K55021L5519j81151k18395q9422M0678K6753
34299d25322j04786j86354r3056J32434L32477L69227K21765J1655q0035L338
34289A81343J05113M2154j32185j79414j1286J70284J44855l3289j27807l9891
34279A19877Q5426O7785p7660j54844k2105K10971K78630Q8333j27270j01703
34269C67440Q8675J27169p3270k40754j68873k9624p8342k34303k13854J3643
$$ y = [237485, 148602, 105632, -5675, -165882, -237195, -229463, -286467, -401207, -414201, -321718, -305074, -393068, -381109, -190905, -35435, -76810, -169691, -129822, -37895, -55433, -112548, -24738, 189681, 341457, 349700, 279228, 155929, -38662, -212599, -222467, -115358, -121619, -338349, -566335, -551298, -294325, -39304, -3785, -184936, -403331, -492753, -452075, -425322, -530108, -716462, -809518, -677084, -344607, 24620, 246385, 258040, 178005, 181343, 286456, 328610, 196425, 17011, 5725, 176009, 320864, 287575, 159768, 119877, 205303, 273088, 195428, 40584, 18479, 229450, 508080, 596413, 469143, 367440, 456115, 583284, 510014, 269260, 100387, 70763, -7579, -241882, -455736, -442093]
34259d42093J81017J30144Q594l870M8755L0277n4987r8219o7015k6225j6469
34248c10091n150M7428J20529J33586K4922j33791j44384R0135L62996L46796
34238E32976J8454k71499k50478p0027l4709j33890r5108J48345L20014J94268
34228C58346r1264k38308j54878J1043J04473R7887M5443J2911L2170N8190M977
34217B40990j25088k05852j45711j8491M1994J6460k1940m2353n4164j9709R0432
34206b43432J74916R1062j10602j95089n2452J33699J30046l1561j15246j4316
34196b32975J16511Q6841p9766j98026j71054q6635m7192n943J29784K87224K76712
34185G5481P8294q3883m9406M6916N472j08505q7866M4945O4805o0816r9610M1649
$$ y = [-442093, -261076, -130932, -122338, -126208, -77453, -47176, -102163, -200382, -267397, -293622, -310091, -315241, -267813, -147284, -13698, 11224, -122567, -266951, -176816, 186180, 532976, 551430, 279931, 29453, -40574, -75283, -209173, -304281, -155936, 164078, 358346, 267082, 28774, -126104, -115061, -10588, 87299, 132742, 145653, 177823, 236013, 240990, 115902, -89950, -235661, -254152, -212158, -195698, -217638, -259991, -314155, -333864, -243432, -68516, 22546, -88056, -283145, -335597, -201898, -71852, -103413, -218659, -232975, -116464, -29623, -109389, -307415, -478469, -565104, -612296, -618239, -488455, -201231, 75481, 153775, 69892, 20486, 67402, 72874, -35631, -123497, -78552, -13747, -74563, -174173, -132524]
34173a32524J28258k3598k23218j86448L5429J56912P5908n3480r5429m8666O3957
34162c02899J96759K06190Q445j99391j23072J95656L75178J94819j25433k49149
34152A77103j29104L6321Q4240j1100j81130k77680j65263Q2047J99702P0494
34142a14370r3675n7727Q7556Q2751r4841k17699j60668l2293O0611J56442K76438
34131a07475L06694J61717n3156j62888j40013r9558j12791j17108k1100J48906
34121a96772K41028J36166q7545k01969q5625J19534J84541P9131l0455m1387
34111A16647k3464m6373n4656L852N3312J0728n8311l8170L6058J9423j12540
34100i3494k11604j63423l2108N3471O4939N6542N4384N1059O6835J18429J43160
$$ y = [-132524, -4266, -27864, -251082, -437530, -402101, -245189, -169281, -222761, -318190, -366856, -302899, -106140, 100050, 108495, -90896, -213968, -18312, 356866, 551685, 426252, 177103, 47999, 84320, 168560, 157460, -23670, -301350, -466613, -384566, -184864, -114370, -208045, -265772, -178216, -95465, -190306, -408005, -568673, -600966, -540355, -383913, -107475, 199219, 360936, 307780, 144892, 4879, -94679, -207470, -324578, -345678, -196772, 44256, 180422, 92877, -109092, -194717, -75183, 109358, 188489, 158034, 116647, 93183, 46810, -7846, -3994, 49318, 60046, 1735, -36435, -377, 19046, -93494, -305098, -468521, -500629, -447158, -382219, -325677, -271293, -220234, -153399, -34970, 108190]
34089A08190O0592p2986q4128P7368K14455J16958j31748k31935n9885J72678
34079A69559K19509J12772L9656J7804r7659k98702l41374p8259K82047L98788
34069D24141K06646m7200j41124j04180q4591j31895j85997j93443j39835j6130
34059d13608J46347K26983J16531j03844j90309k3282K06087K12016j0935j68519
$$ y = [108190, 168782, 95796, 11668, 89036, 303491, 420449, 288701, 56766, -3119, 169559, 389068, 501840, 541496, 559300, 461641, 162939, -178435, -256694, 25353, 424141, 630787, 583587, 442463, 338283, 253692, 121797, -64200, -257643, -397478, -413608, -267261, -40278, 76253, -27591, -217900, -241182, -35095, 176921, 165986, -2533]
$$ [...]
##END NTUPLES=NMR SPECTRUM
##END=
