##TITLE=31Pdec_ANY-165A
 CDCl3, 24 sc
 8.4.2019
##JCAMPDX= 6.0         $$ Bruker NMR JCAMP-DX V2.0
##DATA TYPE= NMR SPECTRUM
##DATA CLASS= NTUPLES
##ORIGIN= UXNMR, Bruker Analytische Messtechnik GmbH
##OWNER= root
$$ XWIN-NMR		Version 3.5
$$ Mon Apr  8 14:28:46 2019 Russian Standard Time (UT+4h)  she@DPX200
##.OBSERVE FREQUENCY= 81.013821
##.OBSERVE NUCLEUS= ^31P
##.ACQUISITION MODE= SIMULTANEOUS
##.ACQUISITION SCHEME= undefined
##.AVERAGES= 24
##.DIGITISER RES= 17
##SPECTROMETER/DATA SYSTEM= spect
##.PULSE SEQUENCE= zgpg30
##.SOLVENT NAME= CDCl3
##.SHIFT REFERENCE= (INTERNAL, CDCl3, 0, 182.463)
##AUDIT TRAIL= $$ (NUMBER, WHEN, WHO, WHERE, WHAT)
$$ ##TITLE= Audit trail, XWIN-NMR		Version 3.5
$$ ##JCAMPDX= 5.01
$$ ##ORIGIN= Bruker BioSpin GmbH
$$ ##OWNER= she
$$ F:/spectra/data/she/nmr/P31/1/pdata/1/auditp.txt
$$ ##AUDIT TRAIL=  $$ (NUMBER, WHEN, WHO, WHERE, WHAT)
(   1,<2019-04-08 14:27:44.34 +0400>,<she>,<DPX200>,
      <created by zg, POWCHK disabled, PULCHK disabled
       configuration hash MD5:
       00 E9 B6 7A A2 85 ED C7 34 08 36 98 17 FE 4E 26
       data hash MD5: 32K
       DD 20 20 49 1A 78 56 18 A2 0F FA A0 C4 10 48 48>)
(   2,<2019-04-08 14:27:50.62 +0400>,<she>,<DPX200>,
      <Start of raw data processing
       efp BC_mod = 2 LB = 1 FT_mod = 6 PKNL = 1 PHC0 = -1844.656 PHC1 = 101.999 SI = 64K 
       data hash MD5: 64K
       6D 6C 5D 24 CB D5 2F AC 81 E6 1E 45 9C ED 5E B0>)
(   3,<2019-04-08 14:28:12.34 +0400>,<she>,<DPX200>,
      <pk PHC0 = 26.98195 PHC1 = -3 
       data hash MD5: 64K
       33 5D 08 97 7F B8 CD 62 36 5D 9D BE D3 CA 2B D2>)
(   4,<2019-04-08 14:28:16.18 +0400>,<she>,<DPX200>,
      <abs ABSG = 5 
       data hash MD5: 64K
       1C 59 F2 72 FE 5F AC 59 09 B7 34 C3 3B 5F 5B 9E>)
$$ ##END=
$$ 
$$ hash MD5
$$ 17 E2 A0 5B 6F 86 B3 A0 8C 7D 37 C2 09 31 7A 28
##$RELAX= 
##$RELAX= 
##$RELAX= 
##$RELAX= 
##$RELAX= 
##$RELAX= 
##$RELAX= 
##$RELAX= 
$$ Bruker specific parameters
$$ --------------------------
##$DU= <F:/spectra>
##$EXPNO= 1
##$NAME= <P31>
##$PROCNO= 1
##$TYPE= <nmr>
##$USER= <she>
##$AMP= (0..31)
100 100 100 100 100 100 100 100 100 100 100 100 100 100 100 100 100 100 
100 100 100 100 100 100 100 100 100 100 100 100 100 100 
##$AQSEQ= 0
##$AQ_mod= 1
##$AUNM= <au_zg>
##$AUTOPOS= <>
##$BF1= 81.014009
##$BF2= 200.13
##$BF3= 200.13
##$BF4= 200.13
##$BF5= 200.13
##$BF6= 200.13
##$BF7= 200.13
##$BF8= 200.13
##$BYTORDA= 1
##$CFDGTYP= 0
##$CFRGTYP= 5
##$CHEMSTR= <none>
##$CNST= (0..31)
1 1 145 1 1 1 1 1 1 1 1 1 1 1 1 1 1 1 1 1 1 1 1 1 1 1 1 1 1 1 1 1 
##$CPDPRG= <waltz16>
##$CPDPRG1= <>
##$CPDPRG2= <waltz16>
##$CPDPRG3= <>
##$CPDPRG4= <mlev>
##$CPDPRG5= <mlev>
##$CPDPRG6= <mlev>
##$CPDPRG7= <mlev>
##$CPDPRG8= <mlev>
##$CPDPRGB= <>
##$CPDPRGT= <>
##$D= (0..31)
0 1 0 0 0 0 0 0 0 0 0 0.03 2e-05 3e-06 0 0 0 0 0 0 0 0 0 0 0 0 0 0 0 0 
0 0 
##$DATE= 1554719263
##$DBL= (0..7)
120 120 120 11 120 120 24 19 
##$DBP= (0..7)
150 150 150 150 150 150 150 150 
##$DBP07= 0
##$DBPNAM0= <>
##$DBPNAM1= <>
##$DBPNAM2= <>
$$ [...]
##$SUBNAM3= <"">
##$SUBNAM4= <"">
##$SUBNAM5= <"">
##$SUBNAM6= <"">
##$SUBNAM7= <"">
##$SUBNAM8= <"">
##$SUBNAM9= <"">
##$SW= 369.568048894756
##$SWIBOX= (0..15)
0 1 3 0 0 0 0 0 0 0 0 0 0 0 0 0 
##$SW_h= 29940.119760479
##$TD= 32768
##$TD0= 1
##$TE= 0
##$TE2= 300
##$TE3= 300
##$TEG= 300
##$TL= (0..7)
0 120 53 12 22 120 120 120 
##$TP= (0..7)
150 150 150 150 150 150 150 150 
##$TP07= 0
##$TPNAME0= <>
##$TPNAME1= <>
##$TPNAME2= <>
##$TPNAME3= <>
##$TPNAME4= <>
##$TPNAME5= <>
##$TPNAME6= <>
##$TPNAME7= <>
##$TPOAL= (0..7)
0.5 0.5 0.5 0.5 0.5 0.5 0.5 0.5 
##$TPOFFS= (0..7)
0 0 0 0 0 0 0 0 
##$TUNHIN= 0
##$TUNHOUT= 0
##$TUNXOUT= 0
##$USERA1= <user>
##$USERA2= <user>
##$USERA3= <user>
##$USERA4= <user>
##$USERA5= <user>
##$V9= 5
##$VALIST= <valist>
##$VCLIST= <CCCCCCCCCCCCCCC>
##$VD= 0
##$VDLIST= <DDDDDDDDDDDDDDD>
##$VPLIST= <PPPPPPPPPPPPPPP>
##$VTLIST= <TTTTTTTTTTTTTTT>
##$WBST= 1024
##$WBSW= 4
##$XGAIN= (0..3)
0 0 0 0 
##$XL= 0
##$YL= 0
##$YMAX_a= 16581
##$YMIN_a= -21320
##$ZGOPTNS= <>
##$ZL1= 120
##$ZL2= 120
##$ZL3= 120
##$ZL4= 120
##$ABSF1= 182.463
##$ABSF2= -187.1042
##$ABSG= 5
##$ABSL= 3
##$ALPHA= 0
##$AQORDER= 0
##$ASSFAC= 0
##$ASSFACI= 0
##$ASSFACX= 0
##$ASSWID= 0
##$AUNMP= <proc_1d>
##$AZFE= 0.1
##$AZFW= 0.5
##$BCFW= 0
##$BC_mod= 2
##$BYTORDP= 0
##$COROFFS= 0
##$CY= -3
##$DATMOD= 1
##$DC= 0
##$DFILT= <>
##$DTYPP= 0
##$F1P= 0
##$F2P= 0
##$FCOR= 1
##$FTSIZE= 65536
##$FT_mod= 6
##$GAMMA= 0
##$GB= 0
##$INTBC= 1
##$INTSCL= 5.30512e-09
##$ISEN= 30
##$LB= 1
##$LEV0= 0
##$LPBIN= 0
##$MAXI= 10000
##$MC2= 0
##$MEAN= 0
##$ME_mod= 0
##$MI= 50
##$NCOEF= 0
##$NC_proc= -5
##$NLEV= 6
##$NOISF1= 182.463
##$NOISF2= 159.3651
##$NSP= 0
##$NTH_PI= 0
##$NZP= 0
##$OFFSET= 182.463
##$PC= 4
##$PHC0= -1817.674
##$PHC1= 98.999
##$PH_mod= 1
##$PKNL= yes
##$PPARMOD= 0
##$PSCAL= 0
##$PSIGN= 0
##$REVERSE= no
##$SF= 81.0140089999434
##$SI= 65536
##$SIGF1= 159.3651
##$SIGF2= -187.1042
##$SINO= 113.3802
##$SIOLD= 16384
##$SREGLST= <1H.CDCl3>
##$SSB= 0
##$STSI= 65536
##$STSR= 0
##$SW_p= 29940.119760479
##$SYMM= 0
##$S_DEV= 0
##$TDeff= 32768
##$TDoff= 0
##$TI= <>
##$TILT= no
##$TM1= 0
##$TM2= 0
##$TOPLEV= 0
##$USERP1= <user>
##$USERP2= <user>
##$USERP3= <user>
##$USERP4= <user>
##$USERP5= <user>
##$WDW= 1
##$XDIM= 65536
##$YMAX_p= 537199179
##$YMIN_p= -15465364
$$ End of Bruker specific parameters
$$ ---------------------------------
##NTUPLES= NMR SPECTRUM
##VAR_NAME=  FREQUENCY,     SPECTRUM/REAL,   SPECTRUM/IMAG
##SYMBOL=    X,             R,               I
##VAR_TYPE=  INDEPENDENT,   DEPENDENT,       DEPENDENT
##VAR_FORM=  AFFN,          ASDF,            ASDF
##VAR_DIM=   65536,         65536,           65536
##UNITS=     HZ,            ARBITRARY UNITS, ARBITRARY UNITS
##FACTOR=    0.456856943014862, 1,           1
##FIRST=     14782.0589164792, 0,            0
##LAST=      -15158.0608439998, 0,           0
##MIN=       -15158.0608439998, -15465364,   0
##MAX=       14782.0589164792, 537199179,    0
$$ Real data points
##PAGE= N=1
##DATA TABLE= (X++(R..R)), XYDATA
$$ [...]
43908 -137227 -185464 -912580 -1377033 -985945 -91477 772981 1389407 1539895 1055053 377939
43898 377939 294682 801861 966797 312615 -345204 -12995 1063570 1774957 1622291 1125070
43888 1125070 884688 914519 993434 1129541 1395606 1624988 1578507 1300084 1071975 1020883
43878 1020883 960932 751491 689330 1244180 2282725 2872093 2249824 870056 15695
43869 15695 326458 1168860 1580362 1319629 717397 23193 -610958 -880168 -647722 -313445
43859 -313445 -308152 -370528 75030 891281 1262330 881186 448354 651468 1154251 1064071
43849 1064071 117358 -1055284 -1731383 -1790559 -1606551 -1501345 -1384280 -896571 22973
43840 22973 758890 514352 -648827 -1593566 -1308169 -147707 577663 225529 -469209
43831 -469209 -481624 170504 598882 301292 -284636 -518457 -378013 -292301 -459286 -681892
43821 -681892 -759724 -707062 -599698 -506956 -597344 -988806 -1395925 -1264036 -478504 324026
43811 324026 439642 -93262 -674346 -975502 -1202385 -1551966 -1827651 -1755357 -1403106 -1061629
43801 -1061629 -829762 -504057 124537 941522 1508518 1445534 855261 284760 186271 516940
43791 516940 957194 1324952 1546838 1402939 685180 -389705 -1261906 -1610671 -1625582 -1658409
43781 -1658409 -1831012 -2002090 -1881681 -1198126 -53238 908930 1081687 703401 665727
43772 665727 1391800 2343445 2818555 2739415 2348377 1644825 641131 -192218 -355709 -37504
43762 -37504 142705 13755 -47529 143856 296654 202129 101078 287246 668711 912307
43752 912307 807537 382720 -134290 -413874 -303228 -49549 -31198 -267212 -445238 -412909
43742 -412909 -322632 -284912 -244910 -251441 -450434 -717902 -732864 -568920 -735383 -1362506 -1821374
43731 -1821374 -1555311 -880169 -455221 -291749 85362 668741 873939 481237 32022
43722 32022 25945 211713 46204 -452068 -719902 -419037 134732 348461 -10451 -606805
43712 -606805 -913777 -762038 -454747 -290580 -128948 329080 920348 1085875 665786 211670
43702 211670 212556 359297 35074 -680123 -1081386 -907637 -714001 -946840 -1217171 -955126
43692 -955126 -371203 -139143 -323765 -335305 22125 197517 -125497 -371479 48905 683583
43682 683583 587497 -281343 -965225 -830036 -289367 -16208 -63315 -123527 -159080 -303699
43672 -303699 -473356 -547207 -708369 -1136392 -1512888 -1329875 -674537 -257668 -545490 -1159959
43662 -1159959 -1266066 -410076 1015776 1991070 1663259 193731 -1252353 -1622725 -1016072
43653 -1016072 -359116 -236381 -481802 -813825 -1244253 -1697645 -1794881 -1372539 -841974 -658878
43643 -658878 -690005 -464517 108323 607182 634895 269613 -2334 267478 1005148 1566445
43633 1566445 1392780 724932 322636 404585 335148 -386287 -1292638 -1533493 -958436 -143475
43623 -143475 423046 681448 685232 471787 242502 256700 508708 784978 976078 1068311
43613 1068311 984634 759483 666961 773528 612541 -139909 -861579 -578187 631097 1548016
43603 1548016 1317043 401705 -204030 -126579 364298 966776 1528805 1916569 2070480 2036763
43593 2036763 1784703 1227658 505983 -73881 -432880 -655668 -542911 181845 1120059
43584 1120059 1361830 673826 -167352 -555364 -794305 -1204798 -1372152 -1037608 -936872
43575 -936872 -1728528 -2664940 -2485869 -1286988 -296668 27779 382569 1021900 1128548
43566 1128548 261871 -672538 -613783 255957 990671 1179448 1104383 1036020 1013305 1057653
43556 1057653 1073179 727126 -134188 -1112310 -1653892 -1665925 -1457800 -1272233 -1149134 -1050426
43546 -1050426 -847458 -370749 291290 744019 754123 552758 483853 608625 844399 1157441
43536 1157441 1347524 995211 15810 -974653 -1233498 -676174 207931 1007379 1612193
43527 1612193 1977493 2055716 1901971 1589674 1124462 620110 341274 356689 417388 406311
43517 406311 548424 878052 963465 629833 465883 924324 1331362 708461 -613471 -1249615
43507 -1249615 -724271 -118246 -364337 -882096 -640101 135861 263033 -684129 -1844491
43498 -1844491 -2263160 -1893069 -1225837 -514751 239215 822034 773557 -102894 -1360851
43489 -1360851 -2171044 -2034090 -1260005 -677531 -807565 -1383080 -1745014 -1585562 -1119746
43480 -1119746 -604871 -12293 682323 1150221 994856 354216 -108539 62398 625680
43471 625680 1020180 974223 522107 -292564 -1318684 -2074920 -2146956 -1812263 -1758776 -2085237
43461 -2085237 -2112543 -1400957 -427061 92859 82891 -116868 -428104 -929630 -1351203 -1270491
43451 -1270491 -731622 -201110 35901 74368 110333 310458 784739 1348028 1565832 1407045
43441 1407045 1455681 1949274 2100549 1191257 -66163 -332365 389601 822943 498667
43432 498667 380850 995232 1340042 549351 -503657 -460282 422724 701532 -146410 -1288337
43422 -1288337 -2023864 -2454866 -2556023 -1759309 31837 1822808 2521642 2105341 1346826
43413 1346826 751878 251729 -235629 -427038 9376 932320 1683147 1657559 928573 175114
43403 175114 -62745 120272 333247 454614 626539 909735 1242407 1586229 1836573 1761410
43393 1761410 1330659 924360 881858 1035118 1056275 1040196 1262708 1547200 1459771 1066057
43383 1066057 873187 973419 861738 259554 -453592 -867381 -1092700 -1400094 -1738546
43374 -1738546 -1909020 -1832383 -1371187 -318095 1053630 1808737 1230665 -274751 -1550502
43365 -1550502 -1844542 -1295398 -476588 119409 243808 -21724 -293409 -290909 -206326 -388386
43355 -388386 -719342 -699791 -198500 312849 459553 490842 762343 1021011 750941 133273
43345 133273 13738 690355 1308618 968186 45694 -287603 262980 738667 396731 -242175
43335 -242175 -293003 204680 581932 647723 670027 524390 -198689 -1234626 -1693674 -1276482
43325 -1276482 -656797 -378685 -162306 275654 503746 154904 -180901 312424 1362143
43316 1362143 1841128 1222740 89240 -802323 -1265550 -1370132 -1049220 -378993 184513
43307 184513 271086 111117 254522 842978 1407921 1403226 776545 -38944 -592986 -773215
43297 -773215 -732769 -638832 -595614 -666164 -764576 -623024 -128482 370327 411422 41592 -294992
43286 -294992 -477508 -804245 -1268008 -1351938 -851972 -320781 -263341 -446563 -548083 -910292
43276 -910292 -1862448 -2724684 -2467491 -1225720 -203193 -32135 -142032 71690 365724
43267 365724 310390 55833 -54541 -42313 -8591 160837 347103 33222 -825983 -1293620
43257 -1293620 -572042 690948 1056507 181915 -747997 -636867 163054 499715 -2902
43248 -2902 -541509 -251960 667615 1182684 674739 -312939 -746791 -319236 346755 633937
43238 633937 599528 575953 583326 490089 435376 667378 1092630 1302174 965435 32031 -1231582
43227 -1231582 -2199642 -2214289 -1325550 -444128 -348326 -782321 -1003353 -955310 -1230276 -1930768
43217 -1930768 -2304355 -1733962 -551344 432678 823340 780492 568778 297794 -17578
43208 -17578 -366701 -692520 -887029 -911492 -872876 -836577 -671526 -315871 -53505 -158916
43198 -158916 -365164 -170494 310585 353548 -345296 -1170201 -1426903 -1226739 -1108932 -1135326
43188 -1135326 -916419 -421062 -206198 -663773 -1349858 -1354517 -350250 892419 1226696
43179 1226696 394993 -666813 -964016 -594333 -390129 -664848 -927637 -795042 -476795
43170 -476795 -180200 270307 853032 1014583 458128 -176682 -13246 937774 1852606 2085479
43160 2085479 1649862 926840 332837 103970 39237 -327305 -980598 -1223319 -666324 16163
43150 16163 -33266 -582292 -709153 -246861 65653 -167929 -508216 -569329 -553902 -632635
43140 -632635 -543816 -173021 90966 -49513 -359205 -506055 -426438 -48132 708290 1383028
43130 1383028 1202059 307636 -26375 904430 2029219 1912232 847943 441319 1295376
43121 1295376 2264221 2160908 1180559 197697 -514094 -1197390 -1773597 -1853298 -1427681 -907080
43111 -907080 -430006 298322 1241977 1614121 784930 -564552 -903635 285582 1700375
43102 1700375 1800636 773767 167772 762357 1724742 2014153 1698705 1428426 1378736
43093 1378736 1366845 1445949 1663632 1628805 1040052 367604 315632 803002 1125439 948518
43083 948518 508158 41145 -279285 -55003 854392 1672084 1443156 447472 -92320 163527
43073 163527 232353 -417148 -781080 186478 1837933 2604694 2045454 1139490 747228 721138
43063 721138 591184 306579 5880 -387825 -967940 -1522167 -1699490 -1390785 -801570 -236821
43053 -236821 88863 94111 -192000 -611846 -846179 -573411 151793 798143 928730 806793
43043 806793 1035513 1577270 1643613 773689 -460655 -1177024 -1206827 -975523 -716356 -358730
43033 -358730 -11116 36958 -176668 -223914 167096 782439 1168899 989789 197643 -876676
43023 -876676 -1657519 -1820711 -1629228 -1565381 -1744735 -1939306 -1992110 -1853052 -1390043 -635000
43013 -635000 -97136 -276684 -881711 -1108335 -749322 -374134 -248513 161504 1167422
43004 1167422 2037635 1928013 1194317 912530 1246186 1205759 206256 -970866 -1270545
42995 -1270545 -842693 -737001 -1352167 -1905859 -1561061 -510197 403185 794558 1016148
42986 1016148 1426766 1844283 1881765 1525767 1112914 867347 738182 669344 736054 884336
42976 884336 758297 53847 -991008 -1710086 -1716579 -1335247 -1174832 -1371960 -1464609 -1001025
42966 -1001025 -64632 862562 1373232 1382950 1094834 867145 972548 1325309 1557803 1492905
42956 1492905 1365192 1405537 1450299 1260940 998423 934378 829344 168602 -927844 -1606569
42946 -1606569 -1347734 -689178 -547746 -1121802 -1816191 -2069135 -1918398 -1779097 -1854504 -1825718
42936 -1825718 -1204095 -79614 735993 681438 309159 531418 1133796 963101 -220525
42927 -220525 -1117738 -684110 374804 736495 332707 55905 143629 35240 -424686 -810212
42917 -810212 -1064006 -1492488 -1781603 -1195509 16713 575218 -38558 -815396 -814288 -492454
42907 -492454 -647421 -950481 -623444 5640 -148964 -1167080 -1827189 -1298767 -274788
42898 -274788 26357 -557401 -1098654 -930762 -487591 -591079 -1207711 -1397631 -598732 535504
42888 535504 1010023 819809 732110 942999 840905 214532 -227639 53274 609161 825733
42878 825733 886823 1258478 1740932 1748899 1177821 376226 -380379 -810663 -500993 406202
42868 406202 852045 100298 -992228 -988902 -691 373895 -615089 -1757207 -1614215 -435173
42858 -435173 393815 224677 -318200 -456145 -247586 -367233 -1205693 -2338630 -2927951
42849 -2927951 -2680421 -2206143 -2176602 -2386721 -2161182 -1524427 -1225252 -1486343 -1502631 -601528
42839 -601528 677147 1222590 769910 172273 364274 1384717 2381223 2423381 1402142
42830 1402142 166463 -389954 -288042 -188751 -340916 -449658 -572295 -1231627 -2270047
42821 -2270047 -2503109 -1261886 394774 939048 417984 219317 982974 1835605 1855197
42812 1855197 1311329 1009343 1135350 1327017 1432283 1607274 1844828 1859878 1428906 623709
42802 623709 -237994 -775900 -827633 -631114 -547327 -568058 -397490 -92738 -174114 -817666
42792 -817666 -1375764 -1205095 -692855 -812962 -1692006 -2275391 -1655073 -220245 886056
42783 886056 1112241 871316 770571 930705 1056108 816339 110881 -767162 -1227242 -960596
42773 -960596 -450214 -523999 -1301991 -2019375 -2096503 -1884108 -1929447 -1964053 -1308887 -83537
42763 -83537 761531 693869 196267 -84069 -130559 -158460 -40044 322874 515867 187986
42753 187986 -151092 326335 1441866 1976730 1206317 -123308 -746687 -381433 209075
42744 209075 398979 358989 505727 811608 943807 799797 558529 302093 -84912 -612614
42734 -612614 -1060714 -1260428 -1285870 -1248104 -1114268 -875660 -650564 -413014 99726 887940
42724 887940 1382196 1112560 472824 195398 159047 -498271 -1925101 -3031704 -2853588
42715 -2853588 -1762377 -746291 -69379 621240 1288371 1492020 1245545 1078089 1210838
42706 1210838 1337967 1270464 1156827 999201 619740 251207 472894 1282388 1851974 1567961
42696 1567961 775591 113530 -350395 -825335 -1114727 -868721 -276901 79732 -31284
42687 -31284 -362456 -675160 -897863 -890307 -544049 -121895 -48511 -310533 -473309 -364705
42677 -364705 -319119 -587785 -902495 -884198 -588838 -339391 -213102 -44363 121703 -78387
42667 -78387 -853483 -1852711 -2399953 -2123653 -1285835 -483108 -66236 117446 422319 895916
42657 895916 1137445 725715 -211724 -969399 -941083 -299949 181822 45808 -327331 -242473
42647 -242473 468787 1362641 1962540 2105813 1815887 1204778 513670 -68568 -628555 -1247589
42637 -1247589 -1554857 -1041112 102405 962225 927816 316986 -216992 -449817 -525013 -609034
42627 -609034 -894543 -1464347 -1867878 -1427272 -340970 235574 -216872 -689888 -187780
42618 -187780 608201 394042 -627269 -1143219 -965770 -1161996 -1822599 -1517450 324986
42609 324986 2093370 2134068 984279 261516 340248 484465 488045 647224 564013 -440722
42599 -440722 -1835228 -2271029 -1573413 -973714 -1109819 -1155015 -449724 253487 -5791 -868344
42589 -868344 -1231430 -748943 36951 584445 628271 -30071 -1241071 -2257135 -2445421
42580 -2445421 -2085592 -1868615 -1809499 -1330051 -317764 605928 944305 846812 634408 346325
42570 346325 -17007 -247452 -216413 -105516 -89035 -8604 399807 1106090 1800200 2202869
42560 2202869 2258340 2153519 2215044 2577664 2833249 2267712 711237 -1010488 -1803271
42551 -1803271 -1462180 -823009 -730722 -1140964 -1362617 -934447 -44158 755952 1000338 582774
42541 582774 -134838 -508024 -196049 382409 446542 -201686 -894177 -894384 -215049 550030
42531 550030 950550 965136 762255 497246 273968 95065 -53488 43491 708588 1780113
42521 1780113 2502699 2372446 1725871 1051361 216426 -888362 -1422925 -468067 1289233
42512 1289233 2029798 1231750 376370 682715 1374276 1121101 153453 -317208 -97014
42503 -97014 -39901 -390861 -475709 -80485 89728 -394409 -1046001 -1384183 -1643852 -2133313
42493 -2133313 -2587752 -2630000 -2341439 -1976975 -1582099 -1234857 -1187254 -1387250 -1299633 -623186
42483 -623186 163105 376631 -30887 -597087 -1063485 -1542926 -2078774 -2410624 -2253752 -1668728
42473 -1668728 -1072034 -803222 -662537 -129826 768333 1208053 670371 -89033 32082
42464 32082 792383 869081 -116148 -959727 -663981 204235 585811 406583 162791 -127251
42454 -127251 -559116 -608644 102988 782510 396190 -663046 -1068700 -588465 -326920 -848988
42444 -848988 -1370611 -1202319 -801964 -771394 -819571 -516413 -293215 -788370 -1678940 -2001067
42434 -2001067 -1364775 -190709 979032 1745664 1690762 714507 -486270 -912678 -322779
42425 -322779 627847 1248108 1331737 895740 30908 -856844 -1209951 -961651 -599992 -420036
42415 -420036 -198692 132353 54774 -773919 -1718123 -1794675 -980107 -260596 -356652 -993070
42405 -993070 -1575769 -1991242 -2386222 -2632204 -2512863 -2199250 -2066665 -2142234 -2109541 -1778089
42395 -1778089 -1224935 -591980 -87300 -29400 -450704 -774577 -402836 415022 845653 610009
42385 610009 248360 164643 92449 -244416 -608042 -743554 -781999 -732328 -210126 783303
42375 783303 1424530 1106364 411869 283944 644341 689361 226089 -233461 -512487 -897915
42365 -897915 -1271253 -1127260 -573206 -329652 -518128 -423334 195437 539016 60247 -551930
42355 -551930 -394769 322144 749186 683213 575606 588359 427289 -30712 -598221 -1174113
42345 -1174113 -1715653 -1891733 -1313686 -137911 976459 1524976 1471422 1017340 436348
42336 436348 56874 13594 30699 -217273 -573743 -582290 -192476 82051 -181552 -743630
42326 -743630 -912283 -236021 1044531 2204697 2730279 2755082 2653516 2348731 1487601
42317 1487601 324639 -222081 253070 970200 969597 330864 -190871 -316993 -304379 -164123
42307 -164123 321045 891379 964079 561171 318730 437040 378854 -146850 -629044 -549580
42297 -549580 -110806 245683 481220 640285 406529 -403481 -1234300 -1316231 -656036 24582
42287 24582 245634 163961 54502 -79152 -249137 -237948 176642 953221 1847127 2536629
42277 2536629 2614535 1736206 29864 -1748935 -2726706 -2631126 -1906973 -1143586 -557853
42268 -557853 -81399 279082 408332 317592 150956 -27313 -184850 -79899 526705 1285090
42258 1285090 1346298 396265 -759441 -1110498 -678945 -306843 -405997 -585030 -504434 -389844
42248 -389844 -477752 -548256 -344313 -223 290354 633370 1078606 1246695 773735 -45782
42238 -45782 -471256 -123707 672414 1262058 1167091 369072 -659790 -1285539 -1258989 -866776
42228 -866776 -473630 -142604 158185 287336 154731 -24744 -25201 26074 -89927 -217399
42218 -217399 1777 557774 1028823 1112637 923489 743096 698938 710682 610474 345211
42208 345211 137138 278543 631339 584313 -220795 -1335126 -2005633 -2063138 -1944374 -1958349
42198 -1958349 -1935027 -1570308 -786407 213974 980421 1042094 445551 -110685 -114164 -24806
42188 -24806 -641491 -1781622 -2318343 -1677737 -629637 -273947 -754195 -1324001 -1291893 -575097
42178 -575097 364425 865776 634245 139353 128181 654240 1061666 1032082 964290 1027722
42168 1027722 657111 -375679 -1092853 -439674 1097194 1948740 1405714 253004 -476514
42159 -476514 -524104 -113830 505341 955450 854800 370302 116301 267002 310424 -98718
42149 -98718 -664293 -1133470 -1773329 -2641762 -2973582 -2034124 -290437 982659 1177510
42140 1177510 833429 652077 624247 340832 -228264 -593072 -308664 482123 1144886 1237035
42130 1237035 1019428 1086376 1516155 1741798 1387456 833303 651517 797399 741777 204312
42120 204312 -603118 -1293836 -1526073 -1093409 -194488 509129 488870 -80476 -659306 -1057917
42110 -1057917 -1387272 -1496545 -1067153 -279928 175453 -97094 -802538 -1438620 -1740607
42101 -1740607 -1558849 -803414 240769 928144 868203 312802 -205820 -378536 -196643
42092 -196643 143563 307539 115260 -141803 -8015 467290 786789 794337 886230 1264880
42082 1264880 1530649 1302920 750018 187292 -346747 -749857 -631241 76588 741443
42073 741443 817199 610595 692981 938586 827306 413484 259003 560330 1032309 1532931
42063 1532931 2094473 2416266 2090036 1367848 975550 1058473 1010098 468214 -260106 -946963
42053 -946963 -1787073 -2628507 -2697663 -1725710 -693547 -660617 -1267860 -1251329 -251829 745810
42043 745810 842010 322062 29702 217992 479983 508502 431514 438754 466827 384843 265477
42032 265477 286295 452048 574699 492552 174760 -328350 -826236 -912930 -282655 753083
42022 753083 1380352 1146314 438392 -161739 -669196 -1388603 -2071242 -2034550 -1157723 -153830
42012 -153830 376689 680002 1290191 2066537 2230785 1320867 -193761 -1355510 -1681997
42003 -1681997 -1558590 -1593044 -1718491 -1295409 -184741 775869 766217 64551 -425612 -432133
41993 -432133 -381418 -369760 50456 909014 1451082 1092263 134977 -818370 -1610742 -2304328
41983 -2304328 -2730799 -2748722 -2593457 -2547438 -2529315 -2323804 -1939333 -1494079 -1066825 -838654
41973 -838654 -962103 -1121992 -772433 -34553 301272 -9564 -223505 121117 340998 -218235
41963 -218235 -936063 -875732 -374824 -448872 -972085 -814883 237905 1054693 922429 539427
41953 539427 731082 1176995 1097700 472763 -143613 -530264 -863927 -1177748 -1288471 -1089192
41943 -1089192 -574341 214879 1024642 1455063 1433196 1308499 1258708 988480 306884 -399319
41933 -399319 -646330 -463454 -130108 354080 1054381 1624504 1605846 1103725 674018 574610
41923 574610 572202 464737 319404 132707 -269478 -818032 -1106908 -979248 -856640 -1129925
41913 -1129925 -1495453 -1369355 -832899 -589963 -879335 -1023434 -454684 272042 136223
41904 136223 -862561 -1594495 -1268515 -363690 149992 -77746 -805327 -1743479 -2516152 -2563810
41894 -2563810 -1805871 -1105634 -1305186 -1951062 -1811370 -679976 213703 -123201 -1145779
41885 -1145779 -1652686 -1402145 -1182513 -1506604 -1878875 -1491682 -311387 775327 898487
41876 898487 157192 -547873 -626048 -390296 -345130 -349379 -23366 359078 174447 -437217
41866 -437217 -608487 -45610 501471 376433 -97511 -285505 -158003 -45895 -18267 -25244
41856 -25244 -194702 -474815 -447542 -47646 30931 -664138 -1379860 -1047341 138961 974580
41846 974580 1004648 1028592 1632743 2156268 1666047 338050 -776258 -1045972 -761861 -498616
41836 -498616 -489638 -654832 -850775 -949552 -893094 -800352 -875818 -1096575 -1121578 -681307 15052
41825 15052 469925 486643 326634 227846 84051 -204667 -400121 -316879 -285895 -720726
41815 -720726 -1354652 -1502579 -1101714 -878604 -1318495 -2042722 -2455872 -2452547 -2145335 -1444592
41805 -1444592 -410696 379935 377632 -242539 -841468 -1045731 -852343 -324458 336790 667985
41795 667985 407033 -88881 -356034 -541694 -1059020 -1705246 -1812154 -1311301 -1002718 -1532991
41785 -1532991 -2564872 -3227449 -3079654 -2375769 -1572224 -833072 -58535 669756 853506
41776 853506 94024 -1128025 -1664260 -1018466 -54921 98758 -452515 -587297 278274
41767 278274 1518959 2196112 1998397 1163735 66474 -812572 -946881 -213817 852597
41758 852597 1501759 1427152 947638 649972 875611 1437776 1812066 1637589 965216 46089
41748 46089 -861817 -1433002 -1429207 -1114307 -1082484 -1397323 -1408072 -808710 -268145 -390719
41738 -390719 -665985 -343166 134150 -299982 -1530652 -2238747 -1777921 -962617 -709276
41729 -709276 -887789 -909004 -592740 -44245 569627 760277 5485 -1326441 -2104530 -1861113
41719 -1861113 -1307418 -1084193 -939681 -635636 -622955 -1061940 -1141983 -329351 541229 499303
41709 499303 59491 409909 1505874 2245875 2207869 1902329 1470816 505401 -742708
41700 -742708 -1283797 -854870 -347608 -359840 -355196 185520 702689 377168 -642079 -1550198
41690 -1550198 -1971212 -2077490 -1971847 -1592862 -1058964 -571701 -65583 614250 1245782
41681 1245782 1347858 831086 259195 303228 971166 1464273 940891 -480721 -1649921
41672 -1649921 -1530564 -261509 1192496 2172776 2606035 2408301 1461031 299663 -45305
41663 -45305 655828 1366274 1148608 406222 105730 275632 145423 -471434 -859057 -509578
41653 -509578 241427 875383 1293633 1480560 1209801 534779 75414 255342 560094 155482
41643 155482 -882804 -1576508 -1375718 -933257 -1224064 -2231029 -2951434 -2646244 -1685856
41634 -1685856 -998975 -928886 -933335 -413505 438928 851205 451714 -236458 -418018 48041
41624 48041 590162 715892 540530 432431 436514 322956 49905 -154077 -158367 -82091 -10506
41613 -10506 157035 418915 482436 143183 -268773 -159673 545710 1159407 968772 101336
41603 101336 -584491 -488523 80202 384887 193129 -94123 -203361 -439567 -1136595 -1991236
41593 -1991236 -2362401 -2095474 -1624685 -1298943 -1057184 -830621 -785922 -946693 -965328 -575722
41583 -575722 3208 397733 552930 572448 348016 -240569 -898948 -1122990 -833239 -482110
41573 -482110 -504721 -908179 -1389985 -1619569 -1423389 -934349 -542588 -478392 -503361 -269856
41563 -269856 106130 190012 -77310 -251213 -54770 211761 138103 -230022 -541494 -621584
41553 -621584 -534194 -324339 28247 471731 914786 1347048 1748653 1932945 1669592 965644
41543 965644 93150 -645470 -1070241 -1116602 -878274 -666774 -821950 -1362164 -1944564 -2246200
41533 -2246200 -2243769 -2021840 -1515695 -715001 -10325 68595 -419293 -711942 -235422 622259
41523 622259 970275 513435 -182660 -464565 -211962 349795 1003034 1502794 1557458 1142663
41513 1142663 624143 337497 229243 90205 -96021 -254110 -414207 -542333 -409522
41504 -409522 58723 499587 514379 202543 -25788 -23222 44385 85102 158090 250167 292832
41493 292832 291518 143946 -450624 -1471907 -2176458 -1794838 -577916 423913 638455
41484 638455 443542 294131 38093 -612554 -1445775 -1959579 -1919233 -1482953 -1025344 -907384
41474 -907384 -1080230 -942975 -118507 659970 233213 -1224841 -2083728 -1418914 -368114
41465 -368114 -466256 -1401180 -1604444 -628729 409040 705489 749883 1092790 1320864 914849
41455 914849 253631 -10166 26544 -113433 -326951 -117336 507729 1049785 1303866 1473741
41445 1473741 1583201 1431536 1143554 1114015 1313229 1291440 1037684 1134327 1703834 1877652
41435 1877652 927350 -528133 -1167929 -626291 173794 297587 -241888 -908600 -1426653
41426 -1426653 -1827129 -2084909 -2045934 -1588947 -736517 236555 793927 531324 -327368 -1095159
41416 -1095159 -1357188 -1255902 -1018719 -638053 -189084 -21052 -319583 -788510 -1037525
41407 -1037525 -995445 -723755 -208990 367343 571973 313136 90494 239020 373367 111999
41397 111999 -120091 268718 955037 1085493 522649 -144325 -669245 -1275984 -1759418 -1516073
41387 -1516073 -656990 -75617 -84093 32775 670762 1126866 808088 272458 201910 122610
41377 122610 -809774 -2274476 -3102944 -2821151 -1886506 -661308 745513 1700591 1309737
41368 1309737 -247380 -1596958 -1786112 -1267466 -908669 -783343 -468675 84646 607386
41359 607386 1015197 1283146 1159872 582271 108114 332893 1029016 1447628 1393504 1395049
41349 1395049 1774298 2160501 2132253 1830321 1621657 1540591 1408846 1209364 959001 430106
41339 430106 -568076 -1706281 -2318029 -2089085 -1306431 -459879 134349 378470 382025 370393
41329 370393 312417 -205893 -1270152 -1973394 -1245683 524847 1567022 876439 -478712
41320 -478712 -863231 -201562 313443 150306 -66738 106013 234273 -83948 -496011 -501921
41310 -501921 -171595 106884 118404 -198773 -793635 -1297455 -1242439 -689074 -188016 2822
41300 2822 113881 166821 -207830 -985402 -1510313 -1461037 -1378357 -1738026 -2139810 -2012710
41290 -2012710 -1560312 -1340331 -1360828 -1252469 -941750 -525774 94486 770643 749955 -382360
41280 -382360 -1713180 -1889564 -877658 71851 205962 68845 296725 508171 -16839
41271 -16839 -1021038 -1278036 29080 2190334 3442836 2732705 934799 -54386 520656
41262 520656 1587172 1921641 1702022 1744827 1939036 1501879 446503 -324711 -358710 -97776
41252 -97776 77356 303908 563806 470259 45901 -95151 255168 430439 -101861 -852979
41242 -852979 -982474 -446458 68958 146235 95810 430028 1156121 1710938 1619736 1141307
41232 1141307 960995 1153376 972029 72257 -640218 -148890 1088687 1661127 1125898
41223 1125898 366070 27659 -263242 -833404 -1173065 -777983 -22085 374521 212167
41214 212167 -269050 -836553 -1293529 -1519624 -1704427 -2063609 -2263258 -1787075 -914192 -473321
41204 -473321 -501310 -170959 656690 944194 84910 -1071192 -1495912 -1315145 -1115902 -898153
41194 -898153 -596774 -712300 -1391857 -1708569 -974089 -30562 -28699 -572146 -413835 485294
41184 485294 1003323 689276 179909 -82867 -236495 -148116 504463 1214543 972493 -177551
41174 -177551 -1054550 -1040517 -741393 -682620 -490603 200257 1038083 1598667 1832208 1516597
41164 1516597 296863 -1260848 -1743726 -731430 369025 130403 -1050086 -1775920 -1625260
41155 -1625260 -1314095 -1347021 -1494474 -1422594 -1037757 -314102 558875 966379 420867 -712317
41145 -712317 -1524044 -1546565 -1067637 -617851 -523857 -796505 -1086375 -924096 -326256 94911
41135 94911 -40904 -303101 -133312 290204 440629 318579 231907 11957 -673112 -1358979
41125 -1358979 -1131432 -68356 618987 252095 -358574 -174841 577645 932719 699760
41116 699760 558350 810612 938305 570642 150191 209295 461205 159345 -816833 -1747650
41106 -1747650 -1986550 -1674437 -1352075 -1169256 -813921 -114595 636911 1016660 854618
41097 854618 204134 -784549 -1749289 -2112534 -1547628 -423308 487352 771518 652122
41088 652122 513491 422627 213653 -180887 -643569 -992268 -1076509 -862885 -505275 -224512
41078 -224512 -88307 -65079 -272441 -849592 -1499545 -1598573 -1059586 -665850 -1054405 -1706789
41068 -1706789 -1629590 -859007 -448511 -871136 -1309892 -922054 -56089 361579 60642 -600871
41058 -600871 -1394490 -2177210 -2442942 -1797167 -779863 -419204 -930604 -1520125 -1486663 -869032
41048 -869032 -27300 674253 732459 -119377 -1227853 -1519771 -935965 -556229 -989651 -1530466
41038 -1530466 -1389977 -853555 -495660 -62123 901740 1867430 1851107 926661 253653 554720
41028 554720 1288675 1451299 695698 -413537 -939717 -452374 373108 300895 -991250
41019 -991250 -2351181 -2490236 -1455676 -232675 641001 1304499 1764007 1739367 1258638
41010 1258638 717396 396592 434004 997520 1853388 2133191 1362688 407066 426931 1138809
41000 1138809 1230430 410640 -188944 197197 990504 1429330 1595374 1775667 1756160 1328635
40990 1328635 731318 92150 -818004 -1811496 -2049686 -1146098 160953 936599 986786
40981 986786 446299 -714790 -2114679 -2684680 -1849884 -494094 23386 -575030 -1543585
40972 -1543585 -2246247 -2499767 -2193751 -1391631 -654071 -616621 -1302757 -2210831 -2825173 -2750620
40962 -2750620 -1832052 -599714 -85614 -621051 -1253319 -921933 241866 1364783 2039145
40953 2039145 2355013 2216400 1499342 614695 125374 11200 -24266 155813 779132 1446321
40943 1446321 1595606 1440005 1599098 2003569 2024560 1524309 910276 295787 -487502 -1160608
40933 -1160608 -1236245 -926986 -836673 -783013 -25907 1214607 1631354 603017 -892467
40924 -892467 -1587440 -1292996 -540561 255443 712834 343034 -812644 -1924217 -2290679
40915 -2290679 -2057548 -1633997 -1013329 -182098 402518 381855 78474 -92999 -347734 -1000663
40905 -1000663 -1610687 -1439903 -595979 18473 -96347 -486125 -481306 -32307 336717 136976
40895 136976 -597635 -1272698 -1227209 -421800 478269 882355 971859 1368739 2232401 2986419
40885 2986419 2955614 2091410 1029368 481458 545771 649292 284516 -310798 -484089 -78211
40875 -78211 443441 809035 1295886 2024674 2457222 2068061 1129116 305312 -255258 -869331
40865 -869331 -1532869 -1813151 -1571920 -1271069 -1364377 -1725065 -1872609 -1546659 -893030 -233532
40855 -233532 198460 363698 370885 344309 332990 323607 259506 39910 -363457 -739387 -763585
40844 -763585 -418842 -129359 -283918 -717327 -874575 -481881 109359 296702 -127583 -750386
40834 -750386 -976157 -695467 -415402 -605534 -1040562 -1076445 -555621 -49581 -37970 -212950
40824 -212950 50825 745458 1177778 865071 122068 -380161 -398334 -257754 -322115 -547791
40814 -547791 -610744 -333943 123666 440884 380900 -76395 -665671 -913849 -544164 105553
40804 105553 330590 -107725 -658184 -719918 -423342 -314070 -487764 -521086 -191421 203957
40794 203957 277684 -93411 -863352 -1845488 -2562516 -2473689 -1534343 -289864 645263 967158
40784 967158 632936 -132699 -766746 -796963 -490367 -649541 -1579047 -2616581 -2865042 -2081163
40774 -2081163 -744094 396866 763460 357574 -146190 -90846 350239 506396 298632
40765 298632 294128 587154 473063 -429507 -1529722 -2174022 -2410797 -2328589 -1530783 -80536
40755 -80536 844231 336398 -733397 -769449 311030 1126190 1008146 828369 1408399 2288458
40745 2288458 2602887 2263092 1647071 837670 -118707 -708863 -491866 65228 -22562 -995156
40735 -995156 -1964768 -1961878 -1075888 -317955 -413875 -973778 -1054786 -436249 78398 -198964
40725 -198964 -849307 -953247 -378699 176577 316455 393750 705132 947790 838388 714725
40715 714725 1017578 1519624 1586353 1032585 271383 -292234 -589700 -632025 -356377 130388
40705 130388 468394 425928 198072 129687 256874 335900 249818 108596 -69721 -439873
40695 -439873 -923941 -1061372 -605759 -15682 122250 633 320255 1129805 1660174 1540510
40685 1540510 1441345 2013489 2796252 2864843 2165755 1466802 1192293 1036707 669158 148981
40675 148981 -393533 -906613 -1193169 -1072648 -819216 -913928 -1306403 -1465344 -1222560 -954059
40665 -954059 -793385 -362622 398997 807798 353079 -463419 -816203 -741423 -955050 -1631732
40655 -1631732 -2080439 -1785771 -1202357 -1145589 -1691508 -2090234 -1701910 -662270 449851
40646 449851 1268162 1722090 1748864 1390208 1116760 1495634 2331761 2644405 1883510 761631
40636 761631 352569 646100 644592 -177503 -1172394 -1431759 -875318 -144633 239499 282049
40626 282049 236139 232847 255772 336629 559772 770528 528362 -275312 -928700 -673898
40616 -673898 12623 -214263 -1579740 -2530131 -1783452 -147154 759808 851555 1258581
40607 1258581 2113976 2290026 1389585 431362 143958 -54981 -793803 -1661895 -2083789
40598 -2083789 -2238464 -2365738 -2087647 -1210855 -387841 -191714 -279922 -219345 -318725 -776522
40588 -776522 -837090 118067 1293436 1467075 788994 416723 686490 846913 461068 -81102
40578 -81102 -453765 -761442 -938970 -705456 -195939 199851 630999 1508104 2412670 2319952
40568 2319952 1133931 14447 -193617 28446 -122136 -570603 -749104 -546639 -264338
40559 -264338 -54694 77748 56755 -56534 62401 554168 1073086 1217909 984334 574665
40549 574665 109013 -262871 -386845 -506754 -1167530 -2340042 -3097074 -2670498 -1507234
40540 -1507234 -733027 -776973 -1067217 -978705 -539029 -151684 -60378 -220738 -406696 -319401
40530 -319401 200249 957927 1534958 1687307 1508478 1186180 762172 228469 -260845 -463645
40520 -463645 -366649 -256533 -311835 -247235 312102 1069154 1098730 -34800 -1508581 -2043663
40510 -2043663 -1360776 -422450 -289572 -1133570 -2307847 -2937732 -2483677 -1267147 -484408
40501 -484408 -1094198 -2528924 -3143482 -2236839 -968006 -768807 -1456926 -1691000 -942903
40492 -942903 -100491 -85733 -703666 -1196933 -1333875 -1405072 -1433361 -1003966 13828 992887
40482 992887 1121460 325502 -696155 -1364666 -1782803 -2210299 -2366965 -1768870 -632026
40473 -632026 153392 92704 -353620 -513505 -366822 -313466 -423876 -378100 -510 542346
40463 542346 1016934 1279329 1214763 835351 434040 352047 529349 505009 -28190 -782548
40453 -782548 -1089384 -566685 431803 1098863 995898 507099 286461 367695 198914 -434985
40443 -434985 -1019418 -1042862 -659218 -288617 21014 384273 574168 285913 -273763 -589985
40433 -589985 -541973 -440710 -466205 -527658 -566765 -508532 -68308 779979 1287980 701536
40423 701536 -411536 -543460 696378 1797927 1253671 -452701 -1555252 -1233461 -256843
40414 -256843 367649 502504 568857 830936 1193410 1279294 646159 -661381 -1799839 -1876967
40404 -1876967 -1031338 -216153 110671 375788 805061 811535 33537 -712194 -386852 676481
40394 676481 1045786 86445 -1200917 -1506529 -781361 -62759 -90615 -582006 -808673 -495251
40384 -495251 19726 336700 443940 525281 528465 246120 -189720 -316092 -44713 47864
40374 47864 -479417 -1176824 -1285450 -859231 -656162 -963345 -1242198 -1076824 -760999 -606706
40364 -606706 -304437 506314 1473142 1919614 1755567 1483637 1440717 1484377 1357622 992876
40354 992876 498818 106377 9847 40568 -272776 -1043426 -1727378 -1856336 -1728641 -1857130
40344 -1857130 -2060680 -1812083 -1291694 -1230677 -1646641 -1614028 -634627 480324 599337 -337226
40334 -337226 -1393842 -1749712 -1280309 -343175 487323 604392 -199938 -1376829 -1956546
40325 -1956546 -1385242 -17547 1189737 1494213 1001000 466879 369374 356641 -75377
40316 -75377 -610018 -448525 397963 927135 522134 -223205 -508798 -464519 -613550 -770743
40306 -770743 -359032 462154 882334 598872 109225 -153037 -197479 62715 854540 1757194
40296 1757194 1697280 287929 -1402599 -2023558 -1486557 -765618 -505892 -523440 -526913 -584115
40286 -584115 -736093 -735661 -450901 -144728 -80287 -141367 -119329 -120762 -343520 -606314 -502498
40275 -502498 -10218 430940 546848 570849 747604 831914 480501 -29986 17811 808555
40265 808555 1631735 1719260 1136104 562777 434282 621576 792904 712134 264595 -409592
40255 -409592 -812636 -543561 62334 194879 -333307 -706842 -184523 849726 1454581
40246 1454581 1472391 1575790 1994143 2014745 1108596 -122138 -730794 -724245 -843492 -1247048
40236 -1247048 -1216187 -283517 1014537 1779335 1651567 840253 -233788 -995986 -912349
40227 -912349 -97184 599750 541803 48708 -192737 -67384 139281 447027 988997 1367404
40217 1367404 1039955 296144 10519 338251 485896 -14700 -635543 -804835 -737233 -811465
40207 -811465 -829662 -544060 -356485 -755076 -1429878 -1660657 -1318053 -811039 -286297 384771
40197 384771 961707 962906 491192 241015 527844 902948 927183 768757 737343 690152
40187 690152 291966 -416789 -1066845 -1405177 -1400284 -1035238 -324239 441808 735328 275956
40177 275956 -577872 -1126722 -1131568 -1141766 -1746317 -2590900 -2603866 -1368341 164326 686875
40167 686875 -29851 -1099716 -1671865 -1644105 -1338745 -957450 -451300 323161 1326150
40158 1326150 2081009 1929779 833364 -355249 -841766 -853304 -1097134 -1491477 -1214149
40149 -1214149 -44560 1131183 1424201 923125 259280 -222905 -449557 -279246 280175
40140 280175 812726 939206 840178 939819 1251029 1444257 1429100 1422952 1463785 1267600 673378
40129 673378 -59253 -527481 -573120 -284077 236113 939510 1706111 2261876 2291287 1663092
40119 1663092 590654 -391569 -665783 58924 1393488 2407334 2387618 1521698 617234
40110 617234 135123 -157435 -477976 -471440 238022 1280224 1849275 1650741 1095528 642922
40100 642922 371929 141948 -209976 -764248 -1259006 -1092779 -35587 1193776 1561750
40091 1561750 865079 -193588 -908636 -1038381 -608278 61735 293257 -219925 -735556
40082 -735556 -361229 489487 559848 -356368 -1192743 -1439818 -1809867 -2595351 -2809489 -1853214
40072 -1853214 -777453 -740671 -1241846 -1167864 -735210 -934334 -1636954 -1796023 -1254408 -896461
40062 -896461 -1059919 -1130739 -785579 -425256 -241364 33578 302252 100306 -423812 -565018
40052 -565018 -241453 -53020 -30186 471857 1355180 1532942 610039 -364181 -441664 5028
40042 5028 251816 315075 328372 -57509 -731566 -658038 526453 1435181 774322 -569468
40032 -569468 -815128 -45139 71481 -934253 -1675803 -1271846 -638976 -796107 -1321140
40023 -1321140 -1377294 -1146158 -1222976 -1407469 -1158795 -722736 -784815 -1301641 -1608067 -1526727
40013 -1526727 -1481495 -1529240 -1177661 -400408 -48578 -744989 -1839683 -2038197 -903211
40004 -903211 728666 1786279 2009954 1882126 1894843 2155432 2510175 2719883 2552256
39995 2552256 2011552 1522811 1586877 2128579 2469940 2134020 1398783 807380 428550 -5220
39985 -5220 -455397 -609296 -511296 -611690 -1043751 -1314556 -972365 -253060 220864 180234
39975 180234 -84958 -112144 321243 1049559 1645932 1788676 1551527 1218644 883971 502760
39965 502760 264213 456542 885777 939208 441987 -51778 -120127 -89415 -359157 -658201
39955 -658201 -598913 -503897 -865560 -1281546 -876875 268551 1059789 878138 232293 -298250
39945 -298250 -804953 -1297846 -1171391 -171422 831637 906113 373840 171531 342256 201964
39935 201964 -246429 -236549 371370 761563 532853 349151 700342 974172 544866 19892
39925 19892 379097 1296238 1425086 311311 -987096 -1404704 -1126982 -919886 -916364 -733976
39915 -733976 -398423 -403831 -900307 -1430970 -1621232 -1668089 -1894795 -2163628 -2086237 -1645127
39905 -1645127 -1230455 -1079439 -1016815 -832236 -618891 -571164 -677539 -820665 -985112 -1104468
39895 -1104468 -862050 1350 1199312 2041279 2125124 1646039 993221 346418 -227588
39886 -227588 -600904 -733772 -788656 -873146 -830969 -508815 -87391 111728 70998 63623 201912
39875 201912 254552 7257 -380417 -551891 -429326 -316817 -427976 -457711 95481 1138910
39865 1138910 1856983 1637541 865657 397492 434954 464960 244738 144942 322363 265838
39855 265838 -355764 -937705 -669164 282843 938650 708385 -99277 -834871 -1026901 -428016
39845 -428016 851820 2158991 2713898 2371693 1689288 1243376 1186042 1365877 1463242 1093561
39835 1093561 259710 -384894 -281845 125807 -38383 -614395 -431379 906521 2195214
39826 2195214 2188891 1228287 568013 672980 1039202 1275913 1393963 1207161 438097 -501307
39816 -501307 -709432 -32634 597073 384911 -343932 -755234 -619938 -367149 -326574 -374764
39806 -374764 -254978 51086 295836 245879 55379 272462 1181429 2162439 2159304 968310
39796 968310 -356099 -693655 -126861 352934 136716 -476574 -922539 -1026174 -912895
39787 -912895 -643232 -161926 531904 1287770 1807898 1749267 978594 -217209 -1299052
39778 -1299052 -1922180 -2132367 -2092655 -1772362 -1063639 -147561 480503 489832 112859 -136527
39768 -136527 -115583 -143396 -353512 -333556 246418 937317 983568 394201 -58406 48676
39758 48676 332381 437652 588219 885664 786395 -19216 -758178 -482334 493247 968466
39748 968466 509092 -214016 -671234 -1014673 -1215573 -746994 399989 1285458 1212956 637388
39738 637388 292775 128105 -179518 -328123 72357 521842 192045 -719362 -1128193 -557258
39728 -557258 310491 666612 483380 228521 218045 431975 614527 491358 133812 -33916
39718 -33916 133675 211721 -15346 34035 825261 1667230 1599794 1044384 1339999 2606294
39708 2606294 3360472 2617655 1194201 357039 218807 203720 238133 609588 1207775 1675213
39698 1675213 1935895 2044600 1972785 1997215 2695388 3993409 4816570 4313509 2892390
39689 2892390 1474718 369377 -446694 -657381 -122838 491207 522595 277254 309803
39680 309803 329674 -95699 -301396 645021 2136324 2507533 1412989 381519 671924
39671 671924 1714914 2137325 1412616 42028 -1142163 -1445429 -725440 330211 860881
39662 860881 883345 1069499 1482908 1402249 567384 -288041 -451017 -1110 675949 1329932
39652 1329932 1561144 1014046 217574 307615 1445409 2401146 2232217 1479921 1087733
39643 1087733 1035746 825760 527466 466682 507763 488148 768089 1483134 1840759 1142142
39633 1142142 25115 -350712 20435 246281 214084 741068 1941019 2641218 1932464
39624 1932464 479536 -314655 23996 749613 1035037 916751 1027189 1621402 2144347
39615 2144347 1925525 1120946 559357 665377 1047618 1259295 1333792 1286708 795863 -96629
39605 -96629 -597648 -181688 486589 421320 -253232 -563067 -157541 309200 228322 -244942
39595 -244942 -562504 -324493 535521 1639459 2341300 2458264 2625982 3456510 4660738
39586 4660738 5598873 6307187 7146538 7720940 7176735 5575980 3999654 3123343 2557246
39577 2557246 1816907 1097187 716611 511627 235309 42990 179437 546170 853872
39568 853872 910786 649399 209886 4467 259389 520766 154761 -667275 -1085542 -679997
39558 -679997 142209 885586 1358401 1296379 492728 -466506 -503006 508502 1400486 1284838
39548 1284838 699247 646436 1223923 1850529 2201149 2198731 1643200 644513 3480 360718
39538 360718 1252145 1739662 1720023 1859877 2416628 2889893 2804906 2192888 1322553 552081
39528 552081 399189 1117431 2151077 2578331 2159881 1430342 755489 -43552 -989387
39519 -989387 -1567275 -1423370 -940161 -678966 -599120 -269276 384760 984096 1238925 1214388
39509 1214388 1101798 1047004 1199594 1637057 2188318 2558982 2672377 2682099 2645917 2467282
39499 2467282 2209652 2122254 2199315 2082096 1658906 1377017 1586304 2024189 2554357 3921461
39489 3921461 6684744 9523243 9982922 7435374 4138960 2545088 2543130 2417584 1613611
39480 1613611 1061936 1231314 1506892 1534618 1686866 1904735 1454629 322041 -401555
39471 -401555 -140645 302882 213229 130732 618044 916850 88153 -1223935 -1503488 -453131
39461 -453131 856182 1666816 2119694 2242619 1649847 515080 -231801 -106386 338233
39452 338233 483962 454010 540174 540601 202001 -228437 -437889 -596681 -932164 -1130800
39442 -1130800 -777639 -165439 -30061 -509139 -914220 -647628 78030 614000 670247 535271
39432 535271 681613 1314879 2185266 2711308 2424172 1478437 655906 651122 1328556 1865469
39422 1865469 1696064 1137877 940620 1353077 1862139 1819859 1091605 45900 -829521
39413 -829521 -1128943 -596030 614547 1730595 1830597 823479 -228622 -131566 1123883
39404 1123883 2406758 2807574 2492707 2056357 1636970 1200092 1203326 2115867 3379471
39395 3379471 3712118 2631677 1004210 -94821 -375071 -12641 805601 1588106 1591967
39386 1591967 800744 240500 712498 1764358 2479241 2645135 2503776 2050738 1388879
39377 1388879 1118263 1492759 1814993 1565536 1402031 1994255 2688135 2619166 2346689 2896478
39367 2896478 4083625 5654201 9068234 15361378 21560710 22548744 17355303 10731753
39359 10731753 7184674 6123254 4640877 2449421 1366372 1650610 1843250 1544711
39351 1544711 1749574 2604912 2990530 2379063 1383817 449369 -459646 -916438 -311645
39342 -311645 854425 1330216 841703 221845 -158271 -741787 -1474152 -1495859 -492414
39333 -492414 731521 1365395 1413270 1209252 935045 760782 743284 578688 128851 -40483
39323 -40483 517591 1128026 906219 360116 736009 1870177 2190362 1084815 -165153
39314 -165153 -309436 266525 526368 370654 475301 1162579 2026406 2342011 1657856 402041
39304 402041 -167310 727169 2208932 2663442 1724696 461586 -281423 -629190 -756659
39295 -756659 -439027 220648 674060 816908 1057727 1366904 1288807 978973 1042676 1241395
39285 1241395 737154 -157385 -52137 1205428 1930365 1127625 57688 189737 998248
39276 998248 1135211 635959 435024 504696 52502 -854371 -1282218 -890154 -246095 227419
39266 227419 638314 980018 937273 418198 -259827 -707951 -693159 -287454 -41074 -528448
39256 -528448 -1402878 -1528042 -484356 755726 1196658 1097581 1182630 1351303 1108882 693345
39246 693345 756692 1277655 1699161 1877985 2091227 2350636 2443745 2406551 2320946 1987572
39236 1987572 1423062 1227806 1748281 2349125 2288133 1812659 1548085 1364780 884092 603699
39226 603699 1289506 2539272 3209900 3127872 3101459 3280501 2896694 1859774 1236743 1599632
39216 1599632 2062686 1689732 923727 767294 1216459 1427528 1086735 753503 892032
39207 892032 1242159 1331686 1195558 1278696 1725597 2064092 1806462 1235854 1179827 1874102
39197 1874102 2508696 2262311 1409344 912400 1202580 1911353 2567337 2907274 2644249
39188 2644249 1681684 616538 339638 959158 1694903 1984366 2067843 2261431 2349242 2131695
39178 2131695 1970016 2187232 2385478 2069209 1654031 2045484 3280080 4392944 4731247
39169 4731247 4584787 4324970 3917330 3770696 4901000 7279969 9289406 10581804 14385211
39160 14385211 23891511 35976042 41881922 36366688 24030387 14010544 10016783 8640522
39152 8640522 6313960 3792508 3104603 3771008 4085064 3835369 3705693 3511558 2866735
39143 2866735 2437544 2870576 3423401 3218902 3041857 4299953 6709370 8434721 8265525
39134 8265525 6595945 4584865 3234319 2882481 2846819 2075515 730576 300320 1482780
39125 1482780 3039414 3655703 3768463 4385085 5247476 5572083 5570518 5687282 5277007 3734410
39115 3734410 2111996 1791961 2223865 1882682 906751 721866 1388191 1502810 746608
39106 746608 420963 1149298 1948270 2044582 1917745 2001142 1863214 1266009 748989 656567
39096 656567 717562 917153 1633060 2661485 3303012 3602853 4219891 4881313 4411513 2676679
39086 2676679 1107246 784891 1266559 1763720 2196338 2529635 2317144 1568180 1011785
39077 1011785 934577 781286 381115 430478 1167489 1678124 1235611 387268 25715 222390
39067 222390 608741 1108177 1657051 1898422 1736071 1628286 1915707 2395130 2817573 3247669
39057 3247669 3813088 4673044 6092461 7751902 8301610 6802381 4434898 3347486 3800708
39048 3800708 4032571 3121920 2186829 2184999 2314672 1594960 580989 350379 846272 1266783
39038 1266783 1260714 915810 388832 225066 1116487 2657895 3327923 2471519 1358335
39029 1358335 1458392 2536344 3292592 3124587 2429820 1798711 1618336 1926455 2137348
39020 2137348 1499681 176929 -850313 -1200507 -1461135 -1846323 -1622840 -408948 1021643
39011 1021643 1858760 2230659 2496072 2523266 2261824 2121106 2220454 2118362 1728612 1592318
39001 1592318 1859812 1981678 1742954 1554319 1453474 1003132 421980 470162 943623 804701
38991 804701 155386 355548 1621492 2334206 1566895 535224 523342 1036044 1146510
38982 1146510 1120017 1458409 1710180 1452922 1240253 1499790 1700610 1557604 1753018 2544404
38972 2544404 3028487 2672185 2141021 1829173 1224846 526165 937206 2355140 2875181
38963 2875181 1832287 1103896 1865654 2361917 849343 -1363993 -2027406 -1244269 -401578
38954 -401578 457921 1772592 2494014 1529387 10755 -218785 625702 1123376 1137654
38945 1137654 1349074 1477720 1119015 1184092 2355539 3319353 2738133 1721025 2015630
38936 2015630 3039433 3217637 3048075 4112534 6009823 7009206 6991140 7097235 7157499
38927 7157499 6129230 4596796 4316861 5600779 7258497 8555561 9247486 8626137 6725398
38918 6725398 5438970 6130191 7232469 6602252 4965876 4381813 4625303 4100545 3168102
38909 3168102 3341696 4089818 3697627 2599845 2660236 3760222 4233012 4057614 4488086
38900 4488086 5150785 4680771 3617887 3515906 3879691 3204546 2244141 2841711 4321862
38891 4321862 4595475 4045738 4586338 5625898 4926900 2902874 2058600 2622736 2718283
38882 2718283 2344369 3049887 4149302 3566592 2047894 2174741 3582051 3633382 2426585
38873 2426585 2430529 3505104 3193749 1752463 1867906 3488956 3993936 3327063 3770894
38864 3770894 4892793 4214839 2602058 3151075 5019710 4581107 2446450 2628672 4836420
38855 4836420 4842029 2705515 2905747 5659125 6174471 3636059 2679029 4513717 5018502
38846 5018502 3296417 3421220 5840089 6058031 3809312 4057263 6893471 6677324 3412318
38837 3412318 3839247 8656154 10807972 9493571 12387142 20107095 23422352 20955424
38829 20955424 23332576 33287166 39486976 38124196 40787857 50944885 55407617 52459176
38821 52459176 62135624 90326344 114576373 135104513 204237118 352544491 505196677
38814 505196677 537199179 419310116 253921563 149869605 113639826 90286039 59528030
38807 59528030 42725999 45180505 45489210 35513948 29429669 32063236 30410944 19899010
38799 19899010 12522024 14102501 15400190 10843013 7232052 8607827 8907635 5060616
38791 5060616 3089507 5897810 7519687 4548271 2117810 3738693 5240085 3406678
38783 3406678 1583966 2363754 2906561 1580267 1698973 4834710 7352965 7192218 7682128
38774 7682128 11277793 15419648 17589906 18801108 19476877 17803581 15057568 16654282
38766 16654282 24235164 31614649 32245875 26766260 20123362 15078329 11661623 9746061
38758 9746061 8956583 8107780 6837980 6070800 5908611 5267090 4141890 3756100 4119775
38749 4119775 4013863 3469613 3597378 4158454 4094671 3972607 4929102 5953174 5443384
38740 5443384 4531997 5421770 7500764 8682566 9260834 10661475 12028713 12071368 12257732
38731 12257732 13932639 15037688 14513036 16192026 22372902 28639653 33642722 48104067
38723 48104067 80351232 115117276 123305406 96724439 58931019 35702150 28113063
38716 28113063 22875008 15966349 12936435 14134566 13815667 10928664 9562330 10120316
38708 10120316 9252850 7415559 8198170 10793143 10621083 7168278 4483873 4040909 3341768
38699 3341768 1637026 1147956 2232053 2600719 1807207 1822454 2840396 2898193 1879060
38690 1879060 1723403 2524957 2431055 1482288 1583397 2577323 2283535 631418 -72306
38681 -72306 729274 1155505 655452 827462 1984639 2362365 1379872 514729 345420 -258351
38671 -258351 -1456222 -1853322 -1117948 -453394 -95058 907841 2118608 1807690 81707
38662 81707 -872050 -191508 685771 919988 1395409 2336846 2487074 1474502 610215 606731
38652 606731 738945 789199 1481598 2462736 2267378 910307 149464 563143 766684 182445
38642 182445 96219 1124212 2061877 2210107 2488098 3184175 2936719 1214759 -324202
38633 -324202 -307417 410318 547405 329088 344256 194412 -384717 -596507 -43773 314195
38623 314195 -174844 -653516 -338671 115080 -16993 -190990 189770 544307 302732 71777
38613 71777 411827 663419 229731 -123374 460231 1383571 1598890 1219633 907715 579889
38603 579889 10051 -142493 702057 1728124 1769999 1172199 1226161 2062910 2473114 1805168
38593 1805168 846432 581845 960961 1242028 1008540 509263 220700 275848 342071 83075
38583 83075 -379538 -678830 -730406 -693152 -546799 -176884 231803 421587 592392 1120858
38573 1120858 1803529 1992974 1503420 845770 571339 834450 1486787 2160555 2448561
38564 2448561 2381469 2410011 2695219 3146517 4429382 7571088 11670178 13570323 11479752
38555 11479752 7675597 5629790 5541323 5085558 3654325 2856485 3083905 2802212 1716849
38546 1716849 1584031 2908042 3649888 2554891 1227155 1308099 1883222 1525538 912617
38537 912617 1339830 2203156 2093898 1273804 1063716 1562474 1745242 1248558 560354 -48961
38527 -48961 -529633 -550216 -81579 158754 -183252 -323610 362875 1160629 1158517 674336
38517 674336 476445 488151 327390 206390 241358 -127688 -942847 -1065951 85497 1286572
38507 1286572 1295386 689883 460246 71606 -1242666 -2386000 -1728541 184703 1347957
38498 1347957 1241130 1050015 1290979 1250873 712424 364938 423387 451544 547633 1172896
38488 1172896 1894596 1844388 1300029 1250143 1585042 1409382 955257 1293643 2182550 2216887
38478 2216887 1301277 922961 1559763 1859703 1052169 232768 395294 970215 1274867
38469 1274867 1719802 2497870 2725983 2204024 2537872 4926482 7935282 9106168 8052556
38460 8052556 6450682 5500492 4885666 4018460 2969887 2056553 1411839 1075220 964895
38451 964895 872710 866617 1307830 2040736 2175451 1322480 411063 439812 989424 1001939
38441 1001939 580248 768772 1723013 2474901 2755587 3698487 5946156 8013947 7692393
38432 7692393 4831181 1742114 650213 1449186 2376968 2358998 1917377 1860165 1994120
38423 1994120 1687646 1128787 1144151 1867005 2429068 2179907 1495060 1002577 641660 66739
38413 66739 -454067 -272427 613253 1392448 1423141 952203 672668 833362 1008069 663076
38403 663076 -198174 -1004705 -1223471 -917996 -576148 -432032 -244612 130117 284884 -234430
38393 -234430 -1109794 -1426212 -786913 157365 563823 440641 399819 581913 438961 -346284
38383 -346284 -1328090 -1956353 -2228053 -2271735 -1806886 -653703 589915 1153272 1193885 1501365
38373 1501365 2182605 2508301 2139866 1607355 1316410 934975 158982 -653328 -1037738
38364 -1037738 -976956 -567813 157448 773518 682235 193030 413515 1505397 2112497 1315852
38354 1315852 91937 -203834 204848 334696 302129 802722 1366702 878286 -396724
38345 -396724 -985126 -445698 120545 -2305 -182283 199710 727327 815982 557692 217521
38335 217521 -221487 -619335 -607005 -259833 -67295 -57311 201595 618625 574126 36285
38325 36285 -347455 -428899 -703893 -1085701 -797704 151060 678570 328422 -3758 363432
38315 363432 873129 986219 1199559 1930895 2539983 2416521 1995045 1744458 1221739 152449
38305 152449 -646244 -592340 -533193 -1304065 -2088674 -1707001 -683186 -391655 -799254 -769057
38295 -769057 -140127 245001 267830 495792 597498 -312962 -1699842 -1931988 -933969 -573004
38285 -573004 -1733739 -2866674 -2474197 -1380174 -1157579 -1617024 -1477438 -677336 -322703
38276 -322703 -697455 -892827 -449027 -37101 -199216 -459637 -183720 403394 609080 269405
38266 269405 -128935 -118717 333590 993307 1599439 1873496 1542107 610252 -402413 -775124
38256 -775124 -341008 225798 154715 -466668 -814139 -397632 388699 914202 1098179 1245859
38246 1245859 1405859 1328764 976030 663056 630802 789346 1023556 1483192 2296240 3108545
38236 3108545 3250707 2489962 1407782 818209 894079 1083882 873286 385222 123985
38227 123985 286324 483315 148518 -787595 -1636778 -1524701 -389122 751738 821224
38218 821224 -131148 -1123573 -1501589 -1462004 -1303273 -851351 41522 1004850 1610968 1870318
38208 1870318 1809041 1067674 -408935 -1682592 -1692729 -715404 -116929 -558788 -1232410
38199 -1232410 -1160262 -556607 -379390 -963574 -1685647 -1848745 -1415753 -807427 -318040 62334
38189 62334 375001 489881 280570 -126776 -473431 -696365 -908198 -1066404 -982736 -713006
38179 -713006 -524351 -318121 394290 1558585 2128357 1209109 -601145 -1718245 -1371935
38170 -1371935 -278844 478249 566880 239672 -289425 -892887 -1337898 -1455351 -1342774
38161 -1342774 -1163722 -891971 -425077 180421 710018 927697 700202 168050 -204732
38152 -204732 -2288 652531 1187416 1207052 825072 364868 2897 -235365 -409835 -704089
38142 -704089 -1271807 -1907657 -2089996 -1519846 -504716 272564 284027 -467749 -1358301 -1475281
38132 -1475281 -421200 1105815 1860273 1343567 271960 -391391 -499397 -515217 -599569
38123 -599569 -453219 3213 374806 444366 643873 1442158 2469024 2793988 2152734 1373901
38113 1373901 1265774 1512393 1225387 337404 -280464 -115955 314373 368133 191690 277556
38103 277556 634258 960108 1267627 1732932 2153602 2117886 1581891 834515 76909 -533722
38093 -533722 -694635 -343048 14147 -74645 -301854 -151682 128191 -94914 -668803 -783884
38083 -783884 -265144 191867 191338 98238 86990 -300734 -1195179 -1864349 -1748949 -1338550
38073 -1338550 -1366359 -1703269 -1750276 -1503162 -1508887 -1988845 -2598047 -2921349 -2767615 -2133278
38063 -2133278 -1259747 -569499 -233856 13650 410221 807912 1029987 1206800 1429314
38054 1429314 1442495 1063790 562232 237210 -23148 -353570 -465075 -82470 494787 793029
38044 793029 863482 1073687 1447685 1729227 1877620 1984369 1907785 1503436 996155 596917
38034 596917 18774 -993246 -1886753 -1820440 -894397 -127321 -168997 -712932 -1238255 -1595306
38024 -1595306 -1662513 -1145242 -116350 745154 871139 460267 134251 203398 494829 661943
38014 661943 463012 -76096 -634556 -867577 -720967 -325463 273282 953848 1259569 815521
38004 815521 -29867 -520698 -467768 -321648 -231017 231088 1146056 1806564 1689360 1277728
37994 1277728 1316377 1688105 1674640 1040792 227412 -355918 -648310 -675014 -524741 -499817
37984 -499817 -738575 -762512 -14684 1142486 1657282 1203860 683972 912718 1397878 1085731
37974 1085731 1867 -642958 -73401 963776 1103543 9572 -1323060 -1819239 -1452993
37965 -1452993 -987109 -908926 -982965 -800872 -381747 -18040 223989 509095 818224 910756
37955 910756 783877 795322 1077848 1135320 435963 -719339 -1387291 -1097463 -371358 8128
37945 8128 -149531 -544245 -938313 -1214574 -1168243 -723060 -216833 -14315 51221 340804
37935 340804 611545 240992 -636287 -969206 -184755 867409 964648 88249 -733546 -907069
37925 -907069 -816898 -882314 -851847 -385583 190456 228306 -324501 -792351 -612572 -25651
37915 -25651 276665 96102 10526 513874 1126328 872591 -308713 -1242602 -982534 -89054
37905 -89054 177083 -385654 -766105 -303017 433901 585756 126119 -408417 -779744 -1062701
37895 -1062701 -1110924 -640979 180612 725543 593265 26006 -434162 -469073 -108829 432649
37885 432649 909147 1153986 1166302 1058917 901076 694238 528288 622545 1065174 1558467
37875 1558467 1613714 1087021 396890 75447 188797 370173 348344 178788 -50487 -400345
37865 -400345 -809706 -950104 -627779 -127938 134466 145869 162427 197936 44959 -237557
37855 -237557 -285087 35104 399346 480342 336485 191244 83905 -44400 -99232 73795
37845 73795 383373 478405 109961 -558776 -1086661 -1227778 -1191335 -1317392 -1586920 -1712230
37835 -1712230 -1680685 -1791682 -2014780 -1802200 -907650 25149 196784 -334942 -918152 -1274936
37825 -1274936 -1527429 -1497370 -837429 150567 692036 684081 840654 1454507 1865969 1585896
37815 1585896 1154566 1284543 1777088 1951679 1671114 1278554 899882 468793 151279
37806 151279 104333 32664 -406355 -921944 -882869 -170263 755498 1479059 1828979 1661419
37796 1661419 1034491 476403 488191 834528 879427 562923 451334 816828 1266809 1376947
37786 1376947 1156756 780536 368471 167783 448413 1015382 1251169 869178 285359
37777 285359 40496 145503 197390 -63364 -466861 -592133 -242916 179010 7667 -756110
37767 -756110 -1215611 -745973 -17598 -127121 -946096 -1266390 -598804 172881 188370 -310756
37757 -310756 -757323 -1188002 -1695168 -1719866 -811086 373632 758681 307979 -82710 -48932
37747 -48932 -197786 -912392 -1537389 -1252055 -287540 293199 -103653 -1005164 -1668141 -2053177
37737 -2053177 -2586066 -3102748 -2706766 -1044295 814306 1488845 1062467 916794 1792800
37728 1792800 2911770 3277823 2961421 2581389 2287464 1951846 1799498 2106577 2650720
37719 2650720 3080437 3427205 3651421 3194073 1771951 205995 -416393 -103405 378166
37710 378166 857988 1722559 2706965 2918809 2186309 1319734 825854 379590 -163196 -297645
37700 -297645 120177 368622 -19078 -431634 -124715 686324 1309306 1529888 1443994 934273
37690 934273 41368 -610644 -490435 68371 377064 317658 190528 63184 -81410 45378
37680 45378 564657 917759 565999 -114783 -398112 -332087 -435841 -568233 -135862 676612
37670 676612 991813 683001 669493 1441647 2247810 2246269 1672127 1258416 1102492 756191
37660 756191 64806 -668759 -1176384 -1476165 -1728109 -2024519 -2185209 -1783949 -726349
37651 -726349 268773 346668 -278625 -497812 149546 905240 1076300 967729 948410 516777
37641 516777 -747603 -1987327 -1988446 -954686 -208108 -254960 -306906 201677 778289 891311
37631 891311 801453 844825 723681 157068 -404705 -400021 -20827 190043 212831 359671
37621 359671 530885 372373 -27311 -306434 -555899 -1099986 -1579432 -1146939 157467
37612 157467 1052156 567654 -647738 -1209329 -749991 -82933 102202 -131298 -622176
37603 -622176 -1520679 -2689696 -3340813 -2824361 -1492844 -339151 43665 -192082 -606699
37594 -606699 -854104 -756774 -456336 -435937 -949436 -1438673 -1025420 273093 1297604 1030395
37584 1030395 -184951 -1056318 -802159 127660 710775 427507 -368009 -951380 -971561
37575 -971561 -685602 -492677 -391463 -113659 265619 232024 -458958 -1276505 -1469234 -1004962
37565 -1004962 -585609 -692089 -961429 -730898 2768 514171 290612 -275637 -436063
37556 -436063 -160347 -156746 -694073 -980730 -237658 985368 1331276 428170 -631948 -829542
37546 -829542 -488888 -536991 -1084244 -1430749 -1186066 -676989 -282837 33563 388714 589699
37536 589699 324616 -398217 -1120390 -1249942 -595427 385220 1040932 1261047 1453952 1718287
37526 1718287 1517470 509120 -731869 -1312654 -1060984 -474312 92767 594426 828544
37517 828544 498164 -207971 -642956 -421551 262012 1001211 1445860 1321334 737840 418093
37507 418093 956550 1793587 1623977 31369 -1915419 -2941758 -2815627 -2034414 -994749
37498 -994749 -30265 316030 -159425 -735090 -430975 747923 1755953 1732152 841018
37489 841018 -200172 -1004073 -1619225 -1958400 -1565765 -206320 1477413 2327769 1870616
37480 1870616 826534 156105 -36892 -204637 -362141 -172409 137227 -125756 -968469
37471 -968469 -1561562 -1551851 -1631168 -2274604 -2757882 -2207132 -989655 -168638 -5268 63590
37461 63590 219405 25227 -609950 -1128305 -1173434 -1020120 -912797 -614659 37211 623763
37451 623763 608252 28269 -608683 -936403 -970140 -867252 -693844 -407667 65830 740732
37441 740732 1482657 2005006 2001164 1373497 414085 -323898 -521835 -430844 -476333 -575226
37431 -575226 -244280 535549 1073022 900239 520273 739059 1505014 1942185 1489887 591934
37421 591934 188959 741648 1758266 2205373 1528149 313225 -345161 -182890 20092
37412 20092 -269550 -526323 -139875 447962 356055 -414470 -1115007 -1406262 -1481301 -1251626
37402 -1251626 -462983 360508 194742 -934993 -1649251 -991799 245204 599597 -214273
37393 -214273 -1197377 -1437198 -927903 -174247 437915 792274 895669 731122 233923 -535035
37383 -535035 -1230910 -1459628 -1232156 -987809 -1100080 -1516902 -1881081 -1816661 -1170694 -243890
37373 -243890 309899 173585 -113712 235113 1148342 1716423 1418460 792943 628017 914113
37363 914113 963150 348021 -573273 -1015867 -553811 402896 987971 844408 497814 548319
37353 548319 836302 839569 536974 254030 -26090 -395797 -337049 658755 1843585 1764069
37343 1764069 282244 -1108948 -1371738 -1130415 -1196274 -1135987 -322177 589658 514492 -324613
37333 -324613 -762552 -454691 -96294 -82306 -136181 -279812 -998748 -2136962 -2607894 -1731976
37323 -1731976 -220641 672622 544845 -55831 -581760 -1007651 -1442914 -1671833 -1387808
37314 -1387808 -807234 -664948 -1305804 -2035283 -1898194 -1020960 -494921 -801541 -1149350
37305 -1149350 -782107 -178040 -263420 -998894 -1550529 -1531324 -1307031 -1259925 -1419096 -1680231
37295 -1680231 -1816510 -1446094 -534609 283982 428534 149699 31993 66874 -97408 -326501
37285 -326501 -235852 -11162 -129424 -410247 -214718 482890 1054171 1180780 1046077 683856
37275 683856 31275 -494720 -484356 -499655 -1387307 -2635383 -2782394 -1704960 -1020614 -1637873
37265 -1637873 -2357414 -1835857 -652951 -187400 -418490 -274802 428009 850725 694069
37256 694069 572348 806017 1002125 1027333 1385092 2273347 3079367 3244488 3009036 2842595
37246 2842595 2636725 2023169 1221440 961296 1488437 2075203 1821630 798495 34629
37237 34629 261606 1000603 1222900 694191 157788 203616 510283 400748 -300993 -1222464
37227 -1222464 -1877100 -1895008 -1191914 -220491 247214 -93143 -716534 -898702 -447124 347870
37217 347870 1105954 1471084 1262882 839910 908879 1605876 2172073 1961069 1347317 1107965
37207 1107965 1281970 1284855 895285 429864 60199 -343906 -679694 -582749 -77808 300520
37197 300520 256346 148199 396958 844937 1033166 906534 899062 1315296 1845859 1840684
37187 1840684 1055478 1093 -567822 -422549 71907 547983 934043 1170218 1104900
37178 1104900 852365 804340 1012622 977887 382710 -376356 -785058 -933222 -1146393 -1251494
37168 -1251494 -805178 158310 1160208 1871275 2141134 1690670 488967 -663510 -714145
37159 -714145 336576 1341862 1398531 745757 55947 -546245 -1287594 -1975798 -2032186 -1290262
37149 -1290262 -359780 4309 -221486 -296691 334475 1224703 1357481 376107 -1025260
37140 -1025260 -2028292 -2486682 -2531918 -2016750 -979388 -218112 -551298 -1584152 -1964334
37131 -1964334 -985336 618125 1593023 1434130 633304 52103 137191 507997 380805
37122 380805 -389285 -991907 -774366 -244594 -281743 -697907 -524025 385703 1077231 978635
37112 978635 653283 689146 726913 182624 -702230 -1155265 -828219 11432 909677 1456063
37102 1456063 1381033 775171 37577 -527809 -815719 -659359 39865 874861 1186608 857834
37092 857834 303899 -313568 -1088626 -1543911 -848811 760406 1803583 1398726 366124
37083 366124 -171078 -316076 -632964 -792813 -227717 481000 244360 -748452 -1167150 -457985
37073 -457985 507858 828894 614251 406392 410867 559708 666002 365836 -432838 -989142
37063 -989142 -409622 970689 1744160 1252778 408670 263030 578402 498032 9757 -110079
37053 -110079 445245 1080811 1148373 687871 205453 63223 235057 475804 593183 589485
37043 589485 598152 736538 1047453 1486630 1864149 1916445 1608516 1252051 1115222 1051132
37033 1051132 790810 460989 421987 654455 749525 549736 364700 420261 486176 255313
37023 255313 -203310 -569482 -628347 -366302 56034 297727 49465 -582494 -1094741 -1129174
37013 -1129174 -827238 -535995 -355305 -119035 323688 945411 1566766 1976115 2115508
37004 2115508 2163483 2305254 2423590 2193512 1527202 774088 405646 561630 912201 945133
36994 945133 474228 -104895 -214008 234797 822590 1294951 1783172 2180296 1920296 860734
36984 860734 -173810 -404646 -183939 -254483 -361616 315634 1551543 2129756 1629159
36975 1629159 945686 700538 334627 -598342 -1337383 -1021476 -108212 291297 -2049
36966 -2049 -217025 129384 784588 1338501 1563713 1358659 928026 794626 1095918 1178071
36956 1178071 500107 -378468 -438493 384812 1180277 1345221 1163168 1131080 1407820 1962321
36946 1962321 2604158 2778568 1972122 514841 -531899 -482132 356087 1230149 1681509
36937 1681509 1674954 1452570 1397080 1687964 2031629 2067594 1991468 2311670 3000971 3430091
36927 3430091 3226332 2673847 2152868 1739689 1541211 1836402 2553479 3084113 2994093 2549197
36917 2549197 2195249 1889881 1366650 780124 626936 1132508 2052554 3006130 3754229
36908 3754229 4241546 4585926 4967319 5415903 5849542 6365491 7171335 8075444 8500712
36899 8500712 8404341 8773023 10544455 13211126 15258088 16066187 16594461 17831616 19343141
36890 19343141 20067483 20015843 20188970 20951527 21543995 21404451 20933362 20440423 19350480
36881 19350480 17366261 15604532 15298981 15789413 15226002 13242684 11480417 11142555 11446876
36872 11446876 11153868 10338353 9688787 9110887 8187728 7258075 6838592 6534518 5710748
36863 5710748 4806079 4761268 5433943 5793615 5511752 5158956 4927887 4402975 3636022 3221551
36853 3221551 3126151 2599276 1500117 618148 386017 346948 224341 420753 1029294 1432943
36843 1432943 1420535 1668986 2489529 3070736 2714116 1980736 1810203 2188734 2467541 2417574
36833 2417574 2219038 1886020 1396411 1025581 997169 1128393 1182095 1147541 941137 427662
36823 427662 -54044 52170 524267 576488 349591 975295 2594251 3631427 2979153
36814 2979153 1719284 1517749 2298223 2772875 2456097 1823574 1125962 367096 -39123
36805 -39123 188514 461072 220659 -10743 386204 833942 585234 297660 995599 2079821
36795 2079821 2150708 1391949 1233698 1851495 1981376 1257435 737093 828194 651948 -39562
36785 -39562 -198766 568214 1143635 830816 502585 841403 986864 133443 -868284 -868362
36775 -868362 -333223 -511144 -1431728 -2072890 -2021177 -1746388 -1538469 -1258661 -979328 -919098
36765 -919098 -782575 14439 1335257 2134745 1550878 -44817 -1301713 -1279187 -525164
36756 -525164 -442063 -1439094 -2277488 -1723998 -212857 940068 1363409 1566899 1561928 944535
36746 944535 132003 46302 566599 703013 335062 320689 819896 1064786 930745 1112500
36736 1112500 1554551 1431685 928440 1166689 2015410 1997109 906290 406686 1289189
36727 1289189 2270247 2403000 2524049 3273229 3838554 3805860 4092583 4883757 4909133 3980429
36717 3980429 3824537 5141302 6490592 7369749 9236286 11924180 12764008 11388165 11298446
36708 11298446 13991027 16256235 16849267 20307317 29139131 38742650 47995802 68166549
36700 68166549 107990159 151731968 167436091 142003460 96697158 61597410 44869123
36693 44869123 35317550 25368421 18286804 16435604 15589556 12766307 10663028 11393479
36685 11393479 12224274 10440944 7633706 6398274 6409047 6163938 5745816 5716006 5499330
36676 5499330 4649746 3970729 4046000 4191710 3828667 3390153 3112165 2447582 1405056
36667 1405056 1067182 2137734 4162959 6475728 8575024 9466160 8275349 5838054
36659 5838054 4085948 3534774 2970206 1856772 1192956 1463281 1638987 1058802 628449
36650 628449 1165630 1997291 2227891 2163080 2459954 2901362 2935771 2560461 1956817 1146386
36640 1146386 571186 952426 1956916 2151507 1020565 -114094 -28356 662817 670617
36631 670617 -74577 -771789 -1123495 -1238466 -903006 -137431 81436 -1117228 -3001679
36622 -3001679 -3893989 -3197384 -1857023 -897789 -388229 68406 572518 951142 1143322
36613 1143322 1282796 1433148 1301915 423609 -1064341 -2032593 -1404066 364671 1591672
36604 1591672 1403334 710475 758620 1459806 1811867 1426436 876875 760255 1044289 1306759
36594 1306759 1224882 827038 445266 374860 588158 953655 1574690 2503336 3262769 3232337
36584 3232337 2474512 1606110 943216 461085 439053 1168208 1998828 1808800 692225
36575 692225 59103 617125 1371035 1233788 536920 128873 -38016 -424090 -796283 -692611
36565 -692611 -449408 -715806 -1297297 -1430853 -975357 -504468 -401753 -571459 -857355 -1116442
36555 -1116442 -1073530 -655287 -242408 -132445 -90067 134732 319365 301622 417226 776964
36545 776964 754723 29137 -464649 316998 1794024 2292863 1199475 -400324 -1215561
36536 -1215561 -1000298 -284379 309915 353781 -113599 -481558 -240826 297437 465063 226481
36526 226481 76546 156400 200210 198125 319205 295268 -249004 -882184 -704195 287928
36516 287928 1051155 914719 311630 -169941 -620615 -1262362 -1792940 -1853200 -1686428 -1812733
36506 -1812733 -2309813 -2751902 -2634037 -1694812 -179205 1035791 1010965 -240067 -1601653
36497 -1601653 -1990684 -1386159 -519275 132047 674934 1286866 1762335 1722470 1191660 788968
36487 788968 1125738 1992063 2467816 2038522 1239319 835017 739146 327063 -425994 -855796
36477 -855796 -648924 -264439 -152245 -160867 7543 243978 255558 3059 -342663 -605630
36467 -605630 -579376 -102214 610979 954496 495624 -558161 -1563195 -1969406 -1609338
36458 -1609338 -706482 243204 737659 590924 29198 -511066 -693883 -532011 -379967
36449 -379967 -520111 -748764 -679268 -477380 -745122 -1423807 -1490938 -353532 1023971 1252069
36439 1252069 440038 -21066 472255 955999 458328 -603323 -1130709 -800807 -195685
36430 -195685 138266 172254 87666 -37919 -187005 -277512 -166345 228427 779457 1191372
36420 1191372 1292201 1189628 1026089 764315 408849 212266 370175 703536 944558
36411 944558 1130375 1404285 1692778 1945238 2381211 3046831 3453579 3205852 2681360 2471154
36401 2471154 2435838 2012632 1193732 425713 -229539 -964932 -1437982 -1094427 -261127 65727
36391 65727 -388267 -921464 -1063107 -1036040 -894195 -319384 416092 416523 -414911 -972209
36381 -972209 -567996 35058 -63688 -494781 -421346 13935 68142 -273160 -346022 79833
36371 79833 612735 1028094 1494362 2036044 2363360 2278682 1881486 1412643 1145322 1266765
36361 1266765 1629612 1817124 1636577 1298048 1001778 732242 569351 694020 900841
36352 900841 675357 17495 -393920 -156538 338400 662303 957797 1394878 1705713 1744120
36342 1744120 1844693 2109553 2024684 1363775 766962 763302 939214 828534 864528 1490701
36332 1490701 2009904 1490271 370030 -81207 302751 407340 -377606 -1309613 -1481659
36323 -1481659 -991631 -597425 -782459 -1378362 -1727023 -1232698 -142583 437732 -153868
36314 -153868 -1095512 -1050672 44787 999594 1065917 706185 584451 691280 755358 785712
36304 785712 838405 803662 752026 1007805 1551084 1764141 1155117 94275 -500291 -141616
36294 -141616 736581 1263849 1048645 544169 419871 728209 1038755 1277656 1801605 2530658
36284 2530658 2764992 2222976 1540540 1276282 1165448 905053 810118 928789 443702 -962707
36274 -962707 -1995184 -1378783 20227 285492 -695235 -1173610 -293901 835112 1111738
36265 1111738 848974 654344 367100 -131460 -277330 178666 549379 360541 154124
36256 154124 346396 265000 -672569 -1631074 -1380842 -176541 516433 -7299 -950605 -1220746
36246 -1220746 -590572 442728 1336766 1818843 1875745 1658528 1346409 1072662 926026
36237 926026 889536 848779 852835 1192723 1887134 2327587 1967374 1181211 792811 900488
36227 900488 951329 872244 1160649 1786213 2050679 1793982 1711377 2113668 2409225 2269274
36217 2269274 2224576 2506090 2403623 1573387 907191 1094587 1304894 525122 -611630
36208 -611630 -773346 -150235 -128343 -899248 -1014796 332436 1923913 2086996 783087
36199 783087 -574864 -887486 -351521 83681 -216317 -1052254 -1753483 -1956713 -1887611 -1851420
36189 -1851420 -1772750 -1472177 -1074465 -789525 -555669 -281589 -184188 -456918 -821242 -851944
36179 -851944 -569899 -295094 -109941 92523 228634 171469 113910 302135 545885 479892
36169 479892 196367 121533 340510 532909 534914 483022 396419 85505 -432763 -798494
36159 -798494 -719128 -307778 33694 -44977 -526789 -930264 -706368 128888 998573 1515926
36149 1515926 1833888 2036207 1728241 723470 -289550 -393751 442974 1410307 1830351
36140 1830351 1645984 1164741 787237 791702 969655 730137 -32815 -554238 -194169 582625
36130 582625 848632 455785 -67710 -474524 -794362 -681888 210111 1294469 1516680
36121 1516680 855372 400603 744258 1231202 1151599 798449 799941 1061120 991294 411675
36111 411675 -275120 -631033 -569366 -327196 -232504 -398675 -625168 -702787 -643465 -391026
36101 -391026 358399 1592064 2562892 2570100 1923757 1436732 1202475 744078 204050 304848
36091 304848 1033853 1452711 1103509 589455 388091 137581 -349621 -400359 394281 1217497
36081 1217497 1117195 421209 107356 244338 65380 -683247 -1439963 -1773680 -1766146 -1472050
36071 -1472050 -825165 -165355 -61855 -374630 -195768 889787 2040908 2164497 1346322
36062 1346322 722529 1008912 1667034 1681417 790344 -376209 -1183613 -1566631 -1671231
36053 -1671231 -1402782 -685858 87772 300846 -253543 -1260867 -2278723 -2921823 -2851578
36044 -2851578 -2076929 -1210876 -934776 -1198951 -1411178 -1360702 -1349494 -1372850 -914954 136347
36034 136347 1012971 978082 294558 -166733 750 441153 599383 273386 -254579 -474277
36024 -474277 -210637 38731 -354940 -1271698 -1965274 -2099555 -2050620 -2020634 -1593693 -595933
36014 -595933 253619 144579 -807342 -1862574 -2554026 -2753458 -2291648 -1190910 -14946
36005 -14946 631339 777104 788269 719958 552018 709175 1534925 2407011 2252748 1022721
35995 1022721 -131345 -336353 77084 433675 776059 1479362 2257638 2300209 1378760
35986 1378760 250759 -248918 -171861 -209312 -658800 -1047135 -876131 -379219 -219304 -627686
35976 -627686 -1211480 -1516259 -1389238 -859166 -137186 257360 -71540 -716284 -797691 -199712
35966 -199712 148549 -396370 -1182373 -1150499 -271077 579640 885964 924271 1028230 1105109
35956 1105109 1014239 939220 1141194 1549946 1757480 1406736 614370 -50417 -204830 -189230
35946 -189230 -584956 -1241338 -1366453 -694326 126953 567330 869301 1253423 1305261 817905
35936 817905 465635 780181 1138121 768219 157986 266626 803883 677667 -61305 -223067
35926 -223067 479567 884998 283273 -506976 -609851 -458503 -880435 -1783643 -2630330 -3405160
35916 -3405160 -4150733 -4191398 -2909538 -980943 140274 -113163 -995139 -1556898 -1492715
35907 -1492715 -976259 -372319 -175866 -642243 -1330119 -1446482 -781552 6870 105727 -690780
35897 -690780 -1882985 -2660226 -2480155 -1580932 -874025 -1036013 -1776657 -2285554 -2234195 -1924182
35887 -1924182 -1610926 -1285223 -1137267 -1547928 -2348057 -2690686 -2117257 -1298503 -1155589
35878 -1155589 -1560775 -1570621 -812820 79271 489675 563476 641374 611192 348734 308534
35868 308534 961651 1862586 1995108 1051404 -232570 -1047785 -1208202 -811554 58682
35859 58682 981625 1218153 587949 -146209 -277166 -116021 -391595 -1054823 -1372595 -1036355
35849 -1036355 -487294 -138442 125898 554107 1077682 1401227 1272190 653762 -115263
35840 -115263 -423981 27888 833488 1351961 1405678 1179364 721130 66960 -399051 -400907
35830 -400907 -454102 -1304781 -2657866 -3294114 -2675858 -1660371 -1251642 -1344975 -1215886 -686033
35820 -686033 -193616 -63219 -276958 -750807 -1341286 -1720210 -1670083 -1415806 -1332354 -1448678
35810 -1448678 -1562592 -1680269 -1917596 -2038759 -1591966 -648930 8401 -213880 -835467
35801 -835467 -751799 358320 1483454 1477277 553264 49132 714285 1849019 2384233 2202778
35791 2202778 1891352 1665535 1232274 488595 -307211 -968235 -1420450 -1434521 -911457 -340995
35781 -340995 -348485 -826971 -1125103 -1022956 -843981 -662721 -205634 382845 485581 -76825
35771 -76825 -795734 -1309987 -1763987 -2160619 -2162436 -1812776 -1676381 -1947411 -2163628 -2075971
35761 -2075971 -1959846 -1763020 -935769 414786 1232306 1033973 733460 1138526 1593584
35752 1593584 1124724 94367 -445178 -387423 -344159 -311257 145440 721290 707140 320560
35742 320560 418807 933817 891015 109723 -392513 -27435 487613 374438 -74652 -214776
35732 -214776 -103777 -181665 -466630 -683743 -799418 -914666 -917723 -659990 -267455 17622
35722 17622 123921 115045 94653 242742 655718 1069038 1066558 645915 229125 43759 -115520
35711 -115520 -415025 -682272 -708454 -458539 133190 1110669 2024803 1999203 698936 -998046
35701 -998046 -1708387 -926541 486838 1202853 722907 -240726 -671470 -416815 -209010
35692 -209010 -554676 -1083657 -1230595 -1035855 -808359 -487513 -6339 121533 -548210 -1358478
35682 -1358478 -1134091 169632 1319951 1475786 1117589 1020861 1171990 1188366 1084032
35673 1084032 1002792 708830 -32674 -880475 -1235828 -936809 -291247 333962 653057 482855
35663 482855 -17630 -327443 -90429 463998 811589 695330 289016 -15883 66560 408362
35653 408362 539592 309913 293801 1019744 1939360 1907727 758225 -391076 -637167 -321550
35643 -321550 -197171 -324536 -337123 -191804 -41132 202865 618556 934438 907958 726938
35633 726938 666205 718571 879422 1306474 1834179 1891981 1351209 869704 893592 954233
35623 954233 565283 137956 214002 412444 98829 -390159 -272376 244540 199717 -538845
35613 -538845 -1030586 -700301 -48075 264051 182990 -83782 -404455 -483124 -6336 733248
35603 733248 1030032 803812 776547 1367438 2077799 2280507 2004550 1602487 1209140 884324
35593 884324 779650 814846 645264 240196 14981 129007 203161 38389 1289 286648
35583 286648 429109 98499 -211770 1066 218815 -460085 -1878586 -2858088 -2657842
35574 -2657842 -1666423 -590290 297361 862043 764378 -54829 -905607 -934008 -143400 571805
35564 571805 516609 30122 -12340 597925 1064169 600934 -513335 -1275664 -1221437 -871919
35554 -871919 -873888 -1214192 -1533585 -1729916 -1814118 -1545520 -795101 -72103 -24805 -398278
35544 -398278 -156314 1082534 2256537 1982002 225988 -1591890 -2130807 -1416416 -556341
35535 -556341 -467196 -1053930 -1500342 -1157380 -112946 999535 1637789 1760899 1684252 1686592
35525 1686592 1857580 2220122 2757920 3236906 3208705 2440594 1315489 585780 662113 1276068
35515 1276068 1866758 2118011 2054035 1837986 1662597 1686767 1854171 1834984 1335031 443450
35505 443450 -443173 -978499 -1044251 -696849 -105408 547700 1242610 2062791 2835948 3112811
35495 3112811 2791981 2460726 2619735 2779713 2013181 422055 -702465 -497631 333767
35486 333767 512469 -155666 -750287 -644421 -251839 -272870 -713808 -969855 -689622 -262538
35476 -262538 -349372 -1019405 -1598939 -1563279 -1339653 -1747653 -2702617 -3151265 -2541544 -1658745
35466 -1658745 -1454425 -1631175 -1194236 -57680 838489 942943 699783 607639 558597 437349
35456 437349 554968 958863 978557 117410 -1066394 -1636559 -1506328 -1338638 -1478670 -1677345
35446 -1677345 -1734239 -1703083 -1457593 -726770 309774 1026615 1107453 814087 410750 -112638
35436 -112638 -570472 -458336 333445 1162627 1383907 1072868 672817 364570 187360 305700
35426 305700 612207 498575 -296623 -947406 -455437 862554 1670547 1397389 816412
35417 816412 639504 462987 -352227 -1458687 -1905726 -1394978 -527513 33913 152701
35408 152701 56399 -21970 -46356 -201617 -615129 -1030452 -1106362 -1095098 -1609358 -2431089
35398 -2431089 -2328450 -735211 1065644 1436120 634030 374844 1282761 2121973 1830246
35389 1830246 989135 595802 513227 144121 -201474 156474 828463 751932 -56986 -385780
35379 -385780 297370 947614 459433 -772286 -1521913 -1396799 -1039375 -943711 -852348 -367958
35369 -367958 422538 1117570 1433322 1314292 889354 480577 454382 873007 1360185 1427369
35359 1427369 934449 228998 -129683 175780 948051 1650171 1883113 1630804 1039006
35350 1039006 194305 -698388 -1181666 -985941 -509085 -414245 -730671 -827052 -399096 45263
35340 45263 -10905 -301053 -281964 -72723 -253603 -881712 -1370492 -1383999 -1222737 -1145132
35330 -1145132 -913705 -388513 -78463 -531682 -1394890 -1670473 -962658 -4205 272355
35321 272355 -124221 -361006 78002 752406 898819 396079 -231446 -617085 -894610 -1196510
35311 -1196510 -1326512 -1192065 -1098569 -1216627 -1184328 -762731 -461855 -768569 -1071291 -352953
35301 -352953 1075040 1630186 556502 -1045688 -1799152 -1711185 -1531560 -1328635 -754956
35292 -754956 -170375 -307504 -989088 -1261489 -845946 -488607 -694081 -1009663 -910034 -638579
35282 -638579 -706892 -1105191 -1461288 -1573963 -1393666 -845152 -84572 359620 122504 -510864
35272 -510864 -1003938 -1253442 -1488757 -1651788 -1374657 -630930 8365 -20774 -657218 -1407419
35262 -1407419 -1967028 -2372878 -2621421 -2488166 -1848419 -933198 -100595 448493 574146
35253 574146 118947 -751927 -1395456 -1325804 -824519 -428360 -35028 783174 1714107 1877418
35243 1877418 1175370 505166 335216 99830 -506929 -749461 -155386 439846 206720
35234 206720 -222386 143447 875209 915857 547607 863737 1583157 1269739 -164625 -1051563
35224 -1051563 -551587 85851 -354584 -1207394 -1267413 -740386 -631263 -1049819 -1315607 -1197504
35214 -1197504 -1042671 -1073747 -1334643 -1885873 -2380156 -2010720 -630274 629993 653946
35205 653946 -233846 -894753 -903780 -626788 -291739 64536 105237 -374571 -777870 -404626
35195 -404626 346481 371137 -630822 -1850635 -2502000 -2481672 -1966213 -1148546 -428757 -170277
35185 -170277 -155663 184927 974879 1771311 2167634 2089169 1673229 1317698 1575358 2443324
35175 2443324 3038876 2589571 1458681 564796 160746 -58330 -53420 364880 707980 282657
35165 282657 -534370 -552164 561608 1770574 2007573 1249703 163388 -561780 -471287
35156 -471287 301890 929480 849777 643568 1037437 1363112 366933 -1521483 -2359204 -1480310
35146 -1480310 -492401 -781275 -1551652 -1406541 -586166 -323395 -876860 -1516369 -1829325
35137 -1829325 -1826550 -1269910 -92278 907086 942701 500029 571366 936701 512881 -655912
35127 -655912 -1165424 -342500 664619 535074 -397513 -773111 -111724 738959 888917
35118 888917 443386 120273 251045 454438 218556 -428726 -957217 -943980 -470597 35155
35108 35155 129432 -420628 -1394336 -2080116 -1902074 -1191015 -856646 -1117142 -1140611 -314830
35098 -314830 731275 974376 392924 -223129 -543804 -927573 -1466854 -1686953 -1392076
35089 -1392076 -1078424 -1151021 -1285256 -994676 -436998 -186453 -427009 -809445 -1001932 -965106
35079 -965106 -687720 -77684 723277 1274112 1372663 1383978 1631058 1689507 922008 -303412
35069 -303412 -741932 38875 885072 626426 -243971 -367456 493250 1388470 1856801 2394601
35059 2394601 3182844 3615800 3434270 3162225 2965862 2245985 984211 327749 955199
35050 955199 1855480 1735069 801294 96915 -167138 -442912 -645678 -382932 43779 58974
35040 58974 -122959 6144 109352 -369625 -840607 -308372 732564 771059 -290419 -835195
35030 -835195 -1273 1153140 1541841 1592658 2028020 2404141 1970264 1077481 670401 986160
35020 986160 1586935 2084684 2108263 1233777 -252142 -1169645 -876752 -286091 -562336 -1373635
35010 -1373635 -1447627 -441295 788057 1494910 1612373 1206523 391456 -274891 -278064 -37381
35000 -37381 -386017 -1131332 -1122705 50149 1379436 1816263 1495908 1141834 963649 691018
34990 691018 190150 -442954 -1017253 -1140867 -457020 668228 1251531 949630 651281
34981 651281 1213198 2136679 2304348 1653914 1146729 1187253 1108564 429749 -323463 -519086
34971 -519086 -394872 -536594 -927853 -1168455 -1238320 -1355088 -1348570 -911263 -326845 -179282
34961 -179282 -343029 -74492 707936 1040939 230043 -1112319 -1873029 -1740661 -1091690
34952 -1091690 -74330 1338386 2583801 2730579 1667216 411364 -53775 219238 548619
34943 548619 565669 392250 218870 129036 179928 286334 98543 -658541 -1700395 -2336021
34933 -2336021 -2226817 -1768884 -1527742 -1460718 -1025430 -59001 845968 1071137 736114 328194
34923 328194 -144849 -980470 -1836348 -1795724 -679290 447109 598297 103038 -110643
34914 -110643 92350 190417 128591 339394 798738 1020150 989423 1164127 1448950 1172085
34904 1172085 352936 -33364 426842 755564 43701 -1005700 -969569 263909 1328763
34895 1328763 1150617 67796 -886343 -1164450 -975821 -816194 -938982 -1119066 -952757
34886 -952757 -533784 -577324 -1501484 -2627466 -2860578 -2086373 -1250680 -974512 -797876 -143395
34876 -143395 620594 732431 267056 -3825 81165 -205020 -1116806 -1607928 -639765 1127531
34866 1127531 1939667 1225493 286135 390144 1111253 1248367 679948 319456 558861
34857 558861 796543 542704 88239 -167519 -318511 -527196 -561503 -168086 443202 823578
34847 823578 780711 463468 144261 -10245 -144903 -618218 -1409588 -1823059 -1293952 -343887
34837 -343887 -62422 -658448 -1259485 -1229382 -894809 -751101 -738808 -657054 -590048 -537849
34827 -537849 -259263 169779 293706 97743 170438 702362 1136768 1226075 1495935 2092089
34817 2092089 2206845 1493736 1056503 1908964 3231751 3403639 2198622 721145 -338573
34808 -338573 -1036879 -1148624 -308568 882220 1292829 910397 788411 1251468 1481257
34799 1481257 1119056 887952 1137346 1081662 213732 -630519 -481058 338509 837397 740314
34789 740314 440980 126529 -266668 -609072 -736648 -724574 -546141 42680 782862 723944
34779 723944 -504522 -1786308 -1792825 -800614 -252411 -671579 -1056534 -480998 649470
34770 649470 1330340 1237621 763495 246101 -261964 -646283 -655756 -239112 301121 579082
34760 579082 466873 171487 35445 224402 552947 672668 481449 227800 88969 -179764
34750 -179764 -851272 -1538582 -1402069 -282964 843145 1028793 611663 637613 1240824
34741 1240824 1464807 761017 -231195 -688769 -537475 23343 1025003 2128643 2393022
34732 2393022 1533220 726515 1164967 2339024 2802572 2179046 1274738 597010 37326
34723 37326 -227657 84834 345965 -382444 -1616359 -1805496 -727967 -2478 -625426
34714 -625426 -1464558 -1092311 134989 906127 892950 733721 770616 858784 968112 1106830
34704 1106830 1030114 676864 422228 368850 60767 -525372 -558775 316276 1137008 1067356
34694 1067356 784050 1229917 1814067 1330695 90944 -519605 -365599 -737746 -2091920
34685 -2091920 -3235475 -3230395 -2725852 -2720942 -3098480 -3165737 -2844269 -2532341 -2298255 -1888425
34675 -1888425 -1258836 -651472 -348406 -565220 -1277446 -1986575 -2027494 -1302326 -401961 113232
34665 113232 232665 249401 370035 630268 856587 718847 179223 -211014 74313 738362
34655 738362 1027238 778572 444611 157667 -399374 -1111831 -1330114 -962113 -834445 -1468759
34645 -1468759 -2181041 -1995482 -961208 29459 379522 199124 -156910 -435310 -479206
34636 -479206 -283564 -47790 21885 -100979 -317858 -442168 -186649 526496 1202324 1196782
34626 1196782 650508 461118 1033400 1589465 1176947 -55162 -1123248 -1460068 -1321256
34617 -1321256 -1087115 -761701 -261870 239417 484037 440506 279914 126576 -56042 -337464
34607 -337464 -649192 -825994 -834256 -832859 -906786 -878086 -560801 -103678 114288 -146043 -849659
34596 -849659 -1731641 -2289231 -2025775 -1044381 -128479 170365 212616 532491 812209 387526
34586 387526 -464672 -741289 -252665 60305 -404535 -1095462 -1380525 -1510713 -1888017 -2164543
34576 -2164543 -1875448 -1426586 -1597472 -2322998 -2705823 -2165488 -1050206 -144417 91747
34567 91747 -121537 -93655 573996 1352017 1305861 362704 -509425 -593544 -200644 183686
34557 183686 694926 1399770 1598659 747801 -432656 -751629 -155517 359373 213502
34548 213502 -284506 -778616 -1233118 -1466706 -1217792 -793629 -865794 -1462987 -1872173 -1684190
34538 -1684190 -1251840 -967482 -803367 -775735 -1125386 -1691825 -1771578 -1065156 -270822 -257462
34528 -257462 -979809 -1618530 -1545296 -820017 51154 555111 514410 201330 21352 42740
34518 42740 24164 -127487 -249341 -273986 -303711 -294468 -101897 74197 -203938 -863166 -1175484
34507 -1175484 -678195 181134 685967 782048 947222 1389151 1825614 1952899 1748608 1331152
34497 1331152 803784 252673 -275058 -777502 -1183394 -1313114 -1049743 -456276 326758
34488 326758 1141175 1719774 1779613 1359354 875390 689702 779624 935495 1054575 1087914
34478 1087914 945937 676694 525180 573028 516374 87138 -462412 -623162 -300970 93008
34468 93008 215171 163876 231755 520168 885570 1104068 1021277 679907 361437 366854 669598
34457 669598 886367 686499 164808 -278731 -372420 -174758 124284 433357 703297 778299
34447 778299 513122 47483 -236935 -147870 64438 44259 -156876 -103419 456299 1201300
34437 1201300 1539511 1269144 827640 802200 1244340 1637270 1581779 1255145 975590 604743
34427 604743 -130185 -856531 -788256 89738 741315 388297 -472057 -893928 -798890 -738270
34417 -738270 -757023 -451358 -25888 -235200 -1038085 -1267499 -185126 1333336 1855715
34408 1855715 1222492 606515 900586 1720630 2143184 1927519 1627958 1651265 1630522 981961
34398 981961 -123882 -831169 -760014 -579302 -998678 -1628207 -1534946 -719251 -203459 -582649
34388 -582649 -1281400 -1508448 -1240572 -885362 -603300 -446258 -638048 -1162921 -1475001 -1171915
34378 -1171915 -645793 -526173 -746842 -733239 -316256 135821 397046 597651 724901 454368
34368 454368 -332725 -1228250 -1708771 -1689038 -1545203 -1691786 -2173701 -2607546 -2548184 -1942656
34358 -1942656 -1120532 -345017 373518 954738 1108206 756778 286594 58522 -78304
34349 -78304 -455796 -1016363 -1457720 -1742994 -2037661 -2282094 -2280070 -2135742 -2137222 -2198988 -1872977
34338 -1872977 -1028917 -160231 157425 -129230 -627129 -991639 -1197649 -1399112 -1632795
34329 -1632795 -1720112 -1511622 -1147580 -866510 -584064 -5663 760345 1138632 892250 582293
34319 582293 838730 1497357 1891819 1737570 1283687 839535 630587 879912 1472216 1703778
34309 1703778 961964 -401480 -1385490 -1450411 -845584 -25347 642816 756441 228733
34300 228733 -268775 1424 677264 687958 -58087 -372005 423895 1368372 1219709 183940
34290 183940 -562143 -548070 -292115 -199050 -108283 71584 76791 -190600 -439858 -482080 -486788
34279 -486788 -574267 -572992 -407613 -354153 -585896 -721938 -241720 692719 1221780 777952
34269 777952 -152590 -565024 -156429 364653 292550 -160168 -298642 18756 311783 334684
34259 334684 403726 752476 1083485 1026181 662300 313227 91752 -63846 -129996 -19257
34249 -19257 271171 646311 879564 606026 -293223 -1260099 -1496389 -994470 -606812 -833444
34239 -833444 -1138216 -893679 -382566 -197760 -167386 237124 717665 398081 -716449 -1515388
34229 -1515388 -1321539 -797984 -811370 -1103982 -844412 -85283 190769 -541573 -1653900
34220 -1653900 -2290588 -2428847 -2587962 -2843762 -2741767 -2175408 -1755186 -1999628 -2570768
34211 -2570768 -2773402 -2557210 -2434268 -2482774 -2150943 -1269328 -578544 -748425 -1348177 -1423025
34201 -1423025 -832178 -349727 -507007 -970009 -1170139 -1018178 -768142 -560297 -368179
34192 -368179 -175195 13240 220976 452275 667093 814926 811654 580959 276109 293939
34182 293939 778280 1245398 1084833 365428 -270768 -474051 -458516 -397080 -140081 287132
34172 287132 511527 464852 625841 1120568 1118785 -137158 -2004869 -2994809 -2639532 -1985389
34162 -1985389 -1989776 -2218409 -1707986 -583856 12234 -461194 -1156992 -973087 15405 748340
34152 748340 608849 104567 -4787 209166 59649 -641584 -1223554 -1063341 -445868 -175346
34142 -175346 -557648 -1182877 -1637136 -1960510 -2288629 -2468665 -2302012 -1865096 -1290460 -512294
34132 -512294 387880 859552 486799 -185770 -104268 901631 1840582 1930917 1539524 1266500
34122 1266500 818121 -337440 -1648888 -1937192 -1154194 -614908 -1173734 -2088839 -2194674
34113 -2194674 -1420732 -488520 268685 956620 1370071 1085767 255118 -424012 -615124
34104 -615124 -650709 -824339 -910628 -621431 -143857 75841 -104974 -406276 -515408 -483674
34094 -483674 -689982 -1340390 -2043483 -2146395 -1592423 -1093740 -1186540 -1472829 -1234719 -523788
34084 -523788 -83271 -314609 -881426 -1303850 -1399102 -1119322 -525107 -28448 -109269 -592799
34074 -592799 -696393 -30621 880125 1317791 1186849 824229 400484 -94955 -523906 -629962
34064 -629962 -305728 349506 1079445 1487324 1300304 773804 505973 662859 764845 490821
34054 490821 247259 518813 1044905 1214119 1034554 1063114 1435132 1633018 1364820 1079542
34044 1079542 1270536 1683850 1663082 1077658 454581 195047 66631 -343911 -951262 -1267595
34034 -1267595 -1112283 -897939 -1086639 -1585365 -1878016 -1636960 -1021664 -459967 -299363
34025 -299363 -570387 -903327 -781510 -84666 735932 1244991 1587978 2099015 2514404 2142305
34015 2142305 887326 -424811 -980153 -831934 -560988 -438900 -294645 -18709 177820
34006 177820 35737 -401575 -786581 -828763 -631940 -514545 -448384 -19786 785334 1179408
33996 1179408 519421 -637766 -1150737 -805935 -390701 -327333 -246241 -78216 -433407 -1362594
33986 -1362594 -1762450 -826099 662420 1348631 1064444 710018 816366 1089114 1117904
33977 1117904 794758 236184 -129833 251075 1199001 1621645 939132 140911 463028
33968 463028 1486647 1722373 802677 -202263 -605681 -892279 -1441217 -1717482 -1254349
33959 -1254349 -461264 96311 425300 625453 442922 -156047 -606136 -469318 -31486
33950 -31486 230088 238094 20105 -550390 -1267790 -1453057 -845568 -162404 -244607 -1028752
33940 -1028752 -1798282 -2048510 -1685268 -799506 275703 1008422 1157934 946346 570249
33931 570249 47083 -279311 151123 1085782 1365205 499600 -440741 -332480 334867 354457
33921 354457 -214422 -254768 457512 885927 475346 18656 300415 847570 711508 -115043
33911 -115043 -731020 -476003 443558 1302128 1486263 905505 26403 -555402 -665816 -579269
33901 -579269 -522122 -388383 2251 593938 1120793 1279172 879061 49604 -698447 -883373
33891 -883373 -603292 -439902 -685647 -854407 -176500 1405681 2865754 2915915 1357789
33882 1357789 -511562 -1155601 -444477 353015 266970 -280792 -403201 -145858 -278053
33873 -278053 -1023776 -1782464 -2076112 -2091281 -2145769 -2152138 -1836067 -1154232 -330042 315530
33863 315530 528407 324711 20347 -105058 -58799 99735 450336 871426 873069 253944
33853 253944 -382382 -342419 199015 598644 795869 1125648 1317929 767579 -176523 -391599
33843 -391599 215429 275354 -1006730 -2430214 -2375876 -1046548 -23369 -28948 -288633 -4177
33833 -4177 627287 1063453 1217180 1239254 1113650 877096 833432 1149502 1468832 1273606
33823 1273606 550462 -142000 -272767 113916 473929 344172 -209469 -783144 -1188213
33814 -1188213 -1569218 -1932442 -1927289 -1385710 -786731 -723784 -1036209 -992016 -355430 291268
33804 291268 485577 561094 935847 1201883 649476 -480580 -1101484 -784186 -355120 -568150
33794 -568150 -916856 -511730 396858 777930 484771 424430 922954 1073752 233248 -848407
33784 -848407 -1194463 -1094228 -1419100 -1996684 -1824146 -704535 423238 820987 656631
33775 656631 250476 -458979 -1402707 -2101775 -2257550 -2049279 -1626434 -931263 -238832 -148073
33765 -148073 -662223 -937464 -415941 347505 496434 40350 -334271 -269857 0 199539
33755 199539 334004 497596 659286 670288 443317 211617 473371 1360439 2199399 2178427
33745 2178427 1364360 505426 -53505 -528860 -864208 -703263 -316145 -501175 -1243859
33736 -1243859 -1542548 -1037105 -697400 -1225683 -1893139 -1868673 -1660812 -2094468 -2719625 -2559685
$$ [...]
##END NTUPLES=NMR SPECTRUM
##END=
