##TITLE=31Pdec_ANY-162-12
 CDCl3, 124 sc
 2.7.2019
##JCAMPDX= 6.0         $$ Bruker NMR JCAMP-DX V2.0
##DATA TYPE= NMR SPECTRUM
##DATA CLASS= NTUPLES
##ORIGIN= UXNMR, Bruker Analytische Messtechnik GmbH
##OWNER= root
$$ XWIN-NMR		Version 3.5
$$ Tue Jul  2 14:02:42 2019 Russian Standard Time (UT+4h)  she@DPX200
##.OBSERVE FREQUENCY= 81.013821
##.OBSERVE NUCLEUS= ^31P
##.ACQUISITION MODE= SIMULTANEOUS
##.ACQUISITION SCHEME= undefined
##.AVERAGES= 124
##.DIGITISER RES= 17
##SPECTROMETER/DATA SYSTEM= spect
##.PULSE SEQUENCE= zgpg30
##.SOLVENT NAME= CDCl3
##.SHIFT REFERENCE= (INTERNAL, CDCl3, 0, 182.463)
##AUDIT TRAIL= $$ (NUMBER, WHEN, WHO, WHERE, WHAT)
$$ ##TITLE= Audit trail, XWIN-NMR		Version 3.5
$$ ##JCAMPDX= 5.01
$$ ##ORIGIN= Bruker BioSpin GmbH
$$ ##OWNER= she
$$ F:/spectra/data/she/nmr/P31/1/pdata/1/auditp.txt
$$ ##AUDIT TRAIL=  $$ (NUMBER, WHEN, WHO, WHERE, WHAT)
(   1,<2019-07-02 14:01:28.59 +0400>,<she>,<DPX200>,
      <continue with go, POWCHK disabled, PULCHK disabled
       configuration hash MD5:
       00 E9 B6 7A A2 85 ED C7 34 08 36 98 17 FE 4E 26
       data hash MD5: 32K
       7A 43 D3 A0 8A 12 56 55 FC 0C 60 4B AA 83 B6 E3>)
(   2,<2019-07-02 14:01:33.42 +0400>,<she>,<DPX200>,
      <Start of raw data processing
       efp BC_mod = 2 LB = 1 FT_mod = 6 PKNL = 1 PHC0 = -2638.208 PHC1 = 252.9996 SI = 64K 
       data hash MD5: 64K
       DF 1D B6 4B AB 3E 93 E5 5F 4D D3 17 53 86 A6 E0>)
(   3,<2019-07-02 14:02:15.25 +0400>,<she>,<DPX200>,
      <pk PHC0 = -267.0167 PHC1 = 220.5995 
       data hash MD5: 64K
       F3 4B 54 E6 ED B7 3F 42 49 A5 D0 D0 39 42 C7 19>)
$$ ##END=
$$ 
$$ hash MD5
$$ 35 79 3B 1D ED 45 42 55 8D 84 67 C4 51 70 D8 D5
##$RELAX= 
##$RELAX= 
##$RELAX= 
##$RELAX= 
##$RELAX= 
##$RELAX= 
##$RELAX= 
##$RELAX= 
$$ Bruker specific parameters
$$ --------------------------
##$DU= <F:/spectra>
##$EXPNO= 1
##$NAME= <P31>
##$PROCNO= 1
##$TYPE= <nmr>
##$USER= <she>
##$AMP= (0..31)
100 100 100 100 100 100 100 100 100 100 100 100 100 100 100 100 100 100 
100 100 100 100 100 100 100 100 100 100 100 100 100 100 
##$AQSEQ= 0
##$AQ_mod= 1
##$AUNM= <au_zg>
##$AUTOPOS= <>
##$BF1= 81.014009
##$BF2= 200.13
##$BF3= 200.13
##$BF4= 200.13
##$BF5= 200.13
##$BF6= 200.13
##$BF7= 200.13
##$BF8= 200.13
##$BYTORDA= 1
##$CFDGTYP= 0
##$CFRGTYP= 5
##$CHEMSTR= <none>
##$CNST= (0..31)
1 1 145 1 1 1 1 1 1 1 1 1 1 1 1 1 1 1 1 1 1 1 1 1 1 1 1 1 1 1 1 1 
##$CPDPRG= <waltz16>
##$CPDPRG1= <>
##$CPDPRG2= <waltz16>
##$CPDPRG3= <>
##$CPDPRG4= <mlev>
##$CPDPRG5= <mlev>
##$CPDPRG6= <mlev>
##$CPDPRG7= <mlev>
##$CPDPRG8= <mlev>
##$CPDPRGB= <>
##$CPDPRGT= <>
##$D= (0..31)
0 1 0 0 0 0 0 0 0 0 0 0.03 2e-05 3e-06 0 0 0 0 0 0 0 0 0 0 0 0 0 0 0 0 
0 0 
##$DATE= 1562061502
##$DBL= (0..7)
120 120 120 11 120 120 24 19 
##$DBP= (0..7)
150 150 150 150 150 150 150 150 
##$DBP07= 0
##$DBPNAM0= <>
##$DBPNAM1= <>
##$DBPNAM2= <>
##$DBPNAM3= <>
##$DBPNAM4= <>
##$DBPNAM5= <>
##$DBPNAM6= <>
##$DBPNAM7= <>
##$DBPOAL= (0..7)
0.5 0.5 0.5 0.5 0.5 0.5 0.5 0.5 
##$DBPOFFS= (0..7)
$$ [...]
##$SUBNAM2= <"">
##$SUBNAM3= <"">
##$SUBNAM4= <"">
##$SUBNAM5= <"">
##$SUBNAM6= <"">
##$SUBNAM7= <"">
##$SUBNAM8= <"">
##$SUBNAM9= <"">
##$SW= 369.568048894756
##$SWIBOX= (0..15)
0 1 3 0 0 0 0 0 0 0 0 0 0 0 0 0 
##$SW_h= 29940.119760479
##$TD= 32768
##$TD0= 1
##$TE= 0
##$TE2= 300
##$TE3= 300
##$TEG= 300
##$TL= (0..7)
0 120 53 12 22 120 120 120 
##$TP= (0..7)
150 150 150 150 150 150 150 150 
##$TP07= 0
##$TPNAME0= <>
##$TPNAME1= <>
##$TPNAME2= <>
##$TPNAME3= <>
##$TPNAME4= <>
##$TPNAME5= <>
##$TPNAME6= <>
##$TPNAME7= <>
##$TPOAL= (0..7)
0.5 0.5 0.5 0.5 0.5 0.5 0.5 0.5 
##$TPOFFS= (0..7)
0 0 0 0 0 0 0 0 
##$TUNHIN= 0
##$TUNHOUT= 0
##$TUNXOUT= 0
##$USERA1= <user>
##$USERA2= <user>
##$USERA3= <user>
##$USERA4= <user>
##$USERA5= <user>
##$V9= 5
##$VALIST= <valist>
##$VCLIST= <CCCCCCCCCCCCCCC>
##$VD= 0
##$VDLIST= <DDDDDDDDDDDDDDD>
##$VPLIST= <PPPPPPPPPPPPPPP>
##$VTLIST= <TTTTTTTTTTTTTTT>
##$WBST= 1024
##$WBSW= 4
##$XGAIN= (0..3)
0 0 0 0 
##$XL= 0
##$YL= 0
##$YMAX_a= 18653
##$YMIN_a= -24378
##$ZGOPTNS= <>
##$ZL1= 120
##$ZL2= 120
##$ZL3= 120
##$ZL4= 120
##$ABSF1= 0
##$ABSF2= 0
##$ABSG= 0
##$ABSL= 0
##$ALPHA= 0
##$AQORDER= 0
##$ASSFAC= 0
##$ASSFACI= 0
##$ASSFACX= 0
##$ASSWID= 0
##$AUNMP= <proc_1d>
##$AZFE= 0.1
##$AZFW= 0.5
##$BCFW= 0
##$BC_mod= 2
##$BYTORDP= 0
##$COROFFS= 0
##$CY= -3
##$DATMOD= 1
##$DC= 0
##$DFILT= <>
##$DTYPP= 0
##$F1P= 0
##$F2P= 0
##$FCOR= 1
##$FTSIZE= 65536
##$FT_mod= 6
##$GAMMA= 0
##$GB= 0
##$INTBC= 1
##$INTSCL= 5.30512e-09
##$ISEN= 30
##$LB= 1
##$LEV0= 0
##$LPBIN= 0
##$MAXI= 10000
##$MC2= 0
##$MEAN= 0
##$ME_mod= 0
##$MI= 50
##$NCOEF= 0
##$NC_proc= -8
##$NLEV= 6
##$NOISF1= 182.463
##$NOISF2= 159.3651
##$NSP= 0
##$NTH_PI= 0
##$NZP= 0
##$OFFSET= 182.463
##$PC= 4
##$PHC0= -2905.225
##$PHC1= 473.5991
##$PH_mod= 1
##$PKNL= yes
##$PPARMOD= 0
##$PSCAL= 0
##$PSIGN= 0
##$REVERSE= no
##$SF= 81.0140089999434
##$SI= 65536
##$SIGF1= 159.3651
##$SIGF2= -187.1042
##$SINO= 113.3802
##$SIOLD= 16384
##$SREGLST= <1H.CDCl3>
##$SSB= 0
##$STSI= 65536
##$STSR= 0
##$SW_p= 29940.119760479
##$SYMM= 0
##$S_DEV= 0
##$TDeff= 32768
##$TDoff= 0
##$TI= <>
##$TILT= no
##$TM1= 0
##$TM2= 0
##$TOPLEV= 0
##$USERP1= <user>
##$USERP2= <user>
##$USERP3= <user>
##$USERP4= <user>
##$USERP5= <user>
##$WDW= 1
##$XDIM= 65536
##$YMAX_p= 470198321
##$YMIN_p= -78119548
$$ End of Bruker specific parameters
$$ ---------------------------------
##NTUPLES= NMR SPECTRUM
##VAR_NAME=  FREQUENCY,     SPECTRUM/REAL,   SPECTRUM/IMAG
##SYMBOL=    X,             R,               I
##VAR_TYPE=  INDEPENDENT,   DEPENDENT,       DEPENDENT
##VAR_FORM=  AFFN,          ASDF,            ASDF
##VAR_DIM=   65536,         65536,           65536
##UNITS=     HZ,            ARBITRARY UNITS, ARBITRARY UNITS
##FACTOR=    0.456856943014862, 1,           1
##FIRST=     14782.0589164792, 0,            0
##LAST=      -15158.0608439998, 0,           0
##MIN=       -15158.0608439998, -78119548,   0
##MAX=       14782.0589164792, 470198321,    0
$$ Real data points
##PAGE= N=1
##DATA TABLE= (X++(R..R)), XYDATA
$$ [...]
$$ plain form
4100 5513712 10968062 -895445 -20827918 -30766218 -28307204 -23791288 -19488431 -9785146
4092 -9785146 529160 -1042062 -10624085 -7566606 13205410 28327068 20033226 6053947
4084 6053947 14768235 41228329 52668440 36037357 15937124 18793470 38846356 51443570
4076 51443570 46061791 31775864 18585157 9172930 6900568 17069656 35980197 48294416
4068 48294416 41604220 19588937 -2923567 -14240211 -12125263 -798190 12322849
4061 12322849 19159311 17052871 12781839 14882125 21184429 20704248 10628385 3629769
4053 3629769 11395657 26618257 31302546 21055878 10362639 11832605 20238802 22697588
4045 22697588 17332059 13879137 18542471 25225112 22830088 8287091 -8890037 -15498758
$$ packed form
4100E513712N454350j1863507j9932473r938300K459014M515916M302857R703285
4092i785146J0314306j571222r582023L057479K0772016J5121658q293842j3979279
4084F053947Q714288K6460094J1440111j6631083k0100233K856346K0052886J2597214
4076E1443570n381779j4285927j3190707r412227k272362J0169088J8910541J2314219
4068D8294416o690196k2015283k2512504j1316644K114948J1327073J3121039
4061A2322849O836462k106440m271032K100286O302304m80181j0075863o998616
4053C629769P765888J5222600M684289j0246668j0693239J469966Q406197K458786
4045B2697588n365529l452922M663334O682641k395024j4542997j7177128o608721
$$ plain form
4037 -15498758 -8989725 -806617 -2036217 -8782787 -8891901 -1441472 994972 -8371350
4029 -8371350 -20074658 -22739807 -17909268 -12823064 -7338723 1802998 9989205 8900986
4021 8900986 -1485443 -13417364 -20272594 -18160548 -5221767 11749398 17926729 9900279
4013 9900279 6773832 25954882 53808743 59856109 37763424 10651056 -5402806 -18683729
4005 -18683729 -35378813 -40766127 -22965250 3301187 16136010 16741973 20677604 28731592
3997 28731592 28031149 17463614 10493618 11768695 9536406 -4138087 -20344838 -26579800
3989 -26579800 -22259540 -15379827 -11704578 -11709831 -11966847 -6742299 5962599 18618174
3981 18618174 20864541 12917291 5142694 3322170 2607005 -1478360 -4446197 -17179
$$ packed form
4037a5498758O509033Q183108j229600o746570j09114P450429K436444r366322
4029h371350j1703308k665149M830539N086204N484341R141721Q186207j088219
4021H900986j0386429j1931921o855230K112046J2938781J6971165O177331q026450
4013I900279l126447J9181050K7853861O047366k2092685k7112368j6053862j3280923
4005a8683729j6695084n387314J7800877K6266437J2834823O05963L935631Q053988
3997B8731592p00443j0567535o969996J275077k232289j3674493j6206751o234962
3989b6579800M320260O879713L675249n253k57016N224548J2704898J2655575
3981A8618174K246367p947250p774597j820524p15165m085365k967837M429018
$$ plain form
3973 -17179 9942237 17333299 16418402 8295127 55392 -192984 7970074 13823900 6565379
3964 6565379 -10465407 -23407786 -25351848 -21843370 -18715696 -14852043 -9924074 -8752114
3956 -8752114 -12460964 -14066116 -8856708 -1588201 2043867 2997247 2422446 -2874337 -10973056
3947 -10973056 -10816310 1839828 13145969 8855621 -3158957 -3141859 10974895 20369700
3939 20369700 12901798 -1115511 -5781366 -222377 5039427 4181816 771721 585677
3931 585677 5575440 12829273 16284316 11745456 2389802 -2959289 1370426 12305925
3923 12305925 21047867 19786562 7266336 -8643847 -15641130 -8801504 3556104 9956980
3915 9956980 9097524 7721025 8825863 10044918 11241588 14008924 14501255 7127403 -4302342
$$ packed form
3973a7179R959416P391062r14897q123275q239735k48376Q163058N853826p258521
3964F565379j7030786j2942379j944062L508478L127674L863653M927969J171960
3956h752114l708850j605152N209408P268507L632068R53380n74801n296783q098719
3947a0973056J56746J2656138J1306141m290348j2014578J7098J4116754R394805
3939B0369700p467902j4017309m665855N558989N261804q57611l410095j86044
3931E85677M989763P253833L455043m538860r355654n349091M329715J0935499
3923A2305925Q741942j261305j2520226j5910183o997283O839626J2357608O400876
3915I956980q59456j376499J104838J219055J196670K767336M92331p373852j1429745
$$ plain form
3906 -4302342 -9999820 -9945079 -14196433 -24553186 -28890935 -19681862 -6103015 166210
3898 166210 455126 1573148 2974883 1999406 3194693 10631218 17639796 15965146 9467237
3889 9467237 7071346 7870369 6312761 6952854 18175334 33196576 34196329 17753415
3881 17753415 979978 -2770279 -1014007 -7377885 -20026242 -24490373 -13211882 5297105
3873 5297105 15586818 10401950 -2041974 -6007691 3784697 14656195 12341823 2048003
3865 2048003 3602254 25272036 52216074 63700491 53535624 30652205 7735599
3858 7735599 -6561335 -10867680 -10988089 -12640363 -13654915 -8765480 -368666 4544217
3850 4544217 6911125 13127113 19894276 16328825 4486769 1297396 12487579 20869766
$$ packed form
3906d302342n697478N4741m251354j0356753m337749R209073J3578847O269225
3898A66210K88916J118022J401735r75477J195287P436525P008578j674650o497909
3889I467237k395891P99023j557608O40093J1222480J5021242R99753j6442914
3881A7753415j6773437l750257J756272o363878j2648357m464131J1278491J8508987
3873E297105J0289713n184868j2443924l965717R792388J0871498k314372j0293820
3865B048003J554251K1669782K6944038J1484417j0164867k2883419k2916606
3858G735599j4296934m306345j20409j652274j014552M889435Q396814M912883
3850D544217K366908O215988O767163l565451j1842056l189373J1190183Q382187
$$ plain form
3842 20869766 12257035 -1680952 -1836085 8759843 11990201 4128385 -769115 5313891
3834 5313891 14460205 17932658 16778760 14575139 11175337 7065412 5467103 7841036
3826 7841036 13212738 20818048 26846627 22407346 4572746 -13793081 -17212283 -9157947
3818 -9157947 -7684658 -19210739 -29904858 -26086888 -11243432 1831375 6285209 4378175
3810 4378175 3224674 10001169 23932222 32300657 23311933 2922713 -11906830 -16589794
3802 -16589794 -21913427 -32140572 -36708301 -30089703 -23738863 -27557966 -32878384 -27067179
3794 -27067179 -14996905 -11525726 -18630548 -23562471 -16922688 -1469560 15496394 29518969
3786 29518969 39557141 47370408 54770573 58159407 50892832 34766139 21390163 16828571
$$ packed form
3842B0869766q612731j3937987j55133J0595928L230358p861816m897500O083006
3834E313891R146314L472453j153898k203621l399802m109925j598309K373933
3826G841036N371702P605310O028579m439281j7834600j8365827l419202Q054336
3818i157947J473289j1526081j0694119L817970J4843456J3074807M453834j907034
3810D378175j153501O776495J3931053Q368435q988724k0389220j4829543m682964
3802a6589794n323633j0227145m567729O618598O350840l819103n320418N811205
3794b7067179J2070274L471179p104822m931923O639783J5453128J6965954J4022575
3786B9518969J0038172P813267P400165L388834p266575j6126693j3375976m561592
$$ plain form
3778 16828571 14402785 10041262 12859616 28132324 40566234 31803211 8503091 -5327594
3770 -5327594 -1618943 4396068 511648 -7185965 -9701471 -9048280 -9391535 -8090543 -4308425
3761 -4308425 -5117947 -13270051 -17849186 -7561804 12468327 26578160 27536586 22033713
3753 22033713 20478582 28248748 44221827 60883450 67227370 57950867 40027513 25790269
3745 25790269 19547702 14831236 5004077 -7256344 -13124294 -8796621 -870750 1277613
3737 1277613 -2467371 -2690303 5843093 15240208 14834916 6752523 2727278 6279259 7766694
3728 7766694 69742 -9347523 -7874318 5923436 21190150 27181052 22065857 10771244
3720 10771244 -2115372 -16222057 -31978787 -43744427 -41168004 -22469153 -2130804
$$ packed form
3778A6828571k425786m361523K818354J5272708J2433910q763023k3300120j3830685
3770e327594L708651O015011l884420p697613k515506O53191l43255J300992L782118
3761d308425q09522q152104m579135J0287382K0030131J4109833R58426n502873
3753B2033713j555131P770166J5973079J6661623O343920r276503j7923354j4237244
3745B5790269o242567m716466r827159j2260421n867950M327673P925871K148363
3737A277613l744984k22932Q533396R397115m05292q082393m025245L551981J487435
3728G766694p696952r417265J473205J3797754J5266714N990902n115195j1294613
3720A0771244j2886616j4106685j5756730j1765640K576423J8698851K0338349
$$ plain form
3713 -2130804 3621238 -2622889 -3897745 6148803 15423497 13709290 6925467 3723510
3705 3723510 885031 -6920872 -13853208 -13182322 -12487590 -22612329 -36464085 -36217890
3697 -36217890 -20842748 -9306646 -13113597 -20961425 -17065496 -2313294 10693220 14222569
3689 14222569 9248155 348007 -5606751 -1985120 8842166 14329519 6479385 -6492879
3681 -6492879 -9904319 -118734 14135546 23735890 24920001 16689262 1594541 -11826629
3673 -11826629 -15768214 -12974742 -13095281 -18991785 -23773893 -22157746 -16699146 -9981291
3665 -9981291 1401804 19427654 36840968 43796902 39933925 33623638 29756352 23789798
3657 23789798 9490324 -10851101 -26335670 -26985149 -12847960 5723453 16555079
$$ packed form
3713b130804N752042o244127j274856J0046548R274694j714207o783823l201957
3705C723510k838479p805903o932336O70886O94732j0124739j3851756K46195
3697c6217890J5375142J1536102l806951p847828L895929J4752202J3006514L529349
3689A4222569m974414q900148n954758L621631J0827286N487353p850134j2972264
3681f492879l411440R785585J4254280R600344J184111q230739j5094721j3421170
3673a1826629l941585K793472j20539n896504m782108J616147N458600O717855
3665i981291J1383095J8025850J7413314O955934l862977o310287l867286n966554
3657B3789798j4299474k0341425j5484569o49479J4137189J8571413J0831626
$$ plain form
3650 16555079 14740418 3970352 -9254305 -20394886 -26608217 -25876336 -18997036 -10544830
3642 -10544830 -5270690 -4050188 -4607350 -4990294 -4742051 -3631885 -956144 3858899 10045686
3633 10045686 14238253 11835946 2732678 -5125530 -2956699 7176385 13707810 10962099
3625 10962099 6658222 9667742 16997997 19680672 15785912 9332679 1588251 -6287987
3617 -6287987 -6440739 6797401 23087528 25661194 15612955 11274466 19957140 27270386
3609 27270386 22293813 15931938 20380963 24951825 11738350 -12688727 -22054578 -5485796
3601 -5485796 20188534 34640009 34082373 23662241 6177100 -13205525 -22958451 -16493195
3593 -16493195 -1424052 10177199 16287202 23338160 33670566 40816037 36982884 22738100
$$ packed form
3650A6555079j814661j0770066j3224657j1140581o213331P31881O879300Q452206
3642a0544830N274140J220502n57162l82944K48243J110166K675741M815043O186787
3633A0045686M192567k402307r103268p858208K168831J0133084O531425k745711
3625A0962099m303877L009520P330255K682675l894760o453233p744428p876238
3617f287987j52752J3238140J6290127K573666j0048239m338489Q682674P313246
3609B7270386m976573o361875M449025M570862j3213475k4427077r365851J6568782
3601e485796K5674330J4451475n57636j0420132j7485141j9382625r752926O465256
3593a6493195J5069143J1601251O110003P050958J0332406P145471l833153j4244784
$$ plain form
3585 22738100 9340474 9942589 25180889 39657211 38351555 24595334 14341884 14243552
3577 14243552 15264215 8348362 -4703065 -18627952 -31678022 -40470245 -38704567 -27818053
3569 -27818053 -19681475 -21268672 -24852912 -20973269 -12960380 -9941698 -12718239 -15790276
3561 -15790276 -17010160 -16109237 -10137784 -209178 3628007 -4894482 -16667531 -19858609
3553 -19858609 -17596606 -18987782 -18780176 -4687828 16812072 23015496 8073222 -5541742
3545 -5541742 1843737 20024027 25352585 12859417 -1756826 -5036041 2663702 14466711
3537 14466711 23311889 22034715 8004973 -10936110 -22890781 -25012183 -23379694 -20091124
3529 -20091124 -9771316 7904356 21336859 20528569 12449658 12893259 23222472 25904799
$$ packed form
3585B2738100j3397626O02115J5238300J4476322j305656j3756221j0253450r8332
3577A4243552J020663o915853j3051427j3924887j3050070q792223J765678J0886514
3569b7818053Q136578j587197l584240L879643Q012889L018682k776541l072037
3561a5790276j219884R00923N971453R928606L837185q522489j1773049l191078
3553a9858609K262003j391176K07606J4092348K1499900O203424j4942274j3614964
3545e541742P385479J8180290N328558j2493168j4616243l279215P699743J1803009
3537A4466711Q845178j277174j4029742j8941083j1954671k121402J632489L288570
3529b0091124J0319808J7675672J3432503q08290q078911M43601J0329213K682327
$$ plain form
3521 25904799 9067992 -12675044 -13227559 11129071 35214835 35676876 16989778 -128661
3513 -128661 -5434444 -2539754 6091551 20802297 33453715 32034899 20296192 17318485
3505 17318485 30574041 43191366 37721608 20622959 10698603 12540530 16093447 16555465
3497 16555465 18454189 21500574 18150935 7679264 -758427 -3279211 -7462594 -17602013
3489 -17602013 -24844068 -20489613 -10647377 -7606988 -12003413 -13983350 -9575713 -5679922
3481 -5679922 -8305913 -14544565 -18726510 -19973640 -20356115 -20395001 -19784358 -18935307 -16605939
3472 -16605939 -9266314 3366058 14514480 16489766 10050581 3967399 5159603 12278424
3464 12278424 19094475 20732683 15779649 6332675 -1378432 38026 10917113 20922728
$$ packed form
3521B5904799j6836807k1743036n52515K4356630K4085764M62041j8687098j7118439
3513a28661n305783K894690Q631305J4710746J2651418j418816j1738707k977707
3505A7318485J3255556J2617325n469758j7098649r924356J841927L552917M62018
3497A6555465J898724L046385l349639j0471671q437691k520784m183383j0139419
3489a7602013p242055M354455R842236L040389m396425j979937M407637L895791
3481e679922k625991o238652m181945j247130l82475l8886O10643Q49051K329368
3472a6605939P339625J2632372J1148422J975286o439185o083182J192204P118821
3464A2278424O816051J638208m953034r446974p711107J416458J0879087J0005615
$$ plain form
3456 20922728 19142208 8180041 2337257 9224610 19246642 19032721 10404831 6713821
3448 6713821 11653336 13188365 2613538 -10872574 -13235757 -5756898 -999927 -3053621
3440 -3053621 -4596693 -2543338 -2916330 -7789487 -10799717 -10526431 -14772604 -23782947 -23120684
3431 -23120684 -5576239 11832614 9090150 -6953101 -12587212 -2364445 6359364 3767858
3423 3767858 1043056 8040705 16780364 16928470 12657318 13245238 18492182 23205423 25815527
3414 25815527 24201924 14365164 1838677 1408248 14884238 22978493 12607460 -1791102
3406 -1791102 -866182 9473534 11812263 9706929 19780510 37003761 37579651 18716977
3398 18716977 6630873 15715962 25669174 14413763 -7078863 -12250958 2621623 17730006
$$ packed form
3456B0922728j780520j0962167n842784O887353J0022032k13921q627890l691010
3448F713821M939515J535029j0574827j3486112k363183P478859M756971k053694
3440c053621j543072K053355l72992m873157l010230K73286m246173r010343O62263
3431b3120684J7544445J7408853k742464j6043251n634111J0222767Q723809k591506
3423C767858k724802O997649Q739659J48106m271152N87920N246944M713241K610104
3414B5815527j613603r836760j2526487m30429J3475990Q094255j0371033j4398562
3406a791102R24920J0339716K338729k105334J0073581J7223251N75890j8862674
3398A8716977j2086104R085089R953212j1255411k1492626n172095J4872581J5108383
$$ plain form
3390 17730006 20238131 16589464 15612102 14810138 7243012 -6690051 -18370276 -18895533
3382 -18895533 -7367266 7061031 12537827 5088099 -9109159 -20347645 -21243197 -9775951
3374 -9775951 6629170 13526864 5639319 -2111232 7847829 28752515 35926740 21956341
3366 21956341 7432942 10005112 20392860 20196236 8057902 -5816470 -18200980 -29609581
3358 -29609581 -32054270 -17820984 3741468 13380722 4307058 -13708271 -29422405 -38616020
3350 -38616020 -40854525 -38109980 -34006834 -26825848 -9196306 16636312 31918891 22279757
3342 22279757 -1784967 -18735682 -22566367 -20077112 -10519427 10170824 28798610 23757907
3334 23757907 -1698182 -17613223 -6934270 12425411 15778672 4854354 -1284931
$$ packed form
3390A7730006K508125l648667r77362q01964p567126j3933063j1680225n25257
3382a8895533J1528267J4428297N476796p449728j4197258j1238486q95552J1467246
3374i775951J6405121O897694p887545p750551R959061K0904686P174225j3970399
3366B1956341j4523399K572170J0387748j96624j2138334j3874372j2384510j1408601
3358b9609581k444689J4233286K1562452R639254r073664j8015329j5714134r193615
3350c8616020k238505K744545M103146P180986J7629542K5832618J5282579r639134
3342B2279757k4064724j6950715l830685K489255R557685K0690251J8627786n040703
3334B3757907k5456089j5915041J0678953J9359681L353261j0924318o139285
$$ plain form
3327 -1284931 3900220 9469198 5930430 -4169596 -12726100 -14219067 -8533573 -1297934
3319 -1297934 677927 -1634243 1576192 16661725 35825078 42654115 27423964 -3596529
3311 -3596529 -31177056 -36184249 -15440944 13815032 29709459 26991658 19093276 20497828
3303 20497828 32616081 45570367 47267821 32267056 8941110 -4571780 -141500
3296 -141500 8265075 3671431 -7004547 -1743574 21787531 40360670 38733361 28528754
3288 28528754 24053567 19435975 5495068 -7386684 -4040940 7896059 6911170 -9650408
3280 -9650408 -21571142 -14831622 2392905 15532802 20375965 18828669 10550759 -2926262
3272 -2926262 -13105934 -11678864 -537652 9892217 11503577 5608575 -286941 -1631573
$$ packed form
3327a284931N185151N568978l538768j0100026q556504j492967N685494P235639
3319a297934J975861k312170L210435J5085533J9163353O829037j5230151l1020493
3311c596529k7580527n007193K0743305K9255976J5894427k717801p898382J404552
3303B0497828J2118253J2954286J697454j5000765k3325946j3512890M430280
3296a41500Q406575m593644j0675978N260973K3531105J8573139j627309j0204607
3288B8528754m475187m617592j3940907j2881752L345744J1936999r84889j6561578
3280i650408j1920734O739520J7224527J3139897M843163j547296q277910j3477021
3272b926262j0179672J427070J1141212J0429869J611360n895002n895516j344632
$$ plain form
3264 -1631573 -1331673 -3364241 -4083600 3846867 18037374 24936846 16404898 984896
3256 984896 -7318221 -5609380 -650971 3527024 7737852 10443099 7291114 -2211071
3248 -2211071 -13172846 -19957161 -19260405 -11822513 -4343107 -4431218 -9324349 -6536800 8097618
3239 8097618 21102945 19017944 7373314 -17241 -3902110 -15892394 -34447529 -41673713
3231 -41673713 -27294535 -2039448 17796250 27816881 32126247 32657185 29290122 24085446
3223 24085446 18803699 11970492 2509284 -7067178 -13654299 -16423913 -15467586 -11393474
3215 -11393474 -6898403 -4788198 -4453307 -3928910 -3506262 -2673024 2453485 11106737 12124237
3206 12124237 -2151106 -19180529 -18304041 -254945 11553947 3949156 -8131691 -6039981
$$ packed form
3264a631573K99900k032568p19359P930467J4190507O899472q531948j5420002
3256I84896q303117J708841M958409M177995M210828K705247l151985r502185
3248b211071j0961775o784315O96756P437892P479406q8111m893131K787549J4634418
3239H097618J3005327k085001j1644630p390555l884869j1990284j8555135p226184
3231d1673713J4379178K5255087J9835698J0020631M309366N30938l367063n204676
3223B4085446n281747o833207r461208r576462o587121k769614R56327M074112
3215a1393474M495071K110205L34891N24397M22648Q33238N126509Q653252J017500
3206A2124237j4275343j7029423Q76488J8049096J1808892p604791j2080847K091710
$$ plain form
3198 -6039981 4677299 4621492 -10311052 -24827118 -25470428 -14028712 -1528708 1915164
3190 1915164 -6866832 -20217109 -23980754 -13023571 424705 1371070 -8680673 -16147816
3182 -16147816 -15889711 -15842742 -20984758 -24360941 -18748686 -9277912 -8260500 -20704103
3174 -20704103 -38705691 -48653410 -42694713 -24921884 -6893189 3565164 7302068 7065030
3166 7065030 1671918 -8108961 -13965937 -9568184 -2292867 -4371417 -13248753 -13316979 501941
3157 501941 14053805 14827039 9123282 8594661 10167597 3263852 -9083817 -12355203
3149 -12355203 -3409548 3733458 -821183 -8110891 -4343900 8786788 16632373 10437870
3141 10437870 -3613883 -12907043 -11540366 -5919526 -8765785 -24567917 -40757705 -39965991
$$ packed form
3198f039981J0717280n5807j4932544j4516066o43310J1441716J2500004L443872
3190A915164q781996j3350277l763645J0957183J3448276R46365j0051743p467143
3182a6147816K58105M6969n142016l376183N612255R470774J017412j2443603
3174b0704103j8001588r947719N958697J7772829J8028695J0458353L736904k37038
3166G065030n393112r780879n856976M397753P275317k078550q877336o8226J3818920
3157E01941J3551864P73234n703757n28621J572936o903745j2347669l271386
3149a2355203Q945655P143006m554641p289708L766991J3130688P845585o194503
3141A0437870j4051753r293160J366677N620840k846259j5802132j6189788P91714
$$ plain form
3133 -39965991 -22959706 -9931696 -13425740 -20756920 -13963720 2434115 9421856 3496184
3125 3496184 -492434 3912668 5674352 -901526 -4223702 3106261 8648900 1004201
3117 1004201 -8245786 -2300169 11372489 10960396 -4495477 -11601062 3949664 29017554
3109 29017554 42541511 37804727 20436590 -396747 -11726749 -2078617 22743405
3102 22743405 39676723 34188128 17507344 9010331 10806506 11996335 10902683 17396708
3094 17396708 33811495 47482512 46811845 35816297 26874284 24023846 19822496 8118079
3086 8118079 -5465819 -9804307 -3543615 2363445 881522 912915 14076896 33354317
3078 33354317 37994102 21201559 -312739 -9587336 -9254123 -9404465 -7792626 4088126
$$ packed form
3133c9965991J7006285J3028010l494044p331180O793200J6397835O987741n925672
3125C496184l988618M405102J761684o575878l322176P329963N542639p644699
3117A004201r249987N945617J3672658m12093j5455873p105585J5550726K5067890
3109B9017554J3523957m736784j7368137k0833337j1330002R648132K4822022
3102B2743405J6933318n488595j6680784q497013J796175J189829j093652O494025
3094A7396708J6414787J3671017o70667j0995548q942013k850438m201350j1704417
3086H118079j3583898m338488O260692N907060j481923L1393J3163981J9277421
3078C3354317M639785j6792543k1514298r274597L33213j50342J611839J1880752
$$ plain form
3070 4088126 22377904 33170509 31078227 23146725 16098559 12021131 15680637 32004662
3062 32004662 53303461 61570858 49379416 29236774 16566882 11911179 6652059 -1373644
3054 -1373644 -7170624 -9278079 -11742980 -15758228 -16729755 -11556280 -3979311 -11844
3046 -11844 -749525 -2573075 -3464603 -5908587 -12113666 -18776978 -20231608 -16326583 -12499020
3037 -12499020 -10688134 -5920185 3872030 10214388 4068220 -9173920 -13906216 -4531488
3029 -4531488 6850129 6312741 -5118970 -15430654 -17390058 -14287120 -11925825 -10432732
3021 -10432732 -5206040 6060773 18447757 22952164 16107129 5045969 -611242 -807701
3013 -807701 -3220577 -9109446 -9120275 2491335 16874157 21421777 16685839 13327407
$$ packed form
3070D088126J8289778J0792605k092282p931502p048166m077428L659506J6324025
3062C2004662K1298799Q267397j2191442k0142642j2669892m655703n259120q025703
3054a373644n796980k107455k464901m015248r71527N173475P576969L967467
3046a1844p37681j823550q91528k443984o205079o663312j454630L905025L827563
3037a2499020J810886M767949R792215O342358o146168j3242140m732296R374728
3029d531488J1381617n37388j1431711j0311684j959404L102938K361295J493093
3021a0432732N226692J1266813J2386984M504407o845035j1061160n657211j96459
3013h07701k412876n888869j0829J1611610J4382822M547620m735938l358432
$$ plain form
3005 13327407 14892692 14404297 8880992 6051695 11354816 16954184 11583080 -3721733
2997 -3721733 -17299404 -20830105 -14468134 -1674718 11792032 15634498 3262324 -15441349
2989 -15441349 -20268642 -4789755 14590212 20089769 14675694 14133726 24197248 36697252
2981 36697252 44063086 45220152 38394269 20787830 -2298172 -18585874 -22598632 -19903568
2973 -19903568 -15137437 -5427734 9873484 22123636 22995194 15440440 9365744 10286709
2965 10286709 15385864 16312913 4968488 -16482473 -31207471 -24001612 -3817112 3539584
2957 3539584 -10221920 -24858902 -23543359 -17598596 -23657468 -32761390 -25305507 -6465474
2949 -6465474 -161742 -10796884 -17488443 -9019956 838011 600332 474749 11839765
$$ packed form
3005A3327407J565285m88395n523305k829297N303121N599368n371104j5304813
2997c721733j3577671l530701O361971J2793416J3466750L842466j2372174j8703673
2989a5441349m827293J5478887J9379967N499557n414075n41968J0063522J2500004
2981C6697252P365834J157066o825883j7606439k3086002j6287702m012758K695064
2973a9903568M766131R709703J5301218J2250152Q71558p554754o074696R20965
2965A0286709N099155R27049j1344425k1450961j4724998P205859K0184500P356696
2957C539584j3761504j4636982J315543N944763o058872r103922P455883J8840033
2949f465474O303732j0635142o691559Q468487R857967k37679j25583J1365016
$$ plain form
2941 11839765 25838384 27508674 17810037 7127729 -2153897 -12144664 -17518803 -12042929
2933 -12042929 -1270204 4617477 6183057 10879665 18199803 21097735 19110297 17803707
2925 17803707 17189165 12846958 7623027 9805415 18613949 23069118 17988903 11006114
2917 11006114 10300879 14653334 20011257 27180446 36448217 40857430 32759329 14921537
2909 14921537 -1158671 -8308606 -10947355 -17526725 -27592475 -29923698 -16353955 4297349
2901 4297349 12281919 -545839 -20025543 -26357393 -16200307 -1551554 7986013 11632425
2893 11632425 9096987 -1265371 -13798287 -16500001 -5839922 7922483 15173185 18262572
2885 18262572 22476909 24509175 18912704 9546220 4111391 1132383 -6849427 -18890028
$$ packed form
2941A1839765J3998619J670290r698637j0682308r281626r990767n374139N475874
2933a2042929J0772725N887681J565580M696608P320138K897932j987438j306590
2925A7803707o14542m342207n223931K182388Q808534M455169n080215o982789
2917A1006114p05235M352455N357923P169189R267771M409213q098101j7837792
2909A4921537j6080208p149935k638749o579370j0065750k331223J3569743K0651304
2901D297349P984570j2827758j9479704o331850J0157086J4648753R537567L646412
2893A1632425k535438j0362358j2532916k701714J0660079J3762405P250702L089387
2885A8262572M214337K032266n596471r366484n434829k979008p981810j2040601
$$ plain form
2877 -18890028 -25544520 -23812225 -21525461 -23807708 -24843755 -18516382 -9592559 -7431731
2869 -7431731 -13257237 -19866405 -20672746 -13856799 -1125046 11748810 15958445 7706784
2861 7706784 -5944394 -14404891 -15023830 -12159553 -7817715 -782249 6555186 9537185
2853 9537185 10052468 14942761 23245681 24047724 11637853 -4732417 -11572596 -5352995
2845 -5352995 8933890 26242794 41553734 47628021 41470911 30009637 22184430 18157914
2837 18157914 12686595 5472278 608213 -1465046 -3790149 -6576141 -7645514 -6770946
2829 -6770946 -3790471 3003182 9679821 5032627 -12727767 -24397920 -10669298 18587901
2821 18587901 33849112 25319805 13726750 17031231 26012048 23867970 13680730 10734350
$$ packed form
2877a8890028o654492J732295K286764k282247j036047O327373Q923823K160828
2869g431731n825506o609168q06341O815947J2731753J2873856M209635q251661
2861G706784j3651178q460497o18939K864277M341838P035466P337435K981999
2853I537185N15283M890293Q302920Q02043j2409871j6370270o840179O219601
2845e352995J4286885J7308904J5310940O074287o157110j1461274p825207m026516
2837A8157914n471319p214317m864065k073259k325103k785992j069373Q74568
2829f770946K980475O793653O676639m647194j7760394j1670153J3728622K9257199
2821A8587901J5261211q529307j1593055L304481Q980817k144078j0187240k946380
$$ plain form
2813 10734350 17451756 21910973 17338929 10349028 10353582 18699009 27877586 28052592 17491626
2804 17491626 7497876 9812910 18553944 16627506 3015335 -2451903 10335442 23803247
2796 23803247 19139419 4571895 -1664104 -2959965 -14699938 -31076243 -28944965 -4862573
2788 -4862573 16879302 18107422 6968385 -2233188 -8731776 -15054982 -15308097 -6611304
2780 -6611304 1205730 -158322 -4223014 -2175934 1297728 -2978158 -11339252 -11532479
2772 -11532479 -218084 13840765 21150114 18686880 9785198 3497148 9158121 24690613
2764 24690613 35268146 30289058 16171926 5541442 629660 -3706694 -7104098 -5143909
2756 -5143909 333309 3439997 4093906 5272671 3557248 -5411249 -13606665 -6518497
$$ packed form
2813A0734350O717406M459217m572044o989901M554Q345427R178577J75006j0560966
2804A7491626r993750K315034Q741034j926438j3612171n467238J2787345J3467805
2796B3803247m663828j4567524o235999j295861j1739973j6376305K131278K4082392
2788d862573K1741875J228120j1139037r201573o498588o323206k53115Q696793
2780f611304P817034j364052m064692K047080L473662m275886q361094j93227
2772a1532479J1314395J4058849P309349k463234q901682o288050N660973J5532492
2764B4690613J0577533m979088j4117132j0630484m911782m336354l397404J960189
2756e143909N477218L106688O53909J178765j715423q968497q195416P088168
$$ plain form
2748 -6518497 15598822 34865011 38091603 30838344 24389778 19890426 13046578 5415850
2740 5415850 1423755 136914 -710666 2978167 15663782 31286403 38325585 34904172
2732 34904172 29269904 25062279 16944960 4249142 -1816010 7632475 24763444 33502084
2724 33502084 27852490 13339462 -5265667 -26124714 -41707439 -41662191 -28552598 -19467068
2716 -19467068 -25202488 -37005091 -41530693 -39418978 -37953424 -33461123 -16855325 5856622
2708 5856622 15461135 5343739 -8629735 -10001043 -1418008 5379985 8375411 13038555
2700 13038555 18633888 19210536 15286313 13520057 15543212 16631011 15320907 15017844
2692 15017844 15235337 10992998 3665473 2674337 11014481 17962102 14511218 9241282
$$ packed form
2748f518497K2117319J9266189L226592p253259o448566m499352o843848p630728
2740E415850l992095j286841q47580L688833J2685615J5622621P039182l421413
2732C4904172n634268m207625q117319j2695818o065152R448485J7130969Q738640
2724C3502084n649594j4513028j8605129k0859047j5582725M5248J3109593R085530
2716a9467068n735420j1802603m525602K111715J465554M492301J6605798K2711947
2708E856622R604513j0117396j3973474j371308Q583035O797993K995426M663144
2700A3038555N595333N76648l924223j766256K023155J087799j310104l03063
2692A5017844K17493m242339p327525r91136Q340144O947621l450884n269936
$$ plain form
2684 9241282 17372080 36632264 46840534 36294078 17396755 9388834 14254138 19522195
2676 19522195 19577343 21921848 32297384 44645793 49425183 43836304 30214463 12067394
2668 12067394 -3831586 -9457298 -6138228 -6054878 -15275517 -21816163 -10821051 12713502
2660 12713502 27967462 23674652 8523658 -3770057 -8478508 -6758796 324532 8973186
2652 8973186 11480036 4090969 -7916809 -16483730 -18507500 -15902074 -12616288 -12446334
2644 -12446334 -14419990 -10459021 4927422 22321409 24517616 8638585 -9145271 -15704202
2636 -15704202 -17039055 -24558063 -35005050 -35445491 -22881032 -7531937 1361383 3196324
2628 3196324 -63971 -8722844 -21948610 -34854740 -40795480 -34480664 -14748207 11544417
$$ packed form
2684I241282Q130798J9260184J0208270j0546456j8897323q007921M865304N268057
2676A9522195N5148K344505J0375536J2348409M779390n588879j3621841j8147069
2668A2067394j5898980n625712L319070Q3350r220639o540646J0995112K3534553
2660A2713502J5253960m292810j5150994j2293715m708451J719712P083328Q648654
2652H973186K506850p389067j2007778q566921k023770K605426L285786J69954
2644a2446334j973656L960969J5386443J7393987K196207j5879031j7783856o558931
2636a5704202j334853p519008j0446987m40441J2564459J5349095Q893320J834941
2628C196324l260295q658873j3225766j2906130n940740O314816J9732457K6292624
$$ plain form
2620 11544417 30020294 28815449 9610886 -13668951 -27427669 -28543614 -23490825 -19782580
2612 -19782580 -18517893 -15117398 -7244747 969556 5578521 9793671 17706806 23954739
2604 23954739 19396638 6817712 -240341 3142710 6252164 -449275 -12374364 -20431429
2596 -20431429 -22857598 -20734108 -13012015 -4507114 -7152787 -22223223 -32353569 -24558966
2588 -24558966 -10826542 -9668246 -16314972 -11578000 4502221 10978565 -173361 -10525113
2580 -10525113 -3385070 12585785 19585045 16883217 16558916 20893741 18995194 5078913
2572 5078913 -11393455 -17246038 -10916077 -2307625 -583933 -6405470 -15311265 -23197301
2564 -23197301 -25612334 -17078667 1765750 19139458 23131492 16830640 12392087 10474366
$$ packed form
2620A1544417J8475877j204845j9204563k3279837j3758718j115945N052789L708245
2612a9782580J264687L400495P872651Q214303M608965M215150P913135O247933
2604B3954739m558101j2578926p058053L383051L109454o701439j1925089q057065
2596b0431429k426169K123490P722093Q504901k645673j5070436j0130346P794603
2588b4558966J3732424J158296o646726M736972J6080221O476344j1151926j0351752
2580a0525113P140043J5970855O999260k701828l24301M334825j898547j3916281
2572E078913j6472368n852583O329961Q608452J723692n821537q905795p886036
2564b3197301k415033Q533667J8844417J7373708L992034o300852m438553j917721
$$ plain form
2556 10474366 -707234 -22722666 -38830523 -36279572 -22645139 -10473434 112831
2549 112831 11618919 16328839 8563996 -2071890 -5530126 -8136544 -18217488 -27000209
2541 -27000209 -22530202 -10966723 -3954842 2491907 13697470 15611479 -2306289 -16478333
2533 -16478333 2301776 37137276 41990803 9449174 -20224409 -22242898 -16238697 -21484222
2525 -21484222 -26839677 -23017076 -24123919 -36096755 -42597390 -42888385 -57717506 -68595988
2517 -68595988 -5626666 150989438 299319937 314688217 201823446 82285719 38727558
2510 38727558 40956408 32575726 17668574 27387980 53847679 63863406 51543294 38315384
2502 38315384 34930420 33491145 28294181 20802463 9721866 -5579388 -16697011 -15545152
$$ packed form
2556A0474366j1181600k2015432j6107857K550951J3634433J2171705J0586265
2549A12831J1506088M709920p764843j0635886l458236k606418j0080944q782721
2541b7000209M470007J1563479P011881O446749J1205563J914009j7917768j4172044
2533a6478333J8780109L4835500M853527l2541629k9673583k018489O004201n245525
2525b1484222n355455L822601j106843j1972836o500635k90995j4829121j0878482
2517f8595988O2969322J56616104J48330499J5368280j12864771j19537727m3558161
2510C8727558K228850q380682j4907152R719406K6459699J0015727j2320112j3227910
2502C8315384l384964j439275n196964p491718j1080597j5301254j1117623J151859
$$ plain form
2494 -15545152 -7021251 -741831 3831269 12817715 23884814 27786566 21073463 9118198
2486 9118198 -1330278 -7222545 -9553187 -12048401 -16454341 -18290789 -12072357 76341
2478 76341 11750177 21754119 30486913 30271403 14314883 -5073609 -5594921 12892327
2470 12892327 23465186 8218008 -17356284 -27924518 -21546775 -14449034 -13893556 -13346904
2462 -13346904 -8741484 -3634170 135221 4495760 8129393 6539263 -1424852 -13458541
2454 -13458541 -27131271 -36718825 -31667524 -7903460 21719340 37897640 35658009 26976056
2446 26976056 23116539 22630114 18381540 8887300 -1471068 -8949128 -12436266 -10788898
2438 -10788898 -2886746 8498825 16586037 18021466 18304768 24023714 30420386 25586632
$$ packed form
2494a5545152Q523901O279420M573100Q986446J1067099L901752o713103j1955265
2486I118198j0448476n892267k330642k495214m405940j836448O218432J2148698
2478G6341J1673836J0003942Q732794k15510j5956520j9388492n21312J8487248
2470A2892327J0572859j5247178k5574292j0568234O377743P097741N55478N46652
2462a3346904M605420N107314L769391M360539L633633j590130p964115j2033689
2454a3458541j3672730r587554N051301K3764064K9622800J6178300k239631q681953
2446B6976056l859517m86425m248574r494240j0358368p478060l487138J647368
2438a0788898P902152J1385571Q087212J435429K83302N718946O396672m833754
$$ plain form
2430 25586632 9815231 -96719 6543241 18004620 18295443 12198485 15674710 27525283
2422 27525283 30776875 21286562 14139731 18045069 23208483 21519746 20347673 26370383
2414 26370383 31271606 24622684 8760394 -8216256 -21833549 -25620063 -10908946 16976233
2406 16976233 36163230 33668004 20724167 11959959 4722767 -6725488 -12453555 -1704230
2398 -1704230 15211135 20147034 13734333 9257831 7896607 1211951 -7277326 -5466953
2390 -5466953 3965331 4688810 -7296333 -16976128 -11842688 5500255 27156911 46738687
2382 46738687 55506445 47928921 33672546 29523646 36913236 40887102 32785628 20073110
2374 20073110 12334277 11573885 17572173 28490570 35382617 31265725 25755025 33297112
$$ packed form
2430B5586632j5771401r911950O639960J1461379K90823o096958L476225J1850573
2422B7525283L251592r490313p146831L905338N163414j688737j172073O022710
2414B6370383M901223o648922j5862290j6976650j3617293l786514J4711117K7885179
2406A6976233J9186997k495226j2943837q764208p237192j1448255n728067J0749325
2398a704230J6915365M935899o412701m476502j361224o684656q489277J810373
2390e466953R432284P23479j1985143r679795N133440J7342943K1656656J9581776
2382D6738687Q767758p577524j4256375m148900P389590L973866q101474j2712518
2374B0073110p738833p60392N998288J0918397O892047m116892n510700P542087
$$ plain form
2366 33297112 46373699 41364848 15162979 -6506505 -5914950 3208761 1554830 -6385019
2358 -6385019 -5411552 3844744 10197354 12610345 17290497 21371858 16266779 2852032
2350 2852032 -10487865 -20483986 -27092758 -24329944 -7007140 16382533 30588750 31937506
2342 31937506 28696705 25516375 19366739 9980690 2755768 467258 1580750 6852274
2334 6852274 17880540 28472645 27640585 14230231 535576 -2232535 3916604 8930706
2326 8930706 6471637 -2652488 -14026297 -22274819 -22297212 -11715748 6798924 25867090
2318 25867090 36705747 34091813 19702559 299107 -17178019 -27502703 -26317508
2311 -26317508 -12809627 5639772 16696776 14241920 3810267 -4299231 -4403231 1620208
$$ packed form
2366C3297112J3076587n008851k6201869k1669484N91555R123711j653931p939849
2358f385019R73467R256296O352610K412991M680152M081361n105079j3414747
2350B852032j3339897r996121o608772K762814J7322804K3389673J4206217J348756
2342C1937506l240801l180330o149636r386049p224922k288510J113492N271524
2334F852274J1028266J0592105q32060j3410354j3694655k768111O149139N014102
2326H930706k459069r124125j1373809q248522k2393J0581464J8514672J9068166
2318B5867090J0838657k613934j4389254j9403452j7477126j0324684J185195
2311b6317508J3507881J8449399J1057004k454856j0431653q109498j04000O023439
$$ plain form
2303 1620208 5802971 -900867 -18274547 -31938539 -27967988 -13044328 -7977273 -17675332
2295 -17675332 -22111814 -6090937 15883597 18882978 1935390 -13899223 -16552910 -13924429
2287 -13924429 -14394482 -14258236 -9673282 -7020788 -13104275 -23653943 -28719964 -23680915
2279 -23680915 -9880105 9194430 25856122 27629478 7953663 -22116798 -39792831
2272 -39792831 -32140540 -9285161 7879058 12127386 15974899 30592607 46273709 43918091
2264 43918091 23041968 5065605 5775532 17242054 23762167 23602938 23969902 23864566
2256 23864566 16227646 2948009 -5461791 -4164726 2235923 8743177 13169833 12090798
2248 12090798 3678571 -6130011 -9309910 -6508986 -3857934 -1941319 1960517 3671716
$$ packed form
2303A620208M182763o703838j7373680j3663992L970551J4923660N067055r698059
2295a7675332m436482J6020877K1974534K999381j6947588j5834613k653687K628481
2287a3924429m70053J36246M584954K652494o083487j0549668n066021N039049
2279b3680915J3800810J9074535J6661692J773356j9675815l0070461j7676033
2272c9792831P652291K2855379J7164219M248328L847513J4617708J5681102k355618
2264D3918091k0876123j7976363P09927J1466522O520113j59229L66964j05336
2256B3864566p636920j3279637q409800J297065O400649O507254M426656j079035
2248A2090798q412227r808582l179899K800924K651052J916615L901836J711199
$$ plain form
2240 3671716 -3528200 -15614609 -21531049 -19884455 -18961196 -20035648 -15240597 -4101407
2232 -4101407 3078185 2819583 4723166 13836561 20825746 17943807 12280235 13872657
2224 13872657 21484229 29208165 36537808 42353192 39743462 27903418 19176469 22086969
2216 22086969 26707713 20286458 8285406 3783409 3481849 -6255552 -22749218 -27574816
2208 -27574816 -16144831 -6467232 -10608640 -14863404 -1049514 24556418 38713396 31884303
2200 31884303 17033536 8680395 6059709 1095129 -6364423 -9000917 -3972540 3136186
2192 3136186 6644200 6896119 5284569 -1291692 -14503139 -25624798 -21336057 -1085427
2184 -1085427 18341486 20627265 7648626 -5850455 -11037228 -11173805 -11086168 -9321408
$$ packed form
2240C671716p199916j2086409n916440J646594R23259j074452M795051J1139190
2232d101407P179592k58602J903583R113395O989185k881939n663572J592422
2224A3872657P611572P723936P329643N815384k609730j1840044q726949K910500
2216B2086969M620744o421255j2001052m501997l01560r737401j6493666m825598
2208b7574816J1429985R677599m141408m254764J3813890K5605932J4156978o829093
2200C1884303j4850767q353141k620686m964580p459552k636494N028377P108726
2192C136186L508014K51919j611550o576261j3211447j1121659M288741K0250630
2184a085427J9426913K285779j2978639j3499081n186773j36577Q7637J764760
$$ plain form
2176 -9321408 -3591813 2170928 1767619 -3696544 -4764522 5851930 23355540 34396763
2168 34396763 31156747 18839306 7020843 -2169332 -11523244 -18052760 -15182612 -6733453
2160 -6733453 -6875108 -19317166 -26468597 -10792852 18386332 32858401 20521112 113142
2152 113142 -3817604 8723015 16279167 5111659 -14469514 -23241183 -17865668 -13692765
2144 -13692765 -23707982 -42267425 -54146114 -53828287 -47351253 -37859265 -21123252 1686873
2136 1686873 17821566 17236762 6321262 -441429 2210103 8724004 14191762 18756006
2128 18756006 22195451 21760978 15966829 6246127 -4304894 -11039158 -9893837 -2831005
2120 -2831005 3312830 7003345 14280469 25458911 28705285 17234825 5285338 12561860
$$ packed form
2176i321408N729595N762741m03309n464163j067978J0616452J7503610J1041223
2168C4396763l240016j2317441j1818463r190175r353912o529516K870148Q449159
2160f733453j41655j2442058p151431J5675745K9179184J4472069j2337289k0407970
2152A13142l930746J2540619P556152j1167508j9581173q771669N375515M172903
2144a3692765j0015217j8559443j1878689L17827O477034R491988J6736013K2810125
2136A686873J6134693n84804j0915500o762691K651532O513901N467758M564244
2128A8756006L439445m34473n794149r720702j0551021o734264J145321P062832
2120b831005O143835L690515P277124J1178442L246374j1470460j1949487P276522
$$ plain form
2112 12561860 35899952 51154970 43738553 24049058 10453516 8999257 13468528 15193765
2104 15193765 8946398 -2538799 -7595158 2376178 18844211 23809530 12514921 -2532697
2096 -2532697 -11319374 -16650987 -21550705 -21489466 -16349132 -16199386 -25358271 -32466541 -27269702
2087 -27269702 -17049263 -14621393 -18621052 -18007937 -9185238 3594843 18717410 35058684
2079 35058684 43585198 34284450 10536805 -13124897 -25968790 -26330970 -16730435 -3156386
2071 -3156386 5323157 6036972 7053105 12749578 12887051 -761960 -14991144 -10370874
2063 -10370874 8959183 21000283 19611460 20060047 28526325 30065255 15541104 -1393434
2055 -1393434 -7077703 -8586866 -16046257 -20664915 -9372507 10636630 21910831 22813745
$$ packed form
2112A2561860K3338092J5255018p416417j9689495j3595542j454259M469271J725237
2104A5193765o247367j1485197n056359R971336J6468033M965319j1294609j5047618
2096b532697q786677n331613m899718O1239N140334J49746r158885p108270N196839
2087b7269702J0220439K427870l999659O13115Q822699J2780081J5122567J6341274
2079C5058684Q526514r300748k3747645k3661702j2843893l62180R600535J3574049
2071c156386Q479543P13815J016133N696473J37473j3649011j4229184M620270
2063a0370874J9330057J2041100j388823M48587Q466278J538930j4524151j6934538
2055a393434n684269j509163p459391m618658J1292408K0009137J1274201R02914
$$ plain form
2047 22813745 23435976 21725347 6213356 -18300088 -30010929 -20054811 -4966555 -2138386
2039 -2138386 -8546553 -12789283 -14211377 -17670450 -18830987 -8487235 12050998 30756431
2031 30756431 38847227 36912244 28367762 14936499 -100872 -10163307 -9956226 -213526
2023 -213526 12552516 20243680 18886992 12254856 8389030 10895830 15769930 18277074
2015 18277074 19183640 20800060 20795202 15823684 9458572 9657651 17237435 22497570 16267140
2006 16267140 1019058 -11882498 -14251894 -8267410 -2748883 -4122089 -11055348 -17451892
1998 -17451892 -20265905 -22692930 -28236394 -33852903 -32918473 -24518066 -14932381 -8314196
1990 -8314196 -754517 12237890 25452039 27197976 13677679 -4083734 -10427029 -836174
$$ packed form
2047B2813745O22231j710629j5511991k4513444j1710841R956118J5088256K828169
2039b138386o408167m242730j422094l459073j160537J0343752K0538233J8705433
2031C0756431Q090796j934983q544482j3431263j5037371j0062435K07081R742700
2023b13526J2766042P691164j356688o632136l865826K506800M874100K507144
2015A8277074R06566J616420m858m971518o365112J99079P579784N260135o230430
2006A6267140j5248082j2901556k369396N984484N518527j373206o933259o396544
1998a7451892k814013k427025n543464n616509R34430Q400407R585685O618185
1990h314196P559679J2992407J3214149J745937j3520297j7761413o343295R590855
$$ plain form
1982 -836174 14304183 21003433 14825578 2570641 -6893642 -10614009 -10197456 -6268654
1974 -6268654 1518073 9533314 10241366 138413 -14933251 -25585559 -28455011 -26679061
1966 -26679061 -22308814 -13638076 -1590968 6544727 4944450 -1206836 -130490 11286280
1958 11286280 22144820 21423563 13001637 10131578 16453037 21187479 15944763 7707339
1950 7707339 7733275 13399346 11603873 -1263839 -13963154 -17547889 -17459028 -22148018 -27693895
1941 -27693895 -23233581 -8214233 5204572 7369908 1739801 -1466666 3032757 12893708
1933 12893708 23625635 33041679 40428287 43748869 40404694 31977404 25511622 25941702
1925 25941702 28510986 24369136 13405856 4086985 -510472 -6740639 -16497691 -20400374
$$ packed form
1982h36174J5140357O699250o177855j2254937r464283l720367M16553L928802
1974f268654P786727Q015241P08052j0102953j5071664j0652308k869452J775950
1966b6679061M370247Q670738J2047108Q135695j600277o151286J076346J1416770
1958A1286280J0858540p21257q421926k870059O321459M734442n242716q237424
1950G707339K5936N666071j795473j2867712j2699315l584735Q8861m688990n545877
1941b7693895M460314J5019348J3418805K165336n630107l206467M499423R860951
1933A2893708J0731927R416044P386608L320582l344175q427290o465782M30080
1925B5941702K569284m141850j0963280r318871m597457o230167r757052l902683
$$ plain form
1917 -20400374 -12981808 -4268443 -4665787 -7558550 -2118321 3797011 -6911293 -30133336
1909 -30133336 -40369884 -24875971 708998 17155451 23861661 27090179 24183751 14049050
1901 14049050 9008164 18534263 30425820 25873022 7394897 -5703991 -6490723 -7129295
1893 -7129295 -15634592 -22580692 -16664316 -1750347 8739927 8257554 3149756 5233817
1885 5233817 19520306 37364929 44467107 38469152 32334425 34721437 36409494 27363149
1877 27363149 17919858 25289588 43731880 49403705 36158515 24842185 30398604 40661808
1869 40661808 39907151 35130649 41471997 54043413 53866624 35952609 13915344 -703318
1861 -703318 -7904858 -9204717 -4061023 1365494 -3866505 -19438271 -30433497 -25724662
$$ packed form
1917b0400374P418566Q713365l97344k892763N440229N915332j0708304k3222043
1909c0133336j0236548J5493913K5584969J6446453O706210L228518k906428j0134701
1901A4049050n040886R526099J1891557m552798j8478125j3098888p86732o38572
1893g129295q505297o946100N916376J4913969J0490274m82373n107798K084061
1885E233817J4286489J7844623P102178n997955o134727K387012J688057r046345
1877B7363149r443291P369730J8442292N671825j3245190j1316330N556419J0263204
1869D0661808p54657m776502O341348J2571416j76789j7914015k2037265j4618662
1861g03318p201540j299859N143694N426517n231999j5571766j0995226M708835
$$ plain form
1853 -25724662 -10953924 2029764 9533570 12547952 7571716 -7537787 -22239165 -20452529
1845 -20452529 -1282003 16927522 17969687 6237873 -1992857 427253 8081311 16904535
1837 16904535 29041555 41036472 39368405 17459435 -9647664 -19448718 -9039400
1830 -9039400 3333638 4845221 3972873 13265433 26118594 23087542 -497767 -24768508
1822 -24768508 -27757122 -10795372 5434621 7369916 2536129 4935551 14752602 20496782
1814 20496782 17226500 12336089 12999874 17969290 24281655 31574213 35111439 25760175
1806 25760175 4427095 -14339418 -22398188 -29603474 -42795341 -47093354 -28459418 -4547184
1798 -4547184 -6019598 -29590606 -38724632 -16316566 11590969 16407063 5270433 977082
$$ packed form
1853b5724662J4770738J2983688P503806L014382m976236j5109503j4701378J786636
1845b0452529J9170526J8209525J042165j1731814q230730K420110P654058Q823224
1837A6904535J2137020J1994917j668067k1908970k7107099r801054J0409318
1830i039400J2373038J511583q72348R292560J2853161l031052k3585309k4270741
1822b4768508k988614J6961750J6229993J935295m833787K399422R817051N744180
1814B0496782l270282m890411O63785M969416O312365P292558L537226r351264
1806B5760175k1333080j8766513q058770p205286j3191867m298013J8633936K3912234
1798d547184j472414k3571008r134026K2408066K7907535M816094j1136630m293351
$$ plain form
1790 977082 5594706 7098647 6914185 15441724 27808865 27497364 11722545 -5951925
1782 -5951925 -16885988 -24200071 -29574453 -29939001 -27741650 -29078236 -30367667 -21613465
1774 -21613465 -5196724 2794856 -5699082 -19392397 -22506072 -11108684 8901949 30218358
1766 30218358 45713938 49617504 42294207 29293995 14061016 -2832993 -17197124
1759 -17197124 -22122888 -17621652 -12200998 -11824369 -13063079 -10012748 -2971836 3049735
1751 3049735 5431940 6818675 11312359 18033033 19640401 10795466 -2529557 -8726225
1743 -8726225 -6090497 -3429568 -3127006 3313857 16317404 19477673 2210698 -20506014
1735 -20506014 -25860341 -12169254 3812573 9894959 4644039 -9240468 -21169586 -12898965
$$ packed form
1790I77082M617624J503941j84462Q527539J2367141l11501j5774819j7674470
1782e951925j0934063p314083n374382l64548K197351j336586j289431Q754202
1774b1613465J6416741P991580q493938j3693315l113675J1397388K0010633K1316409
1766C0218358J5495580L903566p323297j3000212j5232979j6894009j4364131
1759a7197124m925764M501236N420654L76629j238710L050331P040912O021571
1751C049735K382205J386735M493684O720674J607368q844935j3325023o196668
1743h726225K635728K660929L02562O440863J3003547L160269j7266975k2716712
1735b0506014n354327J3691087J5981827O082386n250920j3884507j1929118Q270621
$$ plain form
1727 -12898965 17674034 42432556 35005616 8534896 -3018587 6198119 12137302 3599453
1719 3599453 -4999204 -5014913 -6437956 -13404185 -15257321 -9429683 -7196827 -10241503 -7674599
1710 -7674599 -1879122 -8995661 -27174191 -34053971 -23170003 -11666740 -4541253 13627194
1702 13627194 41686935 55118610 49001943 47066974 53361896 41171107 9604984 -987327
1694 -987327 21719380 32765927 7061939 -12453616 8429972 31467976 20923214
1687 20923214 19483537 68272537 112190149 93271128 89812228 220429234 420093779
1680 420093779 470198321 292577238 69823598 -2319634 42435639 48788478 -12748302
1673 -12748302 -42565558 -1291517 39542962 30989415 12104392 21134589 34048497
$$ packed form
1727a2898965L0572999K4758522p426940k6470720j1553483R216706N939183q537849
1719C599453q598657j5709j423043o966229j853136N827638K232856l044676K566904
1710g674599N795477p116539j8178530o879780J0883968J1503263P125487J8168447
1702A3627194K8059741J3431675o116667j934969O294922j2190789l1566123j0592311
1694i87327K2706707J1046547k5703988j9515555K0883588K3038004j0544762
1687B0923214j439677M8789000M3917612j8919021l458900J30617006J99664545
1680D20093779N0104542j77621083k22753640p2143232M4755273O352839o1536780
1673a2748302k9817256M1274041M0834479q553547j8885023R030197J2913908
$$ plain form
1666 34048497 23336580 7434018 7779610 10534504 1524421 -4840591 1457381 2975772
1658 2975772 -9905704 -15812346 -233682 14845659 6417918 -10789856 -9421849 6736957
1650 6736957 12315551 765394 -10152292 -6789227 6264455 17648453 21539361 20440906
1642 20440906 22422594 31231628 37206335 27679610 8176766 -331347 10644077 26473398
1634 26473398 32077352 29938455 28306334 26714522 22720510 20038977 20720321 20753727 20617378
1625 20617378 26989793 36731593 34551388 16217772 -1653189 -6715432 -9814324 -23852340
1617 -23852340 -38534632 -35172114 -16507416 -2178356 -547032 -3290575 -3966083 -4188699
1609 -4188699 -2901401 3891561 11777389 10389294 -1134234 -13074646 -20776125 -29844654
$$ packed form
1666C4048497j0711917j5902562L45592K754894r010083o365012O297972J518391
1658B975772j2881476n906642J5578664J5079341q427741j7207774J368007J6158806
1650F736957N578594j1550157j0917686L363065J3053682J1383998L890908j098455
1642B0440906J981688Q809034N974707r526725j9502844q508113J0975424J5829321
1634B6473398N603954k138897j632121j591812l994012k681533O81344L3406j36349
1625B0617378O372415R741800k180205j8333616j7870961n062243l098892j4038016
1617b3852340j4682292L362518J8664698J4329060J631324k743543o75508k22616
1609d188699J287298O792962P885828j388095j1523528j1940412p701479r068529
$$ plain form
1601 -29844654 -43403291 -54323716 -53598385 -39395433 -16384634 7178052 21513381
1594 21513381 22245289 16593955 16359858 24174705 32188926 33072244 25576781 11273415
1586 11273415 -5337985 -14507141 -9410865 2214218 4875320 -3768644 -9299128 -2144409
1578 -2144409 7963596 6852464 -3465860 -9362305 -5636141 238816 2430500 4299267
1570 4299267 9321371 13744793 13728265 13439516 18871149 26838181 27987973 20452068 12586469
1561 12586469 9620822 5308686 -6935869 -20186054 -20512314 -6080039 9216636 12805668
1553 12805668 6283887 -1846518 -8719010 -16688731 -25686357 -32903336 -37842112 -41797302
1545 -41797302 -43053171 -37333836 -23501739 -6259867 6769470 9945275 4031434 -2787695
$$ packed form
1601b9844654j3558637j0920425P25331J4202952K3010799K3562686J4335329
1594B1513381P31908n651334k34097P814847Q014221Q83318p495463j4303366
1586A1273415j6611400r169156N096276J1625083K661102q643964n530484P154719
1578b144409J0108005j111132j0318324n896445L726164N874957K191684J868767
1570D299267N022104M423422j6528k88749N431633P967032J149792p535905p865599
1561A2586469k965647m312136j2244555j3250185l26260J4432275J5296675L589032
1553A2805668o521781q130405o872492p969721q997626p216979m938776l955190
1545d1797302j255869N719335J3832097J7241872J3029337L175805n913841o819129
$$ plain form
1537 -2787695 -1860524 5255063 6967530 -3419266 -16684189 -17536939 -3599108 11903830
1529 11903830 16531141 11664374 7092386 7361703 7744166 2524164 -6476456 -11592164
1521 -11592164 -8424123 -344181 7151767 12842592 16531376 13062408 -2129263 -21429304
1513 -21429304 -28674049 -18549118 -3994071 1823480 2736938 9651166 20146104 21060789
1505 21060789 9768793 -579975 -358195 3133308 -1996626 -14428657 -22456017 -20539147
1497 -20539147 -14771890 -12544241 -13905235 -14990915 -14264155 -11279385 -3171931 11108687
1489 11108687 23477225 21137850 2604082 -15918991 -16682242 -326160 16873387 23397547
1481 23397547 21839739 18968946 17028845 17197396 21072156 23760018 15346134 -3965245
$$ packed form
1537b787695R27171P115587J712467j0386796j3264923q52750J3937831J5502938
1529A1903830M627311m866767m571988K69317L82463n220002r000620n115708
1521a1592164L168041Q079942P495948N690825L688784l468968j5191671j9300041
1513b1429304p244745J0124931J4555047N817551R13458O914228J0494938R14685
1505B1060789j1291996j0348768K21780L491503n129934j2432031q027360J916870
1497b0539147N767257K227649j360994j085680P26760K984770Q107454J4280618
1489A1108687J2368538k339375j8533768j8523073p63251J6356082J7199547O524160
1481B3397547j557808k870793j940101J68551L874760K687862q413884j9311379
$$ plain form
1473 -3965245 -19352747 -20490787 -16632106 -21977994 -33230515 -34969382 -23502389 -11451549
1465 -11451549 -8987516 -13225039 -18077703 -23134069 -28520779 -29636086 -22257972 -8390700
1457 -8390700 5580173 13540973 13161298 8960000 9576726 16507005 19204452 8956004
1449 8956004 -6705378 -13848791 -12690098 -14913859 -22153188 -23464408 -17022544 -17220019
1441 -17220019 -31492655 -43707206 -32825086 -552895 30255673 40676848 31649680
1434 31649680 18379285 14619868 20099381 21413501 9479684 -5228770 -4613029 9757142
1426 9757142 15753233 2282313 -13932774 -13963670 -5208335 -8750929 -27195449 -42119805
1418 -42119805 -39759392 -24135434 -6128042 7075246 11687335 8329645 4372923 5961679
$$ packed form
1473c965245j5387502j138040L858681n345888j1252521j738867J1466993J2050840
1465a1451549K464033m237523m852664n056366n386710j115307P378114J3867272
1457h390700J3970873P960800l79675m201298O16726O930279K697447j0248448
1449H956004j5661382p143413J158693k223761p239329j311220O441864j97475
1441a7220019j4272636j2214551J0882120L2272191L0808568J0421175r027168
1434C1649680j3270395l759417N479513J314120j1933817j4708454O15741J4370171
1426I757142N996091j3470920j6215087l0896Q755335l542594j8444520j4924356
1418d2119805K360413J5623958J8007392J3203288M612089l357690l956722J588756
$$ plain form
1410 5961679 7880376 182515 -16241850 -30126077 -34555569 -31271571 -21778775 -6087587
1402 -6087587 9006680 12639456 4245262 -4929703 -8090163 -10860982 -18884402 -27401225
1394 -27401225 -29834925 -29016471 -31701629 -36161615 -33126644 -18767336 -1750098 4466395
1386 4466395 -4490278 -18926922 -25672151 -22891402 -19579027 -19733753 -15925643 -4042208
1378 -4042208 5566465 2634432 -5149976 -3189575 6275790 8357551 1256004 -1339380
1370 -1339380 4310242 3997618 -9950316 -24212972 -24861616 -16785252 -10796058 -5319220
1362 -5319220 4612419 11549622 5601120 -6536422 -8335436 4356888 21270311 34587283
1354 34587283 44562022 49944578 45655961 31422362 14104188 1246386 -1904351 7057791
$$ packed form
1410E961679J918697p697861j6424365j3884227m429492L283998R492796J5691188
1402f087587J5094267L632776q394194r174965l160460k770819q023420q516823
1394b7401225k433700Q18454k685158m459986L034971J4359308J7017238O216493
1386D466395q956673j4436644o745229K780749L312375j54726L808110J1883435
1378d042208R608673k932033p784408J960401R465365K081761p101547k595384
1370a339380N649622l12624j3947934j4262656o48644Q076364N989194N476838
1362e319220R931639O937203n948502j2137542j799014J2692324J6913423J3316972
1354C4587283R974739N382556m288617j4233599j7318174j2857802l150737Q962142
$$ plain form
1346 7057791 22260623 29556395 21667889 8933688 4880346 6623512 2239471 -7303741
1338 -7303741 -8967765 1762374 16618224 29816170 41051649 43241731 26724331 570981
1330 570981 -9205766 7804604 31082926 36932864 27708096 21052861 22205722 22248762
1322 22248762 16265862 7867523 -1162941 -12615409 -23732617 -27338466 -20843852 -8963489
1314 -8963489 1874350 7758664 8893315 10749834 19107306 30239563 32524237 22546039
1306 22546039 11506547 8981148 9320043 3487896 -4325698 -4102056 2609019 6077574
1298 6077574 4863264 5704805 10116318 14038046 17929157 23716952 24634423 13515551
1290 13515551 -314695 373081 14204403 21191831 12957290 4650364 9507666 19006867
$$ packed form
1346G057791J5202832P295772p888506j2734201m053342J743166m384041r543212
1338g303741j664024J0730139J4855850J3197946J1235479K190082j6517400k6153350
1330E70981r776747J7010370K3278322N849938r224768o655235J152861M3040
1322B2248762n982900q398339r030464j1452468j1117208l605849O494614J1880363
1314h963489J0837839N884314J134651J856519Q357472J1132257K284674r978198
1306B2546039j1039492k525399L38895n832147p813594K23642O711075L468555
1298F077574j214310Q41541M411513L921728L891111N787795R17471j1118872
1290A3515551j3830246O87776J3831322O987428q234541q306926M857302R499201
$$ plain form
1282 19006867 19147998 11625081 5980203 2771494 -1719908 -3732703 841838 5197585
1274 5197585 1779497 -2362824 4482509 17037923 17159849 129104 -16961504 -16643132
1266 -16643132 -874080 14631027 18947654 15119943 14461644 23294095 34311645 34152951
1258 34152951 21683393 11929543 15650581 22417976 14481812 -7467683 -24897876 -26164624
1250 -26164624 -18488231 -14452443 -17265895 -21455006 -19620411 -7466243 9978680 17940091
1242 17940091 7298442 -10432286 -14720003 -2250878 11454522 17194568 22732676 33751896
1234 33751896 41307639 38316260 34140830 39453424 47355752 44295877 32483714 26413448
1226 26413448 31041469 37408255 38106040 34206774 27232994 16320266 4475864 -2853349
$$ packed form
1282A9006867J41131p522917n644878l208709m491402k012795M574541M355747
1274E197585l418088m142321O845333J2555414J21926j7030745j7090608L18372
1266a6643132J5769052J5505107M316627l827711o58299Q832451J1017550j58694
1258C4152951j2469558r753850L721038O767395p936164k1949495j7430193j266748
1250b6164624P676393M035788k813452m189111J834595J2154168J7444923P961411
1242A7940091j0641649j7730728m287717J2469125J3705400N740046N538108J1019220
1234C3751896P555743k991379m175430N312594P902328l059875j1812163o070266
1226B6413448M628021O366786O97785l899266o973780j0912728j1844402p329213
$$ plain form
1218 -2853349 -6629820 -11511072 -13336362 -1395775 22559586 39264869 34217370 16948639
1210 16948639 8413041 14174625 20893343 18184936 12676133 15916320 26135681 29964705
1202 29964705 20131666 4324735 -4669192 -2272016 6495510 13587771 12011325 -1556110
1194 -1556110 -21538231 -33633780 -27793913 -10372072 3473017 8303762 10842304 14628350
1186 14628350 14036861 7078349 2200823 4643236 5581460 -5109355 -21665203 -28391784
1178 -28391784 -19379407 -3560267 7297431 8346259 2637613 -396635 9179406 30075815
1170 30075815 47091400 46803028 31811256 13340525 -2793629 -13575158 -11339340 6048362
1162 6048362 23248369 22831007 10218635 5938971 14525903 21279767 21298292 27872732
$$ packed form
1218b853349l776471m881252j825290J1940587K3955361J6705283n047499j7268731
1210A6948639q535598N761584O718718k708407n508803L240187J0219361L829024
1202B9964705r833039j5806931q993927K397176Q767526P092261j576446j3567435
1194a556110j9982121j2095549N839867J7421841J3845089M830745K538542L786046
1186A4628350n91489o958512m877526K442413R38224j0690815j6555848o726581
1178b8391784R012377J5819140J0857698J048828n708646l034248R576041K0896409
1170C0075815J7015585k88372j4991772j8470731j6134154j0781529K235818J7387702
1162F048362J7200007m17362j2612372m279664Q586932O753864J8525O574440
$$ plain form
1154 27872732 43579314 46772152 23600174 -4791891 -8402367 9573084 19249887 7320603
1146 7320603 -8671941 -10615753 -4266296 -5694085 -17142307 -26616756 -24671782 -13109854
1138 -13109854 248993 9186602 11509269 7903879 1226972 -2806256 2472692 17234400
1130 17234400 30317501 28773060 14303054 2864568 4246051 10402020 10168795 6281280
1122 6281280 7355451 10380921 5344400 -5719014 -9318004 -1361148 6594189 6275309
1114 6275309 5083967 11838244 20260091 17449694 3844210 -5694872 -146539 15782670
1106 15782670 28824799 30661728 22581305 10699960 -297795 -9385903 -17108811 -22580868
1098 -22580868 -23480941 -19034425 -11796602 -5609422 -2364579 -1653987 -3198761 -7855952
$$ packed form
1154B7872732J5706582L192838k3171978k8392065l610476J7975451R676803j1929284
1146G320603j5992544j943812O349457j427789j1448222r474449J944974J1561928
1138a3109854J3358847Q937609K322667l605390o676907m033228N278948J4761708
1130A7234400J3083101j544441j4470006j1438486J381483O155969k33225l887515
1122F281280J074171L025470n036521j1063414l598990P956856P955337l18880
1114F275309j191342O754277Q421847k810397j3605484r539082N548333J5929209
1106A5782670J3042129J836929q080423j1881345j0997755r088108p722908n472057
1098b2580868r00073M446516P237823O187180L244843P10592j544774m657191
$$ plain form
1090 -7855952 -14740169 -18539846 -13547948 -2189871 4354429 -1455215 -13136357 -18125957
1082 -18125957 -14026916 -8683498 -4825818 3681286 16549273 20717910 8754968 -6180340
1074 -6180340 -6435973 5243065 10902682 4341419 -2177249 984791 7526159 7788785
1066 7788785 3088610 902789 3927929 9783204 15078417 15275416 7379512 -2759007
1058 -2759007 -3323555 7681739 16842735 12581113 1647046 93771 12472350 28833235
1050 28833235 39281466 42056952 37965110 26135024 7974814 -10504051 -22965356
1043 -22965356 -26279641 -19857097 -6148358 7370880 11765476 5201764 -4461171 -7792757
1035 -7792757 -3193327 2755788 2760495 -4230247 -12110566 -12846743 -3858101 8919591 16131000
$$ packed form
1090g855952o884217l799677M991898J1358077O544300n809644j1681142m989600
1082a8125957M099041N343418L857680Q507104J2867987M168637j1962942j4935308
1074f180340k55633J1679038N659617o561263o518668L162040O541368K62626
1066G788785m700175k185821L025140N855275N295213J96999p895904j0138519
1058b759007n64548J1005294R160996m261622j0934067j553275J2378579J6360885
1050B8833235J0448231K775486m091842j1830086j8160210j8478865j2461305
1043b2965356l314285O422544J3708739J3519238M394596o563712r662935l331586
1035g792757M599430N949115M707o990742p880319p36177Q988642J2777692P211409
$$ plain form
1026 16131000 13914178 7236110 3734057 4833818 4603380 -1617060 -9131068 -7915579
1018 -7915579 4507888 18356614 23022576 19586566 16500576 15775142 12142745 6245447
1010 6245447 8097087 21739737 34865955 32902604 18798566 8664484 9367459 11206358
1002 11206358 4792926 -4908518 -7200380 -1239930 4515066 4606532 673911 -5078964
994 -5078964 -12531721 -18778040 -18173601 -11177326 -7581913 -15243942 -28555385 -33997700
986 -33997700 -26131161 -12782064 -4590064 -4679181 -9369754 -13899925 -15512380 -14827434 -15524347
977 -15524347 -18932772 -19103218 -9334528 5976523 14467202 13197990 12648767 18174312
969 18174312 19658509 10001876 2220584 11721845 29172821 31443839 17486266 10804100
$$ packed form
1026A6131000k216822o678068l502053J099761k30438o220440p514008J215489
1018g915579J2423467J3848726M665962l436010l085990p25434l632397n897298
1010F245447J851640J3642650J3126218j963351j4104038j0134082P02975J838899
1002A1206358o413432r701444k291862N960450N754996R1466l932621n752875
994e078964p452757o246319O04439O996275L595413p662029j3311443n442315
986c3997700P866539J3349097Q192000q9117m690573m530171j612455O84946o96913
977a5524347l408425j70446R768690J5311051Q490679j269212n49223N525545
969A8174312J484197r656633p781292R501261J7450976K271018j3957573o682166
$$ plain form
961 10804100 21941069 31330311 21180365 4591378 4590543 17786994 21100377 8989497
953 8989497 1321708 11468490 25303509 20695870 -3653152 -28220848 -35241816 -23605698
945 -23605698 -5017712 7395024 7134663 -3222344 -14574903 -17617475 -9755646 1793993
937 1793993 4461588 -8616386 -30521102 -46165447 -47336265 -39082168 -29956873 -21238291
929 -21238291 -10352013 -902261 -2032559 -17022345 -36807946 -46878262 -39987347 -22257943
921 -22257943 -6889074 -968276 402712 4909397 11279288 12720875 9422194 7766113
913 7766113 7000007 -967045 -14745394 -20080656 -11383800 -3490908 -9738139 -19967086
905 -19967086 -16796519 -5382586 -6911523 -25107203 -39565212 -35052240 -19323609 -6318086
$$ packed form
961A0804100J1136969R389242j0149946j6588987q35J3196451L313383j2110880
953H989497p667789J0146782J3835019m607639k4349022k4567696p020968J1636118
945b3605698J8587986J2412736k60361j0357007j1352559l042572P861829J1549639
937A793993K667595j3077974k1904716j5644345j170818Q254097R125295Q718582
929b1238291J0886278R449752j130298j4989786j9785601j0070316O890915J7729404
921b2257943J5368869N920798J370988M506685O369891J441587l298681j656081
913G766113p66106p967052j3778349n335262Q696856P892892o247231j0228947
905a9967086L170567J1413933j528937j8195680j4458009M512972J5728631J3005523
$$ plain form
897 -6318086 1935290 8427241 10404277 6324867 3442960 7681009 13197957 11692329
889 11692329 5728695 2822199 1220727 -7372879 -22308456 -31000243 -23521047 -4615087
881 -4615087 11002178 12980619 4400036 -2504097 89991 7365533 9661554 6068072
873 6068072 3939087 5799564 5935127 2366002 2216167 9277653 15162575 11460296 3901437
864 3901437 4158325 12084734 17701957 19116445 25549603 39239828 45704651 30832662
856 30832662 2561501 -14117840 -4925584 17358766 28269706 19803617 7082506 7085982
848 7085982 18497219 27721156 28423405 25288708 20767312 10294085 -6097442 -18120377
840 -18120377 -18016364 -11451198 -8240051 -8378341 -5642811 1841 3647729 6316078 13412355
$$ packed form
897f318086Q253376O491951J977036m079410k881907M238049N516948j505628
889A1692329n963634k906496j601472q593606j4935577q691787P479196J8905960
881d615087J5617265J978441q580583o904133K594088P275542K296021l593482
873F068072k128985J860477J35563l569125j49835P061486N884922l702279p558859
864C901437K56888P926409N617223J414488O433158J3690225O464823j4871989
856C0832662k8271161j6679341R192256K2284350J0910940q466089j2721111L476
848G085982J1411237R223937P02249l134697m521396j0473227j6391527j2022935
840a8120377J04013O565166L211147j38290K735530N644652L645888K668349P096277
$$ plain form
831 13412355 21669134 18619609 42586 -19914488 -23222649 -8935949 7002150 11758989
823 11758989 8918715 9970624 18043616 25718505 27338370 26523089 28577195 30887272
815 30887272 26723845 16005005 5864850 1258546 1368908 5438378 14760865 26231345
807 26231345 30429589 21023732 2917657 -12406821 -17730729 -15032809 -12377864 -16230069
799 -16230069 -23552101 -22917656 -9126027 5425914 3573089 -12234856 -20566464 -9951936
791 -9951936 5775980 9084601 3374884 3481305 10513380 11700660 1845782 -9693160
783 -9693160 -13756415 -11243680 -6885468 -3324974 -3258900 -8503130 -14634272 -14199778 -7215847
774 -7215847 -1471044 -1011459 -1839582 -1057472 -2454481 -9093199 -16290583 -16299309 -6507712
$$ packed form
831A3412355Q256779l049525j8577023j9957074l308161J4286700J5938099M756839
823A1758989k840274J051909Q072992P674889J619865q15281K054106K310077
815C0887272m163427j0718840j0140155m606304J10362M069470R322487J1470480
807B6231345M198244r405857j8106075j5324478n323908K697920K654945l852205
799a6230069p322032O34445J3791629J4551941j852825j5807945q331608J0614528
791i951936J5727916L308621n709717J06421P032075J187280r854878j1538942
783i693160m063255K512735M358212L560494O6074n244230o131142M34494O983931
774g215847N744803M59585q28123P82110j397009o638718p197384q726R791597
$$ plain form
765 -6507712 9201203 23496530 28741961 21949078 8960648 10159 -564971 3163134
757 3163134 6811192 11130878 17496822 22893803 22816781 16516773 7193318 -799690 -3883878
748 -3883878 -1442873 2348519 1474926 -5562870 -14186152 -19189895 -19492438 -16857765 -12678512
739 -12678512 -7930726 -4999016 -7309495 -15697174 -24902027 -26123247 -16597003 -5459751
731 -5459751 -4549362 -12956299 -17709681 -11984144 -4079241 -3084899 -4291162 2506246 16761970
722 16761970 29187969 34991752 34525719 25130171 5055986 -16174844 -24593781 -20272403
714 -20272403 -17078434 -21415422 -22846794 -11153455 6610404 13356329 1831762 -17630253
706 -17630253 -27522954 -20379932 -7261980 -6475528 -20745280 -31712408 -23999342 -6842093
$$ packed form
765f507712J5708915J4295327N245431o792883j2988430q950489n75130L728105
757C163134L648058M319686O365944N396981p7022o300008r323455p993008l084188
748c883878K441005L791392q73593p037796q623282n003743l02543K634673M179253
739a2678512M747786K931710k310479q387679r204853j221220R526244J1137252
731e459751R10389q406937m753382N725537P904903R94342j206263O797408J4255724
722A6761970J2425999N803783m66033r395548k0074185k1230830q418937M321378
714b0272403L193969m336988j431372J1693339J7763859O745925j1524567j9462015
706a7630253r892701P143022J3117952P86452j4269752j0967128P713066J7157249
$$ plain form
698 -6842093 438122 -2323156 1065378 13588170 18785104 8120068 -4379939 -3293730
690 -3293730 7654071 15464847 15155447 8125849 -4055565 -14396065 -11200188 5029498
682 5029498 16793570 13443662 8598578 19728451 40026127 47237685 34844390 17734153
674 17734153 8792264 5420835 1043613 -2703927 -63000 9451668 19245371 21033448
666 21033448 13029897 4321705 6726330 19958672 31450134 33824250 32906679 32957037
658 32957037 26229039 8050126 -8483700 -7873894 4109589 7533969 -3999079 -17158650
650 -17158650 -19259171 -11462878 -1009903 8001686 14146299 18023521 23505173 32902009
642 32902009 41526223 43162458 38309522 30725402 20743450 10041449 6626429 13941526
$$ packed form
698f842093P280215k761278L388534J2522792N196934j0665036j2500007J086209
690c293730J0947801P810776l09400p029598j2181414j0340500L195877J6229686
682E029498J1764072l349908m845084J1129873K0297676P211558j2393295j7110237
674A7734153q941889l371429m377222l747540K640927R514668R793703J788077
666B1033448q003551q708192K404625J3232342J1491462K374116r17571N0358
658C2957037o727998j8178913j6533826O09806J1983483L424380j1533048j3159571
650a7158650k100521P796293J0452975R011589O144613L877222N481652R396836
642C2902009Q624214J636235m852936p584120r981952j0702001l415020P315097
$$ plain form
634 13941526 20423138 12856614 -3515203 -11401636 -5143747 5384689 12064519 15489073
626 15489073 16022263 12466393 9704932 14097882 21306361 21709908 16528070 14235301 13143120
617 13143120 4513565 -8253083 -12816731 -10787236 -16218897 -28251338 -28256427 -11169719
609 -11169719 3526589 2800914 -345240 7424083 15475047 9132435 -3170503 -3506096
601 -3506096 7044579 13798133 13185211 12848945 14444191 14791098 18103243 29141793 39195514
592 39195514 36246030 24605943 17421528 14760953 8018067 1507213 7306404 19128661
584 19128661 15119313 -8196656 -26503185 -21047833 -2482965 9720785 14494380 20843657
576 20843657 25402755 16643406 -3798857 -20005747 -21662198 -13662653 -5636915 -1645074
$$ packed form
634A3941526O481612p566524j6371817p886433O257889J0528436O679830L424554
626A5489073N33190l555870k761461M392950P208479M03547n181838k292769j092181
617A3143120q629555j2766648m563648K029495n431661j2032441n089J7086708
609a1169719J4696308p25675l146154P769323Q050964o342612j2302938l35593
601c506096J0550675O753554o12922l36266J595246L46907L312145J1038550J0053721
592C9195514k949484j1640087p184415k660575o742886o510854N799191J1822257
584A9128661m009348k3315969j8306529N455352J8564868J2203750M773595O349277
576B0843657M559098q759349k0442263j6206890j656451P999545Q025738L991841
$$ plain form
568 -1645074 -1715144 -5119160 -8637127 -7252513 -450376 5526494 5098535 922922 639125
559 639125 6802621 13534007 14139944 9195445 4851373 5293232 10014162 16816847 23040050
550 23040050 24572828 19360955 12816293 13718543 22347080 28481449 24359119 13556490
542 13556490 2921598 -7291535 -18493911 -25241138 -21309594 -11501485 -7762425 -13549875
534 -13549875 -19991734 -18461017 -10316610 -2927285 -1517861 -6106445 -12205070 -14252072
526 -14252072 -11836905 -10766627 -13393596 -11464269 3204067 22859709 29330218 17302018
518 17302018 1992017 -1028232 5048760 6018485 -3203643 -14738508 -20657809 -21211492
510 -21211492 -20308336 -19711209 -19536104 -19594382 -17638183 -9729504 4421801 18534321 25755589
$$ packed form
568a645074p0070l404016l517967J384614O802137N976870m27959m175613k83797
559F39125O163496O731386O05937m944499m344072M41859M720930O802685O223203
550B3040050J532778n211873o544662R02250Q628537O134369m122330j0802629
542A3556490j0634892j0213133j1202376o747227L931544R808109L739060n787450
534a3549875o441859J530717Q144407P389325J409424m588584o098625k047002
526a4252072K415167J070278k626969J929327J4668336J9655642O470509j2028200
518A7302018j5310001l020249O076992R69725r222128j1534865n919301n53683
510b1211492R03156N97127J75105n8278J956199P908679J4151305J4112520P221268
$$ plain form
501 25755589 26799406 28225382 32472623 34546419 30746993 25127817 22465585 20179872
493 20179872 14989897 12987331 21411166 32060787 27916950 9950673 1630200 17369081
485 17369081 40290239 45201665 32876190 23853828 24614805 20741649 4732034 -8800091
477 -8800091 -3463312 16457153 32629481 33527954 21674049 6548880 -3154995 -4115687
469 -4115687 229847 4918838 10175020 18010070 23355931 17651937 3372034 -4253199
461 -4253199 5013364 23527643 35004965 30889223 13991114 -7593816 -25256506 -33606331
453 -33606331 -34010539 -31133756 -24653358 -10499124 8080438 19136564 16037609 5584692
445 5584692 -2094686 -3785074 1319884 16127827 36822897 48040927 38729359 18649427
$$ packed form
501B5755589J043817J425976M247241K073796l799426n619176k662232k285713
493B0179872n189975k002566Q423835J0649621m143837j7966277q320473J5738881
485A7369081K2921158M911426j2325475r022362P60977l873156j6009615j3532125
477h800091N336779J9920465J6172328Q98473j1853905j5125169r703875r60692
469d115687M345534M688991N256182P835050N345861n703994j4279903p625233
461d253199R266563J8514279J1477322m115742j6898109k1584930j7662690q349825
453c3606331m04208K876783O480398J4154234J8579562J1056126l098955j0452917
445E584692p679378j690388N104958J4807943K0695070J1218030r311568k0079932
$$ plain form
437 18649427 8358022 15337753 29681418 40498078 45209826 43306360 33171272 18548030
429 18548030 8714103 7469814 8591851 6101441 2582269 2533328 3313415 -585179 -7431912
420 -7431912 -9596456 -4899606 -687384 -4430789 -14132537 -21075254 -19855797 -12406707
412 -12406707 -3412728 4059747 8176532 8360753 7921371 12323983 21151243 25502328 18308778
403 18308778 4430407 -4937451 -5362086 -639897 5674304 11645373 11801060 1696503
395 1696503 -10898972 -10621236 5250981 21049749 22943897 15738719 12359676 15146525
387 15146525 16859163 13830740 7914260 -616278 -12175626 -21938549 -23475975 -17350358
379 -17350358 -9342513 -2103237 4702030 8609662 6596922 1483332 -1352988 -2066532
$$ packed form
437A8649427j0291405O979731J4343665J0816660M711748j903466j0135088j4623242
429A8548030r833927j244289J122037k490410l519172m8941P80087l898594o846733
420g431912k164544M696850M212222l743405r701748o942717J219457P449090
412a2406707Q993979P472475M116785J84221m39382M402612Q827260M351085p193550
403A8308778j3878371r367858m24635M722189O314201N971069J55687j0104557
395A696503j2595475K77736J5872217J5798768J894148p205178l379043K786849
387A5146525J712638l028423n916480q530538j1559348r762923j537426O125617
379a7350358Q007845P239276O805267L907632k012740n113590k836320p13544
$$ plain form
371 -2066532 -3851072 -4707312 -599318 4534769 1944484 -8066826 -14974709 -12774182
363 -12774182 -7291499 -6212627 -9897346 -15158720 -20329953 -22658954 -17897180 -7312461
355 -7312461 688331 471866 -4275844 -7526951 -8669598 -9175987 -7915528 -5555532 -7786765
346 -7786765 -16693700 -23111815 -16097969 1735124 16233955 18516428 12266281 4129692
338 4129692 -4456922 -12607081 -15094911 -9041440 -1447561 -2400146 -11117410 -15227387 -5988614
329 -5988614 10313599 19217622 13617636 -391526 -11141689 -11804435 -4481477 3008835
321 3008835 4637954 1987452 1090395 2434817 -1239767 -12731519 -21164178 -14010131
313 -14010131 3678500 13081475 6368722 -3384068 -1621102 8951010 16445694 17285301
$$ packed form
371b066532j784540q56240M107994N134087k590285j0011310o907883K200527
363a2774182N482683J078872l684719n261374n171233k329001M761774J0584719
355g312461Q000792k16465m747710l251107j142647n06389J260459K359996k231233
346g786765q906935o418115P013846J7833093J4498831K282473o250147q136589
338D129692q586614q150159k487830O053471P593879r52585q717264m109977R238773
329e988614J6302213Q904023n599986j4009162j0750163o62746P322958P490312
321C008835J629119k650502q97057J344422l674584j1491752q432659P154047
313a4010131J7688631R402975o712753r752790J762966J0572112P494684Q39607
$$ plain form
305 17285301 15729982 13033668 8354386 5849269 9422563 13507863 10672299 6113379
297 6113379 11645545 25420680 31627238 23819388 15552766 21009360 35039497 40768996
289 40768996 30661727 12595848 -799968 -3017450 2732299 6358525 518793 -9721605
281 -9721605 -11310422 -43331 12778999 14512250 6104018 -2268220 -4939976 -3707044
273 -3707044 -1384436 412666 -414377 -3884663 -5579581 -2762725 -723510 -6048844 -14418853
264 -14418853 -12861726 3726093 24238632 33086774 26784749 15345440 9182247 8743098
256 8743098 7950176 4693079 3852305 9206372 16345887 17653335 12589839 8177379 9390808
247 9390808 13966621 17485312 18523415 17035800 12420226 5579749 -1024384 -6839772
$$ packed form
305A7285301j555319k696314m679282k505117L573294M085300k835564m558920
297F113379N532166J3775135O206558p807850q266622N456594J4030137N729499
289D0768996j0107269j8065879j3395816k217482N749749L626226n839732j0240398
281i721605j588817J1267091J2822330J733251q408232q372238k671756J232932
273c707044K322608J797102q27043l470286j694918K816856K039215n325334q370009
264a4418853J557127J6587819K0512539Q848142o302025j1439309o163193m39149
256H743098p92922l257097q40774N354067P139515J307448n063496m412460J213429
247I390808M575813L518691J038103j487615m615574o840477o604133n815388
$$ plain form
239 -6839772 -11962516 -11511007 1246673 22531624 36602710 32980950 18946065 7993274
231 7993274 2283193 -4113996 -9877351 -7011990 3905787 11130991 7356810 -1407180
223 -1407180 -6189905 -6165691 -5020228 -3509086 -1420360 -1671585 -6567146 -13601447 -19846050
214 -19846050 -26507033 -33575947 -34255254 -23008098 -7570551 -3341247 -13212416 -21248143
206 -21248143 -12309187 7688689 19195031 14377771 5618392 6481811 13068624 11525348
198 11525348 -885891 -11875355 -11212738 -2822318 3580423 5741627 7910314 11342099
190 11342099 12897285 11417042 9067134 6604626 3250759 1800813 7419214 18614259
182 18614259 25022894 19060989 6420574 -557529 1489166 3820044 -1198266 -9374681
$$ packed form
239f839772n122744M51509J2757680K1284951J4071086l621760j4034885j0952791
231G993274n710081o397189n763355K865361J0917777P225204l774181q763990
223a407180m782725K4214J145463J511142K088726k51225m895561p034301o244603
214a9846050o660983p068914o79307J1247156J5437547M229304r871169q035727
206b1248143Q938956J9997876J1506342m817260q759379Q63419O586813j543276
198A1525348j2411239j0989464O62617Q390420O402741K161204K168687L431785
190A1342099J555186j480243k349908k462508l353867j449946N618401J1195045
182A8614259O408635n961905j2640415o978103K046695K330878n018310q176415
$$ plain form
174 -9374681 -10429593 -608735 14822288 29178075 38601299 39074414 26403128 3376440
166 3376440 -17399687 -23550929 -14981057 -2312550 5176234 6034443 3000518 -803787
158 -803787 -1337604 4604569 14192049 19447452 16558461 10816218 8747974 8408159 2311807
149 2311807 -10926733 -22531199 -22628549 -11160194 1851039 6311150 1236409 -6127409
141 -6127409 -8792655 -5428587 2178522 12717359 23835251 30739900 30556615 25511277
133 25511277 17614253 3968240 -16107594 -32898778 -34942467 -25100633 -17748014 -19025597
125 -19025597 -20968927 -17846991 -15644060 -18869930 -19827515 -10841396 1916712 7611477
117 7611477 6613314 6199602 6682228 3794497 -36117 494303 2051211 -1995351 -7532419
$$ packed form
174i374681j054912R820858J5431023J4355787R423224M73115j2671286k3026688
166C376440k0776127o151242Q569872J2668507P488784Q58209l033925l804305
158h03787n33817N942173R587480N255403k888991n742243k068244l39815o096352
149B311807j3238540j1604466r7350J1468355J3011233M460111n074741p363818
141f127409k665246L364068P607109J0538837J1117892O904649j83285n045338
133B5511277p897024j3646013k0075834j6791184k043689R841834P352619j277583
125a9025597j943330L121936K202931l225870r57585Q986119J2758108N694765
117G611477r98163m13712M82626k887731l830614N30420J556908m046562n537068
$$ plain form
108 -7532419 -5286969 925776 -2521003 -15846135 -22193958 -12378226 1706381 6174029
100 6174029 4179652 5623070 9001899 6107470 -2211750 -7211115 -5395409 -463826
92 -463826 4712354 8802531 7494874 -2352236 -15336527 -22463744 -22330307 -19967317 -16704162
83 -16704162 -10266312 -3919503 -4940517 -11933583 -13319489 -2891811 10487592 13811864
75 13811864 5182310 -6418752 -11959281 -8546135 772328 8281918 6164411 -4864366
67 -4864366 -13939534 -11984675 -2734003 3546934 4654103 7589732 16300983 26642258
59 26642258 34780651 42095785 48078840 46494314 35167868 23618611 22794744 30455450
51 30455450 34649256 29724822 20910601 14173620 10359381 9974574 14760766 21897336 24607264
$$ packed form
108g532419K245450O212745l446779j3325132o347823R815732J4084607M467648
100F174029j994377J443418L378829k894429q319220m999365J815706M931583
92d63826N176180M090177j307657r847110j2984291p127217J33437K362990L263155
83a6704162O437850O346809j021014o993066j385906J0427678J3379403L324272
75A3811864q629554j1601062n540529L413146R318463P509590k117507j1028777
67d864366r075168J954859R250672O280937J107169K935629Q711251J0341275
59B6642258Q138393P315134N983055j584526j1326446j1549257q23867P660706
51C0455450M193806m924434q814221o736981l814239l84807M786192P136570K709928
$$ plain form
42 24607264 21809989 19694595 20316977 17087552 6707236 -3008841 -4452683 -1628227
34 -1628227 -1490018 -939334 6587637 16717362 18878344 13020270 8992244 9872542 8950956
25 8950956 4802664 5954040 15884235 25331452 26230032 23148979 23093506 23122413 17904631
16 17904631 12530277 16221362 26574953 31030188 23602893 11044918 1890077 -2005584
8 -2005584 -1198488 5486566 15983920 21902805 17014606 6487522 1833840 7005776
0 7005776
$$ packed form
42B4607264k797275k115394O22382l229425j0380316r716077j443842K824456
34a628227J38209N50684P526971J0129725K160982n858074m028026Q80298r21586
25H950956m148292J151376R930195R447217Q98580l081053n5473K8907n217782
16A7904631n374354L691085J0353591M455235p427295j2557975r154841l895661
8b005584Q07096O685054J0497354N918885m888199j0527084m653682N171936
0G005776
$$ Imaginary data points
##PAGE= N=2
##DATA TABLE= (X++(I..I)), XYDATA
$$ plain form
65535 2969739 -1315099 -5234037 -8256409 -15363486 -25624540 -29480384 -21943074 -11626494
65527 -11626494 -8950231 -10019482 -2485741 13984719 24817759 20867557 10733187 6601999
65519 6601999 6879810 1945228 -8728047 -15808540 -14837405 -12225203 -14776876 -19923709
65511 -19923709 -19819613 -11983658 -2803135 -563507 -6033206 -11518432 -10710855 -7268461
65503 -7268461 -9262031 -16542477 -20563576 -17332701 -12132920 -8607691 -2701088 6739919
65495 6739919 10919199 3991868 -4594760 -2299050 6992794 8578994 -142534 -5884276
65487 -5884276 342459 11694678 17433390 15411905 8131325 -3408091 -15331625 -18761456
65479 -18761456 -10186349 1418351 5238426 2114423 4700 -356548 -6125323 -19033093
$$ packed form
65535B969739m284838l918938l022372p107077j0261054l855844P537310J0316580
65527a1626494K676263j069251P533741J6470460J0833040l950202j0134370m131188
65519F601999K77811m934582j0673275p080493R71135K612202k551673n146833
65511a9923709J04096P835955R180523K239628n469699n485226Q07577L442394
65503g268461j993570p280446m021099L230875N199781L525229N906603R441007
65495F739919M179280o927331q586628K295710R291844J586200q721528n741742
65487e884276O226735J1352219N738712k021485p280580j1539416j1923534l429831
65479a8761456Q575107J1604700L820075l124003k109723l61248n768775j2907770
$$ plain form
65471 -19033093 -30065680 -30486430 -22324725 -13967183 -9449855 -6923932 -5134342 -5137460
65463 -5137460 -5128532 264987 12004958 22302626 23147847 16351184 9637065 5245149
65455 5245149 -209893 -5548905 -4089775 4638420 10933059 7424731 -1353103 -6709490
65447 -6709490 -6309191 -1753915 6705605 15935178 17784470 10316244 4959223 11848198
65439 11848198 22822136 21003336 4725210 -10376289 -12654945 -6175505 -387826 712963
65431 712963 -3091777 -10713018 -17422513 -18016973 -14156695 -11058243 -7062313 3693042
65423 3693042 17933978 24464846 21142153 18463785 22178740 24742703 20083958 14694137
65415 14694137 15782648 19103227 17922519 14634402 13484388 10756527 3646851 798131
$$ packed form
65471a9033093j1032587m20750Q161705Q357542M517328K525923J789590l118
65463e137460Q928N393519J1739971J0297668Q45221o796663o714119m391916
65455E245149n455042n339012J459130Q728195O294639l508328q777834n356387
65447f709490M00299M555276Q459520R229573J849292p468226n357021O888975
65439A1848198J0973938j818800j6278126j5101499k278656O479440N787679J100789
65431G12963l804740p621241o709495n94460L860278L098452L995930J0755355
65423C693042J4240936O530868l322693k678368L714955K563963m658745n389821
65415A4694137J088511L320579j180708l288117j150014k727861p109676k848720
$$ plain form
65407 798131 10407987 23435350 23340803 10074937 1164 2048472 7950568 8593348
65399 8593348 6663412 7458323 8353584 5530053 3327109 7771228 15181012 16133906 9460488
65390 9460488 4368840 7292767 12805035 11021806 357013 -11251016 -16279478 -14554771
65382 -14554771 -10177789 -5822520 -2091993 825211 3793690 8466378 13264085 12360620
65374 12360620 2907360 -8846112 -13426904 -8686736 -128129 6694478 8279592 945471
65366 945471 -14597174 -27585743 -26415436 -14961367 -9708162 -17759499 -27717044 -26672576
65358 -26672576 -16234691 -5798340 434633 2235232 -1822936 -9160374 -10379571 -1707351
65350 -1707351 6050169 1726703 -8458386 -9614523 -1218676 2128975 -6733267 -16851136
$$ packed form
65407G98131R609856J3027363r4547j3265866j0073773K047308N902096O42780
65399H593348j929936P94911Q95261k823531k202944M444119P409784R52894o673418
65390I460488n091648K923927N512268j783229j0664793j1608029n028462J724707
65382a4554771M376982M355269L730527K917204K968479M672688M797707r03465
65374A2360620r453260j1753472m580792M740168Q558607O822607J585114p334121
65366I45471j5542645j2988569J170307J1454069N253205q051337r957545J044468
65358b6672576J0437885J0436351O232973J800599m058168p337438j219197Q672220
65350a707351P757520m323466j0185089j156137Q395847L347651q862242j0117869
$$ plain form
65342 -16851136 -14715467 -974667 13111690 19102560 16503869 9098100 948362 -5244898
65334 -5244898 -8171255 -6768761 -581869 7527044 11962000 10651073 7983401 8252648
65326 8252648 9505671 7863486 4048998 500655 -3977700 -10172463 -12537548 -5221811
65318 -5221811 7567952 14827527 12056360 4974671 703746 1651646 7626275 17341390
65310 17341390 26990810 32110004 31090136 24093966 11658929 -1392576 -5944700 143015
65302 143015 5602554 -48084 -10107170 -9965550 71793 4831792 -2853968 -13372468
65294 -13372468 -17021986 -15738626 -13293741 -6951576 3671991 10723997 9876186 8555597
65286 8555597 13209435 17100163 11755306 3367489 4344159 11823269 8956814 -10168091
$$ packed form
65342a6851136K135669J3740800J4086357N990870k598691p405769q149738o193260
65334e244898k926357J402494O186892Q108913M434956j310927k667672K69247
65326H252648J253023j642185l814488l548343m478355o194763k365085P315737
65318e221811J2789763P259575k771167p081689m270925R47900N974629R715115
65310A7341390R649420N119194j019868o996170j2435037j3051505m552124O087715
65302A43015N459539n650638j0059086J41620J0037343M759999p685760j0518500
65294a3372468l649518J283360K444885O342165J0623567P052006q47811j320589
65286H555597M653838L890728n344857q387817R76670P479110k866455j9124905
$$ plain form
65278 -10168091 -28603765 -25868491 -2689586 20417767 26851406 19982845 14545777 16994024
65270 16994024 19439513 12334752 -2740623 -16153082 -21828124 -21121857 -18170275 -16702928
65262 -16702928 -18917110 -21747173 -17301721 -4384063 3740423 -6429091 -27798245 -38512378
65254 -38512378 -30540057 -19331999 -19852800 -26198198 -24529221 -15467644 -10647023 -13003403
65246 -13003403 -13927888 -8628864 -2977981 -3626428 -9492922 -15085914 -16496933 -12602788
65238 -12602788 -4987877 1841494 3461614 -156077 -5114350 -7976768 -8159492 -7547218
65230 -7547218 -9717223 -17346947 -27715644 -33050581 -28826350 -20231877 -16707217 -20333096
65222 -20333096 -22628615 -13830867 5555102 23179155 25935745 13356570 -2173611
$$ packed form
65278a0168091j8435674K735274K3178905K3107353O433639o868561n437068K448247
65270A6994024K445489p104761j5075375j3412459n675042P06267K951582J467347
65262a6702928k214182k830063M445452J2917658Q124486j0169514k1369154j0714133
65254c8512378P972321J1208058n20801o345398J668977R061577M820621k356380
65246a3003403r24485N299024N650883o48447n866494n592992j411019L894145
65238a2602788P614911O829371J620120l617691m958273k862418j82724O12274
65230g547218k170005p629724j0368697n334937M224231Q594473L524660l625879
65222b0333096k295519Q797748J9385969J7624053K756590j2579175j5530181
$$ plain form
65215 -2173611 -10191266 -12996666 -17311944 -20386995 -13744293 1429800 13662119 16529338
65207 16529338 13686636 7404239 -4837419 -18299863 -19649409 -5716575 8544534
65200 8544534 10179727 4922974 3471813 3306200 -2003842 -6259483 -626428 7525240
65192 7525240 4755346 -3780478 234629 18595764 31880286 27649428 15532359 8412414
65184 8412414 4547214 -3212377 -12884904 -17055347 -12742039 -1559598 12066704 19194853
65176 19194853 12604794 -1488989 -8531791 -5865425 -5159224 -10337356 -9287156 3292085
65168 3292085 11311794 272605 -18325861 -23151227 -14089984 -8053065 -10231352 -10443428
65160 -10443428 -6012459 -6730944 -13979108 -14748247 -3631946 6156505 3560877 -2211377
$$ packed form
65215b173611q017655k805400m315278l075051O642702J5174093J2232319K867219
65207A6529338k842702o282397j2241658j3462444j349546J3932834J4261109
65200H544534J635193n256753j451161j65613n310042m255641N633055Q151668
65192G525240k769894q535824M015107J8361135J3284522m230858j2117069p119945
65184H412414l865200p759591r672527m170443M313308J1182441J3626302P128149
65176A9194853o590059j4093783p042802K666366P06201n178132J050200J2579241
65168C292085Q019709j1039189j8598466m825366R061243O036919k178287k12076
65160a0443428M430969p18485p248164p69139J1116301R788451k595628n772254
$$ plain form
65152 -2211377 4165509 21932053 37605637 43025122 39176274 28249359 13305547 1952074
65144 1952074 -510983 384647 -4203130 -12641926 -15990521 -12876290 -10331681 -9720752
65136 -9720752 -3169391 12768509 29435378 37038084 36342675 34458926 34184574 32224571
65128 32224571 24658848 11179287 -3409286 -11327723 -9648730 -5319310 -6038599 -7483488
65120 -7483488 444533 14474170 18558865 7907169 -2208137 -47005 5048825 1517169
65112 1517169 -2342213 6182804 17299989 10571181 -10579733 -20666051 -9797931 4332008
65104 4332008 7837630 10339303 21672213 29773687 19059172 -3335239 -17645604 -18861466
65096 -18861466 -17699607 -20431620 -22977244 -21737913 -17653290 -11864916 -7096811 -9183971
$$ packed form
65152b211377O376886J7766544J5673584N419485l848848j0926915j4943812j1353473
65144A952074k463057Q95630m587777q438796l348595L114231K544609O10929
65136i720752O551361J5937900J6666869P602706o95409j883749k74352j960003
65128C2224571p565723j3479561j4588573p918437J678993M329420p19289j444889
65120g483488P928021J4029637M084695j0651696j0115306K161132N095830l531656
65112A517169l859382Q525017J1117185o728808k1150914j0086318J0868120J4129939
65104D332008L505622K501673J1332910Q101474j0714515k2394411j4310365j215862
65096a8861466J161859k732013k545624J239331M084623N788374M768105k087160
$$ plain form
65088 -9183971 -17794434 -21342881 -11724064 2219205 8089987 10172249 21262708 38946049
65080 38946049 47057158 39626441 26728230 15604146 2639237 -12265333 -19138889
65073 -19138889 -12652420 -1510701 3334890 433718 -6512544 -14521519 -18419528 -12649471
65065 -12649471 -1284244 3734977 -447645 -2688241 4606127 14154102 17087992 16207442
65057 16207442 16678483 13960919 2575047 -11064390 -16536816 -13963123 -9272696 -1502574
65049 -1502574 11649819 20894221 14537346 -347350 -3043161 10852640 20526600 9057815
65041 9057815 -11853787 -18292480 -6547024 5094691 3734302 -3253236 -3064320 4599519
65033 4599519 10619535 9522215 2277059 -8175061 -16060578 -11888757 7172330 27224257
$$ packed form
65088i183971q610463l548447R618817J3943269N870782K082262J1090459J7683341
65080C8946049Q111109p430717j2898211j1124084j2964909j4904570o873556
65073a9138889O486469J1141719M845591k901172o946262q008975l898009N770057
65065a2649471J1365227N019221m182622k240596P294368R547975K933890q80550
65057A6207442M71041k717564j1385872j3639437n472426K573693M690427P770122
65049a502574J3152393R244402o356875j4884696k695811J3895801R673960j1468785
65041I057815k0911602o438693J1745456J1641715j360389o987538J88916P663839
65033D599519O020016j097320p245156j0452120p885517M171821J9061087K0051927
$$ plain form
65025 27224257 29024368 11583073 -5728311 -8117619 -1654457 1244722 866392 3740052
65017 3740052 5936624 -2733965 -21104833 -36238641 -39729332 -33376907 -20054000 -1202787
65009 -1202787 16257450 22969219 19659258 16277807 16778585 15283914 9105333 3878400
65001 3878400 2679832 1705634 434232 3788414 9438969 6258320 -7318990 -16349293
64993 -16349293 -10651517 -1680021 -6072844 -20785542 -27559630 -17358427 1089332 14528925
64985 14528925 17920543 15700635 16502303 24166793 30830334 24944314 9144168 226916
64977 226916 5675248 12196961 7041438 -1740025 -238373 6549277 2660697 -11828536
64969 -11828536 -20150650 -13905779 -2086238 6094180 12357275 20118214 26590381 28434591
$$ packed form
65025B7224257J800111j7441295j7311384k389308O463162K899179l78330K873660
65017C740052K196572q670589j8370868j5133808l490691O352425J3322907J8851213
65009a202787J7460237O711769l309961l381451N00778j494671o178581n226933
65001C878400j198568r74198j271402L354182N650555l180649j3577310r030303
64993a6349293N697776Q971496m392823j4712698o774088J0201203J8447759J3439593
64985A4528925L391618k219908Q01668P664490O663541n886020j5800146q917252
64977B26916N448332O521713n155523q781463J501652O787650l888580j4489233
64969a1828536q322114O244871J1819541Q180418O263095P760939O472167J844210
$$ plain form
64961 28434591 26391246 21983058 17372620 18403575 28519889 39684631 39325579 27058528
64953 27058528 15078537 11661053 14009069 17244543 19343552 16425468 5105285 -8028710
64945 -8028710 -10567889 -1061810 8732354 11039363 10499481 12236140 13233332 10552395
64937 10552395 7362143 5392632 1567334 -2767701 -468185 7200621 6870847 -7326727
64929 -7326727 -21044902 -17802997 -1664996 10126778 11258884 10510434 14897485 20923982
64921 20923982 23018270 20905899 16339982 9231736 -175785 -8748545 -11890432 -7090083
64913 -7090083 2660440 9099844 6452853 -85225 719948 10495665 17385101 12055964
64905 12055964 826556 -3202809 3593172 14739137 24335634 30687118 32540979 29064871
$$ packed form
64961B8434591k043345m408188m610438J030955J0116314J1164742l59052j2267051
64953B7058528j1979991l417484K348016L235474K099009k918084j1320183j3133995
64945h028710k539179R506079R794164K307009n39882J736659R97192k680937
64937A0552395l190252j969511l825298m335035K299516P668806l29774j4197574
64929g326727j3718175L241905J6138001J1791774J132106p48450M387051O026497
64921B0923982K094288k112371m565917p108246r407521q572760l141887M800349
64913g090083R750523O439404k646991o538078Q05173R775717O889436n329137
64905A2055964j1229408m029365O795981J1145965R596497O351484J853861l476108
$$ plain form
64897 29064871 21910200 12308689 -488343 -12917046 -14983067 -2678644 11892278
64890 11892278 12924549 1576311 -5776236 378710 12297863 18096771 15796617 10787690
64882 10787690 7009924 5480442 6614876 9822165 13685179 18389334 24515027 28668052
64874 28668052 25324505 14727866 3912787 -2184209 -5327856 -7346987 -5485448 693413
64866 693413 3571041 -3848117 -16382955 -21685074 -16568331 -11204811 -15338493 -26219076
64858 -26219076 -33194242 -29832589 -18189872 -4783860 3776590 4129249 -443969 -2042875
64850 -2042875 2095471 4371911 -2768869 -13430697 -14102996 -3796082 1889688 -7699183
64842 -7699183 -21416785 -20196373 -2611484 13921545 15754167 6448385 -3545395 -10975163
$$ packed form
64897B9064871p154671r601511j2797032j2428703k066021J2304423J4570922
64890A1892278J032271j1348238p352547O154946J1919153N798908k300154n008927
64882A0787690l777766j529482J134434L207289L863014M704155O125693M153025
64874B8668052l343547j0596639j0815079o096996l143647k019131J861539O178861
64866F93413K877628p419158j2534838n302119N116743N363520m133682j0880583
64858b6219076o975166L361653J1642717J3406012Q560450L52659m573218j598906
64850b042875M138346K276440p140780j0661828o72299J0306914N685770r588871
64842g699183j3717602J220412J7584889J6533029J832622r305782r993780p429768
$$ plain form
64834 -10975163 -18871304 -27618527 -32399985 -27823898 -13102274 5707723 18845175 21384875
64826 21384875 18178019 16795517 17400289 15280152 11634863 13311032 20810349 25433644
64818 25433644 21876954 16085667 16139232 21980027 28952688 34887952 37610189 31502940
64810 31502940 14756040 -3065173 -8628908 227311 12459680 16402768 10277942 808294
$$ packed form
64834a0975163p896141q747223m781458M576087J4721624J8809997J3137452K539700
64826B1384875l206856j382502O04772k120137l645289J676169P499317M623295
64818B5433644l556690n791287N3565N840795O972661N935264K722237o107249
64810C1502940j6746900j7821213n563735Q856219J2232369L943088o124826r469648
$$ [...]
##END NTUPLES=NMR SPECTRUM
##END=
