##TITLE=31Pdec_ANY-157c-12
 D2O, 24 sc
 7.6.2019
##JCAMPDX= 6.0         $$ Bruker NMR JCAMP-DX V2.0
##DATA TYPE= NMR SPECTRUM
##DATA CLASS= NTUPLES
##ORIGIN= UXNMR, Bruker Analytische Messtechnik GmbH
##OWNER= root
$$ XWIN-NMR		Version 3.5
$$ Fri Jun  7 15:49:27 2019 Russian Standard Time (UT+4h)  she@DPX200
##.OBSERVE FREQUENCY= 81.013821
##.OBSERVE NUCLEUS= ^31P
##.ACQUISITION MODE= SIMULTANEOUS
##.ACQUISITION SCHEME= undefined
##.AVERAGES= 24
##.DIGITISER RES= 17
##SPECTROMETER/DATA SYSTEM= spect
##.PULSE SEQUENCE= zgpg30
##.SOLVENT NAME= D2O
##.SHIFT REFERENCE= (INTERNAL, D2O, 0, 182.463)
##AUDIT TRAIL= $$ (NUMBER, WHEN, WHO, WHERE, WHAT)
$$ ##TITLE= Audit trail, XWIN-NMR		Version 3.5
$$ ##JCAMPDX= 5.01
$$ ##ORIGIN= Bruker BioSpin GmbH
$$ ##OWNER= she
$$ F:/spectra/data/she/nmr/P31/1/pdata/1/auditp.txt
$$ ##AUDIT TRAIL=  $$ (NUMBER, WHEN, WHO, WHERE, WHAT)
(   1,<2019-06-07 15:48:26.21 +0400>,<she>,<DPX200>,
      <created by zg, POWCHK disabled, PULCHK disabled
       configuration hash MD5:
       00 E9 B6 7A A2 85 ED C7 34 08 36 98 17 FE 4E 26
       data hash MD5: 32K
       C5 A8 4A 39 F3 EF 6C C0 99 9D 26 E4 DD 55 DB A8>)
(   2,<2019-06-07 15:48:28.70 +0400>,<she>,<DPX200>,
      <Start of raw data processing
       efp BC_mod = 2 LB = 1 FT_mod = 6 PKNL = 1 PHC0 = -2557.115 PHC1 = 63.19916 SI = 64K 
       data hash MD5: 64K
       FE 1C 10 0D D6 F4 B0 2E 61 6F B2 42 A1 BA 86 48>)
(   3,<2019-06-07 15:48:47.32 +0400>,<she>,<DPX200>,
      <pk PHC0 = -0.940953 PHC1 = 0 
       data hash MD5: 64K
       B6 77 74 FC C1 B6 51 EB 1B 16 23 D7 59 72 53 E9>)
$$ ##END=
$$ 
$$ hash MD5
$$ 38 D1 3A C2 2F A1 65 73 C8 12 08 BD B5 24 3E F2
##$RELAX= 
##$RELAX= 
##$RELAX= 
##$RELAX= 
##$RELAX= 
##$RELAX= 
##$RELAX= 
##$RELAX= 
$$ Bruker specific parameters
$$ --------------------------
##$DU= <F:/spectra>
##$EXPNO= 1
##$NAME= <P31>
##$PROCNO= 1
##$TYPE= <nmr>
##$USER= <she>
##$AMP= (0..31)
100 100 100 100 100 100 100 100 100 100 100 100 100 100 100 100 100 100 
100 100 100 100 100 100 100 100 100 100 100 100 100 100 
##$AQSEQ= 0
##$AQ_mod= 1
##$AUNM= <au_zg>
##$AUTOPOS= <>
##$BF1= 81.014009
##$BF2= 200.13
##$BF3= 200.13
##$BF4= 200.13
##$BF5= 200.13
##$BF6= 200.13
##$BF7= 200.13
##$BF8= 200.13
##$BYTORDA= 1
##$CFDGTYP= 0
##$CFRGTYP= 5
##$CHEMSTR= <none>
##$CNST= (0..31)
1 1 145 1 1 1 1 1 1 1 1 1 1 1 1 1 1 1 1 1 1 1 1 1 1 1 1 1 1 1 1 1 
##$CPDPRG= <waltz16>
##$CPDPRG1= <>
##$CPDPRG2= <waltz16>
##$CPDPRG3= <>
##$CPDPRG4= <mlev>
##$CPDPRG5= <mlev>
##$CPDPRG6= <mlev>
##$CPDPRG7= <mlev>
##$CPDPRG8= <mlev>
##$CPDPRGB= <>
##$CPDPRGT= <>
##$D= (0..31)
0 1 0 0 0 0 0 0 0 0 0 0.03 2e-05 3e-06 0 0 0 0 0 0 0 0 0 0 0 0 0 0 0 0 
0 0 
##$DATE= 1559908105
##$DBL= (0..7)
120 120 120 11 120 120 24 19 
##$DBP= (0..7)
150 150 150 150 150 150 150 150 
##$DBP07= 0
##$DBPNAM0= <>
##$DBPNAM1= <>
##$DBPNAM2= <>
##$DBPNAM3= <>
##$DBPNAM4= <>
##$DBPNAM5= <>
##$DBPNAM6= <>
##$DBPNAM7= <>
##$DBPOAL= (0..7)
0.5 0.5 0.5 0.5 0.5 0.5 0.5 0.5 
##$DBPOFFS= (0..7)
0 0 0 0 0 0 0 0 
$$ [...]
##$SUBNAM2= <"">
##$SUBNAM3= <"">
##$SUBNAM4= <"">
##$SUBNAM5= <"">
##$SUBNAM6= <"">
##$SUBNAM7= <"">
##$SUBNAM8= <"">
##$SUBNAM9= <"">
##$SW= 369.568048894756
##$SWIBOX= (0..15)
0 1 3 0 0 0 0 0 0 0 0 0 0 0 0 0 
##$SW_h= 29940.119760479
##$TD= 32768
##$TD0= 1
##$TE= 0
##$TE2= 300
##$TE3= 300
##$TEG= 300
##$TL= (0..7)
0 120 53 12 22 120 120 120 
##$TP= (0..7)
150 150 150 150 150 150 150 150 
##$TP07= 0
##$TPNAME0= <>
##$TPNAME1= <>
##$TPNAME2= <>
##$TPNAME3= <>
##$TPNAME4= <>
##$TPNAME5= <>
##$TPNAME6= <>
##$TPNAME7= <>
##$TPOAL= (0..7)
0.5 0.5 0.5 0.5 0.5 0.5 0.5 0.5 
##$TPOFFS= (0..7)
0 0 0 0 0 0 0 0 
##$TUNHIN= 0
##$TUNHOUT= 0
##$TUNXOUT= 0
##$USERA1= <user>
##$USERA2= <user>
##$USERA3= <user>
##$USERA4= <user>
##$USERA5= <user>
##$V9= 5
##$VALIST= <valist>
##$VCLIST= <CCCCCCCCCCCCCCC>
##$VD= 0
##$VDLIST= <DDDDDDDDDDDDDDD>
##$VPLIST= <PPPPPPPPPPPPPPP>
##$VTLIST= <TTTTTTTTTTTTTTT>
##$WBST= 1024
##$WBSW= 4
##$XGAIN= (0..3)
0 0 0 0 
##$XL= 0
##$YL= 0
##$YMAX_a= 88277
##$YMIN_a= -83496
##$ZGOPTNS= <>
##$ZL1= 120
##$ZL2= 120
##$ZL3= 120
##$ZL4= 120
##$ABSF1= 0
##$ABSF2= 0
##$ABSG= 0
##$ABSL= 0
##$ALPHA= 0
##$AQORDER= 0
##$ASSFAC= 0
##$ASSFACI= 0
##$ASSFACX= 0
##$ASSWID= 0
##$AUNMP= <proc_1d>
##$AZFE= 0.1
##$AZFW= 0.5
##$BCFW= 0
##$BC_mod= 2
##$BYTORDP= 0
##$COROFFS= 0
##$CY= -3
##$DATMOD= 1
##$DC= 0
##$DFILT= <>
##$DTYPP= 0
##$F1P= 0
##$F2P= 0
##$FCOR= 1
##$FTSIZE= 65536
##$FT_mod= 6
##$GAMMA= 0
##$GB= 0
##$INTBC= 1
##$INTSCL= 5.30512e-09
##$ISEN= 30
##$LB= 1
##$LEV0= 0
##$LPBIN= 0
##$MAXI= 10000
##$MC2= 0
##$MEAN= 0
##$ME_mod= 0
##$MI= 50
##$NCOEF= 0
##$NC_proc= -2
##$NLEV= 6
##$NOISF1= 182.463
##$NOISF2= 159.3651
##$NSP= 0
##$NTH_PI= 0
##$NZP= 0
##$OFFSET= 182.463
##$PC= 4
##$PHC0= -2558.056
##$PHC1= 63.19916
##$PH_mod= 1
##$PKNL= yes
##$PPARMOD= 0
##$PSCAL= 0
##$PSIGN= 0
##$REVERSE= no
##$SF= 81.0140089999434
##$SI= 65536
##$SIGF1= 159.3651
##$SIGF2= -187.1042
##$SINO= 113.3802
##$SIOLD= 16384
##$SREGLST= <1H.CDCl3>
##$SSB= 0
##$STSI= 65536
##$STSR= 0
##$SW_p= 29940.119760479
##$SYMM= 0
##$S_DEV= 0
##$TDeff= 32768
##$TDoff= 0
##$TI= <>
##$TILT= no
##$TM1= 0
##$TM2= 0
##$TOPLEV= 0
##$USERP1= <user>
##$USERP2= <user>
##$USERP3= <user>
##$USERP4= <user>
##$USERP5= <user>
##$WDW= 1
##$XDIM= 65536
##$YMAX_p= 312071364
##$YMIN_p= -2460799
$$ End of Bruker specific parameters
$$ ---------------------------------
##NTUPLES= NMR SPECTRUM
##VAR_NAME=  FREQUENCY,     SPECTRUM/REAL,   SPECTRUM/IMAG
##SYMBOL=    X,             R,               I
##VAR_TYPE=  INDEPENDENT,   DEPENDENT,       DEPENDENT
##VAR_FORM=  AFFN,          ASDF,            ASDF
##VAR_DIM=   65536,         65536,           65536
##UNITS=     HZ,            ARBITRARY UNITS, ARBITRARY UNITS
##FACTOR=    0.456856943014862, 1,           1
##FIRST=     14782.0589164792, 0,            0
##LAST=      -15158.0608439998, 0,           0
##MIN=       -15158.0608439998, -2460799,    0
##MAX=       14782.0589164792, 312071364,    0
$$ Real data points
##PAGE= N=1
##DATA TABLE= (X++(R..R)), XYDATA
$$ [...]
40124 75138 161125 124479 9759 -48081 -28034 -42894 -148559 -250768 -248443 -176458 -136813
40113 -136813 -152598 -167922 -154269 -138290 -137385 -135618 -122248 -94279 -19809 131414 299503 349444
40101 349444 230790 72125 40778 131476 178770 82422 -70019 -141202 -121700 -102089 -126738
40090 -126738 -163176 -187929 -209573 -207937 -139916 -29301 24960 -28936 -118964 -137890 -71154
40079 -71154 4218 23030 -3045 -15596 16020 52241 25706 -61035 -113277 -65247 10298 -9696
40067 -9696 -120798 -201786 -201418 -189891 -193174 -117947 75848 254731 283436 216622 180720 151332
40055 151332 22945 -150254 -188805 -76010 -12560 -114804 -230089 -164052 38198 172341
40045 172341 151817 66892 12923 -5868 -8988 6236 21118 -4847 -58347 -63020 17158 115812
40033 115812 146743 113596 90617 109954 118765 62651 -26339 -66511 -44054 -42535 -124910 -225017
40021 -225017 -216079 -79233 61379 90599 31909 -11064 5562 40201 54196 61366 81077
40010 81077 89433 47787 -32627 -78962 -25023 105821 204189 185396 87263 22628 38412 71835
39998 71835 57494 15761 -4483 -15546 -58672 -113802 -116489 -64112 -40888 -115118 -248367 -327278
39986 -327278 -271297 -107900 45484 85349 23934 -33615 -31201 -36527 -128768 -259585 -307851
39975 -307851 -250516 -182673 -163263 -141283 -67419 15193 48514 51685 66923 73237 30292 -35713
39963 -35713 -68893 -75232 -97644 -122260 -97228 -41009 -42851 -134265 -233087 -247745 -179976 -89023
39951 -89023 -2685 91541 195416 280649 311594 269295 169627 71543 44346 104865 198941
39940 198941 258863 268330 263252 281276 315787 311194 213162 43870 -88034 -90929 1081 64225
39928 64225 28559 -59415 -115302 -100796 -24050 74828 118665 49484 -70487 -88325 51437
39917 51437 214800 244726 157735 87089 83526 84687 56564 40329 46949 19676 -60129 -122513
39905 -122513 -111659 -62466 -25210 14519 79535 124935 93470 14290 -21919 28398 131118
39894 131118 238301 328920 387891 393586 345430 285678 280304 370558 530056 677639 761192
39883 761192 818736 907026 977029 905678 681116 460822 372840 342534 225292 49973 -15856
39872 -15856 69069 148132 103744 21572 27612 77486 39960 -76956 -134607 -86375 -46282 -99687
39860 -99687 -171917 -160563 -103236 -110590 -187089 -231474 -200132 -161955 -174748 -201656 -187349 -138886
39848 -138886 -84828 -25359 20254 -13760 -140505 -248210 -224306 -121799 -99107 -202677 -313814
39837 -313814 -323407 -257202 -196110 -167737 -167875 -209026 -283745 -336769 -330297 -290738 -248982 -192942
39825 -192942 -125602 -100677 -135501 -152815 -87120 7269 40806 30366 56057 114484 128868
39814 128868 91723 82985 135343 182613 165079 99986 23302 -59084 -136649 -185381 -218801 -274046
39802 -274046 -320711 -262759 -73119 140642 249793 229194 135909 28283 -49522 -63404 -24297
39791 -24297 16086 44786 111429 231060 325528 323553 267523 247758 266084 241247 133704
39780 133704 -4655 -105614 -157619 -197865 -261079 -333526 -347471 -250954 -97995 -18198 -63154
39769 -63154 -142125 -161215 -159023 -220644 -311238 -308488 -184542 -43868 29891 61375 90384 87640
39757 87640 15245 -98056 -194720 -250865 -260215 -211113 -129133 -91979 -140423 -208760 -205455 -138992
39745 -138992 -100504 -133632 -185464 -189966 -142689 -77363 -16743 28087 43926 27681 -8819 -62171
39733 -62171 -137655 -206925 -203273 -103386 8031 13129 -95827 -201030 -204025 -132666 -67167 -12164
39721 -12164 85091 207688 247838 145404 -10141 -67171 23170 170419 256281 239475 154459
39710 154459 53832 -25488 -65571 -68573 -53791 -36567 -9178 41900 97062 105818 49443 -15490
39698 -15490 -12042 60980 127829 137323 118298 114969 121703 119093 118258 112336 39037 -126212 -280352
39685 -280352 -296830 -201704 -140554 -174584 -222144 -210686 -163302 -109049 -41230 -11792 -121940
39674 -121940 -337021 -452902 -362498 -226357 -232491 -302611 -223670 6047 174611 175150 117408
39663 117408 103362 88867 25091 -31537 -26931 9550 59528 159782 282748 309056 206933
39652 206933 111397 125292 164156 112955 17350 -19874 -27519 -87907 -150212 -103093 11276
39641 11276 40780 -33052 -75542 -31901 -626 -39463 -73116 -55378 -55548 -96878 -71015 65239
39629 65239 153124 51356 -116829 -120656 40983 157053 134170 99703 144971 168123 66013
39618 66013 -78594 -128133 -94123 -77101 -89611 -81764 -80462 -144160 -206743 -133890 51163 158241
39606 158241 94562 -8594 -9809 39639 22384 -27295 11987 123200 155070 52112 -63607
39595 -63607 -75397 -17587 17966 25568 59918 126716 175363 172932 128055 60841 -3256 -27172
39583 -27172 1454 33903 3839 -89104 -173584 -192413 -164782 -147781 -160303 -174078 -172785 -181797
39571 -181797 -217207 -233834 -172380 -58288 1031 -53878 -150904 -176315 -116544 -56033 -52920
39560 -52920 -80817 -96182 -101188 -114757 -124575 -102317 -49557 -5603 -10643 -61493 -101373 -71240
39548 -71240 14250 68371 37247 -27086 -40441 -4365 7020 -41049 -111750 -169596 -214915 -238023
39536 -238023 -207581 -127351 -51245 -18869 -16455 -13803 818 28548 60454 69387 43714 18024
39524 18024 18520 442 -86329 -188820 -200972 -113843 -13606 64218 152481 214605 143619 -44427
39512 -44427 -163265 -94509 48978 98321 53612 19012 19167 18819 42850 125171 192018 146820
39500 146820 39058 4288 56082 82479 44890 32029 90804 138473 96897 14786 -2442
39489 -2442 78860 202277 283799 270793 179521 81704 22598 -27411 -100268 -156962 -156845 -148009
39477 -148009 -187290 -209316 -99810 112751 264902 264087 169113 59444 -44373 -107463 -70538
39466 -70538 28694 46966 -77703 -231210 -288608 -278365 -296339 -340465 -336276 -276800 -234037
39455 -234037 -245970 -270864 -257372 -210096 -176422 -189185 -226691 -237069 -214855 -222381 -291283 -340724
39443 -340724 -272323 -122431 -21103 -8092 -2277 39970 65014 52118 70224 143899 183951
39432 183951 130287 57412 51530 79800 74839 57741 71522 71662 767 -84527 -78307 17830
39420 17830 105309 128559 113505 92945 80761 99208 151050 179606 124344 1984 -115897
39409 -115897 -175257 -150702 -41366 92558 156140 142454 151649 221968 245596 152664 66521
39398 66521 128379 257053 261939 138977 59312 84820 97586 30778 -26151 -8354 11336
39387 11336 -29775 -66298 -24545 53077 88161 75703 39718 -28699 -115825 -154290 -121342 -88781
39375 -88781 -106264 -118156 -71078 -18365 -27770 -62741 -59323 -59025 -148919 -305112 -410686 -418782
39363 -418782 -394026 -384906 -349652 -240947 -96132 2447 26169 23255 48154 89349 86949 27367
39351 27367 -15136 21100 68392 -1427 -181120 -298921 -233756 -71602 23628 14322 -30666
39340 -30666 -89321 -188096 -277314 -246371 -87435 70613 133177 146107 177428 189078 117248
39329 117248 19987 33410 185464 342396 364712 255630 124178 49076 23954 10827 -7158
39318 -7158 -34971 -89065 -179147 -269155 -281556 -166607 24515 157845 141362 31302 -24636
39307 -24636 37094 124263 124904 58563 21645 24296 -11448 -95075 -132324 -87753 -65474 -146109
39295 -146109 -238974 -207996 -81107 -9611 -51472 -122352 -158201 -201982 -299280 -407294 -452008
39284 -452008 -409736 -302804 -172353 -73376 -37878 -29141 12032 76144 106889 105935 128114 172480
39272 172480 181941 165602 206363 311642 373367 330400 257400 223556 176022 54865 -77563
39261 -77563 -131529 -132799 -155663 -180680 -141725 -64479 -32049 -44133 -31109 13097 30889 20423
39249 20423 35381 66823 45969 -20280 -33379 44441 125692 129886 90430 76899 86006 71296
39237 71296 30935 10550 45883 131762 217746 222704 103424 -70051 -159396 -107260 3715
39226 3715 65666 64156 43681 10625 -62936 -161630 -218578 -195258 -132299 -103759 -135361 -180885
39214 -180885 -179076 -124122 -64388 -33955 -20319 -18173 -66535 -175197 -247845 -167974 29672
39203 29672 161031 109587 -25216 -57873 49993 161799 157349 73879 30188 66109 113716
39192 113716 114521 103034 139984 200828 194983 97051 -10081 -58248 -99183 -220690 -393544
39181 -393544 -484134 -417864 -258895 -116063 -33835 2540 13746 14409 14307 581 -50569 -123539
39169 -123539 -159213 -121794 -34343 69084 179029 270649 284031 198724 90603 52300 76914
39158 76914 81220 31280 -23023 -41001 -45600 -58255 -46067 13316 60348 17101 -93708 -162518
39146 -162518 -132692 -64686 -40397 -63285 -91275 -114910 -145815 -166146 -156109 -145578 -164460
39135 -164460 -159330 -48844 133237 244554 213571 128938 107522 149302 174869 137840 41535
39124 41535 -92217 -206373 -219599 -123518 -17222 21622 41253 116126 207167 218157 140466
39113 140466 38638 -63134 -168128 -220431 -159138 -41207 13842 -7773 -21826 -7841 -26362
39102 -26362 -76838 -87188 -63117 -98053 -201740 -268469 -258182 -253169 -277708 -228181 -69954
39091 -69954 56703 38794 -48538 -105656 -180158 -315507 -367837 -183529 121475 274165 202764
39080 202764 86183 59138 65813 30241 -12544 -16404 -8612 -6569 29926 95753 96645 -14751
39068 -14751 -142491 -164653 -87106 -12426 -3883 -45041 -100170 -150583 -178944 -163457 -101527 -29401
39056 -29401 -5676 -52665 -111227 -99973 -43341 -72485 -236772 -387287 -355899 -200238 -130968
39045 -130968 -211617 -289953 -253097 -183240 -179725 -174188 -52834 132144 216995 149917 33880
39034 33880 -37826 -74833 -111002 -131862 -114178 -72872 -33783 1135 38629 73668 99544 114621
39022 114621 109904 73253 15759 -25995 -26346 1575 23219 23290 23236 55005 116264 161536 151280
39009 151280 101560 62724 53971 50006 34428 28976 55708 103444 150030 186789 201258 170219
38997 170219 98397 33523 10056 5402 -12776 -26696 -4855 26339 12097 -34127 -32870 44438
38985 44438 124791 137135 111909 120134 150699 123602 19152 -80487 -97122 -39318 49160 153338
38973 153338 243710 236654 95844 -59337 -64388 62852 123782 9468 -149421 -185098 -137609
38962 -137609 -167382 -290719 -365061 -330220 -300569 -367610 -449761 -429014 -335223 -280984 -276034
38951 -276034 -232850 -138045 -92739 -153436 -232954 -220164 -132068 -71894 -71926 -63726 -5491 44845
38939 44845 22316 -43862 -86192 -115583 -198626 -327246 -401462 -367832 -295987 -270590 -273502 -235581
38927 -235581 -153406 -80442 -35875 1465 27988 19742 -5476 -1191 31103 41067 7991 -38349
38915 -38349 -75657 -106532 -115412 -74153 -3356 32902 11687 -21322 -22298 3666 35576 61971
38903 61971 61789 15463 -50427 -81980 -72425 -64598 -73302 -67062 -35197 -4829 20065 60696 86791
38890 86791 22890 -131806 -266384 -287433 -223699 -162855 -146535 -167171 -205891 -231191 -215927
38879 -215927 -187485 -199660 -234085 -214206 -145484 -134461 -213487 -259920 -174763 -38600 16263
38868 16263 -1032 883 15481 -37674 -143825 -190502 -135010 -56940 -28823 -29442 -6501 46151
38856 46151 91284 82677 3493 -90444 -98738 -1375 86960 55086 -56699 -125032 -114110 -85269
38844 -85269 -74086 -60373 -37677 -15929 24813 92559 125728 76265 14877 38979 107273 95337
38832 95337 -5081 -82889 -96056 -115573 -172424 -209647 -210058 -224303 -238460 -163317 -4215 104067
38820 104067 93325 55021 71559 93528 64812 35474 55034 73255 43939 14607 19044 360
38808 360 -56259 -43149 91409 209955 181967 98954 117342 184438 131354 -18385 -65040
38797 -65040 40743 109718 10084 -134644 -138293 -5661 112855 131153 91727 67950 80761
38786 80761 96671 68145 -13351 -97359 -131141 -124660 -116507 -94170 -13831 106321 184101 173082
38774 173082 105663 36480 3088 32704 110921 148930 72893 -46708 -54733 75849 194464
38763 194464 180650 100134 84801 144150 186880 170261 129545 88825 34605 -28768 -74661
38752 -74661 -109826 -168566 -237171 -242425 -146524 -15853 44460 13851 -20026 28380 132874
38741 132874 189280 157198 119587 164976 248706 239801 100801 -52872 -97794 -45662 -2225
38730 -2225 -32421 -117183 -209582 -274231 -284080 -233957 -162358 -119041 -104032 -74654 -23244 -9667
38718 -9667 -87226 -216483 -289827 -245985 -132512 -38123 15478 80640 185663 272331 259348
38707 259348 145266 13042 -62300 -80696 -91161 -126011 -170792 -186529 -155882 -108862 -91662
38696 -91662 -102743 -82805 8769 127577 187075 156527 83186 25514 -184 -10677 -29947
38685 -29947 -75661 -143301 -202755 -230729 -235052 -224414 -180810 -101090 -34656 -21410 -18965 32389
38673 32389 90366 52659 -78703 -183222 -201712 -218173 -302641 -379947 -349784 -253344 -202615
38662 -202615 -198723 -152324 -62479 -35841 -108400 -174562 -145362 -71948 -37606 -12661 81256 211204
38650 211204 254086 177693 94443 96846 126663 77781 -30619 -80501 -35701 10307 -7611
38639 -7611 -21970 44672 129834 106356 -28129 -145609 -167282 -143018 -133784 -121070 -79409 -44147
38627 -44147 -37459 -1080 115805 253958 311190 275425 214071 162805 104945 37821 -23010
38616 -23010 -92865 -191641 -276712 -281551 -217205 -154134 -105711 -22862 84897 127302 71772 12107
38604 12107 41483 130918 196907 225082 253021 278894 267349 220372 172112 130229 85063 61569
38592 61569 95954 163896 192976 152768 82232 23925 -15255 -26083 23327 134781 240444
38581 240444 254510 156316 2738 -132162 -211652 -237051 -218024 -159637 -77573 -4837 37881
38570 37881 68428 110127 139050 109546 38157 1260 18750 4799 -106532 -241448 -275161
38559 -275161 -206721 -149351 -157766 -167210 -117277 -37593 21845 55984 59067 2075 -87493 -104643
38547 -104643 1981 142842 203025 181913 140902 82444 -13667 -86424 -50294 65693 152611
38536 152611 183914 223762 276499 262521 171019 105961 125766 150608 96165 207 -59396
38525 -59396 -84673 -111661 -119115 -73298 -8371 21846 27090 43447 63304 73592 106966 176382
38513 176382 218087 187321 149179 173590 202304 142138 38417 13883 66630 80574 25220
38502 25220 -13302 -7457 -29006 -83488 -72324 17607 44499 -80070 -249511 -325697 -319357 -303754
38490 -303754 -274014 -220910 -231126 -356022 -462682 -388391 -197680 -112336 -199793 -300031 -279318
38479 -279318 -196964 -166219 -181047 -162167 -90758 -17680 16169 14923 8798 24898 52320 37497
38467 37497 -44037 -121750 -98791 14666 107765 116140 86913 78836 76907 42256 -19529 -79580
38455 -79580 -120005 -116214 -47390 39736 46232 -49097 -138445 -125597 -61203 -63392 -148015 -223899
38443 -223899 -232200 -201086 -166282 -124192 -79686 -62773 -66382 -33932 46754 91250 19461 -123769
38431 -123769 -214849 -209658 -191937 -249490 -355685 -407403 -347048 -210388 -75396 -986 -577
38420 -577 -34707 -36827 12899 46524 -9187 -110579 -123529 4020 159158 199084 120213 36261
38408 36261 22069 43163 27962 -46251 -141599 -197138 -180076 -122631 -91943 -103975 -103859 -64095
38396 -64095 -50175 -125255 -229312 -234195 -102718 80540 221381 281257 247334 134505 24851
38385 24851 10989 74411 98265 22904 -90155 -169675 -218945 -253255 -247658 -205035 -194091 -248337
38373 -248337 -293854 -254915 -179015 -174252 -255171 -329068 -321068 -249432 -182469 -166310 -189078 -190091
38361 -190091 -125493 -41154 -33463 -109378 -150959 -74732 39548 63969 16432 29171 137153
38350 137153 215501 160710 40014 -3658 60104 129534 121621 72294 63774 102957 128156 121578
38338 121578 139495 199704 213654 108701 -31773 -59479 22085 53987 -45241 -165178 -170861
38327 -170861 -71334 46389 142843 196429 148995 -2183 -129696 -114754 -11694 38424 9228
38316 9228 -18974 -27822 -80680 -182979 -256533 -267360 -265339 -279114 -276218 -248266 -236770 -247884
38304 -247884 -230845 -169407 -115947 -109476 -128155 -137579 -121300 -64363 20335 61357 12496 -50211
38292 -50211 -22784 53208 46676 -36920 -48938 53013 126695 89047 62910 159826 266238
38281 266238 205349 9505 -137089 -164433 -159606 -174852 -157076 -82364 -23893 -41091 -91642
38270 -91642 -96888 -38204 37557 67440 17914 -81707 -151998 -143420 -92385 -62649 -54329 -20721
38258 -20721 44249 96299 114161 124235 141846 136809 81332 3436 -37383 -27236 -28313 -102881
38246 -102881 -205161 -202978 -52728 101845 96014 -24096 -60322 46326 130807 59747 -73169
38235 -73169 -103144 -29035 26073 5872 -46928 -90904 -111654 -95933 -68884 -97753 -176906 -193110
38223 -193110 -102103 -35179 -100264 -187530 -144243 -42886 -59731 -155145 -126265 39990 130831
38212 130831 57436 -17298 23541 71506 25779 -20799 21375 54079 -19471 -85602 4126
38201 4126 174426 241055 187324 132546 104507 44005 -18796 4280 78461 88900 51925 92562
38189 92562 209072 257461 199935 170505 230281 247814 125611 -18928 -33232 35928 38598
38178 38598 -33140 -54460 18090 90440 88423 48328 29113 32637 43707 70198 102015 90900
38166 90900 18688 -55594 -63995 -18354 15666 18100 37508 109372 197766 243615 239067 216487
38154 216487 180734 100768 -24221 -134814 -175190 -160694 -152005 -177822 -210143 -203543 -132944
38143 -132944 -5711 133136 216919 212293 157314 117761 111946 110669 102184 109295 135571 145241
38131 145241 120015 92604 89580 76727 7905 -90760 -136323 -90550 -7140 31596 -2417 -69180
38119 -69180 -101679 -54269 58769 159600 171298 103066 41314 38238 52403 35578 26622 86216
38107 86216 170647 171387 85159 37343 96202 166440 139301 58041 32390 56977 40962 -18342
38095 -18342 -29292 28410 64581 28544 -23512 -46198 -68051 -85758 -20174 141830 274625
38084 274625 286461 269550 355917 499783 546873 477867 430755 481724 542381 507206 394748
38073 394748 297252 266346 285216 295232 228734 72828 -86160 -141582 -98488 -63248 -98043
38062 -98043 -164256 -224159 -310643 -461448 -663852 -906387 -1205946 -1524522 -1728235 -1710104
38052 -1710104 -1524462 -1339066 -1270165 -1299848 -1323762 -1239822 -1021877 -752214 -563299 -515436
38042 -515436 -551461 -586375 -595425 -585059 -536463 -437183 -329410 -262504 -221305 -161831 -100013
38031 -100013 -101541 -187142 -302535 -384925 -413205 -390783 -328683 -263478 -255251 -336997 -470228
38020 -470228 -563811 -547524 -438950 -333634 -310513 -354508 -401275 -439181 -502682 -565702 -533239
38009 -533239 -379495 -210953 -130161 -112254 -91654 -92026 -162974 -249593 -256738 -210437 -217036 -275268
37997 -275268 -278908 -216787 -206452 -279749 -299042 -181859 -65140 -110208 -247688 -273111 -139553
37986 -139553 -136 20242 -48982 -131565 -203991 -252930 -241716 -169374 -89069 -33162 11809
37975 11809 32937 -21118 -138565 -213116 -176150 -98286 -94856 -179272 -272641 -313941 -293195 -214236
37963 -214236 -101228 -20483 -23851 -83293 -144261 -219584 -347028 -466188 -443813 -253553 -45123
37952 -45123 16697 -76522 -210081 -289844 -293192 -226846 -116008 -23575 -9257 -57723 -95633
37941 -95633 -92803 -103023 -178864 -276160 -284320 -157643 8242 57166 -65751 -252507 -347324
37930 -347324 -305449 -212413 -163843 -171067 -187009 -178946 -155379 -147992 -178539 -223499 -221463 -153792
37918 -153792 -99504 -143354 -238264 -251208 -158972 -87530 -111630 -134151 -50591 72379 100096
37907 100096 31451 -32139 -55306 -65093 -33036 72162 139958 10631 -269253 -456999 -420150
37896 -420150 -270922 -147711 -42288 67032 86558 -44899 -204637 -235193 -159872 -110807
37886 -110807 -118549 -120379 -120381 -182588 -282987 -309330 -216862 -79555 14715 31494 -34419 -156669
37874 -156669 -257617 -273851 -231947 -192651 -158090 -115708 -116539 -193732 -254388 -197777 -109798 -170661
37862 -170661 -367152 -476197 -377626 -214014 -163157 -200997 -195991 -124936 -77671 -117059 -230804
37851 -230804 -371175 -469347 -462173 -366394 -272746 -217812 -131804 32050 196548 258709 214653
37840 214653 114440 -27909 -192306 -298044 -297772 -266737 -289443 -311050 -224058 -63502 22381
37829 22381 -12519 -61452 -46351 -23943 -67604 -150356 -208785 -245230 -296332 -349205 -354510 -300039
37817 -300039 -224508 -172511 -168917 -222108 -315564 -395628 -397249 -303034 -174350 -103649 -119636 -155692
37805 -155692 -143190 -119980 -186087 -344050 -459278 -422942 -289654 -191555 -170862 -175540 -176895
37794 -176895 -194033 -219093 -218240 -213064 -268075 -374686 -432453 -384263 -299833 -277132 -316574 -346051
37782 -346051 -328124 -281853 -220522 -130278 -18427 59866 48374 -47548 -160200 -222893 -228616
37771 -228616 -223931 -253407 -320354 -393686 -433667 -416109 -356819 -307121 -292963 -269402 -187617 -98357
37759 -98357 -105481 -197601 -225279 -103670 54812 97187 39937 10706 41006 54650 36982
37748 36982 66224 155742 197887 119656 -2895 -47817 1884 65764 78253 47241 24983
37737 24983 45892 84232 84856 51377 54118 102568 83269 -74746 -236431 -209471 -28702 75573
37725 75573 503 -114429 -133461 -102176 -102192 -105026 -85766 -125671 -256601 -332059 -219271 -26188
37713 -26188 34121 -58237 -135163 -102225 -29130 4660 -2376 -46707 -140697 -238898 -258462 -195815
37701 -195815 -129753 -101940 -87916 -84733 -122481 -181349 -200160 -179833 -180097 -202455 -178829 -94569
37689 -94569 -23371 -18093 -59939 -129088 -221117 -277552 -221690 -100977 -72680 -192094 -327325
37678 -327325 -348636 -290669 -248214 -223736 -187165 -195368 -317657 -488700 -560844 -488593 -362029
37667 -362029 -267801 -209639 -166514 -142912 -142018 -150121 -166155 -204510 -259331 -300155 -305588 -274099
37655 -274099 -209187 -123956 -50802 -15814 -11181 -16716 -32880 -65250 -94110 -92316 -64474 -44325
37643 -44325 -61543 -122515 -203656 -255150 -243188 -198674 -182948 -196122 -179175 -126422 -116803 -187450
37631 -187450 -258211 -253305 -221726 -243230 -282511 -256857 -202940 -236096 -355702 -434433 -419561
37620 -419561 -406130 -463345 -515622 -470135 -359390 -270311 -211920 -144380 -77052 -43981 -26831
37609 -26831 7133 24881 -23120 -97365 -107887 -51890 -22147 -70304 -145914 -189642 -206458 -213210
37597 -213210 -185834 -109459 -31936 -16261 -68012 -144389 -202404 -205664 -125580 14444 126761
37586 126761 146575 111290 98939 109428 79119 7831 -17091 45861 114422 99734 46199
37575 46199 71437 186453 262513 197201 47063 -47404 -28801 35507 63006 54527 68696
37564 68696 134248 220943 286105 314083 302688 247266 166469 114704 121131 128507 52532 -90133
37552 -90133 -178019 -137650 -36837 21630 36757 66515 97914 60130 -46686 -135527 -155970
37541 -155970 -144093 -129254 -81336 10981 90915 113622 108097 108340 89886 35051 -2482 28030
37529 28030 86356 104756 96022 114275 142542 113025 24240 -52120 -78697 -83551 -81727 -49929
37517 -49929 6002 35603 18918 -8099 -22895 -46199 -82096 -96568 -86494 -105253 -178446 -246827
37505 -246827 -236559 -146126 -28243 74719 144191 175099 187517 213287 242149 221716 140132
37494 140132 60184 32106 21584 -24926 -87335 -106927 -85055 -80809 -119827 -160452 -152488 -95015
37482 -95015 -39943 -56239 -162492 -269855 -239351 -47706 145055 162224 18040 -113279
37472 -113279 -114706 -28391 51927 93801 106755 92827 60752 34649 12960 -33039 -91810 -99791
37460 -99791 -37099 19114 -7840 -80931 -93209 -8114 93790 105150 -44 -139628 -188498
37449 -188498 -95662 46497 87831 -573 -85381 -51152 41780 56441 -16774 -68896 -69350 -120988
37437 -120988 -277444 -419188 -395257 -222542 -59560 -17728 -72595 -140320 -172198 -176756 -198131
37426 -198131 -267510 -341887 -319051 -164558 7221 50354 -32230 -106392 -96858 -62459 -64592
37415 -64592 -66020 -17287 39502 29884 -43478 -121701 -176093 -202870 -174130 -79444 9497 7388
37403 7388 -56479 -64902 24542 125540 150988 116836 85493 75464 73015 78855 91274 80954
37391 80954 32180 -16342 -15231 28193 61334 51245 10674 -26513 -33489 -9953 7899 -24132
37379 -24132 -102802 -171021 -180576 -136692 -71502 -10707 19801 4070 -18767 27033 144822 223903
37367 223903 168176 31700 -41826 5067 93701 122761 67401 -29735 -104005 -103752 -36130 21617
37355 21617 9998 -22740 12889 96599 103977 -15725 -160206 -220666 -224164 -257251 -313763 -315087
37343 -315087 -252161 -208075 -231838 -269525 -248964 -176440 -113922 -95384 -99172 -83725 -24262 73321
37331 73321 171731 219963 189598 97090 -12870 -100370 -145340 -146711 -122810 -103552 -101942 -96228
37319 -96228 -63568 -31985 -63929 -168740 -266749 -280895 -237669 -217284 -215686 -140299 31508
37308 31508 176678 176522 79957 27572 51026 54652 -10219 -68808 -55831 -24133 -53546 -121925
37296 -121925 -146226 -109285 -65055 -37790 5612 79262 139556 142212 93648 27718 -30623 -57248
37284 -57248 -20390 81673 186935 211630 138035 41042 10426 55427 105380 101140 58193
37273 58193 28639 28934 30581 3916 -56112 -133350 -195788 -219850 -237183 -320263 -472419 -574139
37261 -574139 -518615 -371156 -287975 -285889 -226406 -58640 70947 38346 -57343 -43060 69657
37250 69657 127958 88012 58388 99927 137280 102379 38644 12748 22804 43751 78415 115200
37238 115200 111347 64238 28673 22290 -10274 -92831 -157182 -146663 -105958 -98431 -100945 -59949
37226 -59949 3585 30822 25503 35438 67847 102059 149703 212378 211184 67714 -147609 -254487
37214 -254487 -174226 -19504 52723 4726 -91984 -158092 -158838 -110321 -72001 -93084 -143877 -147108
37202 -147108 -95756 -77760 -147395 -232179 -224071 -123978 -36676 -41614 -117515 -184369 -181556 -111745
37190 -111745 -35684 -13825 -34085 -19650 67112 157581 152759 47224 -67357 -118025 -129027
37179 -129027 -174118 -273884 -355443 -318724 -153244 17742 45750 -75991 -192371 -160694 -9170
37168 -9170 113978 111210 3746 -139064 -265790 -340044 -338311 -274826 -195031 -134821 -111760
37157 -111760 -144449 -231877 -313519 -304679 -189610 -41089 63856 109800 119495 113903 111906 124264
37145 124264 127837 86934 15845 -27760 -29673 -41886 -88975 -114547 -71053 -9647 -15733 -88675
37133 -88675 -148567 -140629 -77375 932 52279 42259 -12350 -28986 49101 166173 227410 235319
37121 235319 261699 292768 217731 5894 -208824 -284036 -231571 -155023 -94966 -26159 36842
37110 36842 34324 -45888 -154800 -263323 -376733 -456160 -414636 -240814 -60945 -5573 -45433
37099 -45433 -34955 83765 195314 160867 -2445 -149230 -186269 -158589 -152970 -183130 -204392
37088 -204392 -191676 -152280 -91918 -22177 15692 -11708 -77761 -132167 -178331 -253516 -337924
37077 -337924 -360350 -310608 -269893 -293425 -329661 -303707 -226061 -165937 -160216 -198122 -254104 -286869
37065 -286869 -251837 -171210 -143609 -213299 -272204 -179146 45905 234174 266137 176562 69433
37054 69433 16745 47344 144842 230625 223705 141985 75194 43547 -27161 -158984 -252622 -231887
37042 -231887 -172393 -194794 -285942 -327289 -276039 -219347 -240959 -311996 -341855 -291039 -206121
37031 -206121 -162329 -184080 -219027 -200838 -137896 -102852 -117394 -101726 10727 151495 184016
37020 184016 77802 -56580 -109462 -81996 -38640 -12230 7916 32397 54818 65491 63516
37009 63516 63279 88611 141890 185261 182146 151701 141974 149072 113901 14999 -86327 -124744
36997 -124744 -112164 -99099 -88296 -40658 44532 107623 96796 25524 -48301 -76866 -49159
36986 -49159 11440 61391 66156 33025 6945 19725 50794 56458 35986 43180 116423 215330
36974 215330 256845 213050 140453 98376 70158 -1312 -116655 -202124 -196182 -123017 -65333
36963 -65333 -83580 -172603 -276906 -331825 -305355 -221093 -138011 -97338 -91806 -88253 -66432 -29378
36951 -29378 5425 10348 -37833 -122741 -180489 -161016 -99096 -90300 -179790 -300619 -347325 -294789
36939 -294789 -214324 -178932 -188938 -200929 -195137 -184010 -171739 -142740 -94526 -55358 -56833 -101562
36927 -101562 -163009 -204904 -200695 -153990 -106045 -103709 -151247 -211309 -257455 -297891 -336527 -347020
36915 -347020 -313304 -265044 -235550 -209764 -159488 -110000 -112863 -156851 -169357 -120312 -66034 -64323
36903 -64323 -100323 -131924 -155656 -175411 -150425 -47500 72967 99385 5936 -115850 -179302
36892 -179302 -195262 -211055 -215938 -167358 -80996 -26717 -34161 -59033 -60561 -65582 -121398 -213397
36880 -213397 -273160 -265778 -234115 -243217 -300812 -350630 -337584 -263171 -173555 -106173 -62419 -31298
36868 -31298 -19572 -40192 -79018 -98543 -81060 -47864 -27084 -25769 -47321 -104517 -181638 -210428
36856 -210428 -139050 -21138 25559 -29488 -76023 -5015 135638 189033 82339 -86469 -166318
36845 -166318 -110513 7579 97809 127733 104952 35690 -69434 -167475 -199801 -149533 -62366
36834 -62366 4195 35413 47924 48400 35497 24918 30138 28057 -7729 -46973 -39624 -16268 -70647
36821 -70647 -211510 -317119 -297577 -225972 -223025 -274534 -274569 -212733 -187218 -228021 -236528 -143257
36809 -143257 -18017 40664 41590 51689 73217 52403 -23214 -108706 -166421 -190625 -183274 -156299
36797 -156299 -145129 -172564 -209276 -212711 -191906 -186326 -190247 -153906 -66734 10527 17093 -39456
36785 -39456 -106839 -151712 -175034 -185580 -192377 -219539 -292051 -386171 -417977 -322515 -148126 -30929
36773 -30929 -50932 -145315 -195707 -167246 -114594 -84380 -83479 -127180 -229924 -336911 -353103 -273531
36761 -273531 -207486 -232699 -300302 -331295 -326265 -313979 -272159 -190546 -146630 -207510 -297842 -283260
36749 -283260 -166421 -83750 -111716 -195022 -276881 -371544 -465558 -470319 -351095 -210735 -154943
36738 -154943 -143973 -78667 13215 -6736 -185806 -395864 -485873 -450733 -400823 -406044 -430549
36727 -430549 -417860 -385619 -400264 -478187 -558061 -581537 -561840 -544841 -537047 -518040 -500287 -513886
36715 -513886 -534426 -494408 -388355 -305085 -313153 -358851 -331553 -206585 -68275 4583 26593
36704 26593 66359 157032 273111 377460 458247 516081 543193 537278 521068 519357 521378 496689
36692 496689 445779 395897 346964 277116 213774 225657 306188 345675 289584 248896 350938
36681 350938 539592 655414 683947 770118 972757 1160865 1211082 1173142 1156097 1162411 1135356
36670 1135356 1084413 1054648 1029650 965541 878519 809413 742499 646566 556469 525016 532639
36659 532639 536745 566597 655918 713778 601094 344258 142191 122556 200867 233109 208618
36648 208618 214189 273372 310319 257767 143956 67259 100611 214359 298225 281655 214904
36637 214904 188943 199957 167596 80524 28636 64640 125538 142814 150471 211531 295896 314593
36625 314593 245908 153483 93942 69982 66048 71207 66528 40210 18925 40472 90259 106710
36613 106710 62642 8304 15794 100457 211314 285993 301116 271834 215987 137528 53305
36602 53305 9420 30638 62002 16275 -105940 -199668 -189011 -120471 -77281 -59689 -24643
36591 -24643 217 -55256 -167737 -215371 -137202 -15686 39183 16754 -30291 -80008 -132327
36580 -132327 -158860 -142102 -133110 -183496 -232234 -154621 56301 240816 250685 118596 -1377
36569 -1377 -20095 17511 25563 -20122 -73917 -75448 -8122 75360 95346 36748 -22464 -11625
36557 -11625 27582 -2852 -103681 -158969 -96508 5773 32240 -1687 26761 166183 309747
36546 309747 320679 189409 28003 -65677 -95031 -117498 -152572 -168442 -144551 -101628 -53962
36535 -53962 24709 144421 238511 226973 136971 86591 127254 175466 145667 82560 88036 160518
36523 160518 195097 133528 35707 -7716 28505 109591 187067 217670 179609 98598 35870
36512 35870 34991 92309 172309 226135 207367 110939 -3933 -65571 -61348 -23002 42883 153337
36500 153337 282855 365794 380313 372002 374739 365238 322518 277005 263277 267772 261259 248274
36488 248274 249108 261307 269110 266915 252477 223604 195571 189266 193494 181196 167929 195453 245896
36475 245896 246739 188025 151070 175270 185627 122790 58023 78336 125355 72930 -68488 -152101
36463 -152101 -96523 26028 114647 147853 143876 112138 84295 110201 174466 182862 80377
36452 80377 -68705 -160519 -166678 -135064 -122130 -160384 -247767 -327848 -317984 -199445 -54526
36441 -54526 15079 -20411 -125786 -250555 -338614 -337969 -253537 -161832 -128731 -137494 -134774 -111569
36429 -111569 -89450 -61510 -10843 33338 27299 -5273 9777 90627 170882 192821 173400 155227
36417 155227 144998 134007 135134 156319 167500 137373 82386 37394 -3494 -65277 -118577 -90253
36405 -90253 29972 142623 139667 27670 -89736 -136395 -126395 -106972 -89839 -60044 -16745
36394 -16745 25081 53768 58552 30062 -9938 -6142 58314 104442 34408 -123938 -212278 -121059
36382 -121059 68855 174664 118488 -6891 -66253 -13485 113519 262852 389520 447059
36372 447059 415807 331878 247187 166962 66711 -37056 -88887 -78128 -63032 -81172 -89490
36361 -89490 -42593 13900 -1304 -76194 -107429 -38057 70172 119003 76218 -19642 -105702
36350 -105702 -127936 -80466 -32435 -60845 -135415 -138811 -37288 48603 8822 -93097 -113930
36339 -113930 -37091 22350 -6422 -81645 -153774 -223553 -271800 -239885 -130450 -40055 -32143
36328 -32143 -50749 -25423 6593 -31616 -111690 -120500 -17376 112415 173779 165164 143204 138587
36316 138587 144663 157234 181987 207294 202725 157679 105121 86208 92296 66183 -23196 -127592
36304 -127592 -171624 -149289 -128850 -155123 -188153 -163645 -84086 -15805 -10015 -59241 -127707 -193330
36292 -193330 -248769 -281122 -272454 -222508 -156022 -93489 -22166 79126 183697 222741 174521
36281 174521 116212 139272 225512 260407 176662 38164 -38160 -9574 66748 112296 105272
36270 105272 81914 72571 54717 -3901 -63144 -35512 73157 121352 10247 -150869 -169039
36259 -169039 -29033 100280 118469 101425 119895 111779 28424 -31470 29937 125538 99444
36248 99444 -34108 -126021 -137152 -186511 -345385 -531573 -650327 -718906 -796486 -893204 -1015266
36237 -1015266 -1217315 -1530518 -1884990 -2165991 -2316225 -2342196 -2261139 -2090659 -1862736 -1607861
36227 -1607861 -1347561 -1125036 -999717 -971884 -951450 -851386 -687968 -546253 -474591 -462637
36217 -462637 -495070 -558566 -602900 -568427 -470817 -397353 -387738 -372512 -277696 -147976 -96849
36206 -96849 -148076 -200842 -168469 -85842 -41698 -58689 -95431 -126826 -151799 -142896 -69701 23278
36194 23278 40429 -39081 -125814 -140436 -105085 -76068 -52623 -13130 9810 -35389 -133267 -212382
36182 -212382 -229039 -196396 -154118 -150944 -221924 -330451 -370874 -292458 -184459 -163763 -212733
36171 -212733 -220120 -159313 -115779 -133008 -143103 -85955 -4835 25797 -2266 -51547 -96429 -116409
36159 -116409 -86262 -16706 42632 78722 141691 252585 338675 320928 228534 162208 163001 176731
36147 176731 142163 61845 -20464 -69780 -70621 -19100 64756 123085 93449 -17608 -111996 -96071
36135 -96071 -397 53441 22412 1592 64808 131983 91786 -11686 -46959 -11958 -26614
36124 -26614 -108264 -122768 -7284 115287 126947 83172 86062 106887 63866 -10770 -22418
36113 -22418 19973 24994 -21255 -40176 2587 52946 61301 27753 -44192 -150711 -241256 -252490
36101 -252490 -198326 -154011 -144446 -119824 -51887 14961 27372 -15363 -75748 -109470 -82071 -3248
36089 -3248 55656 25812 -79070 -186572 -251554 -268927 -229259 -135619 -51113 -49083 -112699 -154538
36077 -154538 -137001 -101198 -76607 -45182 -8416 -8190 -55856 -111206 -152946 -197105 -224049 -171487
36065 -171487 -41127 64204 64061 1147 -33770 -23134 -11008 -15137 -15451 -8570 -19294 -61227
36053 -61227 -115203 -143347 -119732 -66220 -48404 -93782 -127587 -62336 48183 43298 -120207
36042 -120207 -279000 -267784 -125793 -7631 38117 82256 150621 183877 166413 169844 224691
36031 224691 245030 144778 -32562 -165334 -200751 -194198 -218139 -278770 -322493 -295985 -199729
36020 -199729 -99544 -78172 -156231 -266522 -324070 -312398 -275029 -229916 -139384 10482 140378
36009 140378 143999 21368 -106344 -134336 -83989 -46224 -55279 -67388 -43038 5379 46899
35998 46899 64667 46734 -14516 -96921 -151669 -149382 -107991 -69635 -63906 -89319 -112653 -96333
35986 -96333 -47497 -21782 -49802 -86593 -77385 -43671 -40321 -49735 -403 114664 226913 306751
35974 306751 391546 474972 474599 363030 234547 169505 119879 18604 -75540 -56901 51482
35963 51482 122823 108843 82134 95239 108853 86888 66810 88227 120399 112107 70927 52059
35951 52059 95274 195383 305944 358896 319380 240388 225174 312152 430087 487984 472038
35940 472038 426903 381802 339746 313215 316716 328460 305806 244869 184416 139135 73410 -29061
35928 -29061 -109949 -104637 -46285 -32119 -77747 -81178 26274 161306 192897 120210 58908 73825
35916 73825 121876 156534 182391 185285 116219 -6870 -75582 -29830 62161 123472 177118 255255
35904 255255 293793 231583 143435 142995 200354 196282 129409 114734 171990 173609 48404 -99010
35892 -99010 -139573 -81055 -5275 61743 134657 196966 227488 246865 268783 256737 197253 161505
35880 161505 213341 298890 315282 260173 219617 218136 178719 52090 -96739 -174394 -177246
35869 -177246 -172806 -190915 -185852 -112095 -4529 42677 -22936 -148535 -224646 -189437 -73135
35858 -73135 46840 107891 86310 -1481 -105454 -170402 -170832 -111188 -4836 120147 210099
35847 210099 228244 208229 218183 268419 305090 296801 263223 209149 111567 2986 -19985 69195
35835 69195 158627 138237 46639 -5845 -5102 -21105 -64881 -76177 -49390 -55460 -112851 -136912
35823 -136912 -62888 57193 129258 129664 98183 71711 73660 126206 219521 293228 291865 224888
35811 224888 147268 105733 126478 216898 338044 403857 357488 240470 151526 146529 208653
35800 208653 300080 401549 504448 601879 696102 795166 903192 1028740 1188211 1374459
35790 1374459 1533737 1606213 1586555 1520204 1450145 1395123 1362746 1341907 1294268 1203335 1123427
35779 1123427 1117927 1149855 1113839 999835 937957 1026931 1196691 1317780 1375683 1428581 1443028
35768 1443028 1317525 1077090 903851 918138 1036128 1111762 1123224 1129943 1125412 1049181 905063
35757 905063 754355 606933 427126 250843 189183 281237 423892 486209 432083 304368
35747 304368 161861 73421 100347 217508 300723 260546 153719 94575 87903 36389 -91024
35736 -91024 -193310 -178115 -96297 -67048 -103161 -94211 23681 157318 174867 92721 56890
35725 56890 135173 223165 207373 136837 136101 199197 197976 94353 13770 61254 173378 225215
35713 225215 196830 144435 75933 -34021 -140347 -153715 -72565 5486 21362 24566 78320
35702 78320 159138 187351 117933 -22930 -158920 -209585 -154185 -62111 -22846 -41215 -49524
35691 -49524 -26499 -33228 -101573 -161294 -140820 -87434 -106901 -209470 -299972 -317460 -298589 -281556
35679 -281556 -234385 -137580 -73115 -140728 -304245 -409011 -366484 -247805 -165137 -132992 -103278
35668 -103278 -76945 -94438 -142004 -160795 -151952 -182804 -263426 -303010 -239831 -143873 -119985 -157481
35656 -157481 -156240 -79324 411 8463 -41704 -83732 -77795 -37602 -7963 -26412 -86424 -137522
35644 -137522 -139791 -108401 -82560 -71493 -67995 -94058 -176326 -277473 -309727 -235457 -112764
35633 -112764 -20402 29983 85260 177592 280137 328252 282311 177531 98025 82805 80388
35622 80388 30161 -40149 -57950 -31888 -54873 -162906 -264513 -255821 -156552 -80628 -98229
35611 -98229 -169078 -197961 -128444 2118 79812 9628 -180187 -347678 -373811 -272333 -148111
35600 -148111 -76780 -54640 -39958 -1342 65752 133903 154615 101568 6984 -62468 -67924 -26755
35588 -26755 15540 29149 18747 7945 4840 -13524 -68034 -129425 -129001 -33603 104751 190710
35576 190710 172152 80763 -994 -7013 64207 156949 216183 235071 238640 237214 221121 190099
35564 190099 155287 119285 90512 106807 191364 282954 273655 141854 -4635 -50374 6727
35553 6727 86528 130250 130992 103674 76633 85563 128562 150894 118810 83397 121008 229075
35541 229075 332756 383872 405488 448253 550617 733008 974667 1189118 1273020 1202007
35531 1202007 1052961 922260 843995 789829 721076 630116 544252 492305 464400 419274 338536
35520 338536 247127 165742 80958 -9005 -61350 -46351 -358 32814 76434 167106 255146
35509 255146 245602 134662 22698 -15683 5059 60114 168385 330725 485381 570879 583645
35498 583645 543144 457987 360214 309875 319517 329297 301489 277465 284627 254281 118541 -53897
35486 -53897 -116909 -32444 86776 125971 91153 71029 130363 254422 361120 367993 281794
35475 281794 204752 205363 212948 117438 -45808 -118318 -42831 47612 21282 -72560 -106571 -80968
35463 -80968 -101703 -180867 -192142 -58090 118778 177296 94730 -3414 -6946 64532 113145
35452 113145 86239 26277 9202 51272 90082 63496 -6284 -31761 36396 153478 241413
35441 241413 277381 293822 308557 297070 241601 173107 138714 143267 152508 152974 176226 242589
35429 242589 302789 277534 164365 68138 92121 214917 312594 300128 212219 135603 104193
35418 104193 92683 84651 97922 139419 172653 152803 81474 7670 -25554 -21184 -6714 13533
35406 13533 55273 97561 71767 -48685 -171080 -162232 -13469 136450 170958 128568 121665
35395 121665 177349 227566 227187 207280 214056 251680 287242 273543 183860 69380 49198 171396
35383 171396 311906 308707 187253 135324 233562 339524 301428 169160 94404 112515 145703
35372 145703 165009 215943 302949 371825 411093 462559 520958 532832 519169 583625 745942
35361 745942 875200 873437 842023 959221 1242781 1544145 1749460 1869834 1946446 2015722
35351 2015722 2212257 2742996 3606701 4406900 4619131 4084158 3143837 2272423 1678266
35342 1678266 1296760 1026658 834108 679896 493113 252110 23097 -104250 -88559 39026
35332 39026 180911 235626 209845 227103 355713 484165 470957 361610 308898 312476 230929
35321 230929 68047 27115 191546 355204 316962 177532 161243 270488 327286 279065
35311 279065 241300 260879 245489 147105 40610 -14354 -42311 -51210 -1213 91450 151083
35300 151083 178993 261814 401130 471797 414323 341959 374650 477302 557937 634014 789506
35289 789506 1018895 1213925 1286081 1236210 1119705 990478 868224 738567 599214 492958
35279 492958 446521 396504 260626 81369 -2046 54749 139619 147262 103247 81245 96772
35268 96772 138544 210761 280793 271414 171472 77149 63863 95611 114599 129433 152047 143529
35256 143529 97210 83697 134660 172084 132910 70085 46292 29178 -13271 -20481 47411 110097
35244 110097 103360 107061 196777 276536 230376 149079 208536 380159 467019 402189 311898 284545
35232 284545 268503 219522 175356 151006 111690 77585 113355 194592 227752 215240 247734
35221 247734 319992 323866 251414 226260 287016 320380 273889 252461 313252 338407 229870
35210 229870 85379 56095 148686 281972 422741 548646 588791 527454 471971 499393 529621
35199 529621 468252 374636 352601 366291 318871 245880 267459 383219 464595 440387 366770
35188 366770 321312 330995 389000 447377 418847 284006 169344 216797 397635 553252 596890
35177 596890 576227 559496 563541 581899 588897 528626 386729 250776 210133 225920 198340
35166 198340 130016 110773 165534 235453 292781 354551 396597 380517 357799 414130 510665
35155 510665 520879 435636 384321 425680 468085 443247 410871 424490 431852 393189 377346 446220
35143 446220 545447 602209 638128 690636 711038 646827 555491 530355 563880 576858 535579
35132 535579 454993 336947 195322 98240 95972 141897 160953 150249 134183 82800 -20820
35121 -20820 -88000 -29944 71705 37825 -160291 -352823 -394093 -317381 -230462 -167112 -106685
35110 -106685 -58034 -44781 -48308 -26897 27982 90126 132250 137134 98902 35163 -17591 -29387
35098 -29387 14585 114136 226515 257409 141853 -59945 -204150 -213234 -135868 -55210 -4223
35087 -4223 11939 -15939 -70041 -99577 -86689 -68960 -62635 -25502 54625 98119 33414 -84063
35075 -84063 -132218 -78567 -2246 25090 4936 -38057 -94421 -140731 -135721 -76392 -17981 -12806
35063 -12806 -55176 -99215 -105036 -60413 15206 81236 113818 132311 163618 191688 181022 142339
35051 142339 127960 161876 221206 288003 367747 451008 512080 556791 616679 684719 717519
35040 717519 713939 719665 731690 679586 539989 387480 282045 192438 94414 48051 82803
35029 82803 97064 1329 -105741 -56798 121963 228054 161285 29968 -40639 -49580 -25540
35018 -25540 54439 174289 239441 218158 203706 237165 188897 -49517 -347389 -463537 -343936
35007 -343936 -149012 -19660 36709 41488 -16076 -103469 -135481 -89542 -37304 -23138 -847
34996 -847 67259 136466 160518 172732 222810 288390 313477 294428 265855 227843 147226 24686
34984 24686 -83953 -119670 -75596 -3773 26853 -7647 -63610 -86877 -85855 -113627 -179786 -226706
34972 -226706 -205921 -135011 -61837 -12921 5447 -2481 -9426 15689 56205 61572 33837 42224
34960 42224 114504 173792 140922 51594 2598 15617 31273 21588 29591 93292 196074 300737
34948 300737 373275 367060 254164 96677 18973 66003 143439 149261 114868 144693 247228
34937 247228 316037 285025 217522 202430 229430 229061 192210 171757 180485 169595 123062 98112
34925 98112 134814 189289 210581 229639 296940 367061 340550 221324 138184 175593 260089
34914 260089 269350 195800 131624 126218 140730 143813 175076 276218 405573 474231 458336 430585
34902 430585 463809 533859 553958 496038 429222 416168 417148 352294 239149 196316 292602 451882
34890 451882 545943 541353 511151 529687 604103 696102 766335 800547 828059 908004 1055490
34879 1055490 1182916 1166269 990452 788749 707376 757716 833598 849800 819216 801736 827018
34868 827018 883941 949883 1003050 1025196 1017104 1002112 1000023 1012663 1046258 1117157 1208398 1257133
34856 1257133 1235288 1213838 1275694 1377184 1386495 1276549 1182423 1213997 1295416 1270376 1107273
34845 1107273 909557 762317 665738 601276 564484 527839 458383 387884 390691 473754 554672
34834 554672 563921 504927 404539 282051 187861 188129 266758 309532 233214 78153 -62240
34823 -62240 -141472 -148699 -70777 65220 162625 145332 54657 -1649 24472 95090 158015 189173
34811 189173 184133 163956 178398 251570 328476 320098 203104 43047 -76772 -120160 -100772
34800 -100772 -56032 -24207 -25918 -57045 -96233 -112300 -75375 13668 110645 174550 214960 253722
34788 253722 263648 216768 179982 260754 436280 541065 472275 312270 190572 127382 95984
34777 95984 136071 280122 433562 463436 377715 298872 281968 277457 261635 275799 318609
34766 318609 314659 230003 131784 92235 101826 113189 112188 109972 110141 115983 141599 196970 276389
34753 276389 353779 372190 275007 93458 -36146 -10808 110755 191361 199944 223294 308614
34742 308614 399714 445914 479286 545558 628493 686864 726140 803526 979633 1265418 1605437
34731 1605437 1947601 2346461 2913035 3592040 4084986 4127838 3789111 3350774 2949009 2515099
34721 2515099 2040002 1661257 1434462 1232587 971456 752961 665580 610372 474199 335837
34711 335837 327645 396852 389025 302930 276667 349506 415543 418230 425123 469850 462274 330499
34699 330499 156375 85006 148378 251315 310717 337796 362878 335724 177452 -61086 -183781
34688 -183781 -69729 151369 257046 228597 242280 367139 454303 388893 273237 242982
34678 242982 253594 201944 137606 173075 266562 285133 239403 265383 384300 463496 436645
34667 436645 397574 430826 490431 506258 496854 511790 543400 546821 489967 366353 224631
34656 224631 180627 304567 491705 554217 458825 356476 349157 362969 314940 270978 328827
34645 328827 439919 475884 422666 387371 427303 478353 467817 418025 402746 444486 491474
34634 491474 486302 435144 397680 411043 446293 457841 449671 453467 460003 426957 353008 290940
34622 290940 280749 316467 381033 461922 528465 549766 542788 548138 556703 526756 477124 479072
34610 479072 533536 545414 462651 357525 312547 303718 272631 248942 305267 424279 505332
34599 505332 497362 448080 417333 409136 405051 410338 440597 494137 558524 626732 693391 743738
34587 743738 752293 694799 575557 449132 391101 423678 482763 482257 405292 312792 267066 267567
34575 267567 266296 234605 203839 232227 330566 438070 490073 493832 503735 529513 518726 446172
34563 446172 372076 369807 422861 445471 404020 367209 408087 489423 498038 396374 287282
34552 287282 288718 377640 420193 350555 251159 236560 321531 438882 528933 562314 525585
34541 525585 447603 407932 458705 557202 619371 611051 547772 452944 369988 359915 415258 432228
34529 432228 356156 299238 400608 606622 718408 647111 498428 402237 380951 400764 433952
34518 433952 442743 405297 379150 438083 535980 549244 467391 411526 440734 482901 495224 537825
34506 537825 624501 656893 597669 564807 646507 754889 782005 775143 822896 884454 886669 890069
34494 890069 983911 1090310 1061101 931027 884890 973993 1044474 984232 888203 911222 1065453
34483 1065453 1237457 1339883 1383307 1428995 1510039 1593840 1621389 1588898 1561687 1588316 1645277
34472 1645277 1698448 1763453 1855071 1932069 1956402 1962057 2000422 2058358 2093750 2112825 2151122
34461 2151122 2215202 2295118 2390226 2479235 2527394 2569956 2706294 2948289 3165523 3262258 3318284
34450 3318284 3460603 3686596 3922221 4166369 4452133 4740503 4986239 5253672 5645683
34441 5645683 6170856 6788831 7517659 8377793 9294058 10161655 10938028 11585238 12048918
34432 12048918 12416189 12950928 13820294 14935315 16227596 17895835 20147857 22879237
34424 22879237 25892956 29294270 33377826 38280908 44088662 51148240 59922440 70696396
34416 70696396 83909082 100783895 123302295 153482822 192279875 237530297 281315815
34409 281315815 310279304 312071364 284349466 237493788 187343218 144931837 112764350
34402 112764350 88649900 70395463 56777937 46567847 38549335 32158718 27245930
34395 27245930 23445099 20293068 17665625 15610604 13958817 12476975 11192766 10213255
34387 10213255 9397782 8529265 7652814 6950318 6416287 5925798 5490208 5180715 4911665
34378 4911665 4553545 4167699 3895405 3704372 3472030 3231097 3095713 3013129 2828352 2554199
34368 2554199 2349490 2252774 2157479 2045294 2025171 2108473 2137371 1999491 1773151 1602526
34358 1602526 1534408 1519875 1492061 1413136 1307747 1253894 1284358 1319163 1260792 1122670 993700
34347 993700 922915 917386 989880 1104189 1133990 999478 797897 674094 615125 519015 416050
34336 416050 437143 571683 647904 587209 506945 518734 581664 620908 644135 657758 603361
34325 603361 479402 411386 484568 594387 584642 472617 413136 469993 539921 506909 382250
34314 382250 269421 246040 302997 371806 397515 388974 392000 421766 453577 476214 502590 517791
34302 517791 479634 400023 362535 410137 466619 429930 308882 204169 172990 174633 150121
34291 150121 104979 95068 150905 227881 237316 143966 27998 12229 119450 247102 299111
34280 299111 285938 262607 235092 192869 182405 258904 381597 442636 408282 360059 375583
34269 375583 427872 433511 359471 251235 179262 177845 218489 232955 180594 95692 47554 59931
34257 59931 102652 155847 232114 324398 383183 372322 309777 230547 151556 99842 121921 213682
34245 213682 283640 254784 180549 184567 289227 383141 378850 329600 344683 440167 528141 527334
34233 527334 438331 327676 278094 336602 466025 555376 522228 406441 326911 345832 412193
34222 412193 439798 398846 320204 250345 223350 246805 291946 316837 312435 303507 295869 256543
34210 256543 165889 59048 -9607 -21046 7213 46098 63129 43039 26700 85241 214177
34199 214177 298400 242959 103708 15528 17408 38757 49254 110010 242289 348779 337114
34188 337114 251439 199552 195865 165383 82934 19531 40055 123146 205329 256229 285445 309026
34176 309026 334468 362876 392510 426167 469286 509376 516268 486014 459256 458856 438111 349288
34164 349288 244529 232716 333339 449155 497372 489256 459096 406658 354131 365160 437660
34153 437660 465793 397444 343605 411185 499230 420365 194944 48643 98355 210431 229953
34142 229953 193301 212955 276270 284828 215895 128084 59707 21384 38751 105303 141994 101430
34130 101430 60388 102291 163295 125866 23802 1546 82170 135828 95911 48353 61397
34119 61397 77246 46003 36123 118170 239702 307754 312659 287236 227647 144817 114351 174311
34107 174311 239658 219343 156879 148470 180913 173252 135863 153424 227036 265878 241762 230695
34095 230695 280096 342408 367677 363120 330592 243966 132340 92069 153426 209941 152998
34084 152998 23966 -43715 -4198 54838 45153 -6485 -6289 72923 152162 154844 117575 138251
34072 138251 221864 255619 168226 35768 -30596 -29228 -17994 9506 81988 134383 74990
34061 74990 -45113 -74327 14103 79301 29166 -56427 -72216 -29300 19880 80805 154711
34050 154711 177168 113192 34951 18877 39409 44576 54022 90175 94133 18169 -65957 -63332
34038 -63332 -3527 18992 -2915 -13053 -14287 -35312 -17606 115967 294495 349192 242233
34027 242233 114230 82915 117250 140816 142733 139343 120112 79007 31584 -22471 -87205 -119959
34015 -119959 -76964 -4770 13387 -4054 27820 89307 68956 -29240 -56739 43356 135793
34004 135793 117192 81754 144038 240348 254017 219218 234497 267090 221658 137462 131768 185367
33992 185367 170225 77881 38167 100783 174552 212132 279606 387740 422719 332575 239959
33981 239959 264292 348194 374813 362356 416326 553915 702476 836345 996097 1179619
33971 1179619 1313577 1345804 1300563 1238099 1209615 1242833 1318575 1368285 1341899 1268806 1210789
33960 1210789 1177150 1137726 1095185 1077733 1071758 1031591 957974 903012 891306 897714 910972 953492
33948 953492 1021123 1069565 1088720 1128461 1213330 1288562 1297054 1261636 1240949 1247588 1263019 1284954
33936 1284954 1289073 1191819 956986 721349 684436 838806 932353 780016 515973 418420
33926 418420 543510 678459 650667 531109 479110 515999 552576 555008 563729 587767 593560
33915 593560 584989 591299 580163 492379 376349 369801 501570 621452 602074 517412 522380 626578
33903 626578 707388 708293 692181 696497 663005 557215 463206 492848 650779 841723 979453
33892 979453 1050543 1097364 1168577 1267222 1335850 1324639 1280702 1318941 1482836 1688591 1841595
33881 1841595 1953688 2097173 2296332 2534163 2828547 3214460 3659833 4088581 4510270
33872 4510270 5056213 5850748 6904228 8179608 9713882 11607722 13939330 16805865
33864 16805865 20457358 25185943 30809580 36193252 39517111 39373738 35805694 30270121
33856 30270121 24551504 19689409 15817201 12715887 10264122 8416147 7034398 5928219
33848 5928219 5006590 4289518 3776677 3372971 2963671 2531626 2167068 1947613 1824101
33839 1824101 1665617 1427108 1215770 1145791 1177833 1175873 1088306 978746 891641 799647 705173
33828 705173 682696 763185 861670 885652 848874 814159 788249 746816 707285 693673 671544
33817 671544 602773 531811 528593 566546 547551 442843 327891 277234 298105 365447 445163
33806 445163 479971 431062 345367 311125 340520 369638 374643 396694 440050 448138 410235 385623
33794 385623 377118 296143 129020 26696 114569 292156 354158 266827 188354 227160 314214
33783 314214 340247 306281 286125 318371 391665 485362 572387 609718 566455 454063 316763
33772 316763 203688 145787 136067 139971 151575 218193 362684 501111 508177 372294 221909
33761 221909 178389 235502 301429 304857 237421 144993 102145 142839 193291 137023 -18507
33750 -18507 -111026 -18096 177788 295373 281219 237018 238889 233869 146118 9006 -66777
33739 -66777 -28371 62156 105663 76497 42236 74473 156974 208418 193675 170667 205769 282490
33727 282490 333303 334662 323946 335083 360570 373941 357298 311320 261666 240212 237256 202393
33715 202393 125989 76867 102696 136746 90289 12106 44866 210733 351762 330899 200900
33704 200900 110363 117101 168500 205700 202282 142911 54820 35762 155796 334303 406015
33693 406015 326220 227023 236165 316317 341849 279415 214861 221206 279102 343166 418650 520936
33681 520936 595716 553238 395049 246715 221174 286892 327008 302753 279511 290510 270936
33670 270936 174780 75144 65555 112344 104371 30982 5564 94925 218452 261317 218234 169824
33658 169824 166634 196311 232967 258510 249629 194937 118577 46706 -35538 -145494 -233438 -216604
33646 -216604 -95483 24754 59568 39493 36967 49687 28299 -7030 27554 138961 211009
33635 211009 157592 58890 61548 175987 271350 273117 259270 313534 374401 318256 145166
33624 145166 -12875 -55343 -205 91179 187293 261501 276376 239579 212428 212160 166498 32973
33612 32973 -91060 -74209 55812 131939 73386 -12927 -2616 68158 77002 3945 -58817
33601 -58817 -61365 -50971 -60473 -45748 15826 47183 -29676 -162248 -219260 -161800 -87948 -95244
33589 -95244 -157055 -163099 -51240 123288 237859 219528 124173 83541 151571 233316 211748
33578 211748 112892 67119 115443 150800 79719 -47552 -123432 -127831 -116397 -114121 -96728 -52855
33566 -52855 371 50637 90408 99853 71063 28833 -6516 -44262 -77548 -63448 1081 40530
33554 40530 6266 -36102 -9920 36761 6998 -73066 -84112 -1455 73641 74183 38141 10065
33542 10065 -4647 25886 136877 252603 240681 123340 78082 160634 197790 69151 -67730
33531 -67730 -1282 203591 294232 188371 52349 36908 107582 159489 161589 145545 144747 172184
33519 172184 196616 150154 27508 -56709 -720 132337 203235 197002 201061 215436 150240
33508 150240 15509 -59626 -33913 -14699 -55623 -57530 45757 157238 180008 172460 213297
33497 213297 235554 149234 35150 42994 146823 172292 54546 -82436 -112724 -44058 50557
33486 50557 118247 116567 26649 -85002 -106008 -15943 91240 147213 184473 237419 262749
33475 262749 218468 143505 87611 27738 -64943 -128688 -79327 50347 135900 124373 83977
33464 83977 79492 87474 70990 56974 76976 90946 48772 -6793 14173 107030 162315 115911
33452 115911 34175 13884 63427 134077 212302 309027 388152 383971 290934 179554 116673
33441 116673 109880 126233 121914 59494 -53171 -140315 -126164 -33778 30180 -1071 -86939 -138391
33429 -138391 -99507 29829 196852 310765 308744 225625 157468 153548 193537 260706 356996
33418 356996 436777 420553 313569 228369 240399 294329 303848 268427 231036 196822 169625
33407 169625 199430 302340 387443 361719 270786 237459 286414 331376 326728 328192 383258 444243
33395 444243 429831 330591 225273 204585 276743 345298 313009 214038 179005 244215 287446
33384 287446 215847 120025 139547 258284 359250 412759 458878 454474 318778 121829 42313
33373 42313 108392 152888 77748 -2720 40627 162832 252222 295515 322293 296959 196240
33362 196240 112406 145913 247577 291053 266416 281523 384173 492553 515958 466701 433139
33351 433139 486769 619983 748100 789641 769023 807189 983479 1252355 1530375 1809076
33341 1809076 2135553 2539623 3032504 3608446 4170737 4514336 4477575 4089419 3508480 2871107
33331 2871107 2276129 1844761 1656534 1634788 1611153 1517460 1433744 1455729 1607278 1879417
33321 1879417 2257657 2701943 3183963 3732749 4329268 4755965 4706072 4118589 3297594 2613220
33311 2613220 2165205 1823709 1508065 1280445 1186516 1149486 1075972 980997 939174 958276
33301 958276 975834 968387 988051 1068976 1164784 1229115 1304703 1459733 1676067 1894860 2144806
33290 2144806 2503523 2941738 3360573 3806698 4472749 5442495 6684313 8412861 11088415
33281 11088415 14630055 17784623 18834704 17145270 13749413 10298109 7714531 5975277
33273 5975277 4760371 3871408 3166210 2530021 2002043 1704046 1597917 1488227 1282366
33264 1282366 1075902 955650 883993 818187 790265 809209 809568 755251 687664 624897 523252
33253 523252 389878 321084 359130 407954 368934 279313 234720 241255 230215 174344 110419
33242 110419 71461 54679 34982 -28033 -161854 -324081 -417481 -402216 -348283 -335502 -351106
33231 -351106 -332429 -258437 -146243 -11765 103836 123504 26293 -94579 -144884 -156460 -209972
33220 -209972 -271849 -225955 -58348 108225 180629 187763 178863 139451 64255 19942 57393
33209 57393 123347 133365 86708 38580 -2303 -70233 -156394 -202736 -186700 -155797 -165306 -217226
33197 -217226 -266646 -261760 -180290 -54069 44729 65633 26039 -17821 -29998 -9333 26441
33186 26441 42642 3778 -73509 -111847 -64385 10155 16876 -53843 -134588 -186647 -220551 -225845
33174 -225845 -174844 -103982 -93059 -137362 -140092 -74813 -50524 -143997 -264954 -287753 -239171
33163 -239171 -234467 -280367 -279024 -207488 -152537 -156090 -161044 -147849 -195286 -334513 -449236 -416473
33151 -416473 -275611 -160093 -110219 -57095 29793 85597 58509 -5974 -31441 -16623 -30162
33140 -30162 -110850 -206637 -228848 -159326 -77575 -62520 -92182 -84192 -21924 22802 -1584 -65622
33128 -65622 -126962 -179508 -196043 -114044 46153 132020 35231 -139511 -203596 -143530 -111370
33117 -111370 -171569 -219630 -184551 -149651 -189545 -223249 -146043 -8749 63724 65101 85745
33106 85745 142111 167590 155797 169439 193673 122981 -56832 -199651 -189812 -99201 -55215
33095 -55215 -34596 79363 268496 354326 234939 37739 -33936 57842 174058 193849 136830
33084 136830 87298 75031 76022 84370 118569 164300 171473 129668 104446 164377 295183 419203
33072 419203 483765 496614 487433 476102 477313 494400 500517 465562 417684 441723 590996 823414
33060 823414 1044018 1188669 1253256 1276153 1318932 1430038 1587010 1696901 1694997 1625837 1584915
33049 1584915 1597664 1605428 1558211 1463123 1345353 1228392 1162535 1197582 1293344 1326733 1241764
33038 1241764 1134845 1121683 1166082 1133732 999740 899315 945667 1082212 1167756 1149451
33028 1149451 1087503 1042666 1008829 953308 868190 768979 678375 621705 605944 589090 500880
33017 500880 319857 114982 -13023 -27331 21465 56750 40514 -15960 -75913 -101842 -80290
33006 -80290 -40905 -35552 -77338 -114743 -97964 -63117 -102109 -230597 -334244 -295057 -146390
32995 -146390 -41415 -67066 -150293 -170689 -107926 -29418 27570 91313 176644 234818 212114
32984 212114 128518 70260 110498 242464 377938 413155 319668 175572 86849 77953 87735
32973 87735 70060 49784 61838 87662 93099 88506 98493 101529 61025 -899 -27721 -21133 -37998
32960 -37998 -86951 -103842 -58005 -13579 -42740 -135367 -239045 -329880 -388577 -367530 -261366
32949 -261366 -165607 -170582 -219594 -174009 -19766 94805 57098 -62348 -110266 -36195 72778
32938 72778 100382 4787 -149772 -235205 -171291 -19058 79799 72519 42606 62674 82189
32927 82189 22283 -88299 -154819 -147212 -106292 -57322 -6675 2393 -70773 -173923 -202465 -137922
32915 -137922 -64971 -43347 -47788 -52286 -85718 -165434 -246701 -281339 -272014 -235422 -169273 -90922
32903 -90922 -49213 -54455 -50483 -3414 32797 -5469 -89046 -131299 -100229 -43392 -19309 -45215
32891 -45215 -91733 -92246 14564 207177 368954 398089 312019 203841 121580 43141 -45362
32880 -45362 -106828 -98483 -24383 65520 111919 89465 29224 -15930 -34162 -48695 -42371 44944
32868 44944 202100 300753 242671 105203 45939 89796 115897 54627 -10675 28382 160521
32857 160521 284300 325319 286159 225935 220271 298003 391309 390768 273590 136986 87307
32846 87307 142062 254342 371036 437613 410752 315790 243591 242091 251777 192987 73810
32835 73810 -37043 -101130 -119788 -95968 -51548 -48751 -124417 -227078 -287108 -323043 -397618
32824 -397618 -486784 -491379 -391306 -295375 -300614 -373042 -410830 -369022 -276256 -172747 -80677
32813 -80677 -11772 30822 44129 10406 -76231 -164932 -184633 -142036 -122393 -170431 -243961 -317066
32801 -317066 -429704 -565003 -585218 -415793 -215450 -200560 -335914 -382769 -261056 -161930
32791 -161930 -230407 -331532 -271355 -99495 -10031 -37283 -52423 -21163 -53813 -177856 -254437
32780 -254437 -197689 -126422 -192473 -360909 -469214 -439014 -329510 -225312 -167234 -174018 -245247
32769 -245247 -333341 -367454 -318858 -218980 -119060 -52595 -24268 -15608 -10186 -15574 -38013 -44756
32757 -44756 -369 59401 54609 -23446 -94043 -108417 -109957 -134201 -136126 -83373 -46378 -111689
32745 -111689 -256744 -386980 -451142 -450342 -388302 -293822 -242269 -269666 -310167 -295798 -256878
32734 -256878 -236688 -188372 -78976 -15331 -103592 -239082 -226861 -91915 -63135 -225199 -390199
32723 -390199 -379480 -249472 -149641 -119529 -129464 -176140 -222732 -172423 -21871 73498 9453
32712 9453 -100159 -94325 3596 69393 93241 138906 159531 49076 -142580 -229369 -144667
32701 -144667 -26425 -10688 -65436 -77827 -10716 77369 106232 38463 -85893 -176144 -192924
32690 -192924 -197957 -247910 -286324 -227634 -105370 -28330 -21710 -34093 -76034 -202871 -358634
32679 -358634 -400250 -316786 -268979 -342954 -410678 -333077 -176185 -101061 -131145 -164966 -160711
32668 -160711 -167092 -191580 -170240 -87618 -28004 -72251 -203721 -338919 -405562 -380823 -300393
32657 -300393 -241228 -251646 -289098 -272178 -201830 -170853 -224189 -272277 -205753 -57698 29649
32646 29649 -8189 -92574 -143259 -188661 -271233 -328722 -279377 -176322 -144775 -179935 -155727
32635 -155727 -55778 -30187 -147814 -252689 -196972 -84650 -111252 -252355 -312507 -242931 -197441
32624 -197441 -258429 -310933 -252462 -154239 -121520 -134434 -133137 -146237 -216857 -284830 -262117 -174665
32612 -174665 -125866 -154429 -218422 -291093 -385378 -495554 -587574 -648092 -695952 -750509 -818342
32601 -818342 -890588 -928339 -887801 -795578 -759975 -861245 -1055950 -1227895 -1312125 -1343609 -1412762
32590 -1412762 -1592810 -1874491 -2155614 -2334744 -2416443 -2460799 -2434556 -2221820 -1817231 -1390044
32580 -1390044 -1084015 -858973 -619421 -393654 -262582 -195980 -105345 -6757 18268 -6508
32570 -6508 25716 117725 155566 102301 59332 90137 114487 47049 -63029 -107636 -56727 47799
32558 47799 162877 238382 209648 84277 -9234 46504 196738 273815 215958 138018 156901
32547 156901 228181 223361 121319 29450 13086 1220 -84384 -184113 -181613 -91473 -46614 -94433
32535 -94433 -130578 -79154 -18506 -46384 -120444 -138902 -102536 -76684 -51723 22353 97215 70574
32523 70574 -30019 -49032 81374 246443 307155 247818 127813 -5168 -98392 -90351 2633
32512 2633 70081 46490 3424 36879 123438 163795 125768 70025 60137 108538 190631 259994
32500 259994 267818 211325 145312 113289 96663 66522 45448 66633 103788 102461 64736 43993
32488 43993 59243 68315 35603 -15716 -39333 -31621 -38736 -91916 -142320 -88953 95951 288163
32476 288163 319970 179933 39710 45792 144624 172841 73695 -55688 -112897 -100583 -75827
32465 -75827 -62717 -53807 -49782 -47994 -15576 73979 178385 209397 140148 52577 39005 81868
32453 81868 88744 39742 22609 92339 173754 169528 105381 77545 92152 65160 -22085 -79291
32441 -79291 -49308 1223 -18377 -106369 -201046 -263189 -272015 -201169 -67257 40702 51458
32430 51458 9673 24094 128440 242487 267775 186323 65710 -10336 -15322 11395 33041
32419 33041 67551 132155 164169 77506 -99250 -229805 -237338 -174822 -99629 9975 149675
32408 149675 215551 143381 37018 34921 109696 131536 84704 69222 100475 69656 -60850
32397 -60850 -167300 -142669 -55534 -39192 -94343 -101448 1506 142063 216408 205430 166117
32386 166117 145426 137002 116697 87077 62369 28489 -36034 -97076 -80475 22399 121527
32375 121527 145371 135097 158031 182043 131972 41868 35471 142591 241439 226044 143191
32364 143191 99457 97617 50140 -67730 -160568 -130355 -3025 103054 119032 87852 69557
32353 69557 38796 -59671 -183488 -220180 -155377 -104787 -127947 -123053 -1561 131688 108039
32342 108039 -57824 -198033 -231297 -214412 -172537 -59104 89995 144485 90677 91885 243390
32331 243390 413033 444380 387245 375635 380258 268627 66100 -34320 56670 197490 213148
32320 213148 106643 7439 -10099 18788 36225 36692 56538 120203 204891 258226 253803 215925
32308 215925 177248 136198 84390 51089 74230 137132 182933 195014 216955 278473 341706
32297 341706 347951 294236 234600 212990 219255 215450 184631 133355 56267 -62610 -196081 -263138
32285 -263138 -220152 -136601 -114093 -139573 -102069 27951 127893 84771 -48954 -137512 -143432
32274 -143432 -135253 -145450 -122878 -32809 80343 155293 178539 163375 115279 44564 -24538
32263 -24538 -78855 -119595 -129979 -78814 26597 129149 184946 203341 203488 171856 98630 22994
32251 22994 -5137 8935 23865 36394 80789 148564 170165 110649 34749 22842 54314 45277
32239 45277 -6895 -2009 111341 238829 255040 165409 86669 98802 184484 287069 348988
32228 348988 310695 164802 14510 -15242 58234 93872 34346 -11562 53753 164977 206456
32217 206456 188042 196197 228090 199983 99639 12910 -6366 6803 14840 27895 43651 23666
32205 23666 -28680 -37613 43949 150751 178188 113520 46043 54658 123391 176494 175225 157664
32193 157664 176370 216854 213422 146756 78032 62892 79428 80392 69210 68018 52278 -9720
32181 -9720 -80482 -97637 -78147 -89220 -117864 -67761 90515 257194 334319 344835 370177
32170 370177 431316 490340 523311 529730 499864 431733 366424 357722 410630 483504 543742 590680
32158 590680 629524 654863 666626 681952 718095 768037 805731 825857 867813 969628 1094624
32147 1094624 1149868 1103249 1031820 1007571 988647 898643 770729 710205 727531 718202 620761
32136 620761 491204 395836 333026 298683 326501 408543 468740 475172 487758 530186 516037
32125 516037 391885 257826 229275 253928 198780 69575 2952 58668 150839 187371 161898
32114 161898 98595 12022 -64063 -102239 -144380 -249024 -379379 -447867 -467698 -534812 -649213
32103 -649213 -696448 -641179 -590206 -604665 -605005 -551950 -561607 -700978 -804977 -680255 -405802
32092 -405802 -236347 -252013 -302159 -285995 -281907 -357218 -438650 -454331 -450811 -471593 -453175 -358452
32080 -358452 -300558 -391190 -537602 -541315 -371792 -204292 -179821 -245140 -263230 -193857 -115731
32069 -115731 -116576 -200640 -292411 -322973 -311201 -329492 -381346 -379694 -290428 -217495 -258892 -346574
32057 -346574 -346727 -268097 -226925 -233175 -183489 -79253 -67859 -204977 -344502 -357631 -307889
32046 -307889 -293803 -265764 -151940 -44460 -78501 -207527 -284780 -309781 -395063 -518552 -524431
32035 -524431 -388775 -280928 -304757 -358320 -326465 -250320 -209056 -174738 -98613 -29247 -27794
32024 -27794 -54342 -50645 -59271 -145570 -259491 -286766 -199294 -61802 70410 171223 203585
32013 203585 154685 83427 51251 36904 -4961 -45949 -35615 -10338 -48450 -142626 -215726
32002 -215726 -240991 -246553 -223745 -142858 -48589 -22790 -51712 -49113 -19349 -66458 -209527 -322414
31990 -322414 -318642 -275942 -292114 -321029 -263659 -151290 -110080 -166741 -208427 -153982 -71537
31979 -71537 -75529 -160265 -202777 -129671 -25760 -32601 -158347 -256002 -214861 -103598 -57424
31968 -57424 -80271 -65505 7846 29341 -61069 -164044 -166668 -111407 -128734 -252945 -395620
31957 -395620 -475671 -490337 -463596 -403413 -328446 -279254 -271487 -267291 -218234 -122949 -25633 35082
31945 35082 59491 66633 59009 30550 1309 13 -1392 -77212 -225948 -316638 -238683 -67734
31933 -67734 19092 -25802 -94222 -128429 -206458 -367148 -490196 -454418 -315232 -209465 -160557
31922 -160557 -103328 -44736 -57433 -129867 -154157 -77070 37399 105919 95847 -2144 -165488
31911 -165488 -288712 -255012 -104846 -35818 -170301 -396360 -506230 -434301 -288080 -189456
31901 -189456 -165029 -175690 -181237 -163436 -127788 -98994 -99197 -127268 -162863 -179978 -156422 -94985
31889 -94985 -40758 -43431 -87042 -94303 -28227 44029 28069 -77524 -180042 -204746 -169827 -146198
31877 -146198 -175000 -237830 -286078 -279089 -201724 -69822 64675 124282 55018 -112424 -266825
31866 -266825 -312665 -263091 -215649 -238134 -304175 -342948 -323406 -277170 -255930 -275290 -292216
31855 -292216 -244610 -129264 -25044 -8093 -57712 -87532 -59545 -14457 8062 14438 9920
31844 9920 -25602 -85234 -119844 -110681 -98612 -104091 -86346 -33679 -19111 -88190 -158430 -131451
31832 -131451 -54814 -53510 -130653 -169934 -131707 -102470 -122918 -114527 -40296 941 -59581 -117477
31820 -117477 -46843 89075 123886 35368 -42703 -37429 -15078 -29850 -39449 -18432 -29447 -107958
31808 -107958 -173090 -138809 -47356 -9753 -58208 -129179 -158522 -129759 -55920 30152 90173
31797 90173 126682 180829 246301 240999 125028 -7055 -31926 43763 113437 123104 98859 50812
31785 50812 -37149 -124659 -134581 -73178 -30299 -39204 -38422 -1461 4409 -62939 -144769 -185089 -214212
31772 -214212 -257287 -251527 -145482 -7070 64061 72896 81922 82917 23898 -72025 -122574 -103082
31760 -103082 -55079 -1466 51967 55820 -33318 -153807 -199139 -173541 -174005 -214304 -194636 -74598
31748 -74598 49654 92544 89533 95214 77457 447 -72678 -63775 -13337 -30365 -133946 -228520
31736 -228520 -227969 -142172 -47727 -19464 -77887 -164179 -182664 -100372 16979 92341 121029 131698
31724 131698 110831 24688 -108739 -222717 -263656 -217716 -105367 12064 54115 -3647 -100047
31713 -100047 -168495 -210505 -253070 -283671 -282107 -270566 -272127 -265327 -240801 -243459 -279115 -248266
31701 -248266 -88098 74102 56670 -107748 -199339 -121393 -19332 -37575 -116126 -124821 -69429
31690 -69429 -39360 -42096 -24039 178 -28455 -86779 -88786 -27831 6685 -37937 -123809 -213292
31678 -213292 -315011 -405834 -400492 -264861 -100426 -43256 -105665 -179154 -179842 -130298 -93936
31667 -93936 -87837 -91993 -105980 -147965 -205759 -231898 -196841 -116285 -17987 80871 148083 137979
31655 137979 58338 -7946 -3857 17170 -20711 -78059 -51263 49800 96152 37077 -18024
31644 -18024 28917 123582 166668 156417 125988 41885 -103125 -180465 -74288 107012 145140
31633 145140 23574 -60701 -13614 29008 -39888 -108450 -45895 59880 33248 -116672 -228907
31622 -228907 -244016 -252049 -297007 -293771 -174390 2551 134033 179810 156545 102930 82000
31611 82000 146264 262198 322666 263512 125315 -9152 -82881 -66408 32789 141737 177569
31600 177569 160592 196491 310910 386484 322218 177552 80460 54322 26734 -31202 -72200
31589 -72200 -64528 -29384 13934 66060 104261 87879 23314 -27372 -18321 35373 86823 94937
31577 94937 39193 -58994 -132000 -124992 -56213 16828 71352 109587 101569 13489 -113151 -189091
31565 -189091 -189773 -166735 -145740 -103861 -61645 -92083 -193123 -248633 -181370 -64971 -15621
31554 -15621 -47650 -110538 -190267 -277024 -298190 -201737 -71684 -46219 -136359 -229185 -256800
31543 -256800 -252404 -242763 -203701 -143048 -119291 -144735 -167767 -185135 -266559 -413085 -492135 -397342
31531 -397342 -203787 -79751 -91350 -169973 -231616 -248222 -224503 -179445 -148073 -151872 -173870
31520 -173870 -194450 -226085 -277444 -318099 -320850 -300258 -265028 -185977 -75952 -42305 -160817
31509 -160817 -333545 -387680 -306209 -238015 -263143 -278926 -178511 -29080 25658 -28995 -77879
31498 -77879 -52331 -8404 -21015 -75054 -93846 -39091 46451 87656 57422 5166 -877 48390
31486 48390 106253 145236 185508 238440 273608 272013 265353 281559 293714 272112 245814 250275
31474 250275 249699 188762 97425 53720 51071 7668 -76254 -86597 24527 133430 110669 10975
31462 10975 -17634 39467 67180 39418 81948 267240 473705 541715 485908 445166 471222
31451 471222 484565 430000 360847 338618 342250 332113 337317 409118 522978 596423 594984 565418
31439 565418 565625 610991 692741 796700 885329 906640 851936 773813 717550 664601 579660 483162
31427 483162 423517 394004 343584 274625 256338 308570 341462 273727 162774 134931 207699
31416 207699 271731 254228 206983 198949 209344 191244 173118 211764 282837 307427 272957 243080
31404 243080 248505 252706 241047 260199 332357 400000 404204 364150 329094 298229 243775 176015
31392 176015 124921 84190 36097 13358 67021 173304 238143 211336 143562 106720 103003
31381 103003 87274 47805 19851 24016 29072 -4635 -60370 -73814 -19668 35949 9689 -76360
31369 -76360 -100184 5369 150709 192292 108988 17167 19383 98095 169647 190639 181383 173179
31357 173179 163254 120747 33024 -52916 -54254 59446 217239 316507 328291 298308 261545
31346 261545 211187 151160 117246 122760 130680 110403 87199 101395 140044 143395 78026 -13612
31334 -13612 -44152 31675 161272 247537 265824 285992 349409 381808 298087 150752 77128
31323 77128 114951 175010 197575 219079 257566 253209 179105 104112 77034 49994 -3390 -770
31311 -770 106056 191510 100794 -116456 -256642 -220847 -92266 28046 124276 197314 228168
31300 228168 245161 316677 436570 511497 497836 458449 447503 436635 402940 392219 428157
31289 428157 442227 370739 257230 185850 171625 189999 255176 376011 472069 435744 277024
31278 277024 127352 88099 133975 179293 188666 194255 227359 262247 242359 163757 102232 116698
31266 116698 148270 88933 -49466 -131071 -94049 -48529 -104129 -193409 -174976 -46764 69240
31255 69240 118276 154736 202017 209239 173275 174565 235033 249942 141100 -3569 -36412 52545
31243 52545 136030 128123 81223 97302 200571 319251 363820 306285 193633 94067 37667
31232 37667 16518 24108 57793 86794 68360 11379 -23980 -13563 -5263 -32313 -44365 16529
31220 16529 110339 140429 81251 -6051 -75872 -137332 -182050 -155119 -40202 82893 114860
31209 114860 38471 -91207 -220274 -317056 -354558 -328954 -284334 -273797 -302371 -341732 -380515
31198 -380515 -413773 -404592 -321924 -211679 -159468 -172629 -169969 -107760 -38654 -9803 15163 70172
31186 70172 96575 26975 -90878 -151886 -145178 -145921 -172345 -165153 -118529 -113266 -176565 -213049
31174 -213049 -144234 -38419 -20662 -102436 -178953 -171055 -104723 -58642 -77430 -132760 -151659
31163 -151659 -101557 -47864 -77589 -161505 -175895 -96665 -73097 -227323 -459080 -556677 -453992
31152 -453992 -269789 -128505 -61554 -70862 -159729 -273843 -314319 -249365 -143259 -55266 16341
31141 16341 73642 84540 38203 -33538 -112463 -203670 -276412 -279407 -237568 -241749 -307442 -338709
31129 -338709 -280047 -206516 -199120 -226559 -231701 -242041 -288337 -293261 -175322 -20251 -7443 -168412
31117 -168412 -340913 -378086 -295215 -185606 -98272 -48726 -63856 -145205 -233204 -263262 -232433
31106 -232433 -181811 -148948 -163541 -242749 -349497 -396980 -347051 -273783 -269042 -303488 -255585
31095 -255585 -89192 71391 89359 -12168 -92733 -88078 -80016 -155084 -270636 -321526 -292943
31084 -292943 -267227 -290943 -315486 -285642 -217072 -152046 -96238 -45446 -29158 -71001 -134884
31073 -134884 -170601 -199614 -292736 -453201 -575567 -553632 -405178 -257134 -208183 -229319 -215418
31062 -215418 -123815 -29949 -30280 -119090 -198462 -196776 -133748 -69233 -31612 -7409 31049 94760
31050 94760 150265 133668 27003 -103092 -194920 -284052 -420253 -523940 -457136 -247861 -98780
31039 -98780 -121902 -204371 -213009 -189470 -230755 -305774 -332542 -330412 -338312 -278473 -86322 98588
31027 98588 83038 -76671 -144539 -70870 -50364 -177379 -289457 -254767 -193994 -264234 -396259
31016 -396259 -425633 -361758 -339435 -376943 -359761 -233541 -66363 64667 126636 90671 -40517
31005 -40517 -173222 -203204 -156646 -149957 -208752 -231125 -144522 1556 127151 213466 261155
30994 261155 239993 144194 44676 16836 38507 20189 -64317 -130494 -92090 14149 60228
30983 60228 -12890 -116877 -135044 -78543 -53768 -89410 -88067 22883 176094 257017 251795
30972 251795 234189 242195 238235 181403 85555 1619 -33609 -37073 -72489 -175819 -288439 -315669
30960 -315669 -255722 -198102 -179213 -136671 -50073 -16901 -102597 -207032 -189209 -58658 66741
30949 66741 132873 158784 128132 13420 -115556 -148144 -95093 -66811 -91433 -87686 -27803
30938 -27803 11270 -13564 -54310 -88122 -157685 -249224 -266372 -190626 -135117 -156599 -146166 -17078
30926 -17078 119237 108249 -3547 -41561 24265 45766 -61313 -190816 -207772 -125948 -57946
30915 -57946 -57081 -79335 -75825 -65578 -104859 -203975 -295992 -305506 -242165 -192929 -214480 -274629
30903 -274629 -318505 -342485 -364993 -372089 -348470 -328751 -352830 -387631 -359828 -265635 -186317 -179343
30891 -179343 -203410 -178164 -88396 -537 14435 -46138 -125664 -180621 -223080 -275687 -305708
30880 -305708 -248092 -99458 51817 106583 39070 -102423 -238791 -300686 -279376 -250466 -291206
30869 -291206 -362372 -345391 -219678 -111378 -115541 -165364 -157031 -114352 -119953 -153355 -130002 -61853
30857 -61853 -41037 -76861 -84770 -44016 -33420 -84770 -127434 -120323 -119333 -157568 -171472 -119518
30845 -119518 -74745 -112554 -189618 -228259 -249994 -318054 -396082 -378421 -245103 -89759 3633
30834 3633 29535 8061 -53910 -131513 -175553 -162831 -118213 -81902 -85015 -142449 -224035 -248232
30822 -248232 -162928 -28128 38363 -5306 -102349 -199129 -293322 -373308 -396146 -363013 -345291
30811 -345291 -386814 -437824 -439224 -420696 -449321 -516035 -545789 -508464 -454219 -434453 -440708 -435700
30799 -435700 -405579 -363392 -326068 -305718 -311994 -348226 -398227 -414317 -337434 -165147 1451
30788 1451 30208 -98998 -269083 -372152 -426491 -503422 -602148 -675753 -732385 -808271 -864951
30777 -864951 -828245 -731538 -703103 -784981 -877911 -908628 -934429 -1011090 -1070354 -1037794 -990125
30766 -990125 -1065319 -1255596 -1409333 -1418977 -1295047 -1066196 -733736 -354785 -60935 70705
30756 70705 107532 172931 303053 425398 454934 387977 309342 302986 346596 328798 201475
30745 201475 63000 27826 68523 86185 95851 204295 401757 523762 471353 345667 291878
30734 291878 312544 318811 280017 228714 181468 146589 162246 241033 315129 314544 264572 233608
30722 233608 224494 195956 154330 136997 129390 83363 2459 -68330 -119277 -161913 -157356 -53539
30710 -53539 103807 189136 149461 69244 59648 138613 238615 283204 239294 134984 36690
30699 36690 -21679 -77202 -165845 -233188 -179391 11644 244958 411342 459937 395773 278536
30688 278536 210326 238662 272572 186015 10615 -80177 -8553 94769 75181 -40590 -105611
30677 -105611 -53369 51581 123280 127392 63324 -42715 -117961 -81963 63971 215202 255857
30666 255857 167910 43387 -9450 28339 78837 69673 27052 40608 143397 261665 292216
30655 292216 206425 71030 -17691 -19119 21574 35502 20765 32405 70490 49643 -63725
30644 -63725 -154784 -99343 45503 109811 52034 -788 33853 78213 40053 -48373 -110606
30633 -110606 -147105 -192889 -229827 -225026 -199729 -184112 -152976 -78764 -5519 1203 -52427 -103398
30621 -103398 -110855 -75092 -15504 27543 12072 -43210 -65523 -35704 -25805 -80668 -135308 -118406
30609 -118406 -70124 -75168 -133992 -184823 -206646 -216652 -207446 -168359 -129086 -105880 -53572 47892
30597 47892 120176 100358 67451 130232 233939 223678 84912 -27435 -14481 47266 45642
30586 45642 -25865 -110240 -169966 -180038 -121873 -31428 14160 -2962 -11395 51500 164068 258437
30574 258437 281489 215088 96397 15426 25515 66421 52168 11815 37508 107932 98910
30563 98910 -11609 -88026 -35472 70420 116033 101544 86567 79272 58590 33493 15443
30552 15443 -1136 11713 97533 203444 196033 53250 -73790 -70766 -13047 -9225 -16837 48097
30540 48097 123862 95879 10714 17840 122783 168978 74325 -62596 -119579 -90004 -31336
30529 -31336 21720 53889 55052 34820 -2984 -90285 -229236 -322906 -269779 -114721 -2170
30518 -2170 12162 -7503 -21737 -55278 -81416 -18159 113820 169984 86673 -18663 -29864
30507 -29864 5862 -8026 -54538 -69665 -76608 -121362 -145771 -69367 43255 42810 -86504 -202188
30495 -202188 -206582 -152603 -118456 -87737 -8035 108464 197746 210940 137626 9389 -96693
30484 -96693 -109675 -47296 -2833 -29611 -87590 -123153 -140997 -162635 -171570 -148095 -115237 -102247
30472 -102247 -97638 -80949 -63104 -51044 -16173 46701 73884 17755 -59973 -65676 -17475 -9050
30460 -9050 -40295 -8621 103073 159834 72695 -42348 -14729 137459 238502 199859 107951
30449 107951 61458 40378 -18098 -103741 -157722 -159172 -128846 -79675 -14043 48559 80455 73283
30437 73283 37109 -8664 -28743 11735 98175 162453 158285 117258 101266 124711 156883 176122
30425 176122 180481 162299 116002 61513 18363 -34817 -127317 -223324 -237533 -147541 -47955 -51734
30413 -51734 -155375 -243488 -231597 -169243 -173184 -272566 -364084 -339832 -221426 -119618 -81827
30402 -81827 -51299 10965 45227 -9640 -96349 -101497 -18747 35540 -17074 -112625 -136143 -67494
30390 -67494 9955 20215 -30866 -86616 -107583 -94244 -59601 -2906 78069 156893 183932 136416
30378 136416 51213 -11220 -34302 -63981 -156792 -308768 -430795 -406181 -204501 55928 197839
30367 197839 160465 51817 12 -671 -41680 -137073 -193313 -144088 -37320 40536 65953
30356 65953 62573 29169 -60458 -196107 -311656 -338225 -266867 -158270 -91208 -94349 -131968
30345 -131968 -164445 -203029 -274318 -346880 -346197 -252037 -133327 -66040 -58135 -78562 -113540 -154742
30333 -154742 -171719 -150487 -137215 -185991 -269686 -298744 -236467 -146547 -109137 -132097 -168547
30322 -168547 -182886 -165150 -111385 -35405 15428 3710 -40499 -49045 -4861 45232 74915 115781
30310 115781 180311 209639 158031 83964 78777 129037 137195 73901 15983 17641 40007 44937
30298 44937 62778 106225 105169 13560 -86182 -84523 -4680 41802 28759 33884 90657 132090
30286 132090 104345 48648 37781 92604 181499 249516 242716 160606 79809 59865 41406 -71334
30274 -71334 -237012 -303687 -224488 -119948 -86418 -79081 -57604 -106818 -285828 -461191 -447377
30263 -447377 -263459 -101143 -57936 -46586 21724 103480 121595 93908 93502 137532 171459
30252 171459 136162 23311 -109407 -169673 -116061 -19594 6201 -54325 -103726 -75439 -29206
30241 -29206 -56473 -139334 -170795 -100585 2317 44111 15167 -23701 -33813 -36086 -60454 -98850
30229 -98850 -127121 -144295 -160153 -163389 -138538 -101928 -79913 -62210 -28840 -17102 -90245 -222375
30217 -222375 -290029 -220486 -85964 -1460 10449 -5730 -34731 -77083 -85568 -15125 82983
30206 82983 114420 85348 95497 175075 225251 158946 22934 -69568 -71593 -21723 23332 29917
30194 29917 -4851 -46651 -51025 -25101 -29582 -88645 -136914 -103877 -25377 -12491 -107163 -215249
30182 -215249 -204498 -48867 141715 227982 167798 41964 -31109 1306 96823 170444 172644
30171 172644 131405 120276 168830 211802 163895 45509 -23869 16898 82068 58119 -44193
30160 -44193 -126343 -144503 -127826 -85018 2265 95336 114115 60239 30770 73907 116703 81822
30148 81822 -2063 -61622 -81258 -80110 -44921 40515 136309 185599 188830 181550 163261 109409
30136 109409 39181 11902 55468 139334 214762 249438 234605 193745 173542 192320 208535
30125 208535 172249 93587 25078 -10720 -37556 -77123 -121670 -153593 -161648 -138149 -86630 -33867
30113 -33867 -14557 -40860 -91673 -121730 -83900 23998 124219 116296 -429 -104380 -95374
30102 -95374 -22328 -11031 -93425 -178117 -181763 -120627 -62962 -50754 -87482 -151853 -197113 -177945
30090 -177945 -109996 -73282 -122214 -208880 -230421 -152154 -54953 -43177 -117241 -165679 -97887
30079 -97887 38501 109097 55275 -42064 -75526 -40063 -15375 -57646 -153457 -256753 -323495
30068 -323495 -321492 -252307 -166123 -124508 -146574 -206594 -267363 -293338 -256105 -165623 -84438 -75972
30056 -75972 -140675 -218024 -234439 -142899 39754 211529 258274 189574 140526 184180 220004
30045 220004 138256 17048 17602 127074 172110 91204 19512 52900 94966 38779 -35608
30034 -35608 17305 172941 264149 208145 85050 2580 -15555 -4217 -2801 -36832 -94425
30023 -94425 -119573 -76888 -12611 -2517 -54961 -115583 -145978 -141821 -100747 -42407 -36839 -128525
30011 -128525 -241497 -249485 -144294 -42676 -11589 11749 86161 153721 135263 65706 42095
30000 42095 74614 80190 16164 -58985 -72930 -28248 22812 53310 76457 97427 81222 -11385
29988 -11385 -154054 -244025 -195063 -42821 79631 86076 19497 -32336 -55745 -92651 -135135
29977 -135135 -115461 -10746 105715 147742 108111 36313 -35514 -97839 -119450 -59270 66561
29966 66561 174219 196214 153258 118096 126015 151973 166695 175356 190891 206000 217655 250743
29954 250743 317705 369838 337878 224588 108276 38157 -20851 -100881 -138739 -43586 155785
29943 155785 308609 310556 217668 156161 163515 170945 120675 41381 -1463 11481 43230 54018
29931 54018 41925 29206 20724 -7911 -69632 -125766 -117923 -47049 12448 -2260 -72918 -140519
29919 -140519 -179487 -191032 -158019 -70537 20549 48980 32341 48863 101266 90777 -31122
29908 -31122 -166452 -194324 -127829 -65099 -30817 32616 130957 177858 110366 -29109 -151698
29897 -151698 -205756 -183911 -107505 -31861 -14230 -45348 -57204 -23860 -2302 -38107 -84545
29886 -84545 -69584 -5904 26479 -11122 -79922 -128956 -146609 -142306 -116125 -60988 22400 116692
29874 116692 185725 194043 145909 91111 70134 65466 31632 -34555 -79518 -51572 37254 109234
29862 109234 86378 -24322 -117874 -97785 6486 78077 72177 62583 99963 115519 41257
29851 41257 -52055 -49493 21536 29101 -51756 -101724 -51817 19284 35521 45730 107871 151927
29839 151927 75192 -82595 -177428 -154265 -100580 -106954 -160183 -190492 -160485 -88536 -27560
29828 -27560 -28097 -85747 -129056 -98501 -26723 5132 -22633 -56515 -57693 -39372 -18004 8191
29816 8191 26565 19502 12902 45753 81155 29728 -110593 -222885 -225697 -178909 -172673 -186386
29804 -186386 -144640 -58277 -9417 -23502 -52944 -77424 -126868 -199468 -244039 -242061 -230364 -220069
29792 -220069 -169345 -71283 2681 -1640 -36152 -18597 49937 93161 68173 16138 5100 53717
29780 53717 115818 128477 78026 16672 -614 17708 30822 44138 89732 128367 65389 -92743
29768 -92743 -189998 -111975 40565 74191 -37264 -130342 -87418 17250 39440 -54105 -173548
29757 -173548 -214817 -139406 6080 114287 105550 24632 2724 86748 156438 64598 -174619
29746 -174619 -395145 -459528 -378463 -256729 -168205 -99199 2393 131239 191851 97432 -95435
29735 -95435 -212099 -160223 -50602 -53976 -180569 -289850 -299106 -275429 -301737 -355634 -377616
29724 -377616 -375479 -379984 -358182 -274090 -204932 -274011 -447643 -515143 -341311 -57237 96183
29713 96183 66962 20471 79262 163175 139835 28117 -47706 -49873 -58328 -117572 -158730 -108278
29701 -108278 1364 77742 76136 17588 -61200 -127213 -145693 -105668 -46020 -22120 -48250
29690 -48250 -93395 -122456 -118868 -79826 -16645 46257 93812 134044 173522 196034 188796 171389
29678 171389 166939 158552 112668 40079 -8525 -14680 -20290 -64493 -123319 -141997 -110681 -72313
29666 -72313 -53617 -26700 30792 61599 -25793 -220266 -374900 -365743 -246617 -171713 -185857
29655 -185857 -191453 -132909 -93586 -145953 -210822 -173551 -72965 -46465 -112588 -137882 -34341
29644 -34341 120983 198996 162973 60335 -51859 -124114 -120571 -61995 -19087 -21640 -19252 27315
29632 27315 66121 21446 -92444 -182218 -184917 -123737 -66652 -61192 -95805 -103144 -25325 102866
29620 102866 170163 115650 -1351 -93141 -154104 -221317 -271796 -246274 -160887 -105363 -115563
29609 -115563 -124535 -70879 8745 41064 24768 21899 57336 75889 9244 -136430 -271115
29598 -271115 -299099 -210500 -92765 -39150 -47091 -26866 83383 234223 316204 284786 210162
29587 210162 192496 239745 255239 162364 20484 -29679 53385 140106 86686 -72943 -167698
29576 -167698 -116797 -26957 -23310 -65288 -20909 110512 160930 9735 -242432 -379772 -314858
29565 -314858 -163942 -92403 -147446 -255947 -332255 -346518 -310992 -247432 -180786 -141069 -145052
29554 -145052 -168898 -155288 -74881 17807 29122 -47993 -97255 -24867 93292 101015 -9563
29543 -9563 -75148 -3425 85825 49637 -55394 -73286 -2264 14723 -65914 -121241 -67552 15651
29531 15651 24946 -30764 -102947 -196259 -301958 -338735 -260508 -146467 -88040 -59609 -2715
29520 -2715 37296 -13354 -97475 -83948 34250 129440 124739 69519 23939 -10774 -25179 18774
29508 18774 100267 129857 72746 -647 -26001 -23725 -25296 -8139 40537 73994 64706 63146
29496 63146 105753 125644 41478 -103702 -181306 -140841 -56978 -11993 -427 28571 85088
29485 85088 133518 158425 198422 289538 380845 351107 149207 -108685 -243072 -208085 -121324
29474 -121324 -92493 -98928 -62864 18580 77109 65524 -3487 -84886 -132783 -129394 -106101 -106491
29462 -106491 -117092 -81364 4234 70701 77490 62556 55824 22897 -47959 -82011 -22446 61327
29450 61327 56284 -49450 -186237 -315586 -423904 -446034 -318123 -105812 26690 -2981
29440 -2981 -118218 -192777 -169854 -75606 13060 14367 -76228 -155013 -126717 -31037 28616 52120
29428 52120 123653 236359 271619 180386 60034 5557 -1546 -4340 14909 63838 90073 79841
29416 79841 106209 192282 227405 130447 10105 29744 169250 259418 224014 152466 136298
29405 136298 159168 168356 151502 114627 65663 41106 77660 144787 174812 162369 154377 142477
29393 142477 68089 -46125 -82552 3843 106472 124568 107177 148822 217977 207166 114884
29382 114884 53386 74846 103108 69952 23279 39089 89941 76989 -30924 -157836 -223497
29371 -223497 -233269 -244045 -275880 -292167 -256935 -180213 -101828 -53832 -48419 -79993 -120424 -130399
29359 -130399 -101048 -73937 -95010 -159600 -230674 -293779 -347572 -351227 -251700 -83312 30305
29348 30305 21687 -28865 -9204 64881 90355 50188 39549 103951 152652 86990 -59395 -178155
29336 -178155 -233403 -272313 -314150 -311712 -231790 -113254 -25886 -9551 -63148 -155599 -235793
29325 -235793 -263774 -243662 -204737 -158070 -108447 -95228 -157264 -248352 -257961 -149444 -18575
29314 -18575 26844 -9614 -59678 -103777 -165150 -227609 -243042 -213630 -197752 -231915 -298217 -359823
29302 -359823 -374300 -290596 -107581 68789 107705 5793 -114651 -170905 -202077 -262905 -323746
29291 -323746 -328132 -283218 -236323 -209434 -202957 -218820 -239849 -233323 -206886 -200615 -192250 -97167
29279 -97167 76984 170137 66213 -118051 -160653 -12760 171027 260312 276990 283636 267852
29268 267852 192656 85193 19615 44464 144643 243645 251447 157308 60246 52493 99397
29257 99397 107491 76178 75395 92291 33981 -99851 -181744 -142108 -71441 -73558 -120222 -121933
29245 -121933 -51891 69528 223219 352313 369184 284681 236491 294270 334493 227379 55341
29234 55341 -4530 52987 83982 48214 51693 127733 162103 97396 52993 141768 281204 302533
29222 302533 181918 52764 14538 24271 -12107 -103123 -158186 -94860 61851 201195 243177
29211 243177 202190 125339 25075 -78073 -104436 435 154256 211927 153368 101127 135469
29200 135469 190194 168552 75819 -12571 -47052 -23954 29532 52996 -2656 -94707 -120366
29189 -120366 -61077 -13517 -33610 -44723 27704 118899 118121 34389 -31164 -28729 23663 120634
29177 120634 252638 335014 272720 98091 -55245 -119610 -141461 -163302 -165351 -146502 -158390
29166 -158390 -213144 -240050 -183932 -81851 -550 39943 42400 661 -59791 -72772 -17952
29155 -17952 38653 44000 37577 66910 85680 25978 -70010 -93431 -29267 24557 -52 -72394
29143 -72394 -145497 -207858 -225350 -137727 24316 108135 14142 -157514 -228939 -169480 -93654
29132 -93654 -60126 119 133478 258382 272314 185040 78609 -5232 -67852 -92785 -63072
29121 -63072 -16663 -11000 -39986 -46707 -12204 26236 42193 49493 61878 72418 76543 74244 53413
29108 53413 11526 -20893 -27235 -51743 -132747 -210664 -190247 -88144 -20104 -32174 -51641 -33157
29096 -33157 -38013 -110329 -180903 -178686 -155569 -205171 -313429 -379656 -347787 -241775 -108839
29085 -108839 2491 47110 35033 41546 105300 164148 156377 125565 142866 182214 169504 111293
29073 111293 75672 81561 101967 137558 188554 197913 130220 60514 66686 86896 24851 -56244
29061 -56244 -20780 88842 91889 -31996 -95000 -1375 106772 84716 -18855 -100705 -165528
29050 -165528 -230309 -222140 -108588 -1334 4072 -27448 -17300 -36762 -168809 -320696 -349478
29039 -349478 -287241 -266301 -295313 -290362 -263457 -285639 -306663 -213089 -45913 39626 28487
29028 28487 58861 166020 219586 161285 105076 126526 137349 67080 3595 34238 86633
29017 86633 57428 -13601 -30890 -12970 -39784 -98196 -112868 -86860 -88914 -128515 -154302 -159498
29005 -159498 -187669 -240554 -269627 -258965 -240434 -228109 -207978 -191258 -208707 -246765 -251680 -205982
28993 -205982 -146593 -99693 -51283 5043 41150 35178 403 -45312 -102765 -160047 -169367 -93630
28981 -93630 29961 106218 77144 -13903 -73151 -65617 -45168 -70188 -128622 -173360 -190602 -183716
28969 -183716 -125824 -3172 112178 122736 44427 -6472 14458 19179 -60515 -161925 -200008
28958 -200008 -193332 -193030 -170282 -87439 -15428 -45590 -120883 -99545 21117 95985 71458 79124
28946 79124 219291 384164 408519 308112 244432 302721 429613 571000 742506 937459
28936 937459 1071505 1077787 994329 903972 834795 769898 709733 658147 575976 427910 271892
28925 271892 219981 286483 349043 306898 215902 200559 277641 351183 360970 339757 312902 239156
28913 239156 102203 -10870 3559 131360 254547 283480 224453 130923 47395 6555 26317
28902 26317 82002 114997 100870 90815 150922 263281 325779 271921 162218 113137 144650
28891 144650 157166 77612 -35289 -79707 -50557 -19298 -11976 3888 27206 13758 -37935
28880 -37935 -82625 -117303 -174736 -216209 -152749 -12136 48457 -29254 -92496 39 159446
28869 159446 206519 134932 72726 50168 -6814 -79529 -51541 75277 140277 58263 -58040
28858 -58040 -81792 -42544 -26253 -22892 24180 106827 188084 272151 343215 311613 135337 -59343
28846 -59343 -100158 13613 124847 135262 100280 103356 139877 159949 151322 136332 129031 127173
28834 127173 124225 116963 116184 140304 176587 174475 115718 60040 63745 80739 22546 -95080
28822 -95080 -158134 -120564 -70655 -91957 -144450 -149044 -121481 -135326 -189649 -207231 -161176 -120191
28810 -120191 -143867 -194029 -189690 -117249 -46551 -43893 -92736 -108532 -33100 88044 140564 68586
28798 68586 -53908 -110651 -85439 -68685 -123692 -205648 -235959 -202668 -147058 -95216 -56594
28787 -56594 -59155 -121235 -197410 -210988 -144136 -50384 20118 59080 68131 48300 27845 39500
28775 39500 57557 21590 -60799 -108172 -88817 -67068 -81725 -69952 12417 79720 31384 -83793
28763 -83793 -140249 -131591 -156724 -225875 -233304 -148175 -82813 -106655 -124395 -35858 86803 101013
28751 101013 7149 -63132 -40081 18035 43322 34722 3190 -60936 -128763 -120025 -4376 133386
$$ [...]
##END NTUPLES=NMR SPECTRUM
##END=
