##TITLE=31Pdec_ANY-157c-11
 CDCl3, 24 sc
 7.6.2019
##JCAMPDX= 6.0         $$ Bruker NMR JCAMP-DX V2.0
##DATA TYPE= NMR SPECTRUM
##DATA CLASS= NTUPLES
##ORIGIN= UXNMR, Bruker Analytische Messtechnik GmbH
##OWNER= root
$$ XWIN-NMR		Version 3.5
$$ Fri Jun  7 15:58:19 2019 Russian Standard Time (UT+4h)  she@DPX200
##.OBSERVE FREQUENCY= 81.013821
##.OBSERVE NUCLEUS= ^31P
##.ACQUISITION MODE= SIMULTANEOUS
##.ACQUISITION SCHEME= undefined
##.AVERAGES= 24
##.DIGITISER RES= 17
##SPECTROMETER/DATA SYSTEM= spect
##.PULSE SEQUENCE= zgpg30
##.SOLVENT NAME= D2O
##.SHIFT REFERENCE= (INTERNAL, D2O, 0, 182.463)
##AUDIT TRAIL= $$ (NUMBER, WHEN, WHO, WHERE, WHAT)
$$ ##TITLE= Audit trail, XWIN-NMR		Version 3.5
$$ ##JCAMPDX= 5.01
$$ ##ORIGIN= Bruker BioSpin GmbH
$$ ##OWNER= she
$$ F:/spectra/data/she/nmr/P31/1/pdata/1/auditp.txt
$$ ##AUDIT TRAIL=  $$ (NUMBER, WHEN, WHO, WHERE, WHAT)
(   1,<2019-06-07 15:57:02.95 +0400>,<she>,<DPX200>,
      <created by zg, POWCHK disabled, PULCHK disabled
       configuration hash MD5:
       00 E9 B6 7A A2 85 ED C7 34 08 36 98 17 FE 4E 26
       data hash MD5: 32K
       A1 3A 03 D1 C5 F7 10 B7 08 08 76 00 73 61 7B 49>)
(   2,<2019-06-07 15:57:07.07 +0400>,<she>,<DPX200>,
      <Start of raw data processing
       efp BC_mod = 2 LB = 1 FT_mod = 6 PKNL = 1 PHC0 = -2558.056 PHC1 = 63.19916 SI = 64K 
       data hash MD5: 64K
       63 43 E5 07 F8 8F 7C 63 14 84 06 98 48 DD 1B 2C>)
(   3,<2019-06-07 15:57:24.71 +0400>,<she>,<DPX200>,
      <pk PHC0 = 24.27663 PHC1 = 0 
       data hash MD5: 64K
       FD 4F 8B EB A7 AB 15 82 3E A9 4A B4 AE 80 34 A7>)
(   4,<2019-06-07 15:57:28.28 +0400>,<she>,<DPX200>,
      <abs ABSG = 5 
       data hash MD5: 64K
       06 45 69 E3 2F 9D 86 D1 F5 03 51 7B F4 5E 4B 67>)
$$ ##END=
$$ 
$$ hash MD5
$$ F2 5E 11 77 F9 5A F6 28 13 9B FC 44 BB 40 B4 E5
##$RELAX= 
##$RELAX= 
##$RELAX= 
##$RELAX= 
##$RELAX= 
##$RELAX= 
##$RELAX= 
##$RELAX= 
$$ Bruker specific parameters
$$ --------------------------
##$DU= <F:/spectra>
##$EXPNO= 1
##$NAME= <P31>
##$PROCNO= 1
##$TYPE= <nmr>
##$USER= <she>
##$AMP= (0..31)
100 100 100 100 100 100 100 100 100 100 100 100 100 100 100 100 100 100 
100 100 100 100 100 100 100 100 100 100 100 100 100 100 
##$AQSEQ= 0
##$AQ_mod= 1
##$AUNM= <au_zg>
##$AUTOPOS= <>
##$BF1= 81.014009
##$BF2= 200.13
##$BF3= 200.13
##$BF4= 200.13
##$BF5= 200.13
##$BF6= 200.13
##$BF7= 200.13
##$BF8= 200.13
##$BYTORDA= 1
##$CFDGTYP= 0
##$CFRGTYP= 5
##$CHEMSTR= <none>
##$CNST= (0..31)
1 1 145 1 1 1 1 1 1 1 1 1 1 1 1 1 1 1 1 1 1 1 1 1 1 1 1 1 1 1 1 1 
##$CPDPRG= <waltz16>
##$CPDPRG1= <>
##$CPDPRG2= <waltz16>
##$CPDPRG3= <>
##$CPDPRG4= <mlev>
##$CPDPRG5= <mlev>
##$CPDPRG6= <mlev>
##$CPDPRG7= <mlev>
##$CPDPRG8= <mlev>
##$CPDPRGB= <>
##$CPDPRGT= <>
##$D= (0..31)
0 1 0 0 0 0 0 0 0 0 0 0.03 2e-05 3e-06 0 0 0 0 0 0 0 0 0 0 0 0 0 0 0 0 
0 0 
##$DATE= 1559908622
##$DBL= (0..7)
120 120 120 11 120 120 24 19 
##$DBP= (0..7)
150 150 150 150 150 150 150 150 
##$DBP07= 0
##$DBPNAM0= <>
##$DBPNAM1= <>
##$DBPNAM2= <>
$$ [...]
##$SUBNAM3= <"">
##$SUBNAM4= <"">
##$SUBNAM5= <"">
##$SUBNAM6= <"">
##$SUBNAM7= <"">
##$SUBNAM8= <"">
##$SUBNAM9= <"">
##$SW= 369.568048894756
##$SWIBOX= (0..15)
0 1 3 0 0 0 0 0 0 0 0 0 0 0 0 0 
##$SW_h= 29940.119760479
##$TD= 32768
##$TD0= 1
##$TE= 0
##$TE2= 300
##$TE3= 300
##$TEG= 300
##$TL= (0..7)
0 120 53 12 22 120 120 120 
##$TP= (0..7)
150 150 150 150 150 150 150 150 
##$TP07= 0
##$TPNAME0= <>
##$TPNAME1= <>
##$TPNAME2= <>
##$TPNAME3= <>
##$TPNAME4= <>
##$TPNAME5= <>
##$TPNAME6= <>
##$TPNAME7= <>
##$TPOAL= (0..7)
0.5 0.5 0.5 0.5 0.5 0.5 0.5 0.5 
##$TPOFFS= (0..7)
0 0 0 0 0 0 0 0 
##$TUNHIN= 0
##$TUNHOUT= 0
##$TUNXOUT= 0
##$USERA1= <user>
##$USERA2= <user>
##$USERA3= <user>
##$USERA4= <user>
##$USERA5= <user>
##$V9= 5
##$VALIST= <valist>
##$VCLIST= <CCCCCCCCCCCCCCC>
##$VD= 0
##$VDLIST= <DDDDDDDDDDDDDDD>
##$VPLIST= <PPPPPPPPPPPPPPP>
##$VTLIST= <TTTTTTTTTTTTTTT>
##$WBST= 1024
##$WBSW= 4
##$XGAIN= (0..3)
0 0 0 0 
##$XL= 0
##$YL= 0
##$YMAX_a= 49182
##$YMIN_a= -51818
##$ZGOPTNS= <>
##$ZL1= 120
##$ZL2= 120
##$ZL3= 120
##$ZL4= 120
##$ABSF1= 182.463
##$ABSF2= -187.1042
##$ABSG= 5
##$ABSL= 3
##$ALPHA= 0
##$AQORDER= 0
##$ASSFAC= 0
##$ASSFACI= 0
##$ASSFACX= 0
##$ASSWID= 0
##$AUNMP= <proc_1d>
##$AZFE= 0.1
##$AZFW= 0.5
##$BCFW= 0
##$BC_mod= 2
##$BYTORDP= 0
##$COROFFS= 0
##$CY= -3
##$DATMOD= 1
##$DC= 0
##$DFILT= <>
##$DTYPP= 0
##$F1P= 0
##$F2P= 0
##$FCOR= 1
##$FTSIZE= 65536
##$FT_mod= 6
##$GAMMA= 0
##$GB= 0
##$INTBC= 1
##$INTSCL= 5.30512e-09
##$ISEN= 30
##$LB= 1
##$LEV0= 0
##$LPBIN= 0
##$MAXI= 10000
##$MC2= 0
##$MEAN= 0
##$ME_mod= 0
##$MI= 50
##$NCOEF= 0
##$NC_proc= -2
##$NLEV= 6
##$NOISF1= 182.463
##$NOISF2= 159.3651
##$NSP= 0
##$NTH_PI= 0
##$NZP= 0
##$OFFSET= 182.463
##$PC= 4
##$PHC0= -2533.779
##$PHC1= 63.19916
##$PH_mod= 1
##$PKNL= yes
##$PPARMOD= 0
##$PSCAL= 0
##$PSIGN= 0
##$REVERSE= no
##$SF= 81.0140089999434
##$SI= 65536
##$SIGF1= 159.3651
##$SIGF2= -187.1042
##$SINO= 113.3802
##$SIOLD= 16384
##$SREGLST= <1H.CDCl3>
##$SSB= 0
##$STSI= 65536
##$STSR= 0
##$SW_p= 29940.119760479
##$SYMM= 0
##$S_DEV= 0
##$TDeff= 32768
##$TDoff= 0
##$TI= <>
##$TILT= no
##$TM1= 0
##$TM2= 0
##$TOPLEV= 0
##$USERP1= <user>
##$USERP2= <user>
##$USERP3= <user>
##$USERP4= <user>
##$USERP5= <user>
##$WDW= 1
##$XDIM= 65536
##$YMAX_p= 362117004
##$YMIN_p= -4356359
$$ End of Bruker specific parameters
$$ ---------------------------------
##NTUPLES= NMR SPECTRUM
##VAR_NAME=  FREQUENCY,     SPECTRUM/REAL,   SPECTRUM/IMAG
##SYMBOL=    X,             R,               I
##VAR_TYPE=  INDEPENDENT,   DEPENDENT,       DEPENDENT
##VAR_FORM=  AFFN,          ASDF,            ASDF
##VAR_DIM=   65536,         65536,           65536
##UNITS=     HZ,            ARBITRARY UNITS, ARBITRARY UNITS
##FACTOR=    0.456856943014862, 1,           1
##FIRST=     14782.0589164792, 0,            0
##LAST=      -15158.0608439998, 0,           0
##MIN=       -15158.0608439998, -4356359,    0
##MAX=       14782.0589164792, 362117004,    0
$$ Real data points
##PAGE= N=1
##DATA TABLE= (X++(R..R)), XYDATA
$$ [...]
38017b6605j20270j41571r3704J9210N7552k0288n3825O0924J75839J20419j7031
38006c9350l9462L4500K2398j01976j69420r2760K0828O3558O0579O7611P8265
37995i5229P7473P0715L1430o9145j61424j27430K0956J29894J05813K3593n755
37984H91K2827M3514J7224m4846r6681q2946o036M5506Q833m3461n527Q3116R1753
37971C4167J2559l2414l942r48o7197j05271m9008K2972K6931J871J2758L7158
37959a10364L4454K8403L7341J7388m2964o7781k0749R245m9654j14089o7749
37948c46519M6805Q6284J7429n2147m1090J3496L8874K0556m968q76L8699Q0208
37936a03249P7485K6070k5775l7075k0983j5146l0316m2863k0151M3098R2692
$$ plain form
38017 -26605 -146875 -288446 -382150 -362940 -305388 -325676 -379501 -318577 -142738 -22319 -39350
38006 -39350 -78812 -44312 -21914 -123890 -293310 -386070 -365242 -301684 -241105 -173494 -95229
37995 -95229 -17756 52959 84389 15244 -146180 -273610 -252654 -122760 -16947 6646 891
37984 891 23718 67232 84456 39610 -57071 -140017 -146053 -100547 -91714 -135175 -140702 -57586 34167
37971 34167 46726 14312 10370 9422 -57775 -163046 -212054 -189082 -162151 -160280 -147522 -110364
37959 -110364 -75910 -47507 -10166 7222 -35742 -103523 -124272 -115027 -164681 -278770 -346519
37948 -346519 -299714 -213430 -196001 -248148 -289238 -275742 -236868 -216312 -221280 -222156 -183457 -103249
37936 -103249 -25764 306 -25469 -62544 -83527 -98673 -128989 -171852 -192003 -148905 -56213
37925e6213N0537p1069j38123o0765N7299N6121l0393k6559Q4246J10846l2978
37914e7051j67538j19644J6875N4725Q620K1722Q8537O9363m5514r4305L010J22260
37902i8940J29809O5455M4526P0565M6939o3046j74608j84463q3052N1548J37564
37891e7703J41719P2814k7414q4620m2772N4179Q7187J4264o2852m5744J9432
37880F8490L8849L0860N8127P0125j2944j03218m2670J06879J05093r1213k33181
37869d803j51097J2531P0967O9560J18210J46983M8182q4940r0158m453J4973
37858A45955m3084o2603j9274J6417L7209P2350O4682l3506j06539k3757J17697
37847A65547J21443J1360k4521K4427j4705j52034j78206k6902Q5964J1143r2809
$$ plain form
37925 -56213 -5676 -76745 -214868 -275633 -218334 -162213 -192606 -219165 -134919 -24073 -57051
37914 -57051 -224589 -344233 -327358 -272633 -264013 -242291 -153754 -84391 -129905 -224210 -221200 -98940
37902 -98940 30869 96324 140850 211415 258354 195308 20700 -163763 -246815 -195267 -57703
37891 -57703 84016 156830 129416 44796 2024 56203 143390 157654 94802 49058 68490
37880 68490 107339 138199 196326 266451 253507 150289 107619 214498 319591 228378 -4803
37869 -4803 -155900 -143369 -72402 -2842 115368 262351 310533 225593 135435 130982 145955
37858 145955 102871 40268 20994 37411 74620 146970 211652 178146 71607 47850 165547
37847 165547 286990 298350 273829 298256 283551 131517 -46689 -73591 12373 23516 -69293
37836f9293l3568J03446J15528R124m3841M928L1478l9373j22415j06912m498
37825a55396P6277O1564j0857m9423l2151k5818n7803m8087N1530J33885Q4610
37814B8331j2237Q634J09063R1120o8143j56984o5469M4928J8268n4781k2061
37803g9331P5108J03848O4508L8582J7138m3582p9038o423J00707R7751j1808
37792B77460j01094j25303j37329j25843k1084J26429J52324J8361j01471n2495
37782i0045R5046J58785Q3006k6070o0802k5315O351r168m4278m8807k4089k3640
37770i026o6591q9842l4980M5513M3870m0911q1064K282J12126R9293k6830j05260
37758a51420m6124N0169M9995j7575k2187N2746Q8621L4400j1415J9639M2700
$$ plain form
37836 -69293 -102861 585 116113 125237 81396 86324 117802 78429 -43986 -150898 -155396
37825 -155396 -79119 -17555 -28412 -77835 -109986 -135804 -193607 -241694 -190164 -56279 28331
37814 28331 16094 24728 133791 224911 156768 -216 -65685 -20757 -2489 -57270 -79331
37803 -79331 -4223 99625 164133 202715 219853 176271 97233 90810 191517 289268 277460
37792 277460 176366 51063 -86266 -212109 -233193 -106764 45560 63921 -37550 -90045
37782 -90045 5001 163786 246792 220722 159920 134605 140956 131788 87510 38703 14614 -9026
37770 -9026 -75617 -165459 -200439 -154926 -111056 -151967 -233031 -230749 -118623 -19330 -46160 -151420
37758 -151420 -197544 -147375 -97380 -114955 -137142 -84396 4225 38625 27210 46849 89549
37747H9549j9042p4196j3568P7979M6479n8499n2524O3651R0648l1857j16960
37736A660m6472L4441k6131j35450j29905l5640K8996P2089J48300J75506N3308
37725A40702j10611j17321K0632J08530P7970M6694O7862M4286o0687j29649q5460
37714B948j2603l491k7092k8702k6425k7622K2268J18254J42818L5461q7331q7260
37702B1223O907P1011P0395O1264O2659L8195k1562q4856j25442j22771n4692
37691g7669M9632R7247L7784o3366j16118j10046o6960K5917J42748J66427L9237
37680A24833r8976p4264O0740R6673j6285j04197m8049N4706P6323M4811M2392
37669A58707M8715M528o3002r2816r2968q9883n2215K9154O6547L316o0622j2197
$$ plain form
37747 89549 70507 -3689 -17257 60722 107201 48702 -3822 59829 150477 118620 1660
37736 1660 -44812 -10371 -36502 -171952 -301857 -337497 -308501 -236412 -88112 87394 140702
37725 140702 30091 -87230 -66598 41932 119902 166596 234458 278744 218057 88408 2948
37714 2948 -9655 -13146 -40238 -68940 -95365 -122987 -100719 17535 160353 195814 108483 21223
37702 21223 28130 99141 169536 230800 293459 331654 310092 225236 99794 -22977 -77669
37691 -77669 -28037 69210 106994 43628 -72490 -182536 -249496 -223579 -80831 85596 124833
37680 124833 25857 -48407 12333 109006 92721 -11476 -59525 -4819 71504 116315 158707
37669 158707 207422 211950 148948 56132 -36836 -126719 -178934 -149780 -83233 -79917 -140539 -152736
37657a52736P5864N8725j8994K0705J76546K30648P8974j01807j17169j6029L3280
37646B68007j0139p3646j21295j47377j06200Q442Q2224K1144q3989p8645J9221
37635b22253O0830J1481j6791K4769N0405J1317j6685K4929P6290O7636K3667
37624I5595p990m1146r2548j14713o2516K3320O3792M2669J5781L7259R5638J12512
37612A67653K4499j06213j21075K3104J42940N6255j35239j67235J861J35706
37602B2256Q1799l3096n4763l2470n9691p4677j0O9635J8717o4369k1982R7436
37590e1215J13423Q935o4426n0807m4064p3662m8154M9217J00164M8820n894J4264
37578c399M7461K4897j1850j1932j1885l8763k7845N7122J15123L9264j05882
$$ plain form
37657 -152736 -76872 -18147 -37141 -16436 160110 390758 469732 367925 250756 234727 268007
37646 268007 257868 184222 62927 -84450 -190650 -182208 -99984 -78840 -162829 -241474 -222253
37635 -222253 -161423 -149942 -166733 -141964 -91559 -80242 -96927 -71998 4292 71928 95595
37624 95595 87605 46459 -46089 -160802 -223318 -199998 -136206 -93537 -77756 -40497 55141 167653
37612 167653 192152 85939 -35136 -12032 130908 187163 51924 -115311 -113450 22256
37602 22256 104055 70959 16196 -16274 -75965 -150642 -150652 -81017 -62300 -126669 -148651 -51215
37590 -51215 62208 71143 6717 -44090 -88154 -161816 -209970 -160753 -60589 -11769 -17663 -3399
37578 -3399 44062 68959 57109 45177 33292 -5471 -33316 23806 138929 178193 72311
37567G2311j58519p8383J7688K8817j7795m1472j9088J3876L2101M8262P3279
37556b8923P7917K6864m8442o1244J0363O6108J4584p9386p5638L2025J04873
37545C9101O8900R537J2418L2732L606l0183L207N4774J3900j13112j94168j41926
37533b41214r272R3163J09146N9121N200L026N0555Q5546O2346J0139k1601m0122
37521A66033p3506r1491m2990M2419P9566N5107L6180L7248j4014j30323j89872
37510a25643r6469O0184J12012L8163k9950j2445K8953J9939j9775m3397n4971
37499a23399n8853j3599Q5519J44986Q7580j8242m5002Q301L0146j4016l2276
37488E1145K7202Q1738M9760j6628j9442L3964O0146L4931M132j7903o2936j17616
$$ plain form
37567 72311 -86208 -164591 -146903 -118086 -135881 -177353 -196441 -182565 -150464 -102202 -28923
37556 -28923 48994 75858 27416 -33828 -23465 42643 57227 -22159 -97797 -65772 39101
37545 39101 108001 117538 129956 162688 166294 136111 139318 194092 207992 94880 -99288 -241214
37533 -241214 -250486 -157323 -48177 10944 16144 19170 69725 155271 217617 227756 206155 166033
37521 166033 92527 1036 -41954 465 80031 135138 171318 208566 194552 64229 -125643
37510 -125643 -222112 -161928 -49916 -11753 -41703 -54148 -25195 -5256 -25031 -68428 -123399
37499 -123399 -182252 -195851 -110332 34654 122234 103992 58990 67291 97437 83421 51145
37488 51145 78347 160085 209845 193217 173775 207739 267885 302816 306948 289045 226109 108493
37476A08493j07704q711R0652Q6498q263p8317n0263J7063J2175p6769j36995
37465a52141q0654K6726M9780k5390p0755n516Q5105Q0397K926k4398L1319O6154
37453a6447j446j05556j18467k2457O5505M6403l3105m8039L2175J06062R0141
37442e231K8536j923j9787p5771j19243o0556N4747Q1609k722o2753k6761J0901
37430a98954k4997n7666r685M9516K7255l5334n3428m2704m7909k8846M7340R8891
37418b76521O0087K1371P8884J42433P9003m0907n2275J9791K1171l2067J8270
37407C9240J48107J38270n5388j88812r6986O2891P9774k117j5072M7361O4554
37396B21822P739m7572o9488q5760q7785l7288M7647R6971O7498k6410j28349
$$ plain form
37476 108493 789 -7922 82730 169228 160965 82648 32385 49448 61623 -15146 -152141
37465 -152141 -232795 -206069 -156289 -181679 -252434 -257950 -172845 -92448 -89522 -113920 -82601 -16447
37453 -16447 -17893 -123449 -241916 -264373 -198868 -152465 -185570 -233609 -201434 -95372 -5231
37442 -5231 23305 21382 1595 -74176 -193419 -253975 -199228 -117619 -120341 -183094 -209855 -198954
37430 -198954 -223951 -281617 -291302 -241786 -214531 -249865 -303293 -345997 -393906 -422752 -375412 -276521
37418 -276521 -216434 -195063 -116179 26254 105257 64350 12075 31866 53037 20970 39240
37407 39240 187347 325617 270229 81417 -15569 47322 127096 124979 109907 157268 221822
37396 221822 229561 181989 112501 26741 -61044 -98332 -50685 46286 113784 87374 -40975
37385d0975j62072r5040O80K3963o627K1993J25142J77522J06751J718l6513k9641
37373H6901l3885l6045j9964k3623m7565k3722L9921J7744j21434j98553o5451
37362d25676J52128K16535J00066k0125k8762K9908Q5322J15465R7712J4971q5929
37351B51615j36053j31767j06787n9459J0229M7434K0141q628J6459L6235j8117
37340g8698q7596p9408k7975k2357l9740n871M0197J5647k1486M8821J71508J66551
37328G9593K1425p6657l5671J9748j4867o3533m2165j3844m8117p1571J132R9352
37316a45175J03728L8680J3969L1710r6q3314j01930k198J09390J01035j4547
37305E1252j00082n9516N8545J27279Q8569J0350p554M0349O6170J1605o9859
$$ plain form
37385 -40975 -203047 -298087 -297407 -273444 -280071 -258078 -132936 44586 151337 153055 116542 86901
37373 86901 53016 16971 -2993 -26616 -74181 -97903 -57982 -40238 -161672 -360225 -425676
37362 -425676 -273548 -57013 43053 22928 -5834 24074 109396 224861 322573 337544 251615
37351 251615 115562 -16205 -122992 -182451 -172222 -124788 -104647 -113275 -96816 -60581 -78698
37340 -78698 -166294 -245702 -273677 -296034 -335774 -341645 -301448 -285801 -307287 -258466 -86958 79593
37328 79593 101018 24361 -11310 8438 -6429 -69962 -112127 -125971 -174088 -245659 -244527 -145175
37316 -145175 -41447 -2767 11202 42912 42816 -40498 -142428 -144626 -35236 65799 51252
37305 51252 -48830 -108346 -49801 77478 166047 176397 168843 209192 275362 286967 217108
37294B17108p7167R962R8527Q9726M02n8020k8594J3959k1508j01444j26129r4927
37282g8105r1405j05797k5345J46442K18075O8943j43848j78519k4189J21479
37272i2269J29858M8789l1380p4189o7828j9654K0882K1805K4204N6165N1871
37261F8254l4300j04421m9378N7335O1375k6237o4822k8792j6035k8571L4093
37250a31499J45475J43250K569r9274o7183k4356o3520p2998M5249J65906J24394
37239A68013k1267q7891l2733M0029O6227O2219K8779m4601j05755q5465k067
37228a4512O1724O0740M309q1908j48748j34202m5188K9131L9661L6958N3059
37217a38976K6473o9041j25211m5590R1708J43048J03478P1632O7929L0734l8520
$$ plain form
37294 217108 139941 149903 248430 338156 338558 280538 251944 265903 244395 142951 16822 -78105
37282 -78105 -169510 -275307 -300652 -154210 63865 132808 -11040 -189559 -213748 -92269
37272 -92269 37589 86378 54998 -19191 -87019 -106673 -85791 -63986 -39782 16383 68254
37261 68254 33954 -70467 -119845 -62510 -1135 -27372 -92194 -120986 -137021 -165592 -131499
37250 -131499 13976 157226 159795 60521 -6662 -31018 -94538 -167536 -122287 43619 168013
37239 168013 146746 58855 26122 66151 132378 194597 223376 178775 73020 -12445 -14512
37228 -14512 47212 107952 112261 30353 -118395 -252597 -297785 -268654 -228993 -192035 -138976
37217 -138976 -112503 -181544 -306755 -352345 -260637 -117589 -14111 57521 125450 156184 117664
37206A17664o8666n0268m7033p0697n7649J4714Q6067J06354Q9708O1219K3814
37195B05227q997j4362o019k0007m7022l7028J8604O3263M9923j0k9568j4668
37183A59336J1639j015n2824p9272l5327K3686Q570o4257r0497m6221k4294o1607
37171b52083n9159M1471J23771O1612p3558j11504k6423O1689Q6114Q7295Q7112
37160B6337N1708j4212n5869o0677o0494m5923J4998P9733O9607N482j5946J3598
37148H342N445n2150n6630K5082P8108K3333m6938j9957N3683M9703k7855o6557
37136b6391l1077J968r657j5125J5899K9718p418l0984J6334O4704P204j17380
37124a02205j51681m7425N4691L4628k8796L287J00036J18664M6580J2843N5906
$$ plain form
37206 117664 48998 -1270 -48303 -119000 -176649 -161935 -75868 30486 120194 181413 205227
37195 205227 196230 181868 175849 155842 108820 71792 90396 153659 203582 203572 174004 159336
37183 159336 170975 169960 117136 37864 2537 26223 34793 -29464 -119961 -166182 -190476 -252083
37171 -252083 -311242 -269771 -146000 -84388 -157946 -269450 -295873 -234184 -148070 -60775 26337
37160 26337 78045 63833 7964 -52713 -113207 -159130 -144132 -64399 5208 10690 -5256 8342
37148 8342 13787 -38363 -94993 -69911 8197 31530 -15408 -35365 18318 68021 40166 -26391
37136 -26391 -57468 -55500 -65157 -80282 -64383 -34665 -42083 -73067 -56733 7971 15175 -102205
37124 -102205 -253886 -301311 -246620 -211992 -240788 -237501 -137465 -18801 27779 40622 96528
37113I6528O1752j7702o3003J717N6995j8113j29130j03802M0724J32858R4567
37102A53391k25p7032j19526j00815m856Q9431Q1101K068k8025O875J1116m0696
37090b7193o3805k5879o65j9331j0470N3793Q3485J8332o1843n9032r48K0207
37078i3349j6775o5433r5849j06293r1095n1376p625K8685N8501N9835J0054m4629
37066d15349k2215O6071J06162M1895l9088l4637L3482P4373N6995J8713l786
37055a17384O552N0538Q4438L9809p6141j53876j14329j8557J8462k0815n9559
37044c60862m6919n330K4513K6379L901k5464m1967n3032q3736j16275q6624J8823
37032g46593J13692J16933O8795P2843J44499J91699J49289O7871M0978Q0238
$$ plain form
37113 96528 158280 140578 77575 79292 136287 118174 -10956 -114758 -74034 58824 153391
37102 153391 153166 76134 -43392 -144207 -149063 -59632 21469 23537 -4488 2387 13503 -27193
37090 -27193 -90998 -116877 -117542 -136873 -147343 -93550 -10065 8267 -53576 -112608 -113556 -93349
37078 -93349 -110124 -175557 -271406 -377699 -468794 -520170 -527795 -499110 -440609 -380774 -370720 -415349
37066 -415349 -437564 -371493 -265331 -223436 -262524 -297161 -263679 -189306 -132311 -113598 -117384
37055 -117384 -110832 -60294 24144 63953 -12188 -166064 -280393 -298950 -280488 -301303 -360862
37044 -360862 -407781 -413111 -388598 -362219 -358318 -383782 -425749 -478781 -562517 -678792 -765416 -746593
37032 -746593 -632901 -515968 -447173 -374330 -229831 -38132 111157 179028 220006 300244
37022C00244J00450L1172p9365j05322k343J14534J04397j3092q3357k9921N1508
37011C88905M7805j1593k0543L8468Q0798M8334k1905n7674l0129L0664O7219
37000E60349M4653q833k2162L8185J21640J45663Q2370j7407p2459m3639J9656
36989H48016J6057q5124j72619j10815P0090J84028J15761m4032j35436j21967
36979E63959p9975o1441n4176m3802l3256j3601J9714L2554p354o5007p2896l2069
36967A52650k1531q7474j62814j32387K3784J76722J70060O203j31371q8787O3812
36956c1133J30450N9088o602L4673Q9500L5880p3284r6538k4628K1513j2435m9950
36944G6534k5918J9467K5372M500L708K5595L8678L5571L6950M4429K2824n2370
$$ plain form
37022 300244 400694 431866 352501 247179 244836 359370 463767 450675 367318 337397 388905
37011 388905 436710 425117 404574 443042 523840 572174 550269 492595 462466 493130 560349
37000 560349 605002 596169 574007 612192 733832 879495 961865 944458 871999 828360 848016
36989 848016 864073 778949 606330 495515 565605 749633 865394 821362 685926 563959
36979 563959 483984 422543 368367 324565 291309 277708 297422 329976 322622 257615 184719 152650
36967 152650 131119 43645 -119169 -251556 -227772 -51050 119010 125213 -6158 -94945 -31133
36956 -31133 99317 158405 151803 186476 275976 311856 238572 142034 117406 138919 126484 76534
36944 76534 50616 70083 95455 99955 103663 129258 167936 203507 240457 284886 307710 255340
36932B55340j36578j35835j5968J23662J37826N069j42506j77447j09660l1450
36922b27547J1328M1239P9758J08990R1827R865r7136j33303m4932Q0343R5573
36911A6005m228o5125j735P6965M9694k7837l6701J467j2137n3714j4815Q5424
36899A3263J03009m6q9499o9250j6359l5345r0549p2913L3837J32134J24607O535
36887C9424j30041j69881q7166J7928M1831J6185M7565J36308J63787P4320m1010
36876A09250q0028m8763j61M7043P0786K5928o1959p3261M1472J49681R9549n8749
36864B20788j37516p3509K590k6060j01577r4561R236J00350R3407J8695l5741
36853b3898k7159J8969O2762Q9584R4881O7974J6788j7504p785J3762J33l3934
$$ plain form
36932 255340 118762 -17073 -33041 90621 228447 233516 91010 -86437 -196097 -227547
36922 -227547 -216219 -174980 -95222 13768 105595 115460 18324 -114979 -159911 -79568 16005
36911 16005 11777 -53348 -55083 21882 71576 43739 7038 8505 -3632 -57346 -72161 13263
36899 13263 116272 116226 26727 -42523 -58882 -94227 -184776 -257689 -223852 -91718 32889 39424
36887 39424 -90617 -260498 -347664 -329736 -287905 -271720 -224155 -87847 75940 150260 109250
36876 109250 29222 -19541 -19702 27341 98127 124055 62096 -11165 30307 179988 279537 220788
36864 220788 83272 9763 12353 -13707 -115284 -209845 -200609 -100259 -6852 11843 -23898
36853 -23898 -51057 -32088 30674 120258 215139 283113 299901 282397 274612 288374 288507 254573
36841B54573l3330L354J5224k2097n4922l9671j1911k0418m2025k3062K4401L3883
36829H3999j3711n7147l8106K1433M9486J5568l2429k9299K4676O7925O5609N1481
36817B09485N4640L5295m2246j12305q1905R579K5958m5242m4077J10955K48958
36806C69095J60663q9749k30190j39135K2017O2201k268l9052j4285m263m4475
36795E0559p1400j5803J05179J96488J64304O523j56324j79838n9106N1577K8795
36784A20954o3400q1274j7354O131n0468p4049J2126J11062R7268J1945q103N0793
36772A15631O7590o707o3302m660J02687J19195J5017j11328j60891j16517k0992
36761f4277O6027R5944O2447N547l8482p1720r5125p4494L506P3879O1636n517
$$ plain form
36841 254573 221243 224597 239821 217724 162802 123131 111220 90802 48777 25715 50116 83999
36829 83999 70288 13141 -24965 -3532 45954 61522 29093 -206 24470 92395 158004 209485
36817 209485 264125 299420 257174 144869 62964 72543 98501 53259 9182 120137 369095
36806 369095 529758 440009 209819 70684 92701 154902 152634 113582 99297 95034 50559
36795 50559 -20841 -36644 68535 265023 429327 435850 279526 99688 40582 92159 120954
36784 120954 57554 -23720 -41074 -34943 -85411 -159460 -147334 -36272 60996 72941 64838 115631
36772 115631 183221 176514 113212 108552 211239 330434 345451 234123 73232 -43285 -64277
36761 -64277 1750 97694 160141 165688 127206 55486 -39639 -114133 -110627 -36748 24888 19371
36749A9371k7298K3682O4159K9585l5996o4286o8032r0841r8923j8676J21590
36738a45665J83293R2427m5887p3866J5265P8131J9566r1359j31479p9216o011
36727a84801L6187M7579L0244j5721n2720l6553J0045K5345J2281L1549Q0953
36716a5612Q1664J8403j5411K5487M6021k9001j02404m5451P9575R7085j1628
36705A28728q4290l4782L1815J2656l5865k3020J7286N647l2231j7133L6852N1920
36693E7583L3607N9972J21809J01255m5744j89421j83480n4775M9327O2413M9815
36682F2361O3598N3632k7728j11885r0953K3627J07426Q7435J8610k2216l6377
36671A27530n1097m0446K3882Q3805M5717q1603j72521j28764P558J06224Q6208
$$ plain form
36749 19371 -7927 15755 79914 109499 73503 9217 -58815 -149656 -248579 -267255 -145665
36738 -145665 37628 130055 84168 10302 25567 103698 123264 31905 -99574 -178790 -184801
36727 -184801 -148614 -101035 -70791 -86512 -139232 -175785 -165740 -140395 -128114 -96565 -15612
36716 -15612 66052 84455 69044 94531 140552 111551 9147 -36304 43271 140356 128728
36705 128728 44438 9656 41471 54127 18262 -4758 12528 18175 -14056 -31189 5663 57583
36693 57583 91190 151162 272971 374226 328482 139061 -44419 -99194 -49867 12546 62361
36682 62361 125959 179591 151863 39978 -50975 -27348 80078 167513 186123 163907 127530
36671 127530 76433 35987 59869 143674 189391 107788 -64733 -193497 -185939 -79715 6493
36660F493j5638r6202r2353l3801J2044L0167N5801Q8385P3207l841o8809n7736
36648a02283p903P908j2083k5560l0033l8902j7390O2471J33998J06770R303m3482
36636D2814j7714J0523o657l2462l7595l9539l3438P209M5984J9527k4813K9340
36624c6821J50954J53850j5210j51337q3527O0894N7321o9465j10114j4687N7787
36613c55K6129k510M2326O4184q380p0225j3981P0615K8225j08834j61835p0282
36601b04923L9624N9068K7225J6376J1418k0776l7009J0359O7408M7394k5545
36590i381m3815K0621Q1221P6966M8101L6126K250q7731j66047j34414k527J14682
36578f3948J26793M6635m6228p9896m2050J1603J7630j2131q128M1329O0204R336
$$ plain form
36660 6493 -9145 -105347 -197700 -231501 -219457 -189290 -133489 -45104 28103 24262 -44547 -102283
36648 -102283 -110186 -102278 -114361 -139921 -169954 -208856 -226246 -163775 -29777 76993 86296 42814
36636 42814 25100 35623 28966 -3496 -41091 -80630 -114068 -106859 -60875 -41348 -66161 -36821
36624 -36821 114133 267983 252773 101436 17909 78803 136124 66659 -43455 -58142 -355
36613 -355 25774 23264 65590 129774 121394 51169 37188 107803 136028 27194 -134641 -204923
36601 -204923 -165299 -106231 -79006 -62630 -51212 -71988 -108997 -98638 -31230 16164 -9381
36590 -9381 -53196 -32575 48646 125612 173713 209839 212089 124358 -41689 -176103 -178630 -63948
36578 -63948 62845 109480 63252 -16644 -58694 -47091 -29461 -41592 -49720 -8391 51813 61149
36566F1149l7458r246M1546K1808n6378j08429j12633j20227j70947k83447m66458
36555a240720o31017n69741j86538K92119N13277M01946K02572J20146J17203
36546i80753J02953J08485J66639J88840R9053k4867o8215m6542m2044n2125j6558
36535e65134N7949J02924Q7646M2677J2666K7579P8730J00641L9595m7909n3890
36524a16526J3176L6116j3300k8175L4201O5036l501p3078n0387J009k077j1608
36512a49114L4748P6246M7158P544J5865N230o0181n6550Q1514J67007K5005j75666
36500A8806j39488Q7355J76528K2825j28581r9289j6421l4877q7950n8178J2535
36489b46735L6289M0479P2646P7842O839o2296l7179M0170O5068J6848n2720j02990
$$ plain form
36566 61149 23691 14445 55991 77799 21421 -87008 -199641 -319868 -490815 -774262 -1240720
36555 -1240720 -1871737 -2441478 -2628016 -2335897 -1822620 -1420674 -1218102 -1097956 -980753
36546 -980753 -877800 -769315 -602676 -413836 -314783 -339650 -407865 -454407 -496451 -548576 -565134
36535 -565134 -507185 -404261 -316615 -273938 -261272 -233693 -154963 -54322 -14727 -62636 -116526
36524 -116526 -103350 -67234 -80534 -108709 -74508 -9472 -12973 -86051 -136438 -135429 -137506 -149114
36512 -149114 -114366 -38120 9038 16582 32447 37677 -22504 -79054 2460 169467 194472 18806
36500 18806 -120682 -33327 143201 166026 37445 -61844 -78265 -113142 -201092 -259270 -246735
36489 -246735 -210446 -169967 -97321 -19479 -12640 -74936 -112115 -71945 -6877 9971 -42749 -145739
36477a45739j02790k6326P9602J07795L4887l5020k9690n567j6727r845N2804
36466i6616Q4609J3451p1818n3972J7280J6952l2980p109Q7885J04974p5q8768
36454b6187n9013K700k3661r7828r3071M013Q5152Q7607O2584O6333P2315L1340
36442A12284m0544q4097p3826k9549K3732O3249N7853L739m1355j8934L8257M0168
36430E0977k8374q1678n9155j968K9404L8589M7423L8765L529j8189k602J0968
36418B7689n893j9013j1589k9885p6082n6920N8324J33436N5620o4513n1686N0736
36406A0224N5912n1128r6308j8570L7887j4452o3420q252O7368N0427j7621l6673
36394h4606j3827j0994j7222P417K8507j0115p6799r0584l7124K8107O2364O2644
$$ plain form
36477 -145739 -248529 -274855 -195253 -87458 -52571 -87591 -117281 -122848 -139575 -149420 -96616
36466 -96616 -12007 1444 -70374 -124346 -107066 -90114 -123094 -130203 -42318 62656 62581 -26187
36454 -26187 -85200 -82500 -106161 -203989 -297060 -293047 -207895 -120288 -57704 8629 80944 112284
36442 112284 71740 -12357 -86183 -115732 -92000 -28751 29102 32841 -8514 -27448 10809 50977
36430 50977 22603 -59075 -118230 -120198 -90794 -52205 -4782 33983 37512 19323 16721 27689
36418 27689 21796 2783 -8806 -38691 -114773 -171693 -113369 20067 75687 11174 -40512 10224
36406 10224 66136 15008 -81300 -99870 -61983 -76435 -139855 -148107 -80739 -30312 -47933 -84606
36394 -84606 -98433 -109427 -126649 -119232 -90725 -100840 -177639 -268223 -305347 -277240 -214876 -152232
36382a52232M1815K4563L3588M6911J2580o5489j08683o2337L4986J04434J02256
36371A2392L4965m2548m7949L5374R9244M0840o6406o2287M5855Q2194j8444j12604
36359F26r2968m3906n0195l3935P1394J44178N4507r8188j21717k1715M0069K0032
36347a31818K1505P1868P3685q65m7351j1703J6853l3657q7982m3735O1488R7177
36335a4535J6939q5661r2089J3728J35283J59161N8090q8678j66806j19742Q344
36324a75966J03978Q0123k7821q3641q721J10774J33713M5918n0678r7062j11904
36313h1287q6102J5272J30879J32117J8394n7574j5400M4514K7830o353K0071
36302A42361O0113M4643J0605J3057J9312n22Q070O3714O9712k3613j04704q0340
$$ plain form
36382 -152232 -110417 -85854 -52266 -5355 7225 -58264 -166947 -229284 -194298 -89864 12392
36371 12392 47357 4809 -43140 -7766 91478 132318 65912 3625 49480 131674 113230 626
36359 626 -92342 -136248 -186443 -220378 -148984 -4806 49701 -48487 -170204 -191919 -151850 -131818
36347 -131818 -110313 -38445 35240 34375 -12976 -24679 -7826 -41483 -129465 -173200 -111712 -14535
36335 -14535 2404 -83257 -175346 -161618 -26335 132826 190916 102238 -64568 -184310 -175966
36324 -175966 -71988 8135 -19686 -103327 -112048 -1274 132439 178357 127679 30617 -81287
36313 -81287 -167389 -152117 -21238 110879 129273 71699 56299 100813 128643 122290 142361
36302 142361 202474 247117 257722 270779 290091 289569 297639 361353 431065 407452 302748 222408
36290B22408l1908m3942k9097R0055J75532P9223p4788p3091K5162K78j25332
36279B14500j21590K8268Q1684l9620j12092m556R7119K1111j00462p4262L4624
36268B4724M7403k2944l6053J5637K7971n04K6159J11727J51497R5565k878q6028
36256C52276j23729p6266N3530J53245J10269k1899q6686m7715k0098o8110j10095
36245A14722p1820q379N382N395N9446J26344J05184o168j04062j19255p2191
36234C4598L569Q9789J27317M8686r2239j36509l1435Q1636P3574O819p430j3653
36222A84722j03700j93942j25700N0502J21198M3707l335N9957R2930J4196m5010
36211I5525N230L9992l7134r5015j4358P3595J4306q1426l2708P5487L5849j09759
$$ plain form
36290 222408 190500 146558 117461 207516 383048 462271 387483 314392 339554 339832 214500
36279 214500 92910 121178 202862 163242 51150 46594 143713 164824 64362 -9900 24724
36268 24724 72127 49183 13130 28767 56738 56234 82393 194120 345617 441182 438304 352276
36256 352276 228547 152281 205811 359056 469325 447426 360740 313025 292927 224817 114722
36245 114722 42902 34523 39905 45300 104746 231090 336274 330106 226044 106789 34598
36234 34598 38167 127956 255273 303959 211720 75211 43776 125412 198986 205805 198375 184722
36222 184722 81022 -112920 -238620 -188118 -66920 -23213 -26548 33409 126339 140535 95525
36211 95525 100755 140747 103613 8598 -5760 67835 82141 715 -31993 43494 79343 -30416
36199c0416j41085l6150K2569j1642Q0Q8363J17278N0495R120K1886k2169j18528
36187e0199j08133K9291R9625J3745o2453o24P9172L9417m0107k8199K8499J6095
36175A6129m2977n8907l3521o664M7960J36970J62238N9236p1138r9182n0688
36164E9456l2173n3579m9433r624K3880L4795J9073l7902r4622n4126Q3476J68245
36152E7466R7718l1820p5425l7688l014K7623Q7299J16530M4504n9912p2685j1833
36140A38763m0n4276o5788O363O6312M1668n664J1488O6433O1171k4945r5491
36128A45994o0263M1623R0816N2895J7640L9601M0413l5599o9817O5336K56493
36117E85132K70746J05207j3210Q054J7659o2354q3578L3165J08600k7j38926
$$ plain form
36199 -30416 -171501 -207651 -185082 -196724 -196644 -108281 8997 59492 68612 90498 68329 -50199
36187 -50199 -158332 -129041 -29416 -15671 -78124 -78748 424 39841 -266 -28465 34 16129
36175 16129 -26848 -85755 -119276 -125940 -77980 58990 221228 280464 209326 110144 59456
36164 59456 27283 -26296 -75729 -85353 -61473 -26678 -7605 -45507 -140129 -194255 -110779 57466
36152 57466 155184 123364 47939 10251 7237 34860 122159 238689 283193 223281 150596 138763
36140 138763 138723 84447 18659 25022 91334 133002 127338 138826 205259 266430 241485 145994
36128 145994 85731 127354 218170 271065 288705 328306 368719 333120 263303 328639 585132
36117 585132 855878 961085 947875 955929 973588 911234 827656 860821 969421 969394 830468
36106H30468j14946j8273l5347j02283l1852J25504J49454K1685o2905l9227m1751
36095F80527j11755j08635K2495J35878J26424P8548P7772O3420j6954p2469j9886
36084H55365O1608N9446N860p122n031p6200j88770k13083j25564n6580r4638
36073B15291j49505r0180M3906P9453m2124j60934j06218P0548J70979J15334
36063A46550R119m6110o6211p5480k9599P2103J17625L1132r6738j30978p1446
36052a40033j0151J8742L7234L3377j1071m5365r534O3587R8113Q6258O1696J5598
36040A98451n9726r6638l6521N2310N7783o130k9272J8441N6826L1183k7837p5673
36028H3197r3534o5393J028M4788K0627k5822k5372R109K4683K9117N5233O9903
$$ plain form
36106 830468 715522 697249 661902 559619 527767 653271 802725 824410 761505 722278 680527
36095 680527 568772 460137 482632 618510 744934 823482 901254 964674 947720 875251 855365
36084 855365 916973 976419 982279 975157 970126 893926 705156 492073 366509 309929 215291
36073 215291 65786 -24394 19512 98965 56841 -104093 -210311 -139763 31216 146550
36063 146550 155669 109559 43348 -32132 -61731 10372 127997 159129 62391 -68587 -140033
36052 -140033 -150184 -131442 -94208 -60831 -71902 -117267 -126801 -63214 34899 121157 182853 198451
36040 198451 138725 42087 5566 57876 115659 109529 80257 98698 155524 186707 158870 83197
36028 83197 -10337 -75730 -74702 -29914 -9287 -35109 -60481 -51372 -26689 2428 57661 127564
36016A27564K4618l8834m1831p08J59n4195r6902q5169l2179M0081J01018J03315
36004D6937N0110J6246K9632J3760o1876q3168K6278J32956P2513q6025j43770
35993A3593p3123j3729j4449N937N8313N6175l302k6345l414j7363o1098l7654
35981a16459M2472N8401m484l2113j770j5166p3255m3211Q1667J17396j2209j27219
35969a25950p3924L8221L8833l0095k1320O1585R8500O3910L6017L9806K4556
35958A50139k2344n2244l8561m339K3317L2322J6701j5081m5015p1448r1855o6130
35946a84538L3365J36193J27287K315j16138j34490p4903L432P1419J01573P3275
35935C8790K9088L1966N4292J1390q7793j39456j04683m6530M101Q1145J58329
$$ plain form
36016 127564 152182 113348 71517 70809 70968 16773 -80129 -165298 -197477 -157396 -56378 46937
36004 46937 97047 113293 142925 156685 94809 11641 37919 170875 243388 157363 13593
35993 13593 -59530 -73259 -87708 -81771 -23458 32717 29415 3070 -344 -17707 -78805 -116459
35981 -116459 -73987 -15586 -20070 -52183 -53953 -69119 -142374 -185585 -103918 13478 1269 -125950
35969 -125950 -199874 -161653 -122820 -152915 -174235 -112650 -14150 49760 85777 125583 150139
35958 150139 127795 75551 36990 32651 55968 88290 104991 89910 44895 -26553 -118408 -184538
35946 -184538 -151173 -14980 112307 114622 -1516 -136006 -210909 -207477 -136058 -34485 38790
35935 38790 67878 99844 154136 165526 77733 -61723 -166406 -212936 -208835 -127690 30639
35924C0639J38808J4762r5929j16483q7076m2655L9754J29554J30032L5045m1039
35913A35412l9912k3388k2517J1092N5920R463j05626j22748q448N1318l8468
35902i7902j02336R197J47472J04827l5789l7059J08566J80944P7783o6226j09404
35891A80073o7162j6952J8001M5158N3477K6665l1175q5622q0510J93P5892N4960
35879A72998j6526q162P2066O3433q0089j80289r9629M4462O9074r082n4747m1649
35867f8140k8982m823P0810J33217R1916l812l0861J4632L2272q479m5521n0993
35855A01236n5085n8200k8574K2554M9540M0827J7312k846P028O5178J11703N0470
35843C21143q6534j36538m0815N3190K1140n1515l5348L4850O4957P6915J13475
$$ plain form
35924 30639 169447 184209 88280 -28203 -115279 -157934 -118180 11374 141406 176451 135412
35913 135412 95500 72112 49595 60687 116607 126070 20444 -102304 -110752 -59434 -97902
35902 -97902 -200238 -191041 -43569 61258 25469 -11590 96976 277920 355703 289477 180073
35891 180073 112911 95959 113960 159118 212595 239260 208085 122463 41953 42146 118038 172998
35879 172998 156472 148310 220376 283809 203720 23431 -76198 -31736 37338 28256 -26491 -68140
35867 -68140 -97122 -101945 -31135 102082 193998 190186 159325 173957 206229 197750 152229 101236
35855 101236 46151 -12049 -40623 -18069 31471 72298 89610 86764 93792 158970 270673 321143
35843 321143 234609 98071 57256 110446 131586 80071 44723 79573 144530 221445 334920
35832C34920R9325j7716j09930n8006J9082m8568j63902r5515J28761K38017J23627
35821D50095l4085p6575n9345o8301o4268j0156K1386k2085o2721j3744P9430
35810A39631J03782K5418q5157j34546q7348J435L6740k976l4825M982O4947O8302
35798A00385L0376M537j7875n8116p2176k7650J2415o603j7956N3922J42919J35248
35786B79426M6423k5645n2863n3873n077Q4028J01721l523r4122m9369J6303n1411
35774A92018j51888q6903P7074R7540l5918q9358J3439Q0261m724j05910r3890
35763a08259l4357j8386j3059J9940L8104L3305O4253J10782P1665l5940o3014
35752F5034K2419O8564j186n8430M352R8893J00218K5359m5172q3158p0188J4475
$$ plain form
35832 334920 434245 416529 306599 248593 267675 219107 55205 -40310 88451 326468 450095
35821 450095 416010 339435 280090 211789 147521 137365 158751 136666 73945 60201 139631
35810 139631 243413 268831 183674 49128 -38220 -36785 -45 -3021 -37846 -32864 32083 100385
35798 100385 130761 135298 117423 59307 -12869 -40519 -28104 -34707 -52663 1259 144178 279426
35786 279426 325849 300204 247341 193468 188391 272419 374140 370617 276495 227126 243429 192018
35774 192018 40130 -46773 30301 127841 91923 2565 16004 96265 91541 -14369 -108259
35763 -108259 -142616 -161002 -174061 -154121 -116017 -82712 -18459 92323 163988 128048 65034
35752 65034 87453 156017 154831 96401 100753 199646 299864 325223 280051 196893 126705 141180
35740A41180R3194L3818j33976k09322j01762M6167R3752P8563O9612L4578l4096
35729A11708m2671K8806M6941m9978j19841n0428M7702M2157M402M8822R7849
35718A65469K1334j05146j06189L940N5610N112k5430K1824N9113K0902m2810
35707G3729p3760q2419q1798m2254M6655J32715J51372Q9576m616n8188l8691
35696A12321J929j3387p3060q4904j8922L8492J6233l6853l9431K915L5666N1051
35684g950O9827P3789L1979l1741n8549k9030K0089L9926J1894l4284m3942p794
35672C4214R014m2726j04170q1280J2415P6030O9265M0133J6271j8090l7478J0884
35660a5518R5196J18901O9064K8183K3400q455q0564j12715o9919k5506l9417
$$ plain form
35740 141180 234374 268192 134216 -75106 -176868 -130701 -36949 41614 111226 145804 111708
35729 111708 69037 97843 144784 94806 -25035 -75463 -27761 14396 18798 67620 165469
35718 165469 186803 81657 -24532 -20592 35018 40130 14700 36524 95637 116539 73729
35707 73729 -31 -82450 -164248 -206502 -159847 -27132 124240 213816 209200 151012 112321
35696 112321 114250 100863 27803 -57101 -76023 -37531 -21298 -58151 -97582 -94667 -59001 -7950
35684 -7950 61877 135666 167645 135904 77355 48325 68414 108340 120234 85950 42008 34214
35672 34214 43228 502 -103668 -184948 -172533 -96503 -27238 12895 29166 11076 -26402 -15518
35660 -15518 79678 198579 267643 295826 319226 310771 230207 117492 47573 22067 -17350
35649a7350p5872p9830m4113J9648Q7079R9901L6926j6976J1767M5494j7486r3444
35637d4256k9504J12710J27813R396m1123L0097M7052o0143j22943m3331L6264
35626B2032M691l0923K0478N4082j1274o1758j0417K9863k1769l0143J01620K03418
35614B69900R7959r0562j32217m5432j0335n3514o2183j7505J0754K5100N9858
35603E1823O2397n967m6590K1562R1603L8594n3888l6504M5436M6906j6700k1980
35591A76692K9209M2631K8422N6512Q0014J1028q4113p1555J5504L0178l9356
35580B75166o9566k1234K3607K3672J4174L477k4016l8241k2100l6732j04542
35569B3665j19192j3861Q9360O2881p551K4243J03592P9370k3086n8387j9148
$$ plain form
35649 -17350 -93222 -173052 -217165 -197517 -110438 -10537 26389 9413 21180 66674 49188 -44256
35637 -44256 -73760 38950 166763 176159 135036 165133 212185 152042 29099 -14232 22032
35626 22032 26723 -4200 16278 70360 59086 -2672 -13089 16774 -4995 -35138 66482 269900
35614 269900 367859 277297 145080 99648 89313 35799 -26384 -43889 -33135 -8035 51823
35603 51823 114220 108253 61663 83225 174828 213422 159534 123030 168466 215372 198672 176692
35591 176692 205901 248532 276954 333466 413480 424508 340395 268840 284344 314522 275166
35580 275166 205600 184366 207973 231645 245819 249296 225280 187039 164939 128207 23665
35569 23665 -95527 -109388 -20028 42853 35302 59545 163137 242507 219421 161034 141886
35558A41886j3546m1865j6744L6390J1739p5739j13499p8119k3857N3270J58341
35547C8257J83415N1351j03815j08410j8498l00l6214K037P3088L4431o7807n9929
35535a2394M5836P8564K2616K1641Q3247O7393k6975m8489J6521K0773n1533n0236
35523A66964M3093O3247l3782q4208r841N5983K0033k9777k1981j8656m7411k3316
35511H0348P4261J33538R3447K4518k0138o0164p0275j531O4212l233j28923j00690
35499H5370P9541J69011O2456o5201p3112n0648r2360j21853p1998k8571n8586
35488a65951p6544o441Q1520J01054P2093L4321j6872n2489k0698K9177M37n7279
35476g7672n126J21588J36065J3962o2390j6745K5378J1824N4333J56133J35964
$$ plain form
35558 141886 128340 86475 69731 106121 117860 42121 -71378 -149497 -173354 -120084 38257
35547 38257 221672 273023 169208 60798 42300 42000 5786 7823 80911 115342 47535 -12394
35535 -12394 33442 112006 134622 156263 239510 306903 279928 231439 247960 268733 217200 166964
35523 166964 210057 273304 239522 155314 145473 201456 221489 191712 169731 151075 103664 80348
35511 80348 154609 288147 381594 406112 385974 325810 255535 254004 318216 314983 186060 85370
35499 85370 164911 333922 396378 331177 258065 207417 115057 -6796 -78794 -107365 -165951
35488 -165951 -242495 -248936 -167416 -66362 5731 40052 23180 -29309 -50007 -20830 -20393 -77672
35476 -77672 -82798 38790 174855 188817 126427 109682 135060 146884 201217 357350 493314
35465D93314m7997j64988n1711J50431K40377K11818J26548k9334k07797k43405
35455D77256j02402J5615k1944q5282m0332J5592m3659j32552j09416j0809M5821
35444G888N1097M5675J4319l5557l6391j057k9165r1280k5280J54006J96688P565
35432B58508j69440j29582q422J055k2810O7212J76025J30709j0864p4660n7288
35421A60443o2453p6313k8084L5901L5170M151l616k7049o7885k1094J09725J30107
35409A89003l0541j42582k9273J30932J06482o636R50O1083j5227j50157j21248
35398g214L6073R0470O730m8090l4454o0253j08245n2589O6073P4503k2907m2828
35386a02731N7025J18430O5995M999L520P98l0574l3100o641j8505n2746k5602
$$ plain form
35465 493314 445317 280329 228618 379049 619426 831244 957792 928458 720661 477256
35455 477256 374854 390469 368525 283243 242911 258503 214844 82292 -27124 -37933 7888
35444 7888 58985 104660 118979 83422 47031 45974 16809 -74471 -99751 54255 250943 258508
35432 258508 89068 -40514 -48936 -47881 -70691 -3479 172546 303255 292391 217731 160443
35421 160443 97990 21677 -6407 29494 64664 68815 65199 38150 -29735 -50829 58896 189003
35409 189003 158462 15880 -13393 117539 224021 217385 218335 279418 264191 114034 -7214
35398 -7214 28859 119329 126059 77969 43515 -16738 -124983 -177572 -111499 -36996 -59903 -102731
35386 -102731 -45706 72724 138719 143718 147238 148036 117462 84362 77721 59216 6470 -19132
35374a9132M1725M4149j1932j8401K5891Q724p5914r5994r150N8325J8914m7372
35362h0167m1333R567K9685J9266K4214M5711M4743J0055j8503P99M5349L9437
35350A28823l2844o9667P740J00362N7420o7976p6554N3208J19118K7132o6888
35339A79874m4387j3267p0665j05853j4707R1240P7819J1058L823J3153k6464
35328A01624m1372K3718O0341m772m5780L5362J07810M1758n5306m7912j7210
35317A58261o6230q8654J6614J06845M0948m2593K0114R5592p31j37181q8756
35306A4229N4648O3660j3599J1997P0355k7813j74374j07970J09111J73986M5988
35295B20218l9649j7358m2700j19617q0131N9415J05585N9257J03558K12479J58062
$$ plain form
35374 -19132 22593 66742 54810 36409 62300 71024 -4890 -100884 -110034 -51709 -32795 -80167
35362 -80167 -121500 -111933 -82248 -62982 -38768 6943 51686 61741 43238 44037 89386 128823
35350 128823 95979 26312 34052 134414 191834 123858 47304 100512 219630 246762 179874
35339 179874 135487 122220 51555 -54298 -69005 22235 100054 111112 114935 128088 101624
35328 101624 60252 83970 144311 139539 93759 129121 236931 278689 223383 175471 158261
35317 158261 92031 3377 19991 126836 167784 125191 145305 240897 240166 102985 14229
35306 14229 68877 132537 118938 130935 201290 173477 -897 -108867 244 174230 220218
35295 220218 180569 163211 120511 894 -79237 -19822 85763 145020 248578 461057 619119
35284F19119o0324j74967r0266j069j2578K07P9470P7000m5470j20858p3517k7668
35272A69079m7169m2337M208j0026p8010o8171K4616O7315M0148M1781N7617p72
35260A58279n9810R015R5010J097j60342j08700J00043J32603n3341j44128j9016
35249d9290Q5192M0843J5314P5254M1888j11271j34043N5737J92575J04416l5371
35238B81244o7408q7859j51095j01034R5371J93815O7390o6354k3702N1221j2815
35227A78774j12459r1735q303K6220M1525P5779P0040K4503K9530N4735k7433
35216B61176j48576r2858J01485J54269L2231J5040J65676J88240j8110j29271
35206E29302M7206K28937J47157l2574p4020o7564j47513j70634r413J48468J10916
$$ plain form
35284 619119 558795 383828 293562 292493 279915 280122 359592 436592 391122 270264 196747 169079
35272 169079 121910 79573 83781 73755 -4255 -72426 -47810 19505 59653 101434 159051 158279
35260 158279 98469 107484 202494 203591 43249 -65451 34592 167195 113854 -30274 -49290
35249 -49290 35902 76745 92059 167313 209201 97930 -36113 19624 212199 316615 281244
35238 281244 213836 125977 -25118 -126152 -30781 163034 230424 164070 140368 191589 178774
35227 178774 66315 -25420 -33723 -7503 34022 109801 179841 204344 233874 288609 261176
35216 261176 112600 19742 121227 275496 307727 322767 488443 676683 658573 529302
35206 529302 576508 805445 952602 920028 846008 778444 630931 460297 450884 599352 710268
35195G10268J578j5199k6363j10366j07913N5666J44299J0475j08607r342J04337
35184F48833J1496j00060J4001J85661J31654m7118p6950J3014L0395J5485R6434
35173I22845J52393K2195j35313q4646N3939Q454j63755j91508n8646J9231j7562
35162E27627n3652o6733r8710p0672P4062J68919N8572j06224r9092J1058J7324
35151C62479n9324p0784m9223r9646j39113n3980L8760n966o7678J4789J09274
35140b0412K4009j06039l9975J20371R7138p0017r7349N2927J38636N7259m2078
35129A14470n1352j9913M762J8525j2352p6873o7276L3062O6210k6890o5110M5450
35117c7287J05274j9353j22457k8780O8864k3783j10713L1212J95582R0374j25608
$$ plain form
35195 710268 711846 696647 670284 559918 452005 507671 651970 662445 553838 544496 648833
35184 648833 660329 560269 574270 759931 891585 844467 767517 780531 810926 826411 922845
35173 922845 1075238 1097433 962120 877474 931413 939867 776112 584604 525958 545189 527627
35162 527627 473975 407242 308532 237860 311922 480841 539413 433189 334097 345155 362479
35151 362479 303155 232371 183148 83502 -55611 -109591 -70831 -76797 -144475 -129686 -20412
35140 -20412 3597 -102442 -142417 -22046 75092 5075 -92274 -39347 99289 156548 114470
35129 114470 63118 43205 47967 66492 54140 -22733 -90009 -56947 9263 -17627 -82737 -37287
35117 -37287 67987 48634 -73823 -102603 -33739 -57522 -168235 -137023 58559 148933 23325
35106B3325j16974M5743N9365n2622m4115N3928K5064p7024l7388P8614N0773
35095H689n1650m468J18139P9732n5423n3294K7258k9322j31162l8152J41990
35084A2337J19387l2632j3924J26286Q3752j13610j56329l2906j6820j14686o9456
35073b08601J05139J29178o676k9936Q5476R0844l3221m9402N4709N4270m8656
35062A43124m6147J2509j01798k82596j98578Q7675J77840K6118j1700J47776
35052d5777J88166J3834q8932j5732m654j16935j05047P5362J49418L8302k2946
35041F5059J9626m5808j94157j27848J45043K52166R7230M36P7049N7730j23049
35030B23477j54644M6316J40635j6036j22144j2993O0073m0604p8513N0135Q8690
$$ plain form
35106 23325 -93649 -47906 11459 -41163 -85278 -31350 -6286 -83310 -120698 -42084 8689
35095 8689 -42961 -47429 70710 150442 95019 41725 68983 39661 -91501 -129653 12337
35084 12337 131724 99092 85168 211454 295206 181596 25267 -7639 -24459 -139145 -208601
35073 -208601 -103462 25716 19040 -10896 74580 165424 132203 82801 137510 191780 143124
35062 143124 96977 109486 7688 -274908 -473486 -385811 -207971 -181853 -193553 -45777
35052 -45777 142389 156223 67291 51559 46905 -70030 -175077 -99715 49703 88005 65059
35041 65059 84685 38877 -155280 -283128 -138085 114081 211311 211747 288796 346526 223477
35030 223477 68833 115149 255784 239748 117604 104611 164684 124080 45567 95702 184392
35019A84392n5822r5370P9588J57171j1898j16907L7318J71072N2115j08077q7476
35008B06106k2381m8637k3108J12159J29691m7545j49487n1707p853j38510j69132
34997b10404M3024J98826P6816q9698n6167M3794L7169J6661M5708j2142j30797
34986c7210m5230K29483K91313J1948k03173q4484R0102M4565n4073j8981l58
34975B23902r3925q4089J03526J80389K8023n0631R2771J57777j4931j16810L1536
34964D57538J23923l3567j40523M108J01642n6088j73756m2560M1596j17992j92825
34953b8504L0388J83466j0926j94326l1898J65337M3765j30049r201J61298L4435
34942B13785j66258r0531P6380J3088j08466j445J44571N2176o7434P8697K70810
$$ plain form
35019 184392 128570 33200 112788 269959 258061 141154 178472 349544 401659 293582 206106
35008 206106 183725 135088 111980 224139 353830 306285 156798 105091 97238 -41272 -210404
34997 -210404 -167380 31446 108262 18564 -37603 6191 43360 60021 105729 93587 -37210
34986 -37210 -82440 147043 438356 450304 247131 162647 252749 297314 243241 224260 223902
34975 223902 129977 45888 149414 329803 357826 307195 399966 557743 542812 426002 457538
34964 457538 581461 547894 407371 411479 513121 457033 283277 240717 282313 164321 -28504
34953 -28504 1884 185350 174424 -19902 -51800 113537 157302 27253 18052 179350 213785
34942 213785 47527 -43004 33376 46464 -62002 -63447 81124 133300 65866 144563 415373
34931D15373J71970n6605r3729l3889q9098j11509N6842J66542J4438j12188M2945
34920C71092J97528O1743j12414m3997L6457q6562j04619J96280L82835R3091
34910I91434k59350j87214L1119o0445k34486q5775J39296L4298j45721J6251
34900B39407K51727J00477j97268j51307O3280p178k03350j01545J35659R6456
34890B26358p5739k9012N5885j17550k52027q1K60940P0812k00012o298L17742
34879B51018J58244k20469j76140J12837N1050j92459m6125K91960K04269j44702
34869B89483j17161J77398J31251j59689j11933J69269J01975k01846j47836J59564
34859B90475J16218j90714j59142J41495J27674j33635q6955J70871R0463j85967
$$ plain form
34931 415373 587343 530738 437009 403120 314022 202513 259355 425897 440335 328147 371092
34920 371092 568620 630363 517949 473952 510409 423847 319228 515508 898343 991434
34910 991434 732084 544870 575989 515544 281058 195283 334579 368877 223156 239407
34900 239407 491134 591611 394343 243036 306316 299138 95788 -5757 129902 226358
34890 226358 150619 121607 177492 59942 -192085 -192166 68774 139586 -60426 -66724 251018
34879 251018 409262 188793 12653 125490 176540 -15919 -62044 229916 434185 289483
34869 289483 172322 349720 480971 321282 209349 378618 480593 278747 130911 290475
34859 290475 406693 215979 56837 198332 326006 192371 105416 276287 366750 180783
34849A80783p9714K31761J09097k69863j95097K09934K11889j29251j18419J85388
34839C36508J13603k28495j31890K84699K45347j80687j99509J70928J66623j91107
34829C86020j48403K42895J90864k49098k31170K24838K39010k26802l00672R7996
34819B25478J38469k46074k32537K23491K73431j38893j69893K22334J96489k36280
34809B56015j77897L31959K98460k80552l48466J71922K38455k37682k22944L26174
34799C55444L07514l10873l19900L69594M65352k30481m20251J77337L16540k73633
34789D36643l46252L35223M54349k40811l68634L54728M89940k76011m30263L88613
34779G97525N87945k77062n62279K73694N85648k18110m91897L52710O05966l33618
$$ plain form
34849 180783 101069 332830 441927 172064 -23033 186901 398790 269539 151120 336508
34839 336508 450111 221616 89726 374425 619772 439085 239576 410504 577127 386020
34829 386020 237617 480512 671376 422278 191108 415946 654956 428154 127482 225478
34819 225478 363947 117873 -114664 108827 382258 243365 73472 295806 492295 256015
34809 256015 78118 410077 708537 427985 79519 251441 489896 252214 29270 355444
34799 355444 662958 352085 32185 401779 867131 636650 216399 393736 710276 436643
34789 436643 90391 425614 879963 639152 270518 625246 1115186 839175 408912 797525
34779 797525 1385470 1108408 546129 819823 1405471 1187361 695464 1048174 1654140 1320522
34769A320522o46535L46980P50047k13127o22366L32832O87566l47079o60462
34760I48378N63150J012754k50881p69346N21556J046644l17246p90727Q37508
34751B801790J520004j06535p16946J206807J993724l6151p03102J993380L335149
34742A1288120R81155M48695M762964P723717N770496O207949J3127176J7622884
34734F7933156J7259340L1067452P0043115J01200501P4613440q200697q3434160
34727B70482147r6707446o1276130k7602317j8019533j6964097j0617984m990728
34720C4303912n999067p169635l165858J340131K016124J571628J757807n42033
34712B4113009n270402o778655l266764k60108j211515k448943r04527N72066
$$ plain form
34769 1320522 673987 1020967 1771014 1557887 935521 1268353 1955919 1608840 948378
34760 948378 1511528 2524282 2273401 1504055 2025611 3072255 2755009 1964282 2801790
34751 2801790 4321794 4215259 3498313 4705120 6698844 6662693 5959591 7952971 11288120
34742 11288120 12269275 12717970 17480934 25204651 30975147 37183096 50310272 67933156
34734 67933156 85192496 116259948 186303063 287503564 362117004 353916307 270482147
34727 270482147 173774701 112498571 84896254 66876721 49912624 39294640 34303912
34720 34303912 28304845 21135210 17969352 19309483 21325607 22897235 24655042 24113009
34712 24113009 18842607 12063952 8797188 8537080 7325565 4876622 3972095 4544161
34704D544161n64553j700804m53838Q48588l3484j055378j70296P72907q1166
34695B106137r74571j48206P38498j3971q63750j68536O58262N2772o82973p9597
34685F24065O30475M5685o69928j77286M38347m9618n51885Q0114O73878J6216
34675A060063p11683j65778O01774J85296n53759k60745L59685Q1801m51331j32466
34665A2857L91253Q0881l97102l6361M67525Q8861m78381j57086M24536J66895
34655E63878m01735k12730K99155J45708k90556j27968K34262o136l78516q0109
34645b54747L64538R0718l94820j73543L23989J88086k19474m6866L59132J95258
34635D32271j74809K5974L89248J05806l97371k34609K31878R4903l53929k22575
$$ plain form
34704 4544161 3979608 2278804 1824966 2673554 2640070 1584692 1414396 2187303 2106137
34695 2106137 1131566 983360 1721858 1707887 844137 675601 1333863 1386635 703662 624065
34685 624065 1254540 1300225 630297 453011 891358 841740 289855 369969 1043847 1060063
34675 1060063 348380 182602 784376 969672 415913 155168 514853 596654 145323 12857
34665 12857 404110 484991 87889 51528 519053 607914 129533 -27553 396983 563878
34655 563878 162143 -50587 248568 394276 103720 -24248 210014 203878 -174638 -254747
34645 -254747 109791 200509 -194311 -367854 -43865 144221 -75253 -122119 237013 432271
34635 432271 257462 283436 672684 778490 381119 146510 378388 473291 119362 -103213
34625a03213K48867J92423j95344q8566L22770K22991k17766j90363J70012Q4085
34615D45896l18616k56155J75755J98427j61083j93913Q8991N7256k26621j38343
34605c28406K29754K21091j07758j22092J36210P1257k41853j86284J74506K11608
34595E8033n4472l9870K21361J59212j75452j98742N9285M3262j93046r4660K43591
34584B8502K00732j59647j72272J70127K11787j09681j71989J17742J72270j16302
34574A71269j89591P1488J40280r9499j44526J03501J30281j69334k53205N2379
34564a86957K41596P7720m1467Q9548J44426p115m1296J22732J37195o3855j11725
34553C60802P3478J39005R379L59J22077L5444k02953j52980J46862J57620j85790
$$ plain form
34625 -103213 145654 338077 142733 54167 376937 599928 382162 191799 361811 445896
34615 445896 127280 -128875 46880 245307 84224 -109689 -20698 36558 -190063 -328406
34605 -328406 -98652 122439 14681 -107411 28799 100056 -141797 -328081 -153575 58033
34595 58033 3561 -36309 185052 344264 168812 -29930 29355 72617 -120429 -215089 28502
34584 28502 229234 69587 -102685 67442 279229 169548 -2441 115301 287571 171269
34574 171269 -18322 53166 193446 93947 -50579 52922 183203 13869 -239336 -186957
34564 -186957 54639 132359 90892 180440 324866 317751 276455 399187 536382 472527 360802
34553 360802 434280 573285 582664 583023 705100 740544 537591 384611 531473 689093 503303
34542E03303l23390o7228R8544o3489j58725L3863J63405K0256q6523K8081R0534
34531B38631l3846o7064Q6040J10723r0131j73241j0155N9549j20562k31306q3965
34520c15327P1795P4438J02878J97047J18468j12119j37929Q0932J47575n2572
34510A75186j46545J2429Q0540r2976j70098J9430J54323L9869n0923N9367J28843
34499B09445J7722l2549Q5469J09437n1304r9166P0980J42797j4724r2010M6491
34488C92588Q6778j09842k02247l096J62184N6588o9122n697L8871p6873j15193
34477A54939L7218R5126o7000j33716M1020J12976j02195k37327l3647J73669
34467D1063O5889j04815l2778Q2903j8527j36498k5768J02618o383j43156k7900
$$ plain form
34542 503303 179913 112685 211229 147740 -10985 22878 186283 206539 120016 148097 238631
34531 238631 204785 137721 223761 334484 244353 71112 60957 120506 -56 -231362 -315327
34520 -315327 -243532 -169094 -66216 130831 249299 137180 -749 80183 227758 175186
34510 175186 28641 41070 121610 28634 -141464 -122034 32289 72158 21235 80602 209445
34499 209445 227167 194618 280087 389524 338220 239054 310034 452831 438107 346097 392588
34488 392588 479366 369524 167277 164181 326365 382953 313831 308134 347005 270132 154939
34477 154939 192157 287283 220283 86567 127587 240563 138368 -98959 -132606 41063
34467 41063 106952 2137 -30641 52262 33735 -102763 -128531 -25913 -32296 -175452 -203352
34456b03352J59874J25412j4289p637N7468j369o2010L0084J04381j0150j17927
34445F0485j2831J20161N5383n0112J4716R4396r972j22207k3576J06075J5944
34434B48462j36950p6645Q8771Q7038l3177n1795O949n394l7630J0226L2666n8347
34422G4174r8665K9441J34476N6958k7009M4948R8453k1621j23325m5858N964
34411A27936j20169j67913M8993K22159P2275j11820J5194K00929M8410k31361
34401A04633j77756R1057J00011j32733j66501N7821J62616L6861m0281K1200
34391E6928J0033r0580m8123J25697J40111m6540j38311j8351Q6914M2933l732
34380A16979L8812N5140n033l1069J285j6250q1017p0204Q238K6431j0022J1045
$$ plain form
34456 -203352 -43478 81934 67645 60008 117476 116107 54097 84181 188562 178412 60485
34445 60485 47654 167815 223198 173086 187802 282198 272226 150019 126443 232518 248462
34434 248462 111512 34867 123638 210676 177499 125704 132653 127259 89629 99855 132521 74174
34422 74174 -24491 4950 139426 196384 169375 214323 312776 291155 167830 121972 127936
34411 127936 7767 -160146 -111153 111006 183281 71461 86655 287584 335994 104633
34401 104633 -73123 17934 117945 -14788 -181289 -123468 39148 76009 35728 56928
34391 56928 66961 -23619 -71742 53955 194066 147526 9215 -9136 77778 120711 116979
34380 116979 155791 210931 205898 174829 176114 159864 78847 8643 16881 43312 33290 44335
34368D4335N9477J8106n8457k5774O4435N2351k1806k837N8808l178j25704r9978
34356d0222M8270J00717K7876o332J9777j2826o3327J5930J47329J03572q7767
34345B52997j62095m7257O4000Q1701J16613J84787J56537N3772P4623K44859
34335A020537L32755J93298m8577k17538k67382k10811q9882l0906j16697k13146
34325C51651j36886M0600R1416j1947r4139q9211q4520q3156P00J21637J38985
34314B45130N8837p87m2282j32563j80905n9693J10535J02944l4318n6755N3998
34303F4141Q4264q402l4209O4489J23321P7230N9473J21576J42387P6803L2392
34292H03465M8840M4989J3962L1085N7931j6992j44078j65159q3124l0429j1044
$$ plain form
34368 44335 103812 121918 63461 37687 102122 154473 132667 129830 188638 185460 59756 -40222
34356 -40222 8048 108765 136641 130309 150086 137260 73933 89863 237192 340764 252997
34345 252997 90902 43645 107645 189346 305959 490746 647283 701055 775678 1020537
34335 1020537 1353292 1546590 1498013 1280475 1013093 802282 712400 681494 564797 351651
34325 351651 214765 255365 346781 334834 240695 151484 66964 -16192 -15492 106145 245130
34314 245130 303967 303180 260898 128335 -52570 -112263 -1728 101216 66898 10143 64141
34303 64141 148405 140003 105794 170283 293604 370834 430307 551883 694270 771073 803465
34292 803465 852305 897294 911256 942341 1000272 983280 839202 674043 590919 560490 549446
34281E49446N5275R2471j7766j38610l9792J81296K07929J6167j07484o3583m6095
34270F89254j13239p6096R4786J61010M0259m2940L1718Q7299J8095j4945O5829
34259I41030O5327j10653k20372p1978J34499J13946p6507j74431j09956k9332
34249D61573l1081p3118q0798k7465M2620L5110o6902j20931j5175J10856M6765
34238B81454j32918j60447p308P7757r390q2793j3302P9415P8752M0917J4414
34227A66551n2765j34814j07932J1768O0159J7032L7051J32537J23803j8096r0508
34216A44786j8236K0298o0730r7362K483Q8096O1622M5154J02004Q8952n0852
34205C26215j38039o9493Q76l8173n8975K5153O9107k2931r9103m0251K4476k0203
$$ plain form
34281 549446 604721 697192 679426 540816 501024 682320 890249 906416 798932 735349 689254
34270 689254 576015 499919 594705 755715 795974 753034 784752 872051 890146 875201 941030
34259 941030 1006357 895704 675332 603354 737853 851799 775292 600861 490905 461573
34249 461573 430492 357374 276576 249111 291731 326841 259939 139008 123833 234689 281454
34238 281454 148536 -11911 -19219 58538 49148 -33645 -46947 32468 111220 152137 166551
34227 166551 113786 -21028 -128960 -117192 -57033 -40001 -2950 129587 253390 235294 144786
34216 144786 126550 146848 86118 -11244 -8761 79335 140957 186111 288115 377067 326215
34205 326215 188176 118683 119559 81386 22411 47564 116671 93740 -5363 -45614 -21138 -41341
34193d1341n7856J3819P3825J8450l6868M704L3896j6656m028J29898J69948j8838
34181B68953k08705j49338M2872J10855N7648L8206M0803l3810j24399j09122
34171f6037l4158j6420l7634k6999j2642k0064K2809J23393J52320Q0463O4919
34160B29950J44100J16139q5013j90051k3627J58878O8696j45716j66137j6406
34150I0813N5218K1659L6412Q6821M3514m8174n0720j0879n1563r5190J290J40710
34138B19911J22713r202o0357l0311n9729j22447q5965m384l2846j08709l6447
34127b07773J48659K13230J02517r257l1974m1132n4429k763O9173L2271q1546
34116A36976r7243K6181J45069J55120P4845o3969k11291k31441n3862J52798
$$ plain form
34193 -41341 -99197 -85378 -11553 6897 -29971 -25267 8629 -8027 -12055 117843 287791 268953
34181 268953 60248 -89090 -46218 64637 122285 160491 201294 167484 43085 -66037
34171 -66037 -100195 -116615 -154249 -181248 -193890 -213954 -191145 -67752 84568 165031 229950
34160 229950 374050 490189 405176 215125 191498 350376 419072 273356 107219 90813
34150 90813 146031 167690 204102 290923 334437 286263 235543 224664 173101 77911 79201 219911
34138 219911 342624 333422 273065 242754 183025 60578 -25387 -29771 -62617 -171326 -207773
34127 -207773 -59114 154116 256633 247376 215402 174270 119841 117078 186251 218522 136976
34116 136976 39733 65914 210983 366103 440948 376979 165688 -65753 -119615 33183
34106C3183J68381L0173n8858n8074q2572j33056r8880K552M7244M1687Q9485
34095a8735J49072Q3857o2212j01505j2371M5172K5278M4988J19006J10648n383
34084C77815p5802k7129K6010n290n8161o6037n5268m0219J5308Q5508Q0163p250
34072B49648p9019p9331m0820Q883O2548P4051R653o8979q9228q0596q3876l6271
34060a53337J01249J99591J26292l0739r2450n7189m5506o5726m3777m945j5882
34049h2419k7850J8581L7271m0558p9414L6797J41206L8040j23474p2543J07057
34038d7306J13159m2463o1208J03870J68500J8323j19132q8381j8271j8174o641
34027B276M7699L5937l5198o859J15770J24511j6902q4117Q614N5006n4956j23768
$$ plain form
34106 33183 201564 231737 172879 114805 32233 -100823 -199703 -197151 -149907 -108220 -18735
34095 -18735 130337 214194 151982 50477 38106 83278 108556 153544 272550 383198 377815
34084 377815 302013 274884 300894 295604 237443 171406 116138 75919 91227 176735 256898 249648
34072 249648 170629 91298 50478 59361 121909 195960 205613 136634 47406 -33190 -117066 -153337
34060 -153337 -52088 147503 273795 243056 150606 93417 47911 -17815 -61592 -66537 -82419
34049 -82419 -110269 -91688 -54417 -94975 -174389 -137592 3614 41654 -81820 -154363 -47306
34038 -47306 65853 23390 -37818 66052 234552 252875 133743 45362 27091 8917 2276
34027 2276 49975 85912 50714 43855 159625 284136 267234 183117 191731 246737 191781 68013
34015F8013l922J34000R4203l9477q8283m4323K4334J23057K24766K17377R9376
34004H09121K8184N8103N2750l6289o3296J3746J1817j38857k20134q8888N5384
33993D81641l116j44596j39557j9846L4834J2785K2434O2479O4176M7997M9729
33982D68960J4086p2955r4681j0311K3936p7381j33814O151J63721R1911j11800
33971B67823j51888K861J04329L2194o7772o4917j7871j5271l1796j2487K6659
33960G1864M0913K2594o579k4113k4124k5907l9042k2465N3517J12597N2120p4974
33948A36401j00235O978Q2951K0042q5951j06386m0459O3366J80390K31969J17060
33937E06126r0062j62504m2804N3713k6296j44411j23073k5735m963m3682l7134
$$ plain form
34015 68013 64091 198091 292294 252817 164534 120211 144545 267602 492368 709745 809121
34004 809121 837305 895408 948158 911869 848573 862319 874136 735279 515145 426257 481641
33993 481641 478525 333929 194372 174526 209360 222145 244579 307058 371234 419231 468960
33982 468960 483046 410091 315410 305099 329035 251654 117840 123991 287712 379623 267823
33971 267823 115935 118796 223125 255319 187547 122630 104759 89488 57692 45205 71864
33960 71864 112777 135371 128792 104679 80555 54648 15606 -6859 46658 159255 211375 136401
33948 136401 36166 43144 126095 146137 60186 -46200 -86659 -23293 157097 389066 506126
33937 506126 416064 253560 210756 264469 238173 93762 -29311 -55046 -60009 -103691 -140825
33926a40825Q487L3335N1474P1799L2346m9441k9845J08880J53137j4340j82151
33915D2856j25239L7441N5116m9912p4430o211k514p0085n8622N2258J18140P9120
33903b082K3080J615k0732l7839k398M9832L5645k7742n1265k2479N639K7552
33891b1174N5045L6514n3993j15986n7672L9700M2997k2686m0256J501L5828O2675
33879c7507J01825Q8475j2815q2420j8115O3187r1j29813j24289J3161R7716O4883
33867B4197J4356j0336n1574p3103j098Q3553K9204j12141j31747R04R0232L9327
33855i8226j5160L5628R3988M3589n6227q0914k6327J6433n159o2524q5681k2847
33843b63427Q9710J32419M2449q5125j13623l4526O3399J26284J33498M7750j00767
$$ plain form
33926 -140825 -132338 -99003 -47529 24270 56616 7175 -22670 86210 239347 225007 42856
33915 42856 -82383 -44942 10174 -39738 -114168 -120379 -122893 -192978 -251600 -199342 -81202 -2082
33903 -2082 20998 22613 1881 -35958 -38356 11476 47121 19379 -31886 -54365 -48726 -21174
33891 -21174 33871 70385 16392 -99594 -157266 -117566 -74569 -97255 -137511 -136010 -100182 -37507
33879 -37507 64318 152793 139978 57558 39443 102630 102539 -27274 -151563 -138402 -40686 24197
33867 24197 38553 28217 -23357 -96460 -97558 -14005 15199 -96942 -228689 -227785 -137553 -98226
33855 -98226 -113386 -77758 16230 59819 3592 -77322 -103649 -87216 -92375 -154899 -240580 -263427
33843 -263427 -173717 -41298 1151 -83974 -197597 -232123 -168724 -42440 91058 138808 38041
33832C8041j59506l4561J41415J76642Q3265N359l6122j22040k10811j59523L1807
33821b46034J90098J98201R9475j8671r6487p8778K7979J00566M3948n2967n1855
33810A15475J5402L0616R904L9817P0780J153r5564p0402K3839J1099q8557q9684
33798b6122K4130P7569K3852O523P0811Q9194K2575j1517J1395l2584j54183j90828
33786h9185q4765K3474N1206P5713J12496N7883o1912o0733Q1016J37745J4627
33775B57565q0475j21Q7206N380j19807r3692J6379K9758l8178n7933l8031o0506
33763i2455p9052q983P3824M2298m6237l3825P0667J09890L9212j6286K6171Q8719
33751A73943N8388o5018j73245j58574k5029R5339Q2096j6539n0244R669M0011
$$ plain form
33832 38041 -121465 -156026 -14611 162031 245296 250655 214533 92493 -118318 -277841 -246034
33821 -246034 -55936 142265 241740 223069 126582 47804 75783 176349 220297 167330 115475
33810 115475 130877 161493 171397 211214 281994 283147 187583 117181 141020 152119 63562 -26122
33798 -26122 -1992 75577 99429 105952 176763 265957 288532 277015 288410 255826 101643 -89185
33786 -89185 -173950 -150476 -99270 -23557 88939 146822 84910 24177 105193 242938 257565
33775 257565 177090 176969 264175 269555 149748 56056 72435 102193 64015 6082 -31949 -92455
33763 -92455 -171507 -180490 -106666 -64368 -110605 -144430 -73763 36127 75339 59053 85224 173943
33751 173943 232331 167313 -5932 -164506 -189535 -94196 -12100 -28639 -78883 -69214 -29203
33740b9203j7372o2739k1850L4512L9516M6718R3594R5098r21q1923l3646P1778
33728A33562Q9616J5671m7837o2813o2248m9399j0912J6630n427m5048n1652k9588
33716a09445P50M6181Q8664P3480P551k3632M611Q399m6243n9798L4272J33903
33704A58693J07049k4983j39838j65430r6686M2696J67907J59949J6259j13635
33694A11981j19355n6294j1667K8250Q3352Q3692j0959j04809j00266m1874j5884
33683a53833r533J4445J0468n2555q3767N76J19925J37674O2099J1012K9645O2636
33671A48792O4868L7767r626n7064o8630m4482k4916j5189J2594K8734k4446r4327
33659d5925n9920N7248J00061L6402P915N6513M1170p1877r8828L1387J05619
$$ plain form
33740 -29203 -46575 -109314 -131164 -96652 -57136 -10418 83176 178274 177353 95430 61784 133562
33728 133562 223178 238849 191012 128199 65951 16552 5640 22270 16843 -28205 -79857 -109445
33716 -109445 -108695 -62514 26150 99630 107181 83549 88160 96559 50316 -9482 24790 158693
33704 158693 265742 240759 100921 -64509 -161195 -118499 49408 209357 225616 111981
33694 111981 -7374 -63668 -75335 -47085 36267 119959 109000 4191 -96075 -137949 -153833
33683 -153833 -163366 -148921 -138453 -191008 -274775 -274199 -154274 -16600 45499 56511 86156 148792
33671 148792 213660 251427 241801 184737 116107 71625 46709 31520 44114 72848 48402 -45925
33659 -45925 -105845 -48597 51464 87866 95781 152294 193464 121587 22759 54146 159765
33648A59765j2543j14627J525J54902P2713j33498j38400P3832K15153J56349
33638D35171M1991k8333j04356j62543q9077O9631J11428q199j05506o7356K009
33627I4860l904l7136k8339l747J269O134J5316N814M49L2666N0203r543p6390
33614D7652l9241M9175M1074n4050q3740j5361K1915k2632m1013L0955J10523
33603D5257J15195O0010k0696j01682j10691m671J01529O0548o2332p3485K2525
33592C1507K2307j15450j69602j2393J72299J65845J9122p1695m5641J3849M0097
33581E0245K3988k5923o7277l9323M0475P4254K2745m5233p1790o8492l3447N4618
33569h5160J27296O6252r2691j52343k8735J14122R5818m5575j47528j36248n0024
$$ plain form
33648 159765 147222 32595 34120 189022 261735 128237 -10163 63669 278822 435171
33638 435171 477162 448829 344473 181930 92853 162484 273912 265713 160207 92851 94860
33627 94860 90956 53820 25481 21734 23003 29137 44453 50267 50716 83382 133585 124042 47652
33614 47652 8411 57586 98660 44610 -39130 -54491 -32576 -55208 -96221 -65266 45257
33603 45257 160452 220462 199766 98084 -12607 -17278 84251 144799 82467 8982 31507
33592 31507 53814 -61636 -231238 -243631 -71332 94513 113635 41940 -3701 10148 50245
33581 50245 74233 48310 -18967 -58290 -17815 56439 79184 33951 -37839 -106331 -139778 -85160
33569 -85160 42136 108388 15697 -136646 -165381 -51259 44559 -1016 -148544 -284792 -334816
33558c34816M8432R2879L7353o3342q2152J0887J00898R8900M9431J4759k2899
33547d9670p3294p5985r777M4988L2095J454m286k7093q0643q4335j426P4820
33535b53152O8737M0500N8812P6596M5831L5263J00197J43469N8366p4761r5852
33524B04006j1633K6599l6562r5283o1375J9576N7117K9784j9348m4245l3276
33513C5360j2355j0124j3090J3575N5620N5815M412m3807n9534o4959n1018K5626
33501f4479J22198J06637m9326j82374j42277K054O8466P601o6808n1040M4815
33490b04533J43261J73722J19042L6488L35m237o3921j79652k21627j10167N0109
33479b61180J07296N6771K376p642N25J7161M8735O1951K7127j1460K550L7260
$$ plain form
33558 -334816 -286384 -193505 -156152 -219494 -301646 -290759 -189861 -90961 -41530 -26771 -49670
33547 -49670 -122964 -198949 -208726 -163738 -131643 -130189 -134475 -161568 -242211 -326546 -327972 -253152
33535 -253152 -184415 -143915 -85103 -8507 37324 72587 172784 316253 374619 299858 204006
33524 204006 192373 218972 182410 87127 25752 45328 102445 132229 112881 68636 35360
33513 35360 23005 12881 -209 13366 68986 124801 129213 85406 25872 -39087 -90105 -64479
33501 -64479 57719 164356 115030 -67344 -209621 -207567 -139101 -131500 -198308 -249348 -204533
33490 -204533 -61272 112450 231492 267980 268315 264078 200157 20505 -201122 -311289 -261180
33479 -261180 -153884 -97113 -94737 -102379 -101854 -84693 -35958 25993 53120 41660 44210 81470
33467H1470K2648l0723n4787l8586k6141k1241Q101M0331J4830n5038p2994Q191
33455a23939J12070J29763M5834n3349p5736j3461N6053N7784K705l6221k3370
33444G8133O405J4814N331r834k6300j3753O2075J52553J39701j0335j73100k06189
33432A9501j11999l802L9917K5321j1237m2922n7434o2927o8826m7127L7798J43045
33420a40692J60615N5733p2685j13313o4772J665L5502K1824k7434n3609L488
33409a93678R8242J03971l633q7050m1983N0046N7947m730l6240j9007o363O730
33397g5748O2594J19666Q5350l1900j15900r7256k2205L9796P0928P4316M5137
33386A54778j878k4944O340Q7368J82421K31341J87745Q5397K3024L8796N1194
$$ plain form
33467 81470 104118 73395 18608 -19978 -46119 -67360 -59259 -18928 -4098 -59136 -132130 -123939
33455 -123939 -11869 117894 163728 110379 34643 21182 77235 135019 137724 101503 78133
33444 78133 84538 99352 104683 94849 68549 54796 116871 269424 409125 398790 225690 19501
33432 19501 -92498 -96300 -56383 -31062 -42299 -85221 -142655 -205582 -274408 -321535 -283737 -140692
33420 -140692 19923 75656 2971 -110342 -175114 -173449 -137947 -116123 -143557 -197166 -193678
33409 -193678 -95436 8535 4902 -82148 -124131 -74085 -16138 -20868 -57108 -76115 -82478 -75748
33397 -75748 -13154 106512 191862 159962 44062 -53194 -75399 -35603 35325 109641 154778
33386 154778 152900 127956 134296 221664 404085 635426 823171 908568 931592 970388 1021582
33375A021582j7593j14338j27869m6758M0263P1996O0225L0542j14l102K7418
33364I42252L6857j5636o8353l4259M9495O0090j5784m6287M1593J35082R6996
33353A182046k7970q1082k4835J6404l6347r3508n1467K7590J0638q0554q9181
33342G51734K0301Q2909j7809j60541j66147o0321n647m1806o4073l0863j7641
33331B90096n3808o6074k0173J7582K547k3007k4716k6265l4328k1286l845k4880
33319A1843m5049J4902J09304R7964k8326j16131r0078n3638q1926q9980n259
33308b76374Q9203R9634P1995Q1857R7076O2858J0551k3871p8253j59790j75171
33297b00285p0208O3469J15687R1472M2869j4763m7258K179Q7491P7438k9819
$$ plain form
33375 1021582 1003989 889651 761782 715024 755287 827283 887508 918050 917936 914834 942252
33364 942252 979109 963473 895120 860861 910356 970446 954662 908375 949968 1085050 1182046
33353 1182046 1154076 1072994 1048159 1064563 1028216 934708 883241 910831 921469 840915 751734
33342 751734 772035 854944 837135 676594 510447 450126 444479 402673 338600 307737 290096
33331 290096 236288 170214 150041 167623 170170 147163 122447 96182 61854 40568 36723 11843
33319 11843 -33206 -18304 91000 188964 160638 44507 -45571 -99209 -181135 -271115 -276374
33308 -276374 -187171 -87537 -15542 66315 163391 226249 236800 212929 134676 -25114 -200285
33297 -200285 -270493 -207024 -91337 135 43004 28241 -19017 -16838 70653 148091 118272
33286A18272p9256k1076J958p1166q5670M7523J64987J20443K1522L499j1406
33275B09630j07224j48317j7793J21988Q7107k337M2028J03886k5635k19991j89624
33264a46282K1811J13366L8161L1944J46073J61832J1529j00392p3479n1846r6482
33253E6235o2368P7699J16289l0209j45433o7228N0967K1254p3229n8188L8958
33242g5253P9890N0760K2278m249m6163l8514O3933J65842J46199L1737n1760
33231C44700m7860m138J4529j6831p6978j17035j17622j15849j24308p4262O6336
33220b69318J82595J57224O6934O6143J23838P7731p4284j60455j20081p4109
33210b3782p7692l1672R4059J65114J01894R828j546L1738M1162L5967K4766k8431
$$ plain form
33286 118272 39016 17940 19898 -51268 -136938 -89415 75572 196015 217537 221036 209630
33275 209630 102406 -45911 -63704 58284 145391 143054 185082 288968 263333 43342 -146282
33264 -146282 -124471 -11105 27056 59000 205073 366905 378434 278042 204563 152717 56235
33253 56235 -6133 71566 187855 157646 12213 -55015 -4048 17206 -56023 -114211 -75253
33242 -75253 4637 55397 77675 73426 27263 -11251 52682 218524 364723 396460 344700
33231 344700 296840 292702 307231 290400 213422 96387 -21235 -137084 -261392 -335654 -269318
33220 -269318 -86723 70501 137435 203578 327416 405147 330863 170408 50327 -23782
33210 -23782 -101474 -133146 -39087 126027 227921 237749 236203 267941 309103 345070 369836 341405
33198C41405j00939j01768k4029K6652J656k9594k3568k3283m3079l8728j6611
33187c1886k4771k8076M2689J19993O9314o6662j04164j4342M0588m738l0643
33176c2698K1048N2127K5949M4769J28135J41258L7305m2390n984M9680K7801
33165D47000k7030n4391o7632o2243j3324R540p5927j67247r8341N1623N5099
33154b873n8989l2970J52412K09530L0117j35618j14708n6669q5322p2713M6460
33143a21343Q6397m3895j32645l1330Q1538L4334m3101K63N5020q33n0888J3326
33131a53157O0911k0853r6839m2233L1395K2777L4425J12764J00735l8363q1929
33120g0367M5708R0942o5134j57402k5075P8047j8352m5970J73429L03044N7943
$$ plain form
33198 341405 240466 138698 114669 141321 142977 113383 89815 66532 23453 -15275 -31886
33187 -31886 -56657 -84733 -42044 77949 147263 80601 -23563 -37905 2683 -2055 -32698
33176 -32698 -11650 40477 66426 111195 239330 380588 417893 375503 369519 419199 447000
33165 447000 419970 365579 297947 235704 222380 231920 155993 -11254 -109595 -57972 -2873
33154 -2873 -61862 -94832 57580 267110 297227 161609 46901 -9768 -95090 -167803 -121343
33143 -121343 -34946 -78841 -211486 -242816 -161278 -126944 -170045 -169782 -114762 -115595 -166483 -153157
33131 -153157 -92246 -113099 -209938 -252171 -220776 -197999 -163574 -50810 49925 11562 -70367
33120 -70367 -24659 66283 1149 -156253 -181328 -103281 -121633 -167603 5826 308870 366813
33109C66813k33954j62686O0225K596k18262j77293J02773K43161J66520R9173
33099B49066Q0410q132q4840k2400K6472r0559j61975J1544J78718P2454o3663
33088A87095O6227K09821M4894j49499K24J99923J3156k66319j29181J77190J35872
33077D89403r229K37224N35929L39972J26138N77649J054780O97594O32562K637133
33067G319155N422075N081870M54965m475195n401807k940184q68925p52844j020385
33058B818725n30753j26244m65172p53419l61731P2406n3763k76033q1108J62736
33048D05644J5530k09610j09491P7541K1610o4625Q3779K19666N3356j84668j53495
33037A55237K1140L3875p4078q6528k4090k1407l5809J3436L4249n1383j17759
$$ plain form
33109 366813 132859 -29827 30398 32994 -185268 -362561 -259788 -16627 149893 249066
33099 249066 329476 321344 236504 214104 240576 150017 -11958 -414 178304 250758 187095
33088 187095 253322 463143 508037 358538 358762 558685 571841 305522 176341 353531 489403
33077 489403 480174 717398 1253327 1593299 1719437 2297086 3351866 4049460 4682022 7319155
33067 7319155 12741230 17823100 18278065 13802870 8401063 5460879 4591954 3839110 2818725
33058 2818725 2287972 2161728 1696556 943137 581406 653812 600049 324016 242908 405644
33048 405644 421174 211564 102073 179614 201224 136599 220378 440044 493400 308732 155237
33037 155237 176377 210252 136174 49646 25556 4149 -31660 -18224 16025 -35358 -153117
33026a53117n0180N1454O2700K6460R604k3097p2234n7325M06k0640r2570n1450
33014c69989Q2733R6946l6219r2949K126N1753k5504l5778J09470J97366Q4973
33003F4928m8712k4496N0112K0686m9913n6981n0859p2731l0768Q6051J11564
32992a119j1389r6815l4104K4411k7919m1454P9786J45658J1211j29066o5460
32981a46260N2519j3504j52087q7392J37255K19051P1965q0446p1601K2885P5564
32970B7949N9068q170r2252j15997m1145M1881K9772l3477l6401J8235M3108K1689
32958h5740M132j331j4583j4539J0979J0840l6885n9711j6014J4790k3527m4965
32946b56554K1387P5152P842q4686m1600Q7593J06941k5115j47907j42191n4437
$$ plain form
33026 -153117 -203297 -151843 -89143 -62683 -53079 -76176 -148410 -205735 -205329 -225969 -318539 -369989
33014 -369989 -287256 -190310 -226529 -319478 -317352 -265599 -291103 -326881 -217411 -20045 64928
33003 64928 16216 -8280 41832 62518 12605 -44376 -95235 -167966 -198734 -112683 -1119
32992 -1119 -12508 -109323 -143427 -119016 -146935 -188389 -108603 37055 48266 -80800 -146260
32981 -146260 -93741 -107245 -259332 -346724 -209469 9582 81547 1101 -70500 -47615 27949
32970 27949 87017 78847 -13405 -129402 -170547 -128666 -98894 -132371 -168772 -150537 -107429 -85740
32958 -85740 -81608 -82939 -97522 -112061 -101082 -90242 -127127 -186838 -202852 -188062 -211589 -256554
32946 -256554 -235167 -160015 -152173 -236859 -278459 -190866 -83925 -109040 -256947 -399138 -453575
32935d53575K7244P2207O5302m914q6869r3305j3822P0170R1455N9371J9347J383
32923b46006L022p370m9605q3794n6827l932j6448q8270j09501n5852m8066j45940
32911i08589k27791j93354j52602k49018l86989l21071J0888L98537O01090N58451
32901h70448L64388J47136N277j8556N0579J42927J83633J29922J5371n4937k0775
32890G4517L7967J2124n8377m9201K4970K8040m7625n6310L1555O3452q785k1006
32878C1321R4239J39714j8390j83559j25054N0938Q9804m366l1146M6048Q5922
32867A75471M8887K5486K8118m810l8022l72L5506l2269j02927j3972J40684J22078
32855C83858n1616j24273l4030k286j26962k03960p8601R9120J26589L5494k9526
$$ plain form
32935 -453575 -426331 -354124 -288822 -293736 -380605 -473910 -487732 -417562 -326107 -266736 -247389 -246006
32923 -246006 -242984 -250354 -299959 -383753 -440580 -444512 -460960 -549230 -658731 -714583 -762649 -908589
32911 -908589 -1136380 -1329734 -1482336 -1731354 -2118343 -2439414 -2428526 -2029989 -1428899 -870448
32901 -870448 -506060 -358924 -353647 -372203 -321624 -178697 4936 134858 150229 95292 74517
32890 74517 112484 124608 66231 17030 42000 70040 22415 -33895 -2340 61112 52327 31321
32878 31321 125560 265274 246884 63325 -61729 -10791 79013 74647 43501 89549 175471
32867 175471 224358 249844 277962 273152 235130 234758 270264 237995 135068 121096 261780 383858
32855 383858 332242 207969 173939 171653 44691 -159269 -237870 -138750 -12161 23333 -6193
32844f193l6614k4506R742M8959K0610o3920p3562L5429J21508P4342j6933k8910
32832E9952L167j3599n9740o4689l3157N626P0174J40081J12304l5465j48990
32821C5664r5376M2998J03044P1027L8216J9152k8615p1327m3465J9161L3551
32810A24030J5467L2567N4175m31q9610q5361J5868P0839N088q5399r1679l0878
32798f5324K9562Q0448J26688J16118Q731j22403j52038o3455K5820K0449l2217
32787b7621k7456L2411M1614l6529r4194l3159Q1029J12725N6067K3120M7512
32776A75519L4837n9295j27123n8898Q8937J57307P1234r5489k07714j81107m3235
32765b45027Q6299J07475M0506k2906m8047o0372m3847M3441J46260J44506M5296
$$ plain form
32844 -6193 -42807 -67313 -57571 -8612 11998 -51922 -125484 -90055 31453 105795 88862 59952
32832 59952 63119 49520 -10220 -74909 -108066 -102440 -32266 107815 220119 184654 35664
32821 35664 -59712 -16714 86330 157357 195573 214725 186110 114783 71318 90479 124030
32810 124030 139497 172064 226239 225808 136198 50837 66705 137544 142632 57233 -34446 -65324
32798 -65324 -35762 44686 171374 287492 296223 173820 21782 -41673 -15853 4596 -27621
32787 -27621 -55077 -22666 18948 -17581 -111775 -144934 -63905 48820 104887 128007 175519
32776 175519 210356 151061 23938 -34960 53977 211284 282518 187029 -20685 -201792 -245027
32765 -245027 -158728 -51253 -10747 -33653 -81700 -142072 -185919 -142478 3782 148288 193584
32754A93584n74O7686J21003N8666k8056k9941j2497p9833j65408j38414l5151
32743d8935K139l6792l7314K8218P6338Q4069J05523J17001K7153j32375j99283
32732a4258j12998j367K3535J3844N7001J23637J31486O9314j7481r0410j13980
32721F8323o7588m775j2548p2098o4399L7739J05500N5160j2648J9853R4554Q4904
32709B31977P398k5994p413k4675q2706r5200n3909m8101q9525p1228M4476J38213
32697g6687J15658N4836O6053J07155O9530k2724n0969r752j9459j16877j81081
32686f4317j22393j8216K1369J9168N7330J15821J07290L1519k7120l9702n2133
32675B8616o5964k1539P5396J23643O9287j4684m0439j3050K1245M8311N1783
$$ plain form
32754 193584 193010 260696 381699 440365 412309 382368 369871 290038 124630 -13784 -48935
32743 -48935 -46796 -83588 -120902 -92684 -16346 67723 173246 290247 317400 185025 -14258
32732 -14258 -127256 -128623 -105088 -91244 -34243 89394 220880 290194 272713 182303 68323
32721 68323 735 -4040 -16588 -88686 -153085 -115346 -9846 45314 32666 52519 147073 231977
32709 231977 239375 213381 205968 181293 98587 3387 -50522 -98623 -188148 -259376 -214900 -76687
32697 -76687 38971 93807 159860 267015 336545 313821 262852 253100 233641 116764 -64317
32686 -64317 -186710 -204926 -183557 -164389 -107059 8762 116052 147571 120451 80749 28616
32675 28616 -37348 -58887 16509 140152 209439 194755 154316 141266 162511 210822 262605
32664B62605q294j13585j60862r0879K3494Q4525Q9751P5075K7746n1705q7232
32653E0639l4790K5932J8008j470L6034N5552k7710j08434l0146J34559J71116
32642B89290O1719r232J1780j9584j32536j46780L99J03435K2156q1133l3669
32631F5845M5762k0318j22540m1035J56102J95334K5680j23637j09441l4858j1931
32620B4963k556L8894O2556L8202J5048P063l5617r4892p7046J2360M2350l1978
32608f53q6902l5440L7925M2708L5022Q3475J11834K4379j01964j08306R668R9913
32596A11659P3666Q39k4002n264J9j9612k9602j8872k1728n7153p6213j8516P7584
32583g195R3598O25p2191k1509O0264K8263o7489n4350O7371J05885j3731j27132
$$ plain form
32664 262605 254311 140726 -20136 -111015 -87521 -2996 86755 161830 189576 137871 50639
32653 50639 15849 41781 59789 58319 94353 149905 122195 13761 -16385 118174 289290
32642 289290 351009 341777 353557 333973 201437 54657 55056 158491 180647 99514 65845
32631 65845 111607 91289 -31251 -72286 83816 279150 304830 181193 71752 36894 24963
32620 24963 22407 61301 123857 162059 177107 184170 148553 53661 -23385 -11025 31325 -653
32608 -653 -87555 -122995 -85070 -42362 -7340 76135 187969 212348 110384 2078 11746 111659
32596 111659 185325 186164 162162 156898 156917 137305 107703 88831 67103 9950 -66263 -84779 -7195
32583 -7195 86403 87028 14837 -6672 53592 81855 14366 -39984 27387 133272 119541 -7591
32571g591r6377j1461j1180o2248n6168j033K8385L6720O6269Q4444L8247m0032
32559c2025q5183r1200o5955J6191J24875J44420M2467m5547k0799J6566m3940
32548d0130j05268k2005J31716J66404P2834o8j720K589J6971Q6134J19690o476
32536D20671j87288j86578j2802P0393m1303j35654l5434J38494J85008R8868
32526C14375o334p6386q7963k226J24966J34025j3344j40959j08819j1298K799
32515A28836l9529l4952k195j4957l6906J2995J01012J25428O4902k9619j18251
32504A56764j51661o6123R4067J59847O2852m0763n703P4727M3232m6946l9240
32493B41053M2199M7242k0057j5483P0392Q7043p826p4522l3149J9098J348j6505
$$ plain form
32571 -7591 -103968 -115429 -126609 -188857 -245025 -246058 -217673 -180953 -114684 -30240 8007 -32025
32559 -32025 -117208 -208408 -274363 -258172 -133297 11123 53590 8043 -12756 3810 -40130
32548 -40130 -145398 -167403 -35687 130717 203551 203483 201763 204352 221323 307457 427147 420671
32536 420671 233383 46805 34003 104396 63093 -72561 -107995 30499 215507 314375
32526 314375 308041 231655 143692 141466 266432 400457 387113 246154 137335 126037 128836
32515 128836 89307 54355 52160 37203 297 13292 114304 239732 304634 275015 156764
32504 156764 5103 -61020 33047 192894 255746 214983 209280 284007 327239 280293 241053
32493 241053 283252 330494 310437 294954 365346 452389 444563 370041 336892 355990 357338 340833
32481C40833L7858J01914Q9654K9486m949j5605m0302n5530o681R4998J70035
32470G41711J55230N9584n0644j07259r3853n0080k1133k3555o2083j27807j60978
32459B59133r0286M6417J04265K3192o8236l3620O8802Q3353q094q2559o7358
32448B35009l915N3904Q2270N0157m3265j16263r8614m2836l0258k5009L6893
32437I8073P7406j8631j64939j53050K2398J30454L9483j14389j63177j23372
32427c69744q2199l5848L8071P6087K3384n4010n8297K69L3263m384p4365r2375
32415f00148Q871J89312K84575J79177j5426q5028p113M0467k4607p9441l6714
32404a46075O769l5611p8673k9499L9864K7489j9159p039K9305J0739k1800J7273
$$ plain form
32481 340833 378691 480605 570259 599745 594796 579191 538889 483359 476678 571676 741711
32470 741711 896941 956525 905881 798622 704769 654689 633556 610001 547918 420111 259133
32459 259133 168847 215264 319529 342721 274485 240865 309667 393020 384926 302367 235009
32448 235009 231094 284998 367268 417425 374160 257897 159283 116447 86189 61180 98073
32437 98073 175479 156848 -8091 -161141 -138743 -8289 31194 -83195 -246372 -369744
32427 -369744 -451943 -487791 -449720 -373633 -350249 -404259 -462556 -462287 -429024 -433408 -507773 -600148
32415 -600148 -591277 -401965 -117390 61787 46361 -38667 -45780 -5313 -29920 -109361 -146075
32404 -146075 -139306 -174917 -253590 -283089 -243225 -215736 -234895 -241934 -212629 -201890 -223690 -206417
32392b06417Q3847N9104n5918j33621r4758Q240P2953M7763k7484m8646L5253
32381b59684J20093N6976j17707j97691r5438M3980Q8161R4753J32527J17194
32371a6836q591j02079l0487Q3262M5595q7967j13533j6107M0685J1378O161M9912
32359a38607M5178j4843k1913L3564L6188l3294n4862Q705M5233L369k4027O670
32347a08639K625p5708j17354n2382K4463K9666L3910J05837J55670P8479n8176
32336A8391j14130p7194k9202Q732N6412O5412j8244j16152q9566N2559J45618
32325i7364Q8543l3751p8826j6431O9044R0328L3846m4668p5741m2403K298k114
32313a07239m8983p5206m2600J8102N0311L8085J5836J8821L9320M2003J6503
$$ plain form
32392 -206417 -122570 -63466 -119384 -253005 -347763 -339523 -266570 -218807 -246291 -294937 -259684
32381 -259684 -139591 -82615 -200322 -398013 -493451 -449471 -361310 -266557 -134030 -16836
32371 -16836 -25427 -127506 -157993 -74731 -29136 -117103 -230636 -246743 -206058 -194680 -188519 -138607
32359 -138607 -93429 -108272 -130185 -96621 -60433 -93727 -148589 -139884 -94651 -91282 -115309 -108639
32347 -108639 -106014 -181722 -299076 -351458 -326995 -297329 -263419 -157582 -1912 76567 18391
32336 18391 -95739 -172933 -202135 -193403 -136991 -71579 -89823 -205975 -295541 -242982 -97364
32325 -97364 -8821 -42572 -121398 -137829 -68785 21543 55389 10721 -65020 -107423 -105125 -107239
32313 -107239 -156222 -231428 -274028 -255926 -205615 -167530 -151694 -132873 -93553 -51550 -35047
32302c5047o195K881L2215M9640M0143N853m7676j00173j15807q4035l8710n439
32290c02350M0188J17970J74292J29110j1113j38208j51312n5057N1868P2179
32280g2433O016m4948j251P2152L9498r5265j57597m4056J13423J31055L0396
32269b3010k6220O419K5159j8844n0616j9314K6944M3805M6847L8941l274m7212
32257c75k5342L8977M8217m587k3884M473k4632j26264j43733J2598J84207J65163
32245A04818j1821j36701j07235j1085M2599L9425J0004k6703n1955m9308k8915
32234b26877p110K3309O0230O1390L309n7260m5393K5296O9579M5609k425j5342
32222f5685J2899M1933L0303k4787p5644o4509R551Q3044R8179N5559p796n4389
$$ plain form
32302 -35047 -41242 -38361 -6146 43494 83637 89490 41814 -58359 -174166 -258201 -296911 -302350
32290 -302350 -262162 -144192 30100 159210 148097 9889 -141423 -196480 -144612 -72433
32280 -72433 -66417 -111365 -112616 -40464 -966 -96231 -253828 -297884 -184461 -53406 -23010
32269 -23010 -49230 -42811 -17652 -36496 -87112 -106426 -79482 -35677 11170 50111 46837 -375
32257 -375 -25717 13260 61477 56890 33006 37479 12847 -113417 -257150 -244552 -60345 104818
32245 104818 92997 -43704 -150939 -162024 -119425 -80000 -69996 -96699 -148654 -197962 -226877
32234 -226877 -233987 -210678 -150448 -89058 -85749 -143009 -188402 -163106 -93527 -47918 -50343 -65685
32222 -65685 -52786 -10853 19450 -5337 -80981 -145490 -135939 -52895 45284 100843 93047 38658
32210C8658n3706m532L6102L744p3321q9722r490P3599O8312R258j4943K322m78
32197a4197l8888o0109k5437L9688P5340L8810n4454j23565r3004Q686O9796L7649
32185a39685k3293m5758n1006p2598p4511k5295K1229J5818J8916J02896K00570
32174g2717J82505O0799k1071j903K9879N994j9762N825L0457m489n2137m1886
32162A01494n932k2568p6294q1967l2064j1559n2747p6856k3227M8502N2218Q166
32150a72834k725K1223P908m8877n8650K6166J27073J46335Q7143J0300o2969
32139H0093j31199j49585p7078L8865J05173R5133M9653o288o8995j01504o4873
32128b30605M018L1045J4268J1746L3247L8416L2959O1828J06732R8432L7117
$$ plain form
32210 38658 -15048 -19580 16522 20266 -53055 -142777 -152267 -78668 -10356 -1098 -16041 -13719 -14197
32197 -14197 -53085 -113194 -138631 -98943 -23603 15207 -39247 -162812 -255816 -247130 -177334 -139685
32185 -139685 -162978 -208736 -259742 -332340 -406851 -432146 -410917 -395099 -376183 -273287 -72717
32174 -72717 109788 170587 149516 147613 177492 183486 163724 169549 200006 195517 143380 101494
32162 101494 95562 72994 -3300 -85267 -117331 -128890 -181637 -258493 -281720 -233218 -181000 -172834
32150 -172834 -175559 -154336 -146428 -195305 -253955 -227789 -100716 45619 132762 143062 80093
32139 80093 -51106 -200691 -277769 -238904 -133731 -38598 11055 4767 -64228 -165732 -230605
32128 -230605 -226587 -195542 -181274 -169528 -136281 -97865 -64906 -3078 103654 202086 239203
32117B39203p831k1491m8109p0003k1609N8703M7044n5924r6245j0433O7711L1073
32105A12089l3782j7155K9801J8687o306K2134L5762m3983j19588m7766J05417
32094E5310J33373r610j51074j47732m0226N5041Q2928N4795J0883n438M350j1157
32082C1443n9275o1311K2433R9614P4106q868n4270o7489q4301m7387Q1122J70191
32070I6008Q2414p5841q7169L1696O0058n6127j25750m9333K6750j2361n9967
32059a69622j0779L9658j3060o9686r00J04306P5244m6050o4273N4969J38943
32048C8750Q5338n59O3M0346J4191o0683p9356k5681R85n2489r8954m0788O5355
32035a13482P2742l6585j11145m8092N7631O4019j1583n0939l0242k1351l9402
$$ plain form
32117 239203 231372 209881 161772 91769 70160 128863 175907 119983 23738 13305 81016 112089
32105 112089 78307 61152 90953 109640 103334 125468 161230 117247 -2341 -50107 55310
32094 55310 188683 179073 27999 -119733 -159959 -104918 -21990 32805 43688 38250 42600 31443
32082 31443 -27832 -89143 -66710 32904 107010 98142 43872 -23617 -107918 -155305 -74183 96008
32070 96008 178422 102581 15412 47108 107166 51039 -74711 -124044 -97294 -109655 -169622
32059 -169622 -180401 -140743 -153803 -223489 -224389 -120083 -44839 -90889 -155162 -100193 38750
32048 38750 124088 123529 123592 163938 178129 117446 38090 12409 13394 -39095 -138049 -178837 -113482
32035 -113482 -40740 -77325 -188470 -236562 -178931 -114912 -126495 -177434 -207676 -229027 -268429
32024b68429l2790p001j4625k6445L9868J53032J81297R6627J5016o62j9963p6622
32012C9303q6228j1428M4674Q104m2821k9538j1762n1199o7318K2619J27105J08113
32000D9624O610k6928K6339M9556o06m2319k4726Q106K3271M4646P1866O1944
31988B47383J4143k1241l6531p7505j41700j57786r6988k4930o336k4916l2363
31977c58770j8343L156K8069M9680N0657L4033K8931M6174O0484N1051K5699o972
31965f151n0405q7931p8212j0357O6158R5290P6166M4253J2452l2231q0963r3486
31953a45417n1850L603J8376q402k8773j3902J6603L9137N9834Q1324P3448J5973
31941E9954n4141q0346n5197j3056K6836O5169Q6852P0776K7909j2485m1168n3721
$$ plain form
32024 -268429 -301219 -308220 -322845 -349290 -309422 -156390 24907 121534 136550 135888 115925 39303
32012 39303 -46925 -58353 -13679 -5575 -48396 -77934 -89696 -140895 -208213 -185594 -58489 49624
32000 49624 56234 29306 55645 105201 104595 62276 37550 45656 68927 113573 185439 247383
31988 247383 261526 240285 203754 126249 -15451 -173237 -270225 -295155 -301491 -326407 -358770
31977 -358770 -377113 -373957 -345888 -296208 -245551 -211518 -182587 -136413 -75929 -24878 821 -6151
31965 -6151 -56556 -144487 -222699 -233056 -166898 -71608 4558 48811 61263 29032 -51931 -145417
31953 -145417 -197267 -193664 -175288 -183690 -212463 -226365 -209762 -170625 -110791 -29467 43981 59954
31941 59954 5813 -74533 -129730 -142786 -115950 -50781 36071 106847 134756 122271 81103 27382
31929B7382k7301L0921M7682k4439j05028p2535N5380J30213O9188n5923j40055
31918f4515j51771r6996J3352J16459J18980J9571p1778p8597l7122R53L8249
31907a93215N9651J1940p4660o6725P5374J93206J39384o215o2369r888K2007
31896H8490j6250m0522j524L6358J3175l7718n7072m0524j7064L232L1957P3696
31884C6234J00905O1182n2118j36185o9112R8746J46980l5361k62667k67313m1296
31873d20005J73692K07241J25159O7035N9534M5069K15m1247m1356P37L6859K313
31861B15246j00481j67321j01531M9919J37027Q7709j7533o5825m4125j9877l3644
31850f0436n4052l2657K2936N0358J4186l7664l7095J189L734l4168k8092N9688
$$ plain form
31929 27382 81 31002 78684 54245 -50783 -123318 -67938 62275 131463 75540 -64515
31918 -64515 -216286 -313282 -299930 -183471 -64491 -44920 -116698 -195295 -232417 -231464 -193215
31907 -193215 -133564 -121624 -196284 -263009 -187635 5571 144955 138740 76371 66483 88490
31896 88490 72240 31718 30194 66552 79727 42009 -15063 -55587 -72651 -69419 -37462 36234
31884 36234 137139 198321 146203 10018 -59094 39652 186632 151271 -111396 -378709 -420005
31873 -420005 -246313 -39072 86087 153122 212656 257725 257940 216693 175337 176074 212933 215246
31861 215246 114765 -52556 -154087 -104168 32859 120568 103035 37210 -6915 -26792 -60436
31850 -60436 -114488 -147145 -124209 -73851 -59665 -97329 -134424 -133235 -129501 -163669 -191761 -132073
31838a32073J46317J39945N6172k8785p6231q4739n8075k5978l0893m9487q510
31827a52337P6482Q5651j5472r2649m5796K7854J392o3807k6970Q9048J36076
31816A9472P2994n45j0801L0128R3937J33677O4970j07088k04737q5935J20942
31805A27014J71021M0589q5104j13882j11448r0693J1800J33602J13806k9019
31795A67686r0106j4109J3134r7658j66562n3369R5007Q9847j545p624N5402O0530
31783E0633K0967M2944J03580Q5836p242o3226n9423p2816j01177n1478P0613
31772A9211J20648K3017j02847r9059K6497J27267J06443P660p4806j12325j30884
31761h9178j20934l8876Q2397J16427J1887r7510o3412N5210Q3060K750l6793
$$ plain form
31838 -132073 14244 154189 210361 181576 105345 20606 -37469 -63447 -94340 -143827 -152337
31827 -152337 -75855 9796 -5676 -98325 -144121 -116267 -114875 -178682 -205652 -116604 19472
31816 19472 92466 91921 81120 111248 205185 338862 403832 296744 92007 6072 127014
31805 127014 298035 338624 253520 139638 28190 -62503 -50703 82899 196705 167686
31795 167686 77580 63471 76605 -21053 -187615 -240984 -145977 -56130 -57675 -65299 -9897 50633
31783 50633 71600 114544 218124 303960 296718 233492 174069 101253 76 -51402 19211
31772 19211 139859 162876 60029 -39030 -12533 114734 221177 228837 154031 41706 -89178
31761 -89178 -210112 -248988 -166591 -50164 -38277 -135787 -199199 -143989 -60929 -58179 -94972
31750i4972J8935N7595K5074J8728P5734O7265p2358j85936j17715M2254J02811
31739f2585M8914O684K0189L1813K2722J6940o924o8652r9681l5448N6060O7693
31727b275J9868M43j340m9837j02056n6992N8173J08735N1325k9008p0250q5477
31715a58691p5646k7600J1445p726k1677N6398J54154J16214m0368j29476p5561
31704a98534k927r86Q540Q9329J51914J08922K4775q272k1155p2491j11208o8644
31692a00737j035j792l7191q876O7109Q6347L7162J4555N0898O4928P619n6671
31680A22316o1323l3724k2414p994M0408P8022L8704n0521r0014m0474L2416N4819
31668F0221K5003j9540n4700n9900j3840N5072O5187j2368q5422m9303O4991J29331
$$ plain form
31750 -94972 -76037 -18442 6632 25360 101094 168359 96001 -89935 -207650 -165396 -62585
31739 -62585 -13671 -6987 13202 45015 67737 84677 77753 9101 -90580 -126028 -69968 -2275
31727 -2275 17593 18036 16696 -33141 -135197 -192189 -134016 -25281 26044 -2964 -73214 -158691
31715 -158691 -234337 -261937 -250492 -258218 -279895 -223497 -69343 46871 6503 -122973 -198534
31704 -198534 -201461 -202447 -193907 -104578 47336 156258 181033 172761 151606 79115 -32093 -100737
31692 -100737 -101772 -103564 -140755 -149631 -82522 3825 40987 55542 106440 171368 178987 122316
31680 122316 60993 27269 4855 -3139 37269 115291 153995 103474 13460 -27014 5402 60221
31668 60221 85224 65684 10984 -48916 -62756 -7684 57503 45135 -40287 -89590 -24599 104732
31656A04732Q7579J882o1097r4549r3460l4345N2692Q1655K7365l0533k4754J0426
31644B7593J2951j5656m1578n2754l4924L2723J09116R9975o155r3631p7863k0813
31632f1016j1137k1329J5641O8895O5417K1979M143K404l3422p4800m7520L8452
31620c2293R8131R3679N6070Q076m7259q6340r1132q2394o2279J4003J34540J85271
31608A88073J08493J1688l453j2445j11543k00162j25352L7978Q4732P712k0701
31597c4980L1143K3591n4730m5842O0941O2523r9942j97297q2091N7952J8380
31586b60352p8181n998J69327K00726O3731k8184K1055P4766K6257l8817j0866
31575A33464O7878P9982l637j01756j22087n2634K7589L6411m578m81O0786P2150
$$ plain form
31656 104732 192311 194193 133096 38547 -54913 -89258 -36566 45089 72454 41921 17167 27593
31644 27593 40544 24888 -16690 -69444 -104368 -71645 37471 137446 131291 37660 -40203 -61016
31632 -61016 -72153 -93482 -77841 -8946 56471 78450 82593 84997 51575 -23225 -70745 -32293
31620 -32293 65838 159517 215587 223663 176404 90064 -1068 -83462 -145741 -131738 2802 188073
31608 188073 296566 308254 304801 292356 180813 -19349 -144701 -106723 -21991 -14279 -34980
31597 -34980 -3837 19754 -34976 -80818 -19877 42646 -57296 -254593 -336684 -278732 -260352
31586 -260352 -338533 -344531 -175204 25522 89253 61069 82124 156890 183147 144330 133464
31575 133464 201342 281324 277687 175931 53844 1210 28799 65210 60632 60151 120937 193087
31563A93087j6745r2383m7869L2759L90j12432j34119k2950P3110M8541j8549
31552i7160j6746K9907L0888j3427k2129K9889P2061M4324j4034j7788M1244P0482
31540A37511k331j19156j55166q0392R307L2977K0445L1208N0593L1271j1987
31529e5720k2897N176K3381K363l8487p1475q8707r0490p5216m4080o266J7592
31517d44826Q308j4378P463Q3763J21244L5588r8712j19455n021R1821P0793J1403
31505b52009J0905L0285J078l2183j424M3351J5742m9886n5953o967J3739l358
31493b86680O964N3758P6746N2827J3942k2799m7171j2208R1708J55026O9631
31482A51744r0694j46168n8689L6397M9245L6487N4296N6989L029n6183o3258
$$ plain form
31563 193087 176342 83959 36090 68849 69239 -43193 -177312 -200262 -127152 -78611 -97160
31552 -97160 -113906 -83999 -53111 -66538 -88667 -58778 13283 57607 43573 25785 67029 137511
31540 137511 135180 16024 -139142 -219534 -210227 -177250 -156805 -125597 -75004 -43733 -55720
31529 -55720 -78617 -73441 -50060 -47697 -86184 -157659 -246366 -336856 -412072 -456152 -462418 -444826
31517 -444826 -436518 -450896 -443433 -359670 -238426 -202838 -301550 -421005 -426026 -334205 -263412 -252009
31505 -252009 -241104 -210819 -209741 -241924 -243348 -199997 -184255 -234141 -290094 -297061 -283322 -286680
31493 -286680 -279716 -225958 -149212 -96385 -82443 -105242 -152413 -164621 -72913 82113 151744
31482 151744 61050 -85118 -143807 -107410 -58165 -21678 32618 89607 92636 36453 -26805
31471b6805m0828l0512k3275k536J2525J1142J5485K8497K1913m32l02J3966j2623
31458c3785p6794j02388o2103k0959k0567j5713K8405P1715Q2944R0482R5497
31447C6734M0239o8781j16623m6366L6806K9717o765K6124P7698M1701l9843m3566
$$ plain form
31471 -26805 -67633 -98145 -121420 -123956 -111431 -100289 -84804 -56307 -34394 -34826 -35128 -21162 -33785
31458 -33785 -110579 -212967 -275070 -296029 -316596 -332309 -303904 -232189 -149245 -58763 36734
31447 36734 76973 8192 -108431 -154797 -117991 -88274 -95039 -68915 8783 50484 10641 -32925
$$ [...]
##END NTUPLES=NMR SPECTRUM
##END=
