##TITLE=31Pdec_ANY-157C-2
 CDCl3, 24 sc
 5.6.2019
##JCAMPDX= 6.0         $$ Bruker NMR JCAMP-DX V2.0
##DATA TYPE= NMR SPECTRUM
##DATA CLASS= NTUPLES
##ORIGIN= UXNMR, Bruker Analytische Messtechnik GmbH
##OWNER= root
$$ XWIN-NMR		Version 3.5
$$ Wed Jun  5 14:44:06 2019 Russian Standard Time (UT+4h)  she@DPX200
##.OBSERVE FREQUENCY= 81.013821
##.OBSERVE NUCLEUS= ^31P
##.ACQUISITION MODE= SIMULTANEOUS
##.ACQUISITION SCHEME= undefined
##.AVERAGES= 24
##.DIGITISER RES= 17
##SPECTROMETER/DATA SYSTEM= spect
##.PULSE SEQUENCE= zgpg30
##.SOLVENT NAME= DMSO
##.SHIFT REFERENCE= (INTERNAL, DMSO, 0, 182.463)
##AUDIT TRAIL= $$ (NUMBER, WHEN, WHO, WHERE, WHAT)
$$ ##TITLE= Audit trail, XWIN-NMR		Version 3.5
$$ ##JCAMPDX= 5.01
$$ ##ORIGIN= Bruker BioSpin GmbH
$$ ##OWNER= she
$$ F:/spectra/data/she/nmr/P31/1/pdata/1/auditp.txt
$$ ##AUDIT TRAIL=  $$ (NUMBER, WHEN, WHO, WHERE, WHAT)
(   1,<2019-06-05 14:42:59.06 +0400>,<she>,<DPX200>,
      <created by zg, POWCHK disabled, PULCHK disabled
       configuration hash MD5:
       00 E9 B6 7A A2 85 ED C7 34 08 36 98 17 FE 4E 26
       data hash MD5: 32K
       5A D9 DC 73 F5 E9 64 84 CE BD B7 9D 9B 87 A8 DD>)
(   2,<2019-06-05 14:43:01.96 +0400>,<she>,<DPX200>,
      <Start of raw data processing
       efp BC_mod = 2 LB = 1 FT_mod = 6 PKNL = 1 PHC0 = -2167.852 PHC1 = 46.39912 SI = 64K 
       data hash MD5: 64K
       3A D0 6C 9D F3 BA 86 36 B8 AD 74 38 BB 66 BB C9>)
(   3,<2019-06-05 14:43:20.92 +0400>,<she>,<DPX200>,
      <pk PHC0 = -8.019959 PHC1 = 0 
       data hash MD5: 64K
       0E 04 7D 71 D4 E1 81 4E 0F DC AE 21 0D 10 CD CE>)
(   4,<2019-06-05 14:43:34.53 +0400>,<she>,<DPX200>,
      <pk PHC0 = -5 PHC1 = 0 
       data hash MD5: 64K
       2A 1F 66 E7 05 78 D2 F3 EF 51 29 D2 08 A0 BD 73>)
$$ ##END=
$$ 
$$ hash MD5
$$ 5A 29 EA FD 24 54 87 8B 54 B0 CC 79 2D 5A 28 1B
##$RELAX= 
##$RELAX= 
##$RELAX= 
##$RELAX= 
##$RELAX= 
##$RELAX= 
##$RELAX= 
##$RELAX= 
$$ Bruker specific parameters
$$ --------------------------
##$DU= <F:/spectra>
##$EXPNO= 1
##$NAME= <P31>
##$PROCNO= 1
##$TYPE= <nmr>
##$USER= <she>
##$AMP= (0..31)
100 100 100 100 100 100 100 100 100 100 100 100 100 100 100 100 100 100 
100 100 100 100 100 100 100 100 100 100 100 100 100 100 
##$AQSEQ= 0
##$AQ_mod= 1
##$AUNM= <au_zg>
##$AUTOPOS= <>
##$BF1= 81.014009
##$BF2= 200.13
##$BF3= 200.13
##$BF4= 200.13
##$BF5= 200.13
##$BF6= 200.13
##$BF7= 200.13
##$BF8= 200.13
##$BYTORDA= 1
##$CFDGTYP= 0
##$CFRGTYP= 5
##$CHEMSTR= <none>
##$CNST= (0..31)
1 1 145 1 1 1 1 1 1 1 1 1 1 1 1 1 1 1 1 1 1 1 1 1 1 1 1 1 1 1 1 1 
##$CPDPRG= <waltz16>
##$CPDPRG1= <>
##$CPDPRG2= <waltz16>
##$CPDPRG3= <>
##$CPDPRG4= <mlev>
##$CPDPRG5= <mlev>
##$CPDPRG6= <mlev>
##$CPDPRG7= <mlev>
##$CPDPRG8= <mlev>
##$CPDPRGB= <>
##$CPDPRGT= <>
##$D= (0..31)
0 1 0 0 0 0 0 0 0 0 0 0.03 2e-05 3e-06 0 0 0 0 0 0 0 0 0 0 0 0 0 0 0 0 
0 0 
##$DATE= 1559731378
##$DBL= (0..7)
120 120 120 11 120 120 24 19 
##$DBP= (0..7)
150 150 150 150 150 150 150 150 
##$DBP07= 0
##$DBPNAM0= <>
##$DBPNAM1= <>
$$ [...]
##$SUBNAM2= <"">
##$SUBNAM3= <"">
##$SUBNAM4= <"">
##$SUBNAM5= <"">
##$SUBNAM6= <"">
##$SUBNAM7= <"">
##$SUBNAM8= <"">
##$SUBNAM9= <"">
##$SW= 369.568048894756
##$SWIBOX= (0..15)
0 1 3 0 0 0 0 0 0 0 0 0 0 0 0 0 
##$SW_h= 29940.119760479
##$TD= 32768
##$TD0= 1
##$TE= 0
##$TE2= 300
##$TE3= 300
##$TEG= 300
##$TL= (0..7)
0 120 53 12 22 120 120 120 
##$TP= (0..7)
150 150 150 150 150 150 150 150 
##$TP07= 0
##$TPNAME0= <>
##$TPNAME1= <>
##$TPNAME2= <>
##$TPNAME3= <>
##$TPNAME4= <>
##$TPNAME5= <>
##$TPNAME6= <>
##$TPNAME7= <>
##$TPOAL= (0..7)
0.5 0.5 0.5 0.5 0.5 0.5 0.5 0.5 
##$TPOFFS= (0..7)
0 0 0 0 0 0 0 0 
##$TUNHIN= 0
##$TUNHOUT= 0
##$TUNXOUT= 0
##$USERA1= <user>
##$USERA2= <user>
##$USERA3= <user>
##$USERA4= <user>
##$USERA5= <user>
##$V9= 5
##$VALIST= <valist>
##$VCLIST= <CCCCCCCCCCCCCCC>
##$VD= 0
##$VDLIST= <DDDDDDDDDDDDDDD>
##$VPLIST= <PPPPPPPPPPPPPPP>
##$VTLIST= <TTTTTTTTTTTTTTT>
##$WBST= 1024
##$WBSW= 4
##$XGAIN= (0..3)
0 0 0 0 
##$XL= 0
##$YL= 0
##$YMAX_a= 6673
##$YMIN_a= -6641
##$ZGOPTNS= <>
##$ZL1= 120
##$ZL2= 120
##$ZL3= 120
##$ZL4= 120
##$ABSF1= 0
##$ABSF2= 0
##$ABSG= 0
##$ABSL= 0
##$ALPHA= 0
##$AQORDER= 0
##$ASSFAC= 0
##$ASSFACI= 0
##$ASSFACX= 0
##$ASSWID= 0
##$AUNMP= <proc_1d>
##$AZFE= 0.1
##$AZFW= 0.5
##$BCFW= 0
##$BC_mod= 2
##$BYTORDP= 0
##$COROFFS= 0
##$CY= -3
##$DATMOD= 1
##$DC= 0
##$DFILT= <>
##$DTYPP= 0
##$F1P= 0
##$F2P= 0
##$FCOR= 1
##$FTSIZE= 65536
##$FT_mod= 6
##$GAMMA= 0
##$GB= 0
##$INTBC= 1
##$INTSCL= 5.30512e-09
##$ISEN= 30
##$LB= 1
##$LEV0= 0
##$LPBIN= 0
##$MAXI= 10000
##$MC2= 0
##$MEAN= 0
##$ME_mod= 0
##$MI= 50
##$NCOEF= 0
##$NC_proc= -7
##$NLEV= 6
##$NOISF1= 182.463
##$NOISF2= 159.3651
##$NSP= 0
##$NTH_PI= 0
##$NZP= 0
##$OFFSET= 182.463
##$PC= 4
##$PHC0= -2180.872
##$PHC1= 46.39912
##$PH_mod= 1
##$PKNL= yes
##$PPARMOD= 0
##$PSCAL= 0
##$PSIGN= 0
##$REVERSE= no
##$SF= 81.0140089999434
##$SI= 65536
##$SIGF1= 159.3651
##$SIGF2= -187.1042
##$SINO= 113.3802
##$SIOLD= 16384
##$SREGLST= <1H.CDCl3>
##$SSB= 0
##$STSI= 65536
##$STSR= 0
##$SW_p= 29940.119760479
##$SYMM= 0
##$S_DEV= 0
##$TDeff= 32768
##$TDoff= 0
##$TI= <>
##$TILT= no
##$TM1= 0
##$TM2= 0
##$TOPLEV= 0
##$USERP1= <user>
##$USERP2= <user>
##$USERP3= <user>
##$USERP4= <user>
##$USERP5= <user>
##$WDW= 1
##$XDIM= 65536
##$YMAX_p= 349539877
##$YMIN_p= -54060126
$$ End of Bruker specific parameters
$$ ---------------------------------
##NTUPLES= NMR SPECTRUM
##VAR_NAME=  FREQUENCY,     SPECTRUM/REAL,   SPECTRUM/IMAG
##SYMBOL=    X,             R,               I
##VAR_TYPE=  INDEPENDENT,   DEPENDENT,       DEPENDENT
##VAR_FORM=  AFFN,          ASDF,            ASDF
##VAR_DIM=   65536,         65536,           65536
##UNITS=     HZ,            ARBITRARY UNITS, ARBITRARY UNITS
##FACTOR=    0.456856943014862, 1,           1
##FIRST=     14782.0589164792, 0,            0
##LAST=      -15158.0608439998, 0,           0
##MIN=       -15158.0608439998, -54060126,   0
##MAX=       14782.0589164792, 349539877,    0
$$ Real data points
##PAGE= N=1
##DATA TABLE= (X++(R..R)), XYDATA
$$ [...]
$$ plain form
36873 -3502238 -2986100 -1864952 -2327655 -4749803 -5943112 -3587864 308177 2571183
36865 2571183 3045111 3347855 3761577 3870258 4288967 5249028 5324248 3939314 2992552
36856 2992552 3381534 2517297 -1228097 -4157104 -1892432 3388148 5511441 3177849
36848 3177849 784659 538801 -254088 -2818819 -3755571 -973064 2156006 2036540 335449
36839 335449 508348 2008510 1910900 -3231 -1625466 -2284207 -2562485 -1764745 940498
36830 940498 3943662 5137658 5508243 7389744 9965567 10235961 8093975 6444411 5955452
36821 5955452 3801780 -1088410 -5321902 -5794072 -4200111 -4052513 -5225611 -4524420 -840653
36812 -840653 2997070 3661117 847883 -2812966 -4167878 -1974597 1828575 3343897
$$ packed form
36873c502238N16138J121148m62703k422148j193309K355248L896041K263006
36865B571183M73928L02744M13722J08681M18709R60061P5220j384934r46762
36856B992552L88982q64237l745394k929007K264672N280580K123293k333592
36848C177849k393190k45858p92889k564731r36752K782507L129070j19466j701091
36839C35449J72899J500162r7610j914131j622235o58741k78278P97740K705243
36830I40498L003164J193996L70585J881501K575823K70394k141986j649564m88959
36821E955452k153672m890190m233492m72170J593961J47598j173098P01191L683767
36812h40653L837723O64047k813234l660849j354912K193281L803172J515322
$$ plain form
36804 3343897 456845 -4542025 -7229786 -5996045 -3333990 -1985693 -1700988 -953677
36796 -953677 -49441 -289791 -969329 40414 2518141 3336400 731929 -3046760 -4834411
36787 -4834411 -4444243 -3731613 -3451948 -3173775 -2929100 -2612982 -1030056 1787064 2633684
36778 2633684 -983663 -5803791 -5902278 -1080413 2319935 275755 -3702705 -4583749 -2883267
36769 -2883267 -2142892 -2533531 -1386606 1541704 3524232 3054025 1276955 -392749 -1287265
36760 -1287265 -699518 1089672 1636340 -733718 -3281340 -1596557 3896558 7696925
36752 7696925 6261494 1951551 -1405587 -3757442 -7281420 -11652857 -13653216 -11224366
36744 -11224366 -6286995 -3222165 -4822471 -9505842 -12719432 -11677704 -8131743 -5504351
$$ packed form
36804C343897k887052m998870k687761J233741K662055J348297K84705P47311
36796i53677R04236k40350o79538J009743K477727Q18259k604471l778689j787651
36787d834411L90168P12630K79665K78173K44675L16118J582926K817120Q46620
36778B633684l617347m820128r8487M821865L400348k044180l978460q81044J700482
36769b883267P40375l90639J146925K928310J982528m70207j777070j669704q94516
36760a287265N87747J789190N46668k370058k547622J684783N493115L800367
36752G696925j435431m309943l357138k351855l523978m371437k000359K428850
36744a1224366M937371L064830j600306m683371l213590J041728L545961K627392
$$ plain form
36736 -5504351 -4472366 -3468594 -2569154 -3592669 -6109110 -6872008 -4663589 -2661528
36728 -2661528 -3820610 -6369948 -6575855 -4167978 -1998108 -1366366 -880848 233314 795909
36719 795909 344945 520159 2371800 4201846 3871040 2045569 1159451 1684174 1576226
36710 1576226 -268371 -2065448 -1864924 -728325 -1325285 -3994179 -6160226 -5711837 -3232268
36701 -3232268 -648850 591609 -368318 -3489731 -6757149 -7320893 -4881385 -2140944
36693 -2140944 -775603 737958 3591159 5630351 4767923 3285345 5061972 9660318
36685 9660318 12864611 12495712 10037761 6890911 3053821 -179640 -308364 2464322
36677 2464322 4809409 4825223 3806046 2705795 681395 -1488828 -647568 3803152 7853139
$$ packed form
36736e504351J031985J003772Q99440j023515k516441p62898K208419K002061
36728b661528j159082k549338k05907K407877K169870O31742M85518J114162N62595
36719G95909m50964J75214J851641J830046l30806j825471q86118N24723j07948
36710A576226j844597j797077K00524J136599n96960k668894k166047M48389K479569
36701c232268K583418J240459r59927l121413l267418n63744K439508K740441
36693b140944J365341J513561K853201K039192q62428j482578J776627M598346
36685I660318L204293l68899k457951l146850l837090l233461j28724K772686
36677B464322K345087J5814j019177j100251k024400k170223Q41260M450720M049987
$$ plain form
36668 7853139 8390528 7351483 7464964 7323125 4517001 897859 275101 2504894 4051794
36659 4051794 3402404 2037783 796114 -842228 -2154640 -1604810 -32004 -38445 -1803098
36650 -1803098 -2621013 -1229614 270645 -286859 -2315902 -3925169 -4321106 -4005912 -4016303
36641 -4016303 -5233751 -7107960 -7395960 -4927517 -2037432 -1877149 -3732446 -3914797 -1398547
36632 -1398547 591905 -547664 -3220486 -4208295 -2464564 973487 4692691 7089162
36624 7089162 6755369 4252045 2116213 1943012 2796288 3303877 3561533 3933243 3816233
36615 3816233 2894321 1945628 1168407 -460664 -2708474 -2957752 375601 4800805 6371121
36606 6371121 4382622 1495755 114198 651951 2512119 4505169 4765690 2502177
$$ packed form
36668G853139N37389j039045J13481j41839k806124l619142o22758K229793J546900
36659D051794o49390j364621j241669j638342j312412N49830J572806o441j764653
36650a803098q17915J391399J500259n57504k029043j609267l95937L15194j0391
36641d016303j217448j874209k88000K468443K890085J60283j855297j82351K516250
36632a398547J990452j139569k672822r87809J743731L438051L719204K396471
36624G089162l33793k503324k135832j73201Q53276N07589K57656L71710j17010
36615C816233r21912r48693p77221j629071k247810k49278L333353M425204J570316
36606F371121j988499k886867j381557N37753J860168J993050K60521k263513
$$ plain form
36598 2502177 -299947 -971495 112324 36305 -2213849 -4078418 -3049474 -82966 1919576
36589 1919576 1775120 749308 276454 234164 -562877 -2871476 -6011177 -7997127 -6943967
36580 -6943967 -2847405 2018924 4725648 3783156 -145876 -5023969 -8636250 -9591935
36572 -9591935 -8006799 -5403557 -3469122 -2580979 -1782487 -415743 670234 164208 -1693954
36563 -1693954 -3104242 -2933191 -1944254 -1203022 -318950 1493425 3293342 3053198 492843
36554 492843 -2268058 -3434524 -3648684 -4501983 -5813116 -5563766 -2521249 1770859 4085094
36545 4085094 2844864 222463 48686 3197537 6262426 5996444 3705309 3025286 4337467
36536 4337467 4650729 3075553 2572321 4795354 6874543 6045675 4460461 5736985 8810616
$$ packed form
36598B502177k802124o71548J083819p6019k250154j864569J028944K966508K002542
36589A919576j44456j025812m72854m2290p97041k308599l139701j985950J053160
36580f943967M096562M866329K706724r42492l929032m878093l612281r55685
36572i591935J585136K603242J934435Q88143P98492J366744J085977n06026j858162
36563a693954j410288J71051R88937P41232Q84072J812375J799917k40144k560355
36554D92843k760901j166466k14160q53299j311133K49350L042517M292108K314235
36545D085094j240230k622401j73777L148851L064889k65982k291135o80023J312181
36536D337467L13262j575176n03232K223033K079189q28868j585214J276524L073631
$$ plain form
36527 8810616 9415637 6627428 3601892 2095847 783708 -398784 976591 4770467
36519 4770467 6320427 2749426 -2035113 -2468283 799830 2354329 128198 -2326413
36511 -2326413 -1719949 840591 2626178 2918060 2377978 1407790 789430 1786204 3873088
36502 3873088 4287347 1743384 -1080195 -839792 2149409 5165327 7291678 9518986
36494 9518986 11419122 11036580 8376943 5975047 5054231 3768206 635035 -2601435
36486 -2601435 -3391035 -1946833 -419783 312668 1105483 2554519 4303792 5908577 6987774
36477 6987774 6964783 5865262 4794735 4461709 3963081 2250449 -135900 -2189963 -4096711
36468 -4096711 -5901651 -5819709 -2545162 1500604 2348518 -94602 -1894357 -781931 1221574
$$ packed form
36527H810616O05021k788209l025536j506045j312139j182492J375375L793876
36519D770467J549960l571001m784539m33170L268113J554499k226131k454611
36511b326413O06464K560540J785587K91882n40082r70188o18360R96774K086884
36502C873088M14259k543963k823579K40403K989201L015918K126351K227308
36494I518986J900136l82542k659637k401896r20816j286025l133171l236470
36486b601435p89600J444202J527050P32451P92815J449036J749273J604785J079197
36477F987774k2991j099521j070527l33026m98628j712632k386349k054063j906748
36468d096711j804940Q1942L274547M045766Q47914k443120j799755J112426K003505
$$ plain form
36459 1221574 1850900 1910003 2644724 2797969 1040874 -769332 153398 3168580 4991909
36450 4991909 4259684 2691187 1870912 1307274 23603 -1873369 -3775920 -5335247 -6160498
36441 -6160498 -5710469 -3748380 -422338 3645335 6736092 6709852 3799270 1558921 2753540
36432 2753540 5048265 3701905 -1427796 -4873370 -2773433 1814804 2979904 -730631
36424 -730631 -5589277 -7934421 -7333706 -5005327 -1977712 530315 1125297 -63602 -938001
36415 -938001 177299 2456548 3779873 3326484 2022275 970699 556628 848798 1704410
36406 1704410 2373288 2095667 1439674 2009310 4217960 6321776 6614449 5806418 5905310
36397 5905310 7093844 7272955 4979938 1387530 -1316714 -2516379 -3207869 -4180915 -5289124
$$ packed form
36459A221574O29326N9103P34721J53245j757095j810206R22730L015182J823329
36450D991909p32225j568497q20275n63638j283671j896972j902551j559327q25251
36441f160498M50029J962089L326042M067673L090757k6240k910582k240349J194619
36432B753540K294725j346360n129701l445574K099937M588237J165100l710535
36424g30631m858646k345144O00715K328379L027615K508027N94982j188899q74399
36415i38001J115300K279249J323325m53389j304209j051576m14071K92170Q55612
36406A704410O68878k77621o55993N69636K208650K103816K92673q08031R8892
36397E905310J188534J79111k293017l592408k704244j199665o91490r73046j108209
$$ plain form
36388 -5289124 -6294913 -7330590 -8222390 -8101089 -6296322 -3432791 -1089886 -140262 238557
36379 238557 1406407 3260534 4213005 3456893 2301774 2399805 3388461 3542405 2408630
36370 2408630 1419065 1851455 3371950 4698509 4659578 2734681 -117182 -1318300 878040
36361 878040 4622403 6103879 4415888 2604943 2941077 3548308 1575297 -2187733 -4238502
36352 -4238502 -2881835 327073 3010627 3917683 2926103 954684 -239790 429849 2197691
36343 2197691 3613329 4163471 3842708 2439099 684041 599392 2642796 3910571 1821976
36334 1821976 -1466540 -1458539 2338141 5817892 6192427 5069755 4724225 4547334 2957772
36325 2957772 381409 -1648955 -2688961 -3052556 -2776523 -2382661 -3179089 -5153983 -5827762
$$ packed form
36388e289124j005789j035677q91800J21301J804767K863531K342905R49624L78819
36379B38557J167850J854127R52471p56112j155119R8031R88656J53944j133775
36370B408630r89565M32390J520495J326559l8931j924897k851863j201118K196340
36361H78040L744363J481476j687991j810945L36134O07231j973011l763030k050769
36352d238502J356667L208908K683554R07056r91580j971419j194474O69639J767842
36343B197691J415638N50142l20763j403609j755058q4649K043404J267775k088595
36334A821976l288516Q001L796680L479751L74535j122672l45530j76891j589562
36325B957772k576363k030364j040006l63595K76033L93862p96428j974894o73779
$$ plain form
36316 -5827762 -3046252 1794728 4941359 4365132 1445362 -1109971 -1900706 -1413192 -775502
36307 -775502 -308122 560391 1890068 2496165 1554182 307253 664984 2370969 3276220
36298 3276220 2376877 717795 -793761 -2343537 -3644213 -3724471 -2975423 -3105738 -4171541
36289 -4171541 -4066788 -2127339 -670883 -1314620 -2268770 -1396672 306939 749478 284706
36280 284706 540360 1358249 1730733 2363369 4257486 5861190 4904788 2399268 1475654
36271 1475654 2517692 2815346 1214042 -273914 -211001 67758 -800654 -2014321 -2670726
36262 -2670726 -3683296 -5852441 -7830233 -7896101 -6553883 -5646818 -5665334 -5405365 -3868397
36253 -3868397 -1349761 1180324 3007862 3966218 4010608 2574115 -949134 -5385915 -7574481
$$ packed form
36316e827762K781510M840980L146631n76227k919770k555333p90735M87514O37690
36307g75502M67380Q68513J329677O06097r41983j246929L57731J705985R05251
36298C276220q99343j659082j511556j549776j300676q0258P49048j30315j065803
36289d171541J04753J939449J456456o43737r54150Q72098J703611M42539m64772
36280B84706K55654Q17889L72484O32636J894117J603704r56402k505520r23614
36271A475654J042038K97654j601304j487956O2913K78759q68412j213667o56405
36262b670726j012570k169145j977792o5868J342218R07065j8516K59969J536968
36253c868397K518636K530085J827538R58356M4390j436493l523249m436781k188566
$$ plain form
36244 -7574481 -5852275 -3104751 -3667622 -7050791 -7975208 -4017824 68303 -1390449
36236 -1390449 -6699311 -8790802 -4886012 105482 980657 -760298 -217759 2950250
36228 2950250 3939871 104126 -4944275 -6316727 -4255754 -2728184 -3082631 -2626330 401724
36219 401724 3879059 5211427 4916634 4671512 3942182 1298247 -2260293 -4303765 -4820250
36210 -4820250 -6172240 -9014493 -10853307 -9456341 -5728525 -2292825 -628894 -362428
36202 -362428 -368295 -112219 -452267 -2640397 -5648495 -5838562 -1397865 4100250 5582485
36193 5582485 3184335 1389064 1776357 1385805 -727140 -742773 3116166 5895606 2753698
36184 2753698 -2941313 -3977621 115243 2817928 611628 -2761878 -3374171 -3069057
$$ packed form
36244g574481J722206K747524n62871l383169r24417L957384M086127j458752
36236a390449n308862k091491L904790M991494Q75175j740955N42539L168009
36228B950250R89621l835745n048401j372452K060973J527570l54447M56301L028054
36219D01724L477335J332368k94793k45122p29330k643935l558540k043472n16485
36210d820250j351990k842253j838814J396966L727816L435700J663931K66466
36202c62428n867K56076l40048k188130l008098j90067M440697N498115J482235
36193E582485k398150j795271L87293l90552k112945j5633L858939K779440l141908
36184B753698n695011j036308M092864K702685k206300l373506o12293L05114
$$ plain form
36176 -3069057 -5336219 -9029984 -10003710 -7127628 -3315554 -1288696 -1010440 -1214712 -1306584
36167 -1306584 -1278049 -1122356 -959855 -1119085 -1728437 -2461143 -2734578 -2069062 -485084
36158 -485084 1222953 1819197 570706 -2011748 -4366960 -5012559 -3903989 -2637380 -2603829
36149 -2603829 -2872444 -1109413 2852526 5969138 5964590 4939584 6725683 11385382 14969411
36140 14969411 14652868 11452270 7577355 4033671 1752557 1952822 3471376 2462857
36132 2462857 -2610729 -7735865 -8024576 -4118764 -735855 95648 674985 2725012 4695974
36123 4695974 4899635 4069209 3303662 2176888 614535 172483 1282567 1312232 -2020018
36114 -2020018 -6734505 -8842108 -7615579 -5797680 -4940281 -3531261 -253724 3546483
$$ packed form
36176c069057k267162l693765r73726K876082L812074K026858K78256k04272r1872
36167a306584K8535J55693J62501j59230o09352p32706k73435O65516J583978
36158d85084J708037N96244j248491k582454k355212o45599J108570J266609L3551
36149b603829k68615J763031L961939L116612m548j025006J786099M659699L584029
36140A4969411l16543l200598l874915l543684k281114K00265J518554j008519
36132B462857n073586n125136k88711L905812L382909Q31503N79337K050027J970962
36123D695974K03661q30426p65547j126774j562353m42052J110084K9665l332250
36114b020018m714487k107603J226529J817899Q57399J409020L277537L800207
$$ plain form
36106 3546483 5840777 6446284 6261181 5427272 3690668 1662510 331236 -296023 -1068927
36097 -1068927 -2398243 -3711161 -4038930 -2857403 -642445 1364116 2486859 3584303
36089 3584303 5687083 7688564 6924889 2731347 -1974398 -3791054 -2554233 -824801
36081 -824801 -445564 -863661 -490339 1340206 3710952 4945756 4370305 3245256 3058679
36072 3058679 3083237 1461181 -1038099 -1047372 2236690 4784599 3184669 -110646 -480880
36063 -480880 1751465 2197222 -423985 -2646536 -2142013 -764208 -530652 -696481 -611724
36054 -611724 -1662807 -4030625 -4937374 -2865079 -504335 -497576 -1057522 663746 3261040
36045 3261040 3263481 1082170 435609 2406653 4113630 3391294 1188369 -1129601 -3583990
$$ packed form
36106C546483K294294O05507j85103q33909j736604k028158j331274o27259p72904
36097a068927j329316j312918l27769J181527K214958K006561J122743J097444
36089C584303K102780K001481p63675m193542m705745j816656J236821J729432
36081h24801L79237m18097L73322J830545K370746J234804n75451j125049j86577
36072C058679K4558j622056k499280r273L284062K547909j599930l295315l70234
36063d80880K232345M45757k621207k222551N04523J377805K33556j65829Q4757
36054f11724j051083k367818r06749K072295K360744O759n59946J721268K597294
36045C261040K441k181311o46561J971044J706977p22336k202925k317970k454389
$$ plain form
36036 -3583990 -5949603 -7162681 -7185113 -7033125 -6417348 -3943334 -269703 1745131 1109589
36027 1109589 291956 1456763 3567820 4728826 5033808 5271647 4943781 3688476 2855862
36018 2855862 3332210 3283113 633098 -3221951 -4873878 -3596513 -1890250 -1257635 -134143
36009 -134143 2961444 6292329 6617889 3208436 -1193008 -3228280 -1968545 729678
36001 729678 2222082 1338729 -884994 -2440567 -2366969 -1627866 -1928625 -3699399 -5549945
35992 -5549945 -5926800 -4920613 -3851497 -3334618 -2697685 -1356172 336686 1865120 2881876
35983 2881876 2367009 -741892 -5039140 -6814518 -4625678 -1838318 -2036548 -3653725
35975 -3653725 -2709098 350269 1161608 -1206216 -2592891 -1022202 -562852 -4638074 -9601467
$$ packed form
36036c583990k365613j213078k2432J51988O15777K474014L673631K014834o35542
36027A109589q17633J164807K111057J161006L04982K37839l27866j255305q32614
36018B855862M76348m9097k650015l855049j651927J277365J706263O32615J123492
36009a34143L095587L330885L25560l409453m401444k035272J259735K698223
36001G29678J492404q83353k223723j555573P3598P39103l00759j770774j850546
35992e549945l76855J006187J069116N16879O36933J341513J692858J528434J016756
35983B881876n14867l108901m297248j775378K188840K787360j98230j617177
35975c653725R44627L059367Q11339k367824j386675J570689M59350m075222m963393
$$ plain form
35966 -9601467 -9536312 -5010482 -2332352 -5089619 -10508656 -13821172 -12684058 -7497659
35958 -7497659 -745051 3945315 5194110 6228608 10543430 15399115 13919032 4704667
35950 4704667 -4875651 -7241486 -3002846 1887227 4314356 5668479 7186194 7740647
35942 7740647 6255305 3352368 159587 -2490577 -3550021 -2447148 -584446 -298907
35934 -298907 -1860162 -3184537 -3107959 -3193242 -5186695 -8067891 -9131983 -7289568 -3854443
35925 -3854443 -392162 2705503 5258063 6254821 4743952 1303994 -2171825 -4149833
35917 -4149833 -4513574 -4072861 -3512736 -2945205 -2209770 -1433346 -1213769 -1970031 -3013549
35908 -3013549 -2868035 -1126907 478249 -167075 -2866402 -5176107 -5179087 -3134924 -318060
$$ packed form
35966i601467O5155M525830K678130k757267n419037l312516J137114N186399
35958g497659O752608M690366J248795J034498M314822M855685j480083r214365
35950D704667r580318k365835M238640M890073K427129J354123J517715N54453
35942G740647j485342k902937l192781k650164j059444J102873J862702K85539
35934b98907j561255j324375P6578q5283j993453k881196j064092J842415L435125
35925c854443L462281L097665K552560R96758j510869l439958l475819j978008
35917d149833l63741M40713N60125N67531P35435P76424K19577p56262j043518
35908c013549J45514J741128J605156o45324k699327k309705k980K044163K816864
$$ plain form
35899 -318060 2391494 4271751 4490390 2962071 553123 -2087234 -4696202 -6036805
35891 -6036805 -4380962 -486508 2088779 1548750 691110 2665582 5868925 6542012 5052021
35882 5052021 5162277 7248574 7104070 2831143 -1566645 -2065775 -494221 -1143482 -4025478
35873 -4025478 -5311658 -3303116 -413739 697150 220312 25865 1246898 3428775
35865 3428775 5009915 4672540 2890763 1557068 1465556 1302587 -19769 -1571044 -2200665
35856 -2200665 -2395444 -2656952 -1904215 216190 1225277 -1016433 -4391530 -5180809 -3747504
35847 -3747504 -3734584 -5769720 -6119322 -2550252 2206766 4519743 4299778 3386195 2060694
35838 2060694 -381891 -3168419 -4447640 -3569715 -1658515 -389915 -651099 -1495210 -433555
$$ packed form
35899c18060K709554J880257K18639j528319k408948k640357k608968j340603
35891f036805J655843L894454K575287n40029q57640J974472L203343O73087j489991
35882E052021J10256K086297j44504m272927m397788m99130J571554o49261k881996
35873d025478j286180K008542K889377J110889m76838j94447J221033K181877
35865C428775J581140l37375j781777j333695r1512j62969j322356j551275o29621
35856b200665j94779k61508P52737K120405J009087k241710l375097p89279J433305
35847c747504J2920k035136l49602L569070M757018K312977k19965r13583j325501
35838B060694k442585k786528j279221Q77925J911200J268600k61184q44111J061655
$$ plain form
35829 -433555 3688882 8198281 9075700 5947236 2023736 -935765 -4062547 -7132003
35821 -7132003 -7325032 -4454857 -3192588 -6549272 -10537209 -9508304 -4197915 87257
35813 87257 1280333 1573125 1888535 741128 -1388023 -1619597 490591 2085676 2096963
35804 2096963 3010650 6024760 8430558 7932152 6123095 5285573 4776974 3268373 1959893
35795 1959893 2485346 3370306 1621761 -2972887 -7483472 -9250328 -7967704 -5014914
35787 -5014914 -2186323 -566197 322076 1612205 2987283 2884534 1235592 4965
35779 4965 164238 369508 -206473 -236018 964708 1629270 680374 112872 1584798 3041083
35769 3041083 1970132 -4852 480789 2959435 3903395 2354039 911991 1252214 2221988
$$ packed form
35829d33555M122437M509399Q77419l128464l923500k959501l126782l069456
35821g132003j93029K870175J262269l356684l987937J028905N310389M285172
35813H7257J193076K92792L15410j147407k129151k31574K110188J595085J1287
35804B096963R13687L014110K405798m98406j809057q37522n08599j508601j308480
35795A959893N25453Q84960j748545m594648m510585j766856J282624K952790
35787e014914K828591J620126Q88273J290129J375078j02749j648942j230627
35779D965J59273K05270n75981k9545J200726O64562r48896n67502J471926J456285
35769C041083j070951j974984M85641K478646R43960j549356j442048L40223R69774
$$ plain form
35760 2221988 2598519 2554594 2193057 1618107 2457370 6101028 10335188 11109843 7914852
35751 7914852 3936624 741038 -2983488 -6679498 -6855004 -2960118 134473 -1245564
35743 -1245564 -4081662 -3465712 23085 1950823 1084291 337300 1359633 2305350 1403539
35734 1403539 -458706 -1600106 -1717058 -1333739 -711901 -42787 422759 1013669 2636534
35725 2636534 5639565 8921642 10407820 8792104 5282792 3009677 3513474 4490708
35717 4490708 2961439 20746 -613377 1225287 1458521 -1483081 -3585391 -1656434
35709 -1656434 1287707 1119851 -200524 2287199 8098395 11400532 9180239 4472285
35701 4472285 1183642 89036 623647 2533698 4521491 4608294 2988045 1717531 1043120
$$ packed form
35760B221988L76531m3925l61537n74950Q39263L643658M234160P74655l194991
35751G914852l978228l195586l724526l696010j75506L894886L094591j380037
35743a245564k836098O15950L488797J927738q66532p46991J022333R45717r01811
35734A403539j862245j141400j16952L83319O21838O69114M65546N90910J622865
35725B636534L003031L282077J486178j615716l509312k273115N03797R77234
35717D490708j529269k940693o34123J838664K33234k941602k102310J928957
35709a656434K944141j67856j320375K487723N811196L302137k220293m707954
35701D472285l288643j094606N34611J910051J987793Q6803j620249j270514o74411
$$ plain form
35692 1043120 -843966 -3978583 -6075819 -6430744 -6580873 -6321275 -3474142 876615 1751436
35683 1751436 -2390535 -6146041 -4698150 -1004914 -922106 -4119982 -5164381 -2101612
35675 -2101612 1416619 2454669 2407592 3299851 4315513 3684785 1471435 -1043400 -3087699
35666 -3087699 -4486342 -5334400 -6222349 -7626435 -8699141 -7804920 -4594855 -651613 2024666
35657 2024666 2451240 950255 -1018832 -1731065 -904393 9190 156474 805342 3079951
35648 3079951 5464255 5791072 4801054 5003659 6363535 6120274 3254531 217753 -778991
35639 -778991 -661612 -1341131 -2817448 -3966667 -4429370 -4104872 -2301032 903422 3716714
35630 3716714 4795063 5288324 6971871 9340816 10622111 10947139 12035909 13738802
$$ packed form
35692A043120j887086l134617k097236l54925j50129K59598K847133M350757Q74821
35683A751436m141971l755506J447891L693236Q2808l197876j044399L062769
35675b101612L518231J038050m7077Q92259J015662o30728k213350k514835k044299
35666c087699j398643q48058q87949j404086j072706Q94221L210065L943242K676279
35657B024666M26574j500985j969087p12233Q26672R13583J47284O48868K274609
35648C079951K384304L26817r90018K02605J359876k43261k865743l036778r96744
35639g78991J17379o79519j476317j149219m62703L24498J803840L204454K813292
35630C716714J078349M93261J683547K368945J281295L25028J088770J702893
$$ plain form
35622 13738802 13476514 10045840 5864360 3873913 3686608 2721735 327171 -1445654
35614 -1445654 -1153944 153271 1143695 2336222 4487682 6296523 5874337 3856694 2702497
35605 2702497 2884121 2219118 -293399 -2383380 -1829966 -14061 -63830 -2549248 -5162356
35596 -5162356 -6170982 -6181903 -6496704 -7347468 -7929560 -7018606 -3688824 1372874 5508825
35587 5508825 6410143 4681494 2823089 1972255 1252996 141797 -580765 -697990 -1498670
35578 -1498670 -3881728 -6792708 -8428993 -8035908 -5872813 -2474723 1207791 3750979
35570 3750979 4247115 3062009 1283858 -145658 -717529 -536134 -355409 -695939 -893012
35561 -893012 140572 2245708 4081300 4796030 4601159 3916864 3308773 3973624 6339106
$$ packed form
35622A3738802k62288l430674m181480j990447j87305r64873k394564j772825
35614a445654K91710J307215R90424J192527K151460J808841m22186k017643j154197
35605B702497J81624o65003k512517k089981N53414J815905m9769k485418k613108
35596e162356j008626j0921l14801q50764n82092R10954L329782N061698M135951
35587E508825R01318j728649j858405q50834p19259j111199p22562j17225q00680
35578a498670k383058k910980j636285L93085K163095L398090L682514K543188
35570C750979M96136j185106j778151j429516n71871J81395J80725l40530j97073
35561h93012J033584K105136J835592P14730j94871o84295o08091O64851K365482
$$ plain form
35552 6339106 8056935 5754620 -198660 -4683326 -3118037 3513458 10160312 12973566
35544 12973566 11797149 8694795 5792950 4131230 3310154 2362501 1404771 1590098 2908520
35535 2908520 3388330 1583384 -1331247 -3233652 -3753416 -3903785 -4081258 -4103976 -4364700
35526 -4364700 -5017060 -4595995 -1640291 2331363 3691537 1309852 -1404342 -292142
35518 -292142 4598125 9023145 9268603 5885948 2392559 925039 281608 -1383357 -3203255
35509 -3203255 -2599190 710719 3809130 4383241 3631703 4137764 6228700 7944508 7696470
35500 7696470 5548296 2591450 346722 64572 1282478 1705011 -172450 -2910796
35492 -2910796 -3866671 -2456033 -364700 813883 625379 -1013559 -3906348 -6957194
$$ packed form
35552F339106J717829k302315n953280m484666J565289O631495O646854K813254
35544A2973566j176417l102354k901845j661720q21076r47653r57730J85327J318422
35535B908520M79810j804946k914631j902405n19764j50369j77473k2718k60724
35526d364700o52360M21065K955704L971654J360174k381685k714194J112200
35518b92142M890267M425020K45458l382655l493389j467520o43431j664965j819898
35509c203255O04065L309909L098411N74111p51538N06061K090936J715808k48038
35500G696470k148174k956846k244728k82150J217906M22533j877461k738346
35492b910796r55875J410638K091333J178583j88504j638938k892789l050846
$$ plain form
35484 -6957194 -8787725 -8966530 -7795890 -5458003 -2426410 83881 1440796 2569069
35476 2569069 4085554 4404521 1724312 -2677570 -5320658 -4554889 -1830817 790861
35468 790861 2319981 2137174 -108876 -3421029 -5957549 -6954169 -6877858 -6031881 -4728758
35459 -4728758 -4309101 -5698106 -7167821 -5952329 -2011672 2281571 5910979 9525007
35451 9525007 11945405 10264391 4643904 -564454 -2283753 -2054840 -1961999 -790463 2648777
35442 2648777 5360154 3484335 -1663453 -4794224 -3474844 -484482 645976 -462696
35434 -462696 -2064216 -2839574 -2564409 -1742560 -1297092 -1825014 -2966466 -4012218 -4715575
35425 -4715575 -4873856 -3895781 -1723708 584988 2132289 3145946 3793959 3323563 1646931
$$ packed form
35484f957194j830531j78805J170640K337887L031593K510291J356915J128273
35476B569069J516485L18967k680209m401882k643088P65769K724072K621678
35468G90861J529120j82807k246050l312153k536520r96620P6311Q45977J303123
35459d728758M19657j389005j469715J215492L940657M293243L629408L614028
35451I525007K420398j681014n620487n208358j719299K28913R2841J171536L439240
35442B648777K711377j875819n147788l130771J319380K990362J130458j108672
35434d62696j601520p75358K75165Q21849M45468n27922j141452j045752p03357
35425d715575j58281R78075K172073K308696J547301J013657O48013m70396j676632
$$ plain form
35416 1646931 431114 979017 2193137 2304695 1351493 110286 -1870990 -4679143 -5883521
35407 -5883521 -3235778 1090798 2381823 -411026 -3645017 -4671844 -5089664 -6909077
35399 -6909077 -8591609 -7321197 -3312186 606906 2760549 3893733 5019951 5675190
35391 5675190 4591804 1370463 -2654137 -5109795 -4581102 -2102875 -165761 -124470 -1172862
35382 -1172862 -1838313 -1573476 -660373 547408 1807022 2918821 3711196 3780898 2533501
35373 2533501 173727 -1715619 -1660628 -271547 344873 -806470 -2590113 -3403237 -2889169
35364 -2889169 -1829445 -1112718 -942140 -602113 719009 2491171 3089896 2212695 1762649
35355 1762649 3000800 4285657 3682505 2447245 3118752 5062992 5287231 3475047 2562000
$$ packed form
35416A646931j215817N47903J214120J11558r53202j241207j981276k808153j204378
35407e883521K647743M326576J291025k792849l233991j026827m17820j819413
35399f909077j682532J270412M009011L919092K153643J133184J126218O55239
35391E675190j083386l221341m024600k455658N28693K478227J937114M1291j048392
35382a172862o65451K64837R13103J207781J259614J111799P92375O9702j247397
35373B533501k359774j889346N4991J389081O16420j151343j783643q13124N14068
35364b889169J059724P16727J70578L40027J321122J772162N98725q77201m50046
35355A762649J238151J284857o03152j235260O71507J944240K24239j812184r13047
$$ plain form
35346 2562000 3722426 4392692 2606372 50283 -997304 -1007577 -1493423 -2268733 -2317035
35337 -2317035 -1398800 695320 4129928 6768128 4944521 -1174666 -5950443 -5023302
35329 -5023302 -1132351 243466 -1369959 -2235184 -1058224 83054 671475 2420205
35321 2420205 4596010 3656440 -872894 -4418794 -3494590 -323034 1214289 1183014 1935261
35312 1935261 3033326 1647628 -2541198 -6118923 -6176999 -3576976 -1164008 -234056 185682
35303 185682 1311604 2904389 3638467 2660335 452383 -1792070 -3291219 -3941811 -3791213
35294 -3791213 -2764026 -948897 1123049 2501933 2120033 -478982 -4333151 -7299154
35286 -7299154 -7563283 -4977555 -1090012 1702576 1467427 -1516519 -4253896 -3790366 -841631
$$ packed form
35346B562000J160426O70266j786320k556089j047587j0273m85846p75310m8302
35337b317035R18235K094120L434608K638200j823607o119187m775777R27141
35329e023302L890951J375817j613425q65225J176960J141278N88421J748730
35321B420205K175805r39570m529334l545900R24204L171556J537323l1275P52247
35312A935261J098065j385698m188826l577725n8076K600023K412968R29952M19738
35303A85682J125922J592785P34078r78132k207952k244453j499149o50592J50598
35294c791213J027187J815129K071946J378884l81900k599015l854169k966003
35286g299154k64129K585728L887543K792588k35149k983946k737377M63530K948735
$$ plain form
35277 -841631 1062859 571587 254672 2020639 3465415 1398005 -2974961 -5582202 -5032033
35268 -5032033 -3437748 -2522338 -2199975 -2532447 -3648589 -3921070 -1819539 434139 -909226
35259 -909226 -4756153 -5496435 -1138605 3393804 3607723 1922758 3191078 6920892 8298838
35250 8298838 5269216 564512 -2611313 -3573235 -3141440 -2419013 -2497613 -3326006 -3318045
35241 -3318045 -1853372 -1089127 -3012857 -5783453 -5813726 -2926042 -559552 -923805 -2611488
35232 -2611488 -3270751 -2306194 -537462 873562 873210 -487966 -1630546 -1554054 -1566014 -2728110
35222 -2728110 -2692196 1501769 7742816 9970557 5982464 466223 -1502189 -671796 -838618
35213 -838618 -2574527 -3021665 -606376 3130718 6125968 7844665 8552361 8219444 6675434
$$ packed form
35277h41631J904490m91272l16915J765967J444776k067410m372966k607241N50169
35268e032033J594285R15410L22363l32472j116142k72481K101531K253678j343365
35259i09226l846927p40282M357830M532409K13919j684965J268320L729814J377946
35250H298838l029622m704704l175825r61922M31795P22427p8600q28393P961
35241c318045J464673P64245j923730k770596l0273K887684K366490l64253j687683
35232b611488o59263R64557J768732J411024l52j361176j142580P6492j1960j162096
35222b728110L5914M193965O241047K227741l988093n516241j968412Q30393j66822
35213h38618j735909m47138K415289L737094K995250J718697P07696l32917j544010
$$ plain form
35204 6675434 4196202 1836633 1183256 2960840 5625072 6514413 4924359 2727249
35196 2727249 1346004 -115773 -2508844 -4190545 -2960548 514695 3131682 2759768
35188 2759768 -161358 -3719934 -5775912 -4932350 -2012060 -28882 -1040264 -3561113
35180 -3561113 -4700408 -4013994 -3098855 -2109609 435860 4259860 6679898 6323806 5028269
35171 5028269 4749971 4764229 3547359 1584994 379310 36996 -183626 -7589 1089572
35162 1089572 2024946 1264489 -450335 -738901 898967 2268622 1749904 545478 708582
35153 708582 2299809 3556543 2949286 250133 -3512081 -6345037 -6472389 -4143075 -1502382
35144 -1502382 49615 1277923 2995530 4043184 3121253 1414493 1030829 1495962 565233
$$ packed form
35204F675434k479232k359569o53377J777584K664232Q89341j590054k197110
35196B727249j381245j461777k393071j681701J229997L475243K616987l71914
35188B759768k921126l558576k055978Q43562K920290J983178j011382k520849
35180c561113j139295O86414R15139R89246K545469L824000K420038l56092j295537
35171E028269k78298J4258j216870j962365j205684l42314k20622J76037J097161
35162A089572R35374p60457j714824k88566J637868J369655n18718j204426J63104
35153G08582J591227J256734o07257k699153l762214k832956j27352K329314K640693
35144a502382J551997J228308J717607J047654r21931j706760l83664M65133r30729
$$ plain form
35135 565233 -1490923 -1481422 1892349 5660023 6683191 5716077 5235240 5288133 4217052
35126 4217052 2115346 600321 -114017 -993352 -1433543 129775 2647836 2683745 -765964
35117 -765964 -4429219 -5196798 -4076241 -3978655 -5516556 -7026351 -7330819 -6387236 -4187684
35108 -4187684 -1125776 1046196 607713 -1712330 -3125259 -1836054 1074500 2798170
35100 2798170 1395708 -2317713 -5090816 -4187309 -448844 2603515 3139597 2907025 3866807
35091 3866807 4924384 3866047 1019793 -1327619 -2232719 -2549311 -2782519 -2768147 -2954984
35082 -2954984 -3693420 -3715033 -1799748 394963 -80305 -3092337 -5498808 -5805753 -5708032
35073 -5708032 -6435332 -6835396 -6224102 -5884622 -6049621 -4541001 -696303 2206235 1333751
$$ packed form
35135E65233k056156R501L373771L767674J023168r67114m80837N2893j071081
35126D217052k101706j515025p14338q79335m40191J563318K518061L5909l449709
35117g65964l663255p67579J120557R7586j537901j509795l04468R43583K199552
35108d187684L061908K171972m38483k320043j412929J289205K910554J723670
35100B798170j402462l713421k773103R03507L738465L052359N36082k32572R59782
35091C866807J057577j058337k846254k347412r05100l16592k33208J4372j86837
35082b954984p38436k1613J915285K194711m75268l012032k406471l06945R7721
35073e708032p27300m00064O11294L39480j64999J508620L844698K902538q72484
$$ plain form
35064 1333751 -1087963 -638659 3383305 7847554 10266706 10475616 9030155 6964189
35056 6964189 6179613 7026518 6483593 2142704 -2924982 -3385977 585839 3360215 2253645
35047 2253645 965112 2781034 5088283 3960577 626213 -570091 1642519 4979648
35039 4979648 7495753 8320992 6053565 477044 -4829879 -5585220 -2491496 -285333
35031 -285333 -1072452 -2354189 -2103793 -1691382 -2347056 -2523417 -946959 924640 1951817
35022 1951817 3833792 7555189 9846789 6913382 267056 -4671586 -4913408 -1678399
35014 -1678399 3068507 7977440 10573326 8455776 3247668 -127042 555896 2437841
35006 2437841 2349445 865033 -19561 -182140 -78006 1230292 4084723 6300968 5918246
$$ packed form
35064A333751k421714M49304M021964M464249K419152K08910j445461k065966
35056F964189p84576Q46905n42925m340889n067686m60995L971816K774376j106570
35047B253645j288533J815922K307249j127706l334364j196304K212610L337129
35039D979648K516105Q25239k267427n576521n306923p55341L093724K206163
35031b85333p87119j281737K50396M12411o55674j76361J576458J871599J027177
35022A951817J881975L721397K291600k933407o646326m938642k41822L235009
35014a678399M746906M908933K595886k117550n208108l374710O82938J881945
35006B437841q8396j484412q84594j62579J04134J308298K854431K216245l82722
$$ plain form
34997 5918246 4241810 3570474 3523163 2440830 961281 1025271 2352158 3088980 3144207
34988 3144207 3619481 3741729 2106090 507720 2224628 6118922 6956801 2957859 -1229399
34979 -1229399 -1236758 1140379 1549105 -653382 -3073766 -4837554 -6857172 -8843269 -9264607
34970 -9264607 -7788592 -5505892 -3361460 -2029452 -2111117 -2684977 -1278831 2548481 5291717
34961 5291717 3756409 -254536 -2294596 -949321 1793175 4456440 6941946 8583522
34953 8583522 9111599 10882162 16207989 22858180 26390431 26799446 28080548 30650462
34945 30650462 29552796 22222382 13192672 8064513 6768778 6194233 5954112 7372688
34937 7372688 9160078 8454386 5121545 1602894 -674311 -1904822 -2036930 -1156442 -651322
$$ packed form
34997E918246j676436o71336m7311j082333j479549O3990J326887P36822N5227
34988C144207M75274J22248j635639j598370J716908L894294Q37879l998942m187258
34979a229399p359K377137M08726k202487k420384j763788k019618j986097m21338
34970i264607J476015K282700K144432J332008q1665n73860J406146L827312K743236
34961E291717j535308m010945k040060J345275K742496K663265K485506J641576
34953H583522N28077J770563N325827O650191L532251M09015J281102K569914
34945C0650462j097666p330414r029710n128159j295735n74545k40121J418576
34937G372688J787390p05692l332841l518651k277205j230511j32108Q80488N05120
$$ plain form
34928 -651322 -1138231 -447546 3118586 6681393 5789350 1050069 -2320844 -1853211 -604765
34919 -604765 -1468739 -2647671 -1039189 2865438 6173913 7686788 8106583 7441702 4930406
34910 4930406 1190935 -1838496 -3330460 -4242835 -5175613 -5023865 -2598697 1364305 4861783
34901 4861783 6833703 7620496 7410124 5797725 3540539 3100054 5720411 9014806 9689821
34892 9689821 8100419 7409850 8346021 8117227 5345516 2631531 2647103 5008138 8835021
34883 8835021 14449222 19785502 19744391 13785905 10115706 16142000 27856032 35953827
34875 35953827 40128143 48389665 63380743 80727014 102964191 141501843 195625904
34868 195625904 239212817 241733520 200499957 142293582 94384590 63674759 44054602
$$ packed form
34928f51322m86909O90685L566132L562807q92043m739281l370913M67633J248446
34919f04765q63974j178932J608482L904627L308475J512875M19795o64881k511296
34910D930406l739471l029431j491964r12375r32778J51748K425168L963002L497478
34901D861783J971920P86793k10372j612399k257186m40485K620357L294395O75015
34892I689821j589402o90569R36171k28794k771711k713985J5572K361035L826883
34883H835021N614201N336280m1111n958486l670199O026294J1714032Q097795
34875C5953827M174316Q261522J4991078J7346271K2237177L8537652N4124061
34868A95625904M3586913K520703m1233563n8206375m7908992l0709831j9620157
$$ plain form
34861 44054602 31877688 27392298 27931437 28065415 25395814 21558737 18101752 14650915
34853 14650915 10876770 7714273 6217237 6374090 7113569 6984125 5221146 2491447
34845 2491447 173202 -1021664 -1083638 61579 2034006 3163705 1987902 -412023
34837 -412023 -1394248 -319380 645349 -309990 -2352523 -3406901 -2368721 436414 3460145
34828 3460145 4310802 1695117 -2478446 -4573079 -3334502 -978751 111276 -183845
34820 -183845 -1100846 -2534400 -4034630 -4157870 -2216328 645039 3058172 4672693 5110416
34811 5110416 3684481 1343157 893473 3605890 7097519 8182704 6550307 4279151
34803 4279151 3148836 3782850 5858354 7658157 7071309 4640392 3751840 5898215 7825543
$$ packed form
34861D4054602j2176914m485390N39139J33978k669601l837077l456985l450837
34853A4650915l774145l162497j497036J56853P39479j29444j762979k729699
34845B491447k318245j194866o1974J145217J972427J129699j175803k399925
34837d12023r82225J074868R64729r55339k042533j054378J038180K805135L023731
34828C460145Q50657k615685m173563k094633J238577K355751J090027k95121
34820a83845r17001j433554j500230j23240J941542K861367K413133J614521M37723
34811E110416j425935k341324m49684K712417L491629J085185j632397k271156
34803D279151j130315O34014K075504J799803n86848k430917q88552K146375J927328
$$ plain form
34794 7825543 5937398 1650810 -781104 -369221 273444 -71850 242980 2012178 3507028
34785 3507028 3363640 2244007 745322 -1608559 -4204495 -4786575 -2596656 -21796
34777 -21796 418383 -922357 -2128577 -2386769 -1926529 -851542 312500 72086 -2312117
34768 -2312117 -5227028 -6264377 -4973532 -3026461 -2095986 -2421320 -2964864 -2245151 424321
34759 424321 3871511 5861691 5490993 4004728 2818261 1988731 1445910 2154310 4383680
34750 4383680 5938262 4309602 375419 -2071659 -849539 2178414 3750519 2843397
34742 2843397 808729 -875256 -1662623 -1408120 -267534 820967 760270 -225807 -720197
34733 -720197 -236102 -139136 -1440005 -2645864 -1551960 1147553 2132817 -147373 -3297146
$$ packed form
34794G825543j888145m286588k431914M11883O42665l45294L14830J769198J494850
34785C507028j43388j119633j498685k353881k595936n82080K189919K574860
34777b1796M40179j340740j206220k58192M60240J074987J164042k40414k384203
34768b312117k914911j037349J290845J947071R30475l25334n43544P19713K669472
34759D24321L447190J990180l70698j486265j186467q29530n42821P08400K229370
34750D383680J554582j628660l934183k447078J222120L027953J572105r07122
34742B843397k034668j683985p87367K54503J140586J088501o0697r86077m94390
34733g20197M84095R6966j300869j205859J093904K699513R85264k280190l149773
$$ plain form
34724 -3297146 -4217765 -2753983 -679723 1229654 3068471 4099922 3727559 3453842 5223064
34715 5223064 8046410 8947045 7419607 6239343 7210418 8710782 8567397 7144897 6251291
34706 6251291 6732183 8286868 10055816 10492513 8401146 4906808 2494532 1531996 253117
34697 253117 -1233807 -566389 1660203 680849 -5041070 -9239253 -5814417 1418620 3305325
34688 3305325 -1396611 -4328983 -181882 5713580 5744984 573553 -3499737 -4216796 -4778593
34679 -4778593 -6773951 -7073855 -2920971 3510197 7627177 7638667 5568821 4026456 3514216
34670 3514216 2924499 1647371 416334 50942 35422 -899747 -2912561 -4631393 -4812591
34661 -4812591 -3645349 -2086655 -672184 503320 1241494 1269425 498217 -1025949 -2996516
$$ packed form
34724c297146r20619J463782K074260J909377J838817J031451l72363k73717J769222
34715E223064K823346R00635j527438j180264R71075J500364j43385j422500q93606
34706F251291M80892J554685J768948M36697k091367l494338k412276r62536j278879
34697B53117j486924O67418K226592r79354n721919m198183L424836P233037J886705
34688C305325m701936k932372M147101N895462L1404n171431m073290p17059n61797
34679d778593j995358k99904M152884O431168M116980J1490k069846j542365n12240
34670C514216n89717j277128j231037l65392j5520r35169k012814j718832j81198
34661d812591J167242J558694J414471J175504P38174K7931p71208j524166j970567
$$ plain form
34652 -2996516 -4497259 -4411448 -2564648 -71621 1592011 1475589 -543258 -3250655 -4007445
34643 -4007445 -843513 4638338 7919571 6354655 2293076 108123 958801 2145115
34635 2145115 1256963 -945591 -2211378 -1778950 -593811 642646 2326502 4718119
34627 4718119 6750519 6810212 4628829 1800027 126501 -114751 191293 643576 1706910
34618 1706910 3431809 4729689 4444416 2673632 571839 -899948 -1718197 -2493291 -3669247
34609 -3669247 -4969200 -5602891 -5057924 -3511551 -1440602 666052 2046812 2066975 1572836
34600 1572836 2777543 6452511 10021396 10188560 7019461 3467723 1145847 -952432
34592 -952432 -3209904 -3733444 -1409588 1631032 2560983 1343200 -174340 -1261340 -2316886
$$ packed form
34652b996516j500743Q5811J846800K493027J663632j16422k018847k707397p56790
34643d007445L163932N481851L281233j564916m061579k184953Q50678J186314
34635B145115q88152k202554j265787M32428J185139J236457J683856K391617
34627D718119K032400N9693k181383k828802j673526k41252L06044M52283J063334
34618A706910J724899J297880k85273j770784k101793j471787q18249p75094j175956
34609c669247j299953o33691N44967J546373K070949K106654J380760K0163m94139
34600A572836J204707L674968L568885J67164l169099l551738k321876k098279
34592i52432k257472n23540K323856L040620R29951j217783j517540j087000j055546
$$ plain form
34583 -2316886 -2987422 -2692343 -2541978 -4288516 -7186551 -8077310 -5398102 -1588545 -486277
34574 -486277 -3071044 -6489583 -6933293 -3205382 2161063 5114811 3710557 -269214
34566 -269214 -3252894 -3209326 -1038001 868381 1152944 769244 1636281 3817899 4890737
34557 4890737 3202135 732424 534043 1924995 1398110 -1391491 -2453613 55844
34549 55844 2223867 480207 -2135830 -349821 4958909 7987443 6693909 4784476
34541 4784476 4687687 3967869 546742 -3097670 -3692513 -1791692 71871 1174064 1916849
34532 1916849 1701299 261311 -654519 455282 2374352 3347888 4161357 6334020 8559326
34523 8559326 8078217 5038785 2479250 2012652 2379473 2684847 4194081 7544571 10361040
$$ packed form
34583b316886o70536K95079J50365j746538k898035q90759K679208L809557J102268
34574d86277k584767l418539m43710L727911N366445K953748j404254l979771
34566b69214k983680M3568K171325J906382K84563l83700Q67037K181618J072838
34557D890737j688602k469711j98381J390952n26885k789601j062122K509457
34549E5844K168023j743660k616037J786009N308730L028534j293534j909433
34541D784476r6789p19818l421127l644412n94843J900821J863563J102193P42785
34532A916849k15550j439988r15830J109801J919070R73536Q13469K172663K225306
34523H559326m81109l039432k559535m66598L66821L05374J509234L350490K816469
$$ plain form
34514 10361040 9750515 6286587 3540179 3523519 4149838 2204442 -1988533 -4505837 -2713831
34505 -2713831 1479075 4543717 6023229 7981981 10508000 10865197 7749144 3604833
34497 3604833 1326986 851836 537317 -78215 -612817 -1170737 -1587639 -985934 261598
34488 261598 15868 -2255803 -3672383 -1935552 937769 1904704 2017809 4440307 8524529
34479 8524529 10156640 7874735 4577937 2635911 1078410 -1349892 -3728478 -4856055
34471 -4856055 -4760162 -3250716 147096 3736710 4218576 1205333 -1669451 -1621140 221756
34462 221756 2044176 4112693 6127924 5457921 1225457 -2871643 -3390645 -2104871 -2301586
34453 -2301586 -2901519 -1152000 1012684 -663761 -4739810 -4772475 1058874 6889671 7670956
$$ packed form
34514A0361040o10525l463928k746408j6660O26319j945396m192975k517304J792006
34505b713831M192906L064642J479512J958752K526019L57197l116053m144311
34497C604833k277847m75150l14519o15532n34602n57920m16902O01705J247532
34488B61598k45730k271671j416580J736831K873321R66935J13105K422498M084222
34479H524529J632111k281905l296798j942026j557501k428302k378586j127577
34471d856055R5893J509446L397812L589614M81866l013243k874784M8311J842896
34462B21756J822420K068517K015231o70003m232464m097100n19002J285774j96715
34453b301586n99933J749519K164684j676445m076049l2665N831349N830797P81285
$$ plain form
34444 7670956 5394410 4130951 3884367 3146241 3244172 5377955 6465636 3198502 -1678222
34435 -1678222 -2435644 1228327 4071060 3446788 2257242 2846133 3082972 754550 -2345608
34426 -2345608 -3551377 -3261482 -2816126 -1341390 1898318 4276119 2758055 -1180654
34418 -1180654 -3226078 -2176086 -854490 -1362881 -2721047 -3455571 -3465317 -2642818 -268361
34409 -268361 3350395 6665255 8810476 9884363 9463544 7329126 5438267 5883739 6756017
34400 6756017 4104532 -1078207 -2630956 1695007 5802005 3853677 -885904 -1214977
34392 -1214977 2946146 5096476 2617680 -5430 802780 2594119 2093018 564764
34384 564764 815166 2355371 2812808 1736588 170045 -1570170 -3089489 -2688888 395197
$$ packed form
34444G670956k276546j263459k46584p38126R7931K133783J087681l267134m876724
34435a678222p57422L663971K842733o24272j189546N88891K36839k328422l100158
34426b345608j205769K89895M45356J474736L239708K377801j518064l938709
34418a180654k045424J049992J321596n08391j358166p34524r746Q22499K374457
34409b68361L618756L314860K145221J073887m20819k134418j890859M45472Q72278
34400F756017k651485n182739j552749M325963M106998j948328m739581l29073
34392a214977M161123K150330k478796k623110Q08210J791339n01101j528254
34384E64764K50402J540205M57437j076220j566543j740215j519319M00601L084085
$$ plain form
34375 395197 3849626 4814136 3479794 2040400 1293143 625562 296685 1108072 2387507
34366 2387507 2778965 2685927 3515895 4697664 4019582 1195499 -1408729 -2347931 -3103734
34357 -3103734 -5258470 -7521501 -7332271 -4410721 -995659 1069997 1970471 2557429 2777350
34348 2777350 2299360 1941320 3154705 5826008 7613409 6379428 2859630 -47794
34340 -47794 -472279 969551 2836202 4666909 6628598 8396647 9164091 8368833 6220447
34331 6220447 4009900 3590766 5432564 7472086 7515065 6591913 7624456 10444454 11085278
34322 11085278 7453101 2858339 1538394 3021489 3949690 3696761 4469302 6527160
34314 6527160 7100261 4622073 1127642 -489837 466212 2827236 5113564 6235154
$$ packed form
34375C95197L454429R64510j334342j439394p47257o67581l28877Q11387J279435
34366B387507L91458r3038Q29968J181769o78082k824083k604228r39202p55803
34357c103734k154736k263031J89230K921550L415062K065656R00474N86958K19921
34348B777350m77990l58040J213385K671303J787401j233981l519798k907424
34340d7794m24485J441830J866651J830707J961689J768049P67444p95258k148386
34331F220447k210547m19134J841798K039522M2979r23152J032543K819998O40824
34322A1085278l632177m594762j319945J483095R28201k52929P72541K057858
34314F527160N73101k478188l494431j617479R56049K361024K286328J121590
$$ plain form
34306 6235154 6264675 6858678 9431003 12909741 14971554 15268545 15335166 15462306 14266605
34297 14266605 11727427 10001968 10415723 12068842 14276784 17782202 22299758 25500056
34289 25500056 26293863 26974630 30099166 35085147 39987829 44977385 51679257 60271640
34281 60271640 69686865 80083831 93032912 109608815 129968668 154356677 182989738
34274 182989738 215390159 250905234 288474137 323697587 347231541 349539877 328665363
34267 328665363 292182553 251060876 212465488 178083227 147189546 119809296 97208104
34260 97208104 80122671 67188813 55965537 45666682 37642955 32456531 28049934
34253 28049934 22461543 17177674 15482512 17717805 20273825 19592857 15603468 10910530
$$ packed form
34306F235154K9521N94003K572325L478738K061813K96991O6621J27140j195701
34297A4266605k539178j725459M13755J653119K207942L505418M517556L200298
34289B5500056P93807O80767L124536M985981M902682M989556O701872Q592383
34281F0271640R415225J0396966J2949081J6575903K0359853K4388009K8633061
34274A82989738L2400421L5515075L7568903L5223450K3533954K308336k0874514
34267C28665363l6482810m1121677l8595388l4382261l0893681k7380250k2601192
34260I7208104j7085433j2933858j1223276j0298855q023727n186424m406597
34253B8049934n588391n283869j695162K235293K556020o80968l989389m692938
$$ plain form
34245 10910530 8005819 7659219 8883530 10022935 10509496 11417660 13581722 15833229
34237 15833229 16399759 15435436 14455445 13638767 11670072 8265799 4924675 2975560 2662040
34228 2662040 4102552 6882973 8538556 6286828 1249630 -1823919 -573432 1941588
34220 1941588 2321366 2162792 4981851 9679066 11304575 8094650 3746019 1794870
34212 1794870 1309542 50175 -1082493 258064 3348506 4881760 3782293 2663743
34204 2663743 3769301 5844809 6479654 5722092 5254865 4969996 2920900 -1154492 -4641737
34195 -4641737 -5485536 -5010156 -5651007 -7100105 -6839232 -4156824 -1480291 -1147374 -2407030
34186 -2407030 -2552256 -122366 3852699 7228002 8633347 8243555 7167502 6145853
$$ packed form
34245A0910530k904711l46600J224311J139405M86561R08164K164062K251507
34237A5833229N66530r64323r79991q16678j968695l404273l341124j949115l13520
34228B662040J440512K780421J655583k251728n037198l073549J250487K515020
34220A941588L79778j58574K819059M697215J625509l209925m348631j951149
34212A794870m85328j259367j132668J340557L090442J533254j099467j118550
34204B663743J105558K075508O34845p57562m67227k84869k049096m075392l487245
34195d641737q43799M75380o40851j449098K60873K682408K676533L32917j259656
34186b407030j45226K429890L975065L375303J405345l89792j076053j021649
$$ plain form
34178 6145853 5011181 3687460 3179030 4534313 6883834 7725277 5693455 2255758
34170 2255758 86124 247561 1388184 1358321 -596533 -2975917 -3484653 -1760654 -80085
34161 -80085 -376759 -1279265 19742 3112142 4096716 940901 -3134051 -3532139 -88754
34152 -88754 3214690 3634508 2493353 2507294 4197836 5802261 5719515 4128810 2396225
34143 2396225 1404705 780419 -112205 -851165 -439311 994633 2109835 2282532 2481546
34134 2481546 3675075 5432926 6672887 6668465 4877659 1390748 -1675428 -1258912 2650745
34125 2650745 5985741 5576724 3437880 3638242 6458172 8696064 8649530 7245827 4790089
34116 4790089 653736 -3377418 -3569593 417059 4119822 4125036 2231992 1564781 1592128
$$ packed form
34178F145853j134672j323721n08430J355283K349521Q41443k031822l437697
34170B255758k169634J61437J140623k9863j954854k379384n08736J723999J680569
34161h0085k96674r02506J299007L092400R84574l155815m074952l98088L443385
34152h8754L303444M19818j141155J3941J690542J604425q2746j590705j732585
34143B396225r91520o24286q92624p38960M11854J433944J115202J72697J99014
34134B481546J193529J757851J239961m422j790806l486911l066176M16516L909657
34125B650745L334996m09017k138844K00362K819930K237892m6534j403703k455738
34116D790089m136353m031154j92175L986652L702763N214j893044o67211K7347
$$ plain form
34107 1592128 82550 -2391634 -3576890 -3744730 -5010882 -6994501 -6814368 -3719198
34099 -3719198 -477181 704876 798122 1209571 1004986 -1090679 -3640940 -3840001 -1299098
34090 -1299098 1540470 2769332 3085626 4071362 5807986 7186316 7756939 8048999 8316041
34081 8316041 8258429 8213354 9292305 11582386 13465775 14042717 15175742 19156300 24830808
34072 24830808 28441817 28648296 28415243 31094790 36823139 44011641 52239566 61963078
34064 61963078 73363390 87549813 106673677 129391556 147238389 149653321 133912511
34057 133912511 108006371 83068791 64827977 52600454 43641605 36412323 30883760
34050 30883760 27497553 25836450 24041028 20263659 14823944 9840551 6570268 4441556
$$ packed form
34107A592128j509578k474184j185256j67840j266152j983619J80133L095170
34099c719198L242017J182057R3246M11449k04585k095665k550261j99061K540903
34090a299098K839568J228862L16294R85736J736624J378330N70623K92060K67042
34081H316041n7612m5075J078951K290081J883389N76942J133025L980558N674508
34072B4830808L611009K06479k33053K679547N728349P188502Q227925R723512
34064F1963078J1400312J4186423J9123864K2717879J7846833K414932j5740810
34057A33912511k5906140k4937580j8240814j2227523q958849p229282n528563
34050C0883760l386207j661103j795422l777369n439715m983393l270283k128712
$$ plain form
34042 4441556 2960681 2850252 4447010 6444502 7376317 7263114 6675601 5178171 2150909
34033 2150909 -1291798 -2669316 -845611 2241552 3149352 475382 -3402524 -4866283
34025 -4866283 -3375835 -1870125 -2208775 -2267683 430024 4063015 4716371 2195789 -222481
34016 -222481 -1541637 -3985321 -7376151 -7583341 -3102290 1180912 429295 -3290163 -4599968
34007 -4599968 -2551895 -345227 652896 1716970 2625734 1638381 -399396 -369255 2117428
33998 2117428 3877339 3017379 1108677 -198279 -1225391 -2086768 -1969488 -1638807 -3077832
33989 -3077832 -5293857 -4272130 866065 5294887 4803618 1516416 -5983 216323
33981 216323 -1535484 -6130968 -9937481 -9757444 -6393591 -2785218 -794542 -468191 -888785
$$ packed form
34042D441556j480875j10429J596758J997492R31815j13203n87513j497430l027262
34033B150909l442707j377518J823705L087163R07800k673970l877906j463759
34025d866283J490448J505710l38650n8908K697707L632991O53356k520582k418270
34016b22481j319156k443684l390830k07190M481051M283202p51617l719458j309805
34007d599968K048073K206668R98123J064074R08764r87353k037777L0141K486683
33998B117428J759911q59960j908702j306956j027112q61377J17280L30681j439025
33989c077832k216025J021727N138195M428822m91269l287202j522399K22306
33981B16323j751807m595484l806513J80037L363853L608373J990676L26351m20594
$$ plain form
33972 -888785 -972121 -150016 1268296 2423640 2330675 214699 -3507502 -6548541 -6527768
33963 -6527768 -3792551 -921267 867894 2733661 5056560 5885617 3986593 1049559
33955 1049559 -1000253 -2699102 -4952839 -6411159 -5537913 -3603014 -2884315 -3203127 -2850099
33946 -2850099 -1734732 -1050521 -1015897 -1437320 -3011195 -5272538 -5048850 -551330 4494457
33937 4494457 5010237 1860830 348391 1916919 2666147 714347 -565628 1280297
33929 1280297 3417746 2674091 798302 1066356 2767020 3140424 2612267 3742260 5948173
33920 5948173 5514180 1265522 -3060188 -3357293 -84820 2655823 2041180 -556819 -1553767
33911 -1553767 472295 3064036 2943192 13074 -2872695 -3626722 -2803834 -2041306 -2537243
$$ packed form
33972h88785q3336Q22105J418312J155344r2965k115976l722201l041039K0773
33963f527768K735217K871284J789161J865767K322899Q29057j899024k937034
33955A049559k049812j698849k253737j458320Q73246J934899P18699l18812L53028
33946b850099J115367O84211L4624m21423j573875k261343K23688M497520N045787
33937D494457N15780l149407j512439J568528P49228j951800j279975J845925
33929A280297K137449p43655j875789K68054J700664L73404n28157J129993K205913
33920E948173m33993m248658m325710k97105L272473K740643o14643k597999r96948
33911a553767K026062K591741j20844k930118k885769p54027Q22888P62528m95937
$$ plain form
33902 -2537243 -4975058 -8687680 -10731209 -8423916 -3425318 -510257 -1319027 -2350343
33894 -2350343 -651217 1782584 1719842 -133684 -904823 -370202 -524412 -1718717 -2636322
33885 -2636322 -3213571 -4249514 -4620190 -2224371 2225581 5343572 5351783 3618977 1636394
33876 1636394 -751696 -3283406 -4107678 -2327289 -54404 -202207 -2892596 -5249536
33868 -5249536 -4582111 -1137857 2348204 3623323 3059450 2360916 1715927 -115700 -2773173
33859 -2773173 -3735814 -2028609 -179544 -449402 -1179025 371484 3137871 3486657 556079
33850 556079 -2816681 -4112782 -3003423 427717 5783958 10332932 10464256 6407077
33842 6407077 2660697 2442409 4234752 5144572 5131948 6022535 8146967 9853515 9405087
$$ packed form
33902b537243k437815l712622k043529K307293M998598K915061q08770j031316
33894b350343J699126K433801o2742j853526p71139N34621j54210j194305r17605
33885b636322n77249j035943l70676K395819M449952L117991Q211j732806j982583
33876A636394k388090k531710q24272J780389K272885j47803k690389k356940
33868e249536O67425L444254L486061J275119n63873o98534o44989j831627k657473
33859b773173r62641J707205J849065k69858p29623J550509K766387L48786k930578
33850E56079l372760j296101J109359L431140N356241M548974J31324m057179
33842F407077l746380k18288J792343R09820j2624Q90587K124432J706548m48428
$$ plain form
33833 9405087 6347734 2050651 -664445 10926 2356899 2910792 1105234 -199153
33825 -199153 673513 1994032 2226847 2721526 4739973 6650612 6805050 6784341 8569940
33816 8569940 10478681 9715456 7697989 8506737 12115414 13504647 9758103 4401855
33808 4401855 2587228 4723188 7475568 9091592 10562653 12224756 12383210 9981022
33800 9981022 6353245 3190078 386096 -2790960 -5772467 -7641110 -9032439 -10967202
33792 -10967202 -12222628 -10355116 -5708044 -1921842 -1389271 -2420476 -2355279 -1308908
33784 -1308908 -852775 -954015 -720405 -625302 -1301595 -1533474 -473460 -531427 -4329187
33775 -4329187 -9500250 -10703735 -6980690 -3009726 -2319080 -3278597 -3109285 -2018768 -1547938
$$ packed form
33833I405087l057353m297083k715096O75371K345973N53893j805558j304387
33825a99153Q72666J320519K32815M94679K018447J910639J54438k0709J785599
33816H569940J908741p63225k017467Q08748L608677J389233l746544n356248
33808D401855j814627K135960K752380J616024J471061J662103J58454k402188
33800I981022l627777l163167k803982l177056k981507j868643j391329j934763
33792a0967202j255426J867512M647072L786202N32571j031205O5197J046371
33784a308908M56133j01240K33610R5103o76293k31879J060014n7967l797760
33775d329187n171063j203485L723045L970964O90646r59517J69312J090517M70830
$$ plain form
33766 -1547938 -2159342 -4218058 -8076046 -11527183 -10934512 -7034702 -5557241 -9081807
33758 -9081807 -12285144 -9206986 -1702717 3950387 5803520 6219367 5537573 2223327
33750 2223327 -1412081 -345695 5082898 7957801 4016688 -2411878 -4574927 -1913896
33742 -1913896 741209 285961 -1688856 -2140223 -195173 2420036 3108140 666985 -3279986
33733 -3279986 -5412090 -4012223 -949846 159384 -2276554 -6181295 -8063816 -6879817
33725 -6879817 -5107833 -5373855 -6876995 -6975572 -5794158 -6150997 -8194558 -7877877 -3172443
33716 -3172443 1646129 1653200 -1436250 -2257936 -294848 117344 -2098030 -2533334 1339713
33707 1339713 5752055 6386569 4637029 4699984 7010089 8186369 6396184 3696688 2946210
$$ packed form
33766a547938o11404k058716l857988l451137N92671L899810J477461l524566
33758i081807l203337L078158P504269N653104J853133M15847o81794l314246
33750B223327l635408J066386N428593K874903l941113o428566k163049K661031
33742a913896K655105m55248j974817m51367J945050K615209O88104k441155l946971
33733c279986k132104J399867L062377J109230k435938l904741j882521J183999
33725f879817J771984k66022j503140r8577J181414l56839k043561L16681M705434
33716c172443M818572P071l089450q21686J963088M12192k215374m35304L873047
33707A339713M412342O34514j749540O2955K310105J176280j790185k699496p50478
$$ plain form
33698 2946210 4210093 4723245 2006344 -2893814 -5614003 -2935345 3184382 7363594
33690 7363594 6382478 1590500 -3651574 -6709063 -6211245 -2772230 267622 -497680 -4175469
33681 -4175469 -6187876 -4164503 -850800 21727 -1532121 -2677494 -1627132 882761
33673 882761 2681773 1750932 -2049404 -6313916 -8464148 -8681017 -8576655 -7502072 -3354187
33664 -3354187 2762542 6415467 5543312 2851374 1167182 19675 -1366297 -1534191
33656 -1534191 29029 587045 -1726373 -4236105 -3522006 -581539 1133065 829616 204222
33647 204222 -106762 -629432 -1041466 -983082 -1317030 -1904284 -346518 3785228 5982291
33638 5982291 2390054 -3597513 -5352724 -2437013 -513557 -2047085 -2973582 -83342
$$ packed form
33698B946210J263883N13152k716901m900158k720189K678658O119727M179212
33690G363594r81116m791978n242074l057489M97818L439015L039852p65302l677789
33681d175469k012407K023373L313703Q72527j553848j145373J050362K509893
33673H82761J799012r30841l800336m264512k150232k16869J04362J074583M147885
33664c354187O116729L652925q72155k691938j684192j147507j385972j67894
33656a534191J563220N58016k313418k509732P14099K940467J714604l03449o25394
33647B04222l10984n22670m12034N8384l33948n87254J557766M131746K197063
33638E982291l592237n987567j755211K915711J923456j533528r26497K890240
$$ plain form
33630 -83342 3563718 3485590 304269 -1884216 -1484726 -726131 -1910714 -4592264 -6517409
33621 -6517409 -6314069 -4941205 -4324362 -4586330 -3817964 -1327341 721359 724010 774874
33612 774874 3433194 6669411 5762164 -13779 -6251949 -9318648 -9814995 -9253673 -6959179
33603 -6959179 -2427329 1822629 2451256 -588906 -3977053 -4744686 -3040801 -1290051
33595 -1290051 -1171041 -1942296 -2329072 -3335159 -6843130 -11070089 -10901358 -4931685 1188979
33586 1188979 1881180 -901723 -1747748 -547497 -1334522 -4054500 -4361156 -1646395 -414133
33577 -414133 -2333215 -3399811 -1178079 1304802 1790048 2976126 6624505 8769070
33569 8769070 5532108 -349341 -3533970 -3371838 -2782998 -2789634 -2592092 -2623259 -3291886
$$ packed form
33630h3342L647060p8128l181321k188485L99490P58595j184583k681550j925145
33621f517409K03340J372864O16843k61968P68366K490623K048700K651N0864
33612G74874K658320L236217r07247n775943o238170l066699m96347N61322K294494
33603f959179M531850M249958O28627l040162l388147p67633J703885J750750
33595a290051J19010p71255l86776j006087l507971m226959J68731N969673O120664
33586A188979O92201k782903q46025J200251p87025k719978l06656K714761J232262
33577d14133j919082j066596K221732K482881M85246J186078L648379K144565
33569H769070l236962n881449l184629J62132N88840o636J97542l1167o68627
$$ plain form
33560 -3291886 -2825180 -196774 2085770 1838317 1235775 3021791 5510278 5817382 5157522
33551 5157522 5772758 5436619 1209454 -3475778 -2533019 2885528 5472208 2906904 611895
33542 611895 2107879 3914223 2794388 1431211 2819623 4377458 2428750 -1336096
33534 -1336096 -2678292 -1346026 -250046 -32297 1084653 2859291 2409500 -1662324
33526 -1662324 -7113297 -10435612 -9954280 -6775907 -3791825 -3254030 -4503362 -4869992 -3300758
33517 -3300758 -1622115 -1493134 -2046476 -1861924 -1406683 -1758987 -2391201 -2037223 -638498
33508 -638498 1083823 2782643 3864457 3304984 1736580 1962809 5165554 8065919 6499107
33499 6499107 945784 -4045879 -5353461 -3697132 -1064930 1449797 3033106 2977536
$$ packed form
33560c291886M66706K628406K282544k47453o02542J786016K488487L07104o59860
33551E157522O15236l36139m227165m685232R42759N418547K586680k565304k295009
33542F11895J495984J806344j119835j363177J388412J557835j948708l764846
33534a336096j342196J332266J095980K17749J116950J774638m49791m071824
33526a662324n450973l322315M81332L178373K984082N37795j249332l66630J569234
33517c300758J678643J28981n53342J84552M55241l52304o32214L53978J398725
33508f38498J722321J698820J081814n59473j568404K26229L202745K900365j566812
33499F499107n553323m991663j307582J656329K632202K514727J583309n5570
$$ plain form
33491 2977536 1953015 1610021 2221963 2222868 556450 -1981625 -4119032 -5301332 -5120122
33482 -5120122 -3201532 -366317 1526034 1637726 837929 -115961 -1382382 -2187064 -239687
33473 -239687 5015624 9865437 9658569 4727478 786102 2437155 7572419 9515495
33465 9515495 4382057 -4710436 -11002304 -11036841 -7569091 -5519138 -5984892 -5532986 -1402221
33456 -1402221 4344936 7282643 6266928 4461526 4475945 4671459 1896664 -3397057 -7095817
33447 -7095817 -6575285 -3899233 -2825730 -3958715 -4499242 -2417138 829355 2336926
33439 2336926 1434352 243150 876929 3161052 5446177 6763682 7227213 6731877 4708943
33430 4708943 1686627 -172240 673493 3004097 4285456 3800479 2748692 1529227
$$ packed form
33491B977536j024521l42994O11942R05j666418k538075k137407j182300J81210
33482e120122J918590K835215J892351J11692p99797r53890j266421q04682J947377
33473b39687N255311M849813k06868m931091l941376J651053N135264J943076
33465I515495n133438r092493o291868l4537L467750K049953m65754M51906M130765
33456a402221N747157K937707j015715j805402J4419J95514k774795n293721l698760
33447g095817N20532K676052J073503j132985n40527K082104L246493J507571
33439B336926r02574j191202O33779K284123K285125J317505M63531m95336k022934
33430D708943l022316j858867Q45733K330604J281359m84977j051787j219465
$$ plain form
33422 1529227 -810217 -3831075 -4795720 -2138671 1893505 4095113 4523175 5553529
33414 5553529 7560776 8258130 6387774 3580800 1910357 1568538 1671896 1637378 1094775
33405 1094775 117593 102130 2427702 5471391 5367353 1232040 -2811034 -3140231 -1946765
33396 -1946765 -3651570 -7360562 -7257844 -1071205 5855796 7034443 2619157 -1851676
33388 -1851676 -2663076 -893134 1029256 2565064 4215908 5790593 6897202 7882031
33380 7882031 9013310 9505364 8489033 6469652 4791290 3963998 3490772 3098270 3015319
33371 3015319 2997231 2209311 466104 -1285335 -2143495 -2169512 -1779215 -1120851 -615773
33362 -615773 -1158296 -2850699 -4281037 -4219715 -3597814 -4474399 -6969508 -8389169 -5988757
$$ packed form
33422A529227k339444l020858r64645K657049M032176K201608M28062J030354
33414E553529K007247O97354j870356k806974j670443l41819J03358l4518n42603
33405A094775r77182j5463K325572L043689j04038m135313m043074l29197J193466
33396a946765j704805l708992J02718O186639O927001J178647m415286m470833
33388a851676q11400J769942J922390J535808J650844J574685J106609R84829
33380G882031J131279M92054j016331k019381j678362q27292m73226l92502q2951
33371C015319j8088p87920j743207j751439q58160k6017L90297O58364N05078
33362f15773n42523j692403j430338O1322O21901q76585k495109j419661K400412
$$ plain form
33353 -5988757 -176748 5382057 6840684 3584342 -1132430 -3183360 -1428575 1726167
33345 1726167 3542931 3723494 3645338 4211760 5475900 7179060 8318533 7356650 4559370
33336 4559370 2961279 4743021 7546789 7209345 3760276 1410510 2218701 3352816
33328 3352816 2073686 94415 557439 3261444 5841593 7932989 11003992 15008184
33320 15008184 18334278 20945130 24822529 30803623 36945950 40515399 40188129 36250185
33312 36250185 30176371 24118356 19349821 15167140 10683713 7339629 7560060 10772542
33304 10772542 13030118 11463153 7293705 3511728 1403403 703417 1460223 3722621
33296 3722621 6217827 7305735 7075177 6970585 7365138 6891423 4421747 618013 -2782187
$$ packed form
33353e988757N812009N558805J458627l256342m716772k050930J754785L154742
33345A726167J816764J80563p8156N66422J264140J703160J139473r61883k797280
33336D559370j598091J781742K803768l37444l449069k349766Q08191J134115
33328C352816j279130j979271M63024K704005K580149K091396L071003M004192
33320A5008184L326094K610852L877399N981094O142327L569449l27270l937944
33312C6250185o073814o058015m768535m182681m483427l344084K20431L212482
33304A0772542K257576j566965m169448l781977k108325o99986P56806K262398
33296C722621K495206J087908k30558j04592L94553m73715k469676l803734l400200
$$ plain form
33287 -2782187 -4332776 -3388169 -417802 2599896 3159018 695192 -2389190 -3167955 -1407894
33278 -1407894 628491 1326309 1242277 1237162 761138 -827226 -2473729 -2709200 -2149242
33269 -2149242 -2776817 -4665971 -5341698 -3105745 535902 2719595 2320412 297578 -1883797
33260 -1883797 -3072749 -2729012 -1728908 -2109197 -4670006 -7422722 -7729743 -5492154 -2952897
33251 -2952897 -1876389 -2287965 -3451745 -4489295 -4376727 -2959392 -1665719 -1533532 -1056224
33242 -1056224 1706528 5136811 5197024 1256225 -2326926 -2093481 -140679 -410984 -2610474
33233 -2610474 -3107511 -631436 2452605 4257169 5317711 5935751 4862487 2030846
33225 2030846 -73187 321784 1630301 1552810 657205 923495 1938383 1364446 -1135243
$$ packed form
33287b782187j550589R44607K970367L017698N59122k463826l084382p78765J760061
33278a407894K036385O97818q4032n115m76024j588364j646503k35471N59958
33269b149242o27575j889154o75727K235953L641647K183693l99183k022834k181375
33260a883797j188952L43737J000104l80289k560809k752716l07021K237589K539257
33251b952897J076508m11576j163780j037550J12568J417335J293673J32187M77308
33242a056224K762752L430283O0213l940799l583151K33445J952802k70305k199490
33233b610474m97037K476075L084041J804564J060542O18040j073264k831641
33225B030846k104033L94971J308517p7491q95605K66290J014888n73937k499689
$$ plain form
33216 -1135243 -3159172 -3080675 -1888095 -797214 719186 3244466 5532012 5855317 4109425
33207 4109425 1347336 -1586247 -3732305 -3778781 -1940278 -946335 -3042481 -6691461 -8374773
33198 -8374773 -7144508 -5092432 -3680560 -2347998 -981610 -867847 -2181813 -3051204
33190 -3051204 -2456371 -1839699 -2378748 -2897399 -2319552 -2025917 -3378932 -4740020 -3875696
33181 -3875696 -2103269 -2741261 -5778613 -7335538 -4956458 -707410 1967447 2245254
33173 2245254 1561828 1039452 791814 767956 912734 803564 -105968 -1948171 -4231327
33164 -4231327 -5919769 -6120377 -5320717 -5278711 -6587443 -7180635 -5056174 -1888916 -1446238
33155 -1446238 -4291595 -6811294 -6389727 -4799397 -4762724 -5656998 -5206883 -3676581 -3241389
$$ packed form
33216a135243k023929P8497J192580J090881J516400K525280K287546L23305j745892
33207D109425k762089k933583k146058m6476J838503R93943k096146l648980j683312
33198h374773J230265K052076J411872J332562J366388J13763j313966q69391
33190c051204N94833O16672n39049n18651N77847K93635j353015j361088Q64324
33181c875696J772427o37992l037352j556925K379080M249048K674857K77807
33173B245254o83426n22376k47638k3858J44778j09170r09532j842203k283156
33164d231327j688442k00608P99660M2006j308732n93192K124461L167258M42678
33155a446238k845357k519699M21567J590330L6673q94274M50115J530302M35192
$$ plain form
33146 -3241389 -3907121 -3214445 -250965 2808121 4009617 4130494 4626133 5106790 4680769
33137 4680769 4350891 5758214 8062786 8385932 5688009 2255287 453631 -390616 -2440124
33128 -2440124 -5678457 -7577512 -6375590 -3274695 -933044 -590021 -1073898 -201767 2927037
33119 2927037 6603016 7673219 4744903 53123 -2680082 -2030371 414034 2676835
33111 2676835 4205687 5111452 5329149 4961175 4035527 1739013 -2407641 -6508235 -7738780
33102 -7738780 -6374355 -5704947 -6891414 -6892452 -3310439 1706194 4888971 6261175 6965247
33093 6965247 5561829 817694 -3864667 -3868655 -361401 1198538 -536649 -1094199 2196478
33084 2196478 5820262 5333311 1114237 -3268865 -5291579 -4297564 -1127047 1400862
$$ packed form
33146c241389o65732O92676K963480L059086J201496J20877M95639M80657m26021
33137D680769l29878J407323K304572L23146k697923l432722j801656q44247k049508
33128b440124l238333j899055J201922L100895K341651L43023m83877Q72131L128804
33119B927037L675979J070203k928316m691780k733205O49711K444405K262801
33111B676835J528852R05765K17697l67974r25648k296514m146654m100594j230545
33102g738780J364425O69408j186467j038L582013N016633L182777J372204P04072
33093F965247j403418m744135m682361l988L507254J559939j735187n57550L290677
33084B196478L623784m86951m219074m383102k022714R94015L170517K527909
$$ plain form
33076 1400862 555864 -2343229 -3179758 -1374202 -886900 -3134274 -3758472 260121 4822307
33067 4822307 4608717 1181924 -34155 1706574 2537996 1002037 -727181 -2093044
33059 -2093044 -4986127 -8744774 -9420514 -5554652 -685913 1490078 1131063 71267
33051 71267 -1058419 -1856885 -1298024 83444 -491727 -4388657 -8872590 -9988111 -7003392
33042 -7003392 -2606128 256591 583307 -602172 -1272211 -134651 2097261 3781151
33034 3781151 4488488 4782486 4292470 2260261 130475 801593 4236241 6518534 5098306
33025 5098306 2620691 3085343 6018313 7532246 6314330 5292049 7132012 11106309
33017 11106309 15613292 21248944 29043461 36868939 40295910 37437815 31175937 25768222
$$ packed form
33076A400862q44998k899093q36529J805556M87302k247374o24198M018593M562186
33067D822307k13590l426793j216079J740729Q31422j535959j729218j365863
33059b093044k893083l758647o75740L865862M868739K175991l59015j059796
33051G1267j129686p98466N58861J381468n75171l896930m483933j115521K984719
33042g003392M397264K862719L26716j185479o70039J137560K231912J683890
33034C781151P07337K93998m90016k032209k129786O71118L434648K282293j420228
33025E098306k477615M64652K932970J513933j217916j022281J839963L974297
33017A1106309M506983N635652P794517P825478L426971k858095o261878n407715
$$ plain form
33009 25768222 22559136 20055725 16965113 13359960 9397346 5037441 1439220 818414
33001 818414 3922147 8688747 12089222 12441324 9780051 5450487 1762367 390484
32993 390484 561642 529681 971532 4095806 8664041 9731594 5586813 1207244 1414232
32984 1414232 4036801 4310013 2876450 3461201 4711076 1682510 -4634727 -6935526
32976 -6935526 -2679742 1595637 578538 -1717243 575792 4792878 3636662 -3334958
32968 -3334958 -9045589 -8957054 -5538792 -2244402 1041098 4456157 5040187 872892 -4473710
32959 -4473710 -5524000 -1932162 1374331 990142 -1146413 -1780240 -1409017 -2732914 -5525709
32950 -5525709 -6612282 -5235507 -4767167 -7171575 -9037869 -6464969 -1502451 700397
$$ packed form
33009B5768222l209086k503411l090612l605153l962614m359905l598221o20806
33001H18414L103733M766600L400475L52102k661273m329564l688120j371883
32993C90484J71158l1961M41851L124274M568235J067553m144781m379569K06988
32984A414232K622569K73212j433563N84751J249875l028566o317237k300799
32976f935526M255784M275379j017099k295781K293035M217086j156216o971620
32968c334958n710631Q8535L418262L294390L285500L415059N84030m167295n346602
32959d473710j050290L591838L306493l84189k136555o33827L71223j323897k792795
32950e525709j086573J376775M68340k404408j866294K572900M962518K202848
$$ plain form
32942 700397 -69659 925298 5170429 8161816 6731304 4063422 4124233 5178392 3163982
32933 3163982 -1196941 -3339175 -1657342 839563 1337315 149281 -1236025 -2064852
32925 -2064852 -1942427 -881076 111621 465664 1759293 5611949 9999566 10505123 6055646
32916 6055646 1023507 134534 2807494 4290890 1957144 -1120741 284446 6846163
32908 6846163 12938978 12749618 7193592 2583360 2603318 4470585 3931381 1020445 -1110908
32899 -1110908 -506192 2912462 8630294 14495319 16297217 11965065 5238497 1923216
32891 1923216 3191876 5599751 6779854 7472140 8241107 8012898 6462948 4785758 3520738
32882 3520738 2222649 1405879 2019623 3076903 2955124 2832062 4924860 7210281 4810310
$$ packed form
32942G00397p70056R94957M245131K991387j430512k667882O0811J054159k014410
32933C163982m360923k142234J681833K496905M97752j188034j385306q28827
32925b064852J22425J061351R92697L54043J293629L852656M387617N05557m449477
32916F055646n032139q88973K672960J483396k333746l077885J405187O561717
32908F846163O092815j89360n556026m610232J9958J867267n39204k910936k131353
32899a110908O04716L418654N717832N865025J801898m332152o726568l315281
32891A923216J268660K407875J180103O92286P68967k28209j549950j677190j265020
32882C520738j298089q16770O13744J057280j21779j23062K092798K285421k399971
$$ plain form
32873 4810310 -1920435 -5791819 -2296727 3579270 4198369 -236929 -2842930 -14806
32865 -14806 4655777 6256025 4131556 693430 -2157502 -3958837 -5045881 -6285063
32857 -6285063 -8247587 -9866502 -9028448 -5252506 -846927 1461089 1502216 1484304 3092209
32848 3092209 5560815 6805175 5791641 3193379 216410 -2035803 -2103692 1091168
32840 1091168 6036323 8845926 7558910 5045236 5326016 7825006 8190488 4797940
32832 4797940 1250879 1337795 4130054 5773716 4391928 1589809 165736 1402647
32824 1402647 3782851 4063875 890705 -2808517 -3109231 -642701 192715 -1892099 -2795675
32815 -2795675 549469 5209339 6747331 5669280 5638880 7404623 8484396 7524867 5090196
$$ packed form
32873D810310o730745l871384L495092N875997O19099m435298k606001K828124
32865a4806M670583J600248k124469l438126k850932j801335j087044j239182
32857f285063j962524j618915Q38054L775942M405579K308016M1127j7912J607905
32848C092209K468606J244360j013534k598262k976969k252213o7889L194860
32840A091168M945155K809603j287016k513674K80780K498990L65482l392548
32832D797940l547061Q6916K792259J643662j381788k802119j424073J236911
32824A402647K380204K81024l173170l699222l00714K466530Q35416k084814r03576
32815b795675L345144M659870J537992j078051l0400J765743J079773r59529k434671
$$ plain form
32806 5090196 1135500 -4278037 -8366348 -7981184 -4632666 -2989808 -3935477 -3488411 239220
32797 239220 3598946 3249725 1374357 1694566 3381974 2976282 494119 -602782 1059621
32788 1059621 3095199 3513319 3284876 3850770 4727815 4926402 4749940 4690903 4010637
32779 4010637 2021506 -136517 -540033 1127156 3504186 5646961 7985071 11041743
32771 11041743 14072755 15313477 13269852 7946861 1338961 -3576111 -5209549 -4782156
32763 -4782156 -4643086 -5227919 -4713916 -1919880 1608324 3117431 1508127 -1905367 -4723064
32754 -4723064 -4935712 -2027489 2339651 5285508 5305075 3539461 1889269 744811 -471707
32745 -471707 -1560777 -1848811 -1538762 -1155675 -205812 1859922 3790649 3617842 1403743
$$ packed form
32806E090196l954696n413537m088311L85164L348518J642858r45669M47066L727631
32797B39220L359726l49221j875368L20209J687408m05692k482163j096901J662403
32788A059621K035578M18120k28443N65894Q77045J98587j76462n9037o80266
32779D010637j989131k158023m03516J667189K377030K142775K338110L056672
32771A1041743L031012J240722k043625n322991o607900m915072j633438M27393
32763d782156J39070n84833N14003K794036L528204J509107j609304l413494k817697
32754d723064k12648K908223M367140K945857J9567j765614j650192j144458j216518
32745d71707j089070k88034L10049L83087R49863K065734J930727j72807k214099
$$ plain form
32736 1403743 -1088749 -3241044 -5633124 -7172658 -5291015 -328365 2991102 746068
32728 746068 -5029071 -8458352 -6226158 -261050 5106361 6962532 5259189 2052726
32720 2052726 -492667 -1987209 -3576931 -5688014 -6900376 -5683603 -2534754 233284
32712 233284 403838 -2479206 -6472916 -8266721 -6014529 -1253389 2935956 5069381
32704 5069381 5063196 2278245 -3001917 -6825537 -4869937 592506 1740839 -4583521 -12160915
32695 -12160915 -13950361 -10991715 -8536957 -7308222 -4416584 -507061 535487 -1527378
32687 -1527378 -2621690 -1123544 -129893 -1872938 -4357683 -4982269 -3704865 -1351746
32679 -1351746 1618103 3478278 2042408 -1476888 -2940971 -1067767 901412 949916
$$ packed form
32736A403743k492492k152295k392080j539534J881643M962650L319467k245034
32728G46068n775139l429281K232194N965108N367411J856171j703343l206463
32720B052726k545393j494542j589722k111083j212362J216773L148849K768038
32712B33284J70554k883044l993710j793805K252192M761140M189345K133425
32704E069381o185k784951n280162l823620J955600N462443J148333o324360p577394
32695a2160915j789446K958646K454758J228735K891638L909523J042548k062865
32687a527378j094312J498146R93651j743045k484745o24586J277404K353119
32679a351746K969849J860175j435870l519296j464083J873204J969179M8504
$$ plain form
32671 949916 1629368 5058392 8379280 7833118 4643601 2958357 3676764 4095240 2722752
32662 2722752 897008 -204601 -1119850 -2257302 -2806796 -2245583 -1514730 -1980358 -3756344
32653 -3756344 -5275142 -4543045 -1315109 2124257 3437780 3372033 4716804 7958349 10216845
32644 10216845 9379499 7029961 5851621 6087718 6198982 5320691 3478904 1067251 -323864
32635 -323864 1462716 5660266 7578819 3611078 -3997308 -9658357 -10581004 -8279837
32627 -8279837 -5367315 -3478311 -3427313 -4759456 -5631885 -5222640 -5261555 -6894842 -7525282
32618 -7525282 -4081833 1472275 3740483 1056390 -2567083 -3186107 -1158795 1305235
32610 1305235 3383717 4756858 4385542 2283402 415691 -47540 -510920 -2212685 -3653030
$$ packed form
32671I49916O79452L429024L320888n46162l189517j685244P18407M18476j372488
32662B722752j825744j101609r15249j137452n49494N61213P30853m65628j775986
32653c756344j518798P32097L227936L439366J313523o5747J344771L241545K258496
32644A0216845q37346k349538j178340K36097J11264q78291j841787k411653j391115
32635c23864J786580M197550J918553l967741p608386n661049r22647K301167
32627h279837K912522J889004N0998j332143q72429M09245l8915j633287o30440
32618g525282L443449N554108K268208k684093l623473o19024K027312K464030
32610A305235K078482J373141l71316k102140j867711m63231m63380j701765j440345
$$ plain form
32601 -3653030 -2985068 -1420794 -1675529 -3848959 -5380788 -4900717 -3816243 -3702390 -4014653
32592 -4014653 -3253707 -1177118 1112175 2649006 3315833 3257554 2340728 577351 -1191461
32583 -1191461 -1707530 -754260 311263 232817 -232303 861908 3852401 6747282 7836065
32574 7836065 7747407 7798520 7372803 4808343 672924 -2008660 -1732618 -1014334 -3153011
32565 -3153011 -7480457 -10162831 -9647546 -8545552 -8892246 -8277096 -3550825 3198303 6170093
32556 6170093 3396667 -921281 -2727759 -3170520 -5031101 -7234978 -6649916 -3746842
32548 -3746842 -2387794 -4075689 -5995828 -5539150 -3748639 -2897482 -3013597 -2569450 -1042427
32539 -1042427 910100 2731893 3834597 2987054 -476429 -5054093 -8099275 -8585070
$$ packed form
32601c653030O67962J564274k54735k173430j531829M80071J084474J13853l12263
32592d014653P60946K076589K289293J536831O66827n8279r16826j763377j768812
32583a191461n16069R53270J065523p8446m65120J094211K990493K894881J088783
32574G836065q8658N1113m25717k564460m135419k681584K76042P18284k138677
32565c153011m327446k682374N15285J101994l46694O15150M726271O749128K971790
32556F170093k773426m317948j806478m42761j860581k203877N85062K903074
32548c746842J359048j687895j920139M56678J790511Q51157j16115M44147J527023
32539a042427J952527J821793J102704q47543l463483m577664l045182m85795
$$ plain form
32531 -8585070 -7766427 -6907306 -5613493 -3270250 -1077127 -829972 -1627242 40831 5414770
32522 5414770 10300865 9373962 3112882 -2498949 -3504631 -2002515 -1488303 -1706232 -826070
32513 -826070 100151 -1355778 -4534471 -6476662 -6403414 -5844871 -4863396 -2087312 1407310
32504 1407310 2398035 677844 7259 2208603 3860440 1320426 -3808585 -7121789
32496 -7121789 -7332423 -6741699 -6892750 -6645385 -4586366 -1389138 721317 166504 -2278162
32487 -2278162 -3875823 -2731417 -158645 924615 -203977 -1642187 -2144997 -2361569
32479 -2361569 -2348252 -761214 2203921 3875727 2929796 1610861 2050388 2832208 1753883
32470 1753883 -207854 -608311 563689 1688930 2684713 4250164 5314229 4605721 3659557
$$ packed form
32531h585070Q18643Q59121J293813K343243K193123K47155p97270J668073N373939
32522E414770M886095r26903o261080n611831j005682J502116N14212k17929Q80162
32513h26070R26221j455929l178693j942191P3248N58543R81475K776084L494622
32504A407310R90725j720191o70585K201344J651837k540014n129011l313204
32496g121789k10634N90724j51051K47365K059019L197228K110455n54813k444666
32487b278162j597661J144406K572772J083260j128592j438210n02810k16572
32479b361569J3317J587038K965135J671806r45931j318935M39527P81820j078325
32470A753883j961737m00457J172000J125241R95783J565451J064065p08508r46164
$$ plain form
32461 3659557 4592535 5662005 3188917 -2045782 -4607797 -1783114 2475885 2760509
32453 2760509 -1415100 -6291874 -8631803 -7777751 -4633098 -781038 1976078 2706183
32445 2706183 1992994 1164896 1303929 2872386 5372861 7466014 8376839 8778259 9134790
32436 9134790 8083231 4414185 -128168 -2639828 -3273703 -4643611 -6970090 -7320454
32428 -7320454 -4547799 -1406091 -73600 1028777 3531142 5298225 3621573 114062
32420 114062 -1223272 247556 1437786 587305 -497267 333524 2648812 4514954 4717534
32411 4717534 3256693 1002874 -610422 -627997 302261 624684 -278163 -1745260 -3094471
32402 -3094471 -4080572 -4191249 -2812340 -473279 1054884 478964 -1570142 -2962193 -1747011
$$ packed form
32461C659557R32978J069470k473088n234699k562015K824683M258999K84624
32453B760509m175609m876774k339929Q54052L144653L852060K757116P30105
32445B706183p13189q28098J39033J568457K500475K093153R10825M01420L56531
32436I134790j051559l669046m542353k511660o33875j369908k326479l50364
32428g320454K772655L141708J332491J102377K502365J767083j676652l507511
32420A14062j337334J470828J190230q50481j084572Q30791K315288J866142K02580
32411D717534j460841k253819j613296j7575R30258L22423r02847j467097j349211
32402c094471r86101j10677J378909K339061J528163n75920k049106j392051J215182
$$ plain form
32393 -1747011 2165266 6365815 7443269 4207270 -537304 -2410562 -44602 3351962
32385 3351962 3466457 -414809 -4751846 -5932164 -4484939 -4116355 -6561311 -9184302
32377 -9184302 -9096914 -7991082 -9971805 -15058423 -18379887 -16720703 -12471964 -9300695
32369 -9300695 -7197291 -4636291 -2753895 -3428412 -4965494 -4033404 -1206207 -271614 -1926493
32360 -1926493 -2494188 9406 2509247 1528898 -1921484 -4405864 -4653458 -3866995 -3355514
32351 -3355514 -3979420 -6260086 -8889541 -8677217 -4381778 539585 1497337 -1571353 -4456799
32342 -4456799 -4182848 -1845828 97955 948485 1299649 1261648 487330 -784444 -1697392
32333 -1697392 -1614732 -663850 306177 295498 -838304 -1903722 -1509927 97805 922021
$$ packed form
32393a747011L912277M200549J077454l235999m744574j873258K365960L396564
32385C351962J14495l881266m337037j180318J447225L68584k444956k622991
32377i184302Q7388J105832j980723n086618l321464J659184M248739L171269
32369i300695K103404K561000J882396o74517j537082R32090K827197R34593j654879
32360a926493n67695K503594K499841r80349l450382k484380k47594P86463N11481
32351c355514o23906k280666k629455K12324M295439M921363R57752l068690k885446
32342d456799K73951K337020J943783Q50530L51164l8001p74318j271774r12948
32333a697392Q2660R50882R70027j0679j133802j065418L93795J607732Q24216
$$ plain form
32324 922021 -512522 -2993861 -3475308 -524647 3528971 4808666 2334386 -855399
32316 -855399 -1617530 -460322 -60823 -1164303 -2100578 -1893999 -1268052 -248893 2536695
32307 2536695 7004533 10340043 10207439 7514614 4494774 1841525 -502516 -1612567
32299 -1612567 -1063469 -748439 -2498396 -4713556 -4142278 -685803 2286051 2551519 1458686
32290 1458686 1201160 1861154 2073785 1107706 -518755 -1542367 -842116 1268062 2862585
32281 2862585 2590346 1392626 604092 -582901 -3413055 -6178123 -5694483 -2124358 1000029
32272 1000029 2015439 2782775 4008466 2906023 -1971893 -6913652 -7538163 -4945279
32264 -4945279 -3733334 -5152304 -5986492 -4039370 -1279220 -636105 -2036612 -2877319 -1308154
$$ packed form
32324I22021j434543k481339m81447K950661M053618J279695k474280l189785
32316h55399p62131J157208L99499j103480r36275K06579O25947J019159K785588
32307B536695M467838L335510j32604k692825l019840k653249k344041j110051
32299a612567N49098L15030j749957k215160N71278L456475K971854K65468j092833
32290A458686k57526O59994K12631r66079j626461j023612P00251K110178J594523
32281B862585k72239j197720p88534j186993k830154k765068M83640L570125L124387
32272A000029J015410P67336J225691j102443m877916m941759o24511K592884
32264d945279J211945j418970q34188J947122K760150O43115j400507q40707J569165
$$ plain form
32255 -1308154 1762228 3617239 2779884 1205905 2255401 5783170 7093728 2659234
32247 2659234 -4639475 -8616232 -7289292 -4341690 -3271146 -3365852 -2509231 -1176574 -1563814
32238 -1563814 -4074206 -6473829 -6208127 -2739309 1991936 5044016 5088841 3881425 4391510
32229 4391510 7242435 9871236 9488828 5955493 1431118 -1787302 -2570178 -1115163
32221 -1115163 1261440 2797063 2321798 -223370 -3900055 -6874208 -6981536 -3515122
32213 -3515122 1393022 4271611 3575571 772535 -1779378 -2978947 -2905926 -1900230 -407184
32204 -407184 967998 1762279 1674356 405013 -1810184 -3764671 -4437001 -4428898 -5044636
32195 -5044636 -6128338 -6368686 -5725912 -5622761 -6291032 -6009890 -3996249 -2136961 -2333626
$$ packed form
32255a308154L070382J855011q37355j573979J049496L527769J310558m434494
32247B659234p298709l976757J326940K947602J070544r4706Q56621J332657l87240
32238a563814k510392k399623K65702L468818M731245L052080M4825j207416N10085
32229D391510K850925K628801l82408l533335m524375l218420p82876J455015
32221a115163K376603J535623m75265k545168l676685k974153j07328L466414
32213c515122M908144K878589o96040k803036k551913j199569P3021J005696J493046
32204d07184J375182P94281q7923j269343k215197j954487o72330Q103o15738
32195e044636j083702k40348O42774J03151o68271K81142K013641J859288j96665
$$ plain form
32186 -2333626 -3601987 -3512231 -1446301 1222291 3209436 3724788 1640411 -3277804 -8161302
32177 -8161302 -8440130 -2765499 4695455 8234155 6366581 2523587 334858 -176566
32169 -176566 -975439 -2040798 -1150619 2286646 5463519 5698513 4164251 3977780 5428676
32160 5428676 5656136 3155223 163622 -350732 1636813 3527203 2920099 -485192 -4652776
32151 -4652776 -6467688 -4467829 -609531 1936543 2585265 3083232 3719853 2653495 -334508
32142 -334508 -2492966 -2077743 -1024341 -1731325 -3530586 -4481630 -4502134 -4356828 -3483947
32133 -3483947 -1365533 591451 1032390 968046 1739911 2424204 1815807 1028700 1117254
32124 1117254 160064 -3592230 -7409169 -7219898 -3964664 -2323820 -3689237 -4979152
$$ packed form
32186b333626j268361Q9756K065930K668592J987145N15352k084377m918215m883498
32177h161302k78828N674631P460954L538700j867574l842994k188729n11424
32169a76566p98873j065359Q90179L437265L176873K34994j534262j86471J450896
32160E428676K27460k500913k991601n14354J987545J890390o07104l405291m167584
32151d652776j814912J999859L858298K546074O48722M97967O36621j066358k988003
32142c34508k158458M15223J053402p06984j799261r51044k0504J45306Q72881
32133c483947K118414J956984M40939o4344P71865O84293o08397p87107Q8554
32124A117254r57190l752294l816939J89271L255234J640844j365417j289915
$$ plain form
32116 -4979152 -4238850 -2621487 -527081 3190005 7151691 7521695 3812198 178802
32108 178802 -810098 -1196080 -2515844 -2625826 -500829 600541 -1464131 -3417944 -1982581
32099 -1982581 242784 -689117 -2916130 -1876968 1622698 2553500 -118816 -2290030
32091 -2290030 -1707171 -426970 362782 2465682 5993753 7473980 5025286 1485853
32083 1485853 -51573 -296346 -826136 -592951 1363794 2596840 560637 -2624640 -2835255
32074 -2835255 -478553 -198038 -3849241 -7712100 -8078981 -6344790 -6152173 -7670054 -7758300
32065 -7758300 -5069166 -1966477 -784618 -597681 747057 2863449 3091722 153102
32057 153102 -4124916 -6895895 -6937131 -5113917 -3297615 -2878733 -3293585 -2226237 1285673
$$ packed form
32116d979152P40302J617363K094406L717086L961686L70004l709497l633396
32108A78802r88900l85982j319764j09982K124997J101370k064672j953813J435363
32099a982581K225365r31901k227013J039162L499666R30802k672316k171214
32091b290030N82859J280201P89752K102900L528071J480227k448694l539433
32083A485853j537426k44773n29790K33185J956745J233046k036203l185277k10615
32074b835255K356702K80515l651203l862859l66881J734191J92617j517881q8246
32065g758300K689134L102689J181859J86937J344738K116392K28273k938620
32057A53102m278018k770979m1236J823214J816302M18882m14852J067348L511910
$$ plain form
32048 1285673 4301767 2888015 -2088114 -4977223 -2639143 1084596 747617 -3050025
32040 -3050025 -4811009 -1833000 2941188 5799137 6538471 6840772 7104526 6611598 5311542
32031 5311542 3933347 2965114 2247816 1124487 -1001422 -3472553 -4142165 -1686760 2124319
32022 2124319 4130598 3681254 3027904 3712107 4542212 3676345 949300 -2436027 -4882627
32013 -4882627 -4673074 -1260992 2993556 4409752 2371815 303159 1124344 3610432
32005 3610432 4721207 3776240 2396183 1561962 820137 -143267 -850644 -803741 129306
31996 129306 1755369 3290127 3702300 2935939 1937186 996922 -618015 -2686261 -3349828
31987 -3349828 -1678498 533264 1030252 -19719 -824151 -452764 951165 3237391 5911793
$$ packed form
32048A285673L016094j413752m976129k889109K338080L723739l36979l797642
32040c050025j760984K978009M774188K857949P39334L02301K63754m92928j300056
32031E311542j378195r68233p17298j123329k125909k471131o69612K455405L811079
32022B124319K006279m49344o53350O84203Q30105q65867k727045l385327k446600
32013d882627K09553L412082M254548J416196k037937k068656Q21185K486088
32005C610432J110775r44967j380057q34221p41825r63404p07377M6903R33047
31996A29306J626063J534758M12173p66361r98753r40264j614937k068246o63567
31987c349828J671330K211762M96988j049971q04432L71387J403929K286226K674402
$$ plain form
31978 5911793 7765811 8253478 8039519 6997673 3668972 -1447425 -4475744 -2951736
31970 -2951736 30219 51183 -1994365 -1901831 375945 683333 -1732282 -2438021 419412
31961 419412 2052036 -1622666 -6775196 -6466681 -207672 5896659 7349293 5315174
31953 5315174 2787842 799027 -583333 -552305 1377378 3993744 5264598 4136173
31945 4136173 1325911 -1110460 -1344475 325704 1674868 1388086 607644 416037 -722163
31936 -722163 -4613992 -9274635 -10264980 -6483060 -1930121 -631506 -1994094 -2680240 -1343284
31927 -1343284 435680 1049633 811721 970519 1995036 3251320 3969560 4240433 4818098
31918 4818098 5701246 5385632 2442541 -2251194 -5904976 -6597977 -4721809 -1634349 1726741
$$ packed form
31978E911793J854018M87667k13959j041846l328701n116397l028319J524008
31970b951736K981955K0964k045548R2534K277776L07388k415615p05739K857433
31961D19412J632624l674702n152530L08515O259009O104331J452634k034119
31953E315174k527332j988815j382360L1028J929683K616366J270854j128425
31945D136173k810262k436371k34015J670179J349164k86782p80442j91607j138200
31936g22163l891829m660643r90345L781920M552939J298615j362588o86146J336956
31927a343284J778964O13953k37912J58798J024517J256284P18240K70873N77665
31918D818098Q83148l15614k943091m693735l653782o93001J876168L087460L361090
$$ plain form
31909 1726741 4474379 5622635 5422891 5683576 7426496 9042429 8212077 5131677 2267157
31900 2267157 1025439 261884 -1477925 -3568711 -4096218 -2351634 445112 2728674
31892 2728674 3983589 4311388 3467686 1313874 -981659 -1517856 -123211 777890 -1078213
31883 -1078213 -4854604 -7803441 -8765838 -8573892 -7323013 -4012002 288391 1757899
31875 1757899 -1536520 -6199412 -7179015 -3766807 401269 2335151 1991661 190797
31867 190797 -2640522 -5294104 -6156866 -5608129 -5673660 -6467545 -5550525 -2149555 591015
31858 591015 -289400 -3225343 -4408739 -3031158 -1556892 -1585094 -2246248 -2579174 -2852681
31849 -2852681 -3100690 -2661430 -1913433 -2407846 -4276655 -5394009 -4445410 -3138934 -3532055
$$ packed form
31909A726741K747638J148256j99744K60685J742920J615933q30352l080400k864520
31900B267157j241718p63555j739809k090786n27507J744584K796746K283562
31892B728674J254915L27799q43702k153812k295533n36197J394645R01101j856103
31883a078213l776391k948837r62397J91946J250879L311011M300393J469508
31875A757899l294419m662892r79603L412208M168076J933882l43490j800864
31867A90797k831319k653582q62762N48737o5531p93885R17020L400970K740570
31858E91015q80415k935943j183396J377581J474266k8202o61154l32926k73507
31849b852681k48009M39260P47997m94413j868809j117354R48599J306476l93121
$$ plain form
31840 -3532055 -4398132 -2622773 2052925 6026292 6251970 3879327 2286068 2774451 3900589
31831 3900589 4463357 5041942 6014301 5921513 3502482 546110 638936 4662683 9116245
31822 9116245 9886990 6683231 2679606 634742 766815 1922733 2952714 2614345 -63262
31813 -63262 -4146141 -6676695 -5623068 -2382748 -378 636579 1104813 2056247 1862913
31804 1862913 -187710 -1379178 1378047 6777825 9979707 8490548 4985832 3542448
31796 3542448 5060955 7558635 9129237 8928978 6705546 3416850 1428231 2084074
31788 2084074 3687705 3746638 2441357 1636421 1194590 -794145 -4153147 -6115914 -5377502
31779 -5377502 -3763354 -2869228 -2010397 -1045526 -2274081 -7139237 -13251564 -17120398 -18002056
$$ packed form
31840c532055q66077J775359M675698L973367K25678k372643j593259M88383J126138
31831C900589N62768N78585R72359r2788k419031k956372R2826M023747M453562
31822I116245P70745l203759m003625k044864J32073J155918J029981l38369k677607
31813f3262m082879k530554J053627L240320K382370O36957M68234R51434j93334
31804A862913k050623j191468K757225N399778L201882j489159l504716j443384
31796C542448J518507K497680J570602k00259k223432l288696j988619O55843
31788B084074J603631N8933j305281q04936m41831j988735l359002j962767P38412
31779e377502J614148Q94126Q58831R64871j228555m865156o112327l868834q81658
$$ plain form
31770 -18002056 -16787391 -13298928 -7770593 -3220197 -2638290 -4615916 -5182712 -3388572
31762 -3388572 -1524368 -241373 2347750 6094064 7502222 4747431 693378 -1177631
31754 -1177631 -1077894 -895922 -413496 1526975 3763133 3925528 2194502 1085622 1468262
31745 1468262 1429682 -175296 -1414481 -322859 1084026 -1532824 -8639800 -14523269
31737 -14523269 -13304464 -6340021 -867264 -1051373 -3549867 -3486551 -1448078 -1178307 -2725854
31728 -2725854 -2532154 351962 2825546 3016792 2663216 2972192 2205519 -565447 -2866130
31719 -2866130 -2577146 -1464921 -2272943 -4542174 -5856801 -5257402 -3044908 799370 5480368
31710 5480368 8483543 8315499 6612725 5448549 4559010 3434235 3505696 5134538 4953843
$$ packed form
31770a8002056J214665L488463N528335M550396N81907j977626n66796J794140
31762c388572J864204J282995K589123L746314J408158k754791m054053j871009
31754a177631R9737J81972M82426J940471K236158J62395j731026j108880L82640
31745A468262l8580j604978j239185J091622J406885k616850p106976n883469
31737a4523269J218805O964443N472757j84109k498494O3316K038473K69771j547547
31728b725854J93700K884116K473584J91246l53576L08976p66673k770966k300683
31719b866130K88984J112225q08022k269231j314627N99399K212494L844278M680998
31710E480368L003175j68044j702774j164176q89539j124775P1461J628842j80695
$$ plain form
31701 4953843 175439 -6270680 -9041991 -7458803 -5131551 -3891216 -2828328 -2445115
31693 -2445115 -4341823 -6650015 -5276674 -812038 984890 -2596689 -7365979 -8998803
31685 -8998803 -9065810 -10972096 -13684627 -13610941 -10383900 -6902337 -4874126 -3507243 -1949370
$$ packed form
31701D953843m778404o446119k771311J583188K327252J240335J062888L83213
31693b445115j896708k308192J373341M464636J796928l581579m769290j632824
31685h998803o7007j906286k712531P3686L227041L481563K028211J366883J557873
$$ [...]
##END NTUPLES=NMR SPECTRUM
##END=
