##TITLE=31Pdec_ANY-157C-1
 CDCl3, 24 sc
 5.6.2019
##JCAMPDX= 6.0         $$ Bruker NMR JCAMP-DX V2.0
##DATA TYPE= NMR SPECTRUM
##DATA CLASS= NTUPLES
##ORIGIN= UXNMR, Bruker Analytische Messtechnik GmbH
##OWNER= root
$$ XWIN-NMR		Version 3.5
$$ Wed Jun  5 14:35:13 2019 Russian Standard Time (UT+4h)  she@DPX200
##.OBSERVE FREQUENCY= 81.013821
##.OBSERVE NUCLEUS= ^31P
##.ACQUISITION MODE= SIMULTANEOUS
##.ACQUISITION SCHEME= undefined
##.AVERAGES= 24
##.DIGITISER RES= 17
##SPECTROMETER/DATA SYSTEM= spect
##.PULSE SEQUENCE= zgpg30
##.SOLVENT NAME= DMSO
##.SHIFT REFERENCE= (INTERNAL, DMSO, 0, 182.463)
##AUDIT TRAIL= $$ (NUMBER, WHEN, WHO, WHERE, WHAT)
$$ ##TITLE= Audit trail, XWIN-NMR		Version 3.5
$$ ##JCAMPDX= 5.01
$$ ##ORIGIN= Bruker BioSpin GmbH
$$ ##OWNER= she
$$ F:/spectra/data/she/nmr/P31/1/pdata/1/auditp.txt
$$ ##AUDIT TRAIL=  $$ (NUMBER, WHEN, WHO, WHERE, WHAT)
(   1,<2019-06-05 14:34:12.31 +0400>,<she>,<DPX200>,
      <created by zg, POWCHK disabled, PULCHK disabled
       configuration hash MD5:
       00 E9 B6 7A A2 85 ED C7 34 08 36 98 17 FE 4E 26
       data hash MD5: 32K
       7B 78 CA EB 82 67 0F FC 8D 57 CA 06 C0 2E C3 EF>)
(   2,<2019-06-05 14:34:15.28 +0400>,<she>,<DPX200>,
      <Start of raw data processing
       efp BC_mod = 2 LB = 1 FT_mod = 6 PKNL = 1 PHC0 = -2173.574 PHC1 = 46.39912 SI = 64K 
       data hash MD5: 64K
       8E 13 3C 7B AC 99 08 67 48 ED C6 BA AD BF 8C D5>)
(   3,<2019-06-05 14:34:42.50 +0400>,<she>,<DPX200>,
      <pk PHC0 = 5.722146 PHC1 = 0 
       data hash MD5: 64K
       14 9C 82 68 3B 8A D5 EA 43 ED BC 81 97 4A 5C 6F>)
$$ ##END=
$$ 
$$ hash MD5
$$ 40 BC AF F0 44 DC 24 FE C6 23 B7 84 D7 AE D3 EC
##$RELAX= 
##$RELAX= 
##$RELAX= 
##$RELAX= 
##$RELAX= 
##$RELAX= 
##$RELAX= 
##$RELAX= 
$$ Bruker specific parameters
$$ --------------------------
##$DU= <F:/spectra>
##$EXPNO= 1
##$NAME= <P31>
##$PROCNO= 1
##$TYPE= <nmr>
##$USER= <she>
##$AMP= (0..31)
100 100 100 100 100 100 100 100 100 100 100 100 100 100 100 100 100 100 
100 100 100 100 100 100 100 100 100 100 100 100 100 100 
##$AQSEQ= 0
##$AQ_mod= 1
##$AUNM= <au_zg>
##$AUTOPOS= <>
##$BF1= 81.014009
##$BF2= 200.13
##$BF3= 200.13
##$BF4= 200.13
##$BF5= 200.13
##$BF6= 200.13
##$BF7= 200.13
##$BF8= 200.13
##$BYTORDA= 1
##$CFDGTYP= 0
##$CFRGTYP= 5
##$CHEMSTR= <none>
##$CNST= (0..31)
1 1 145 1 1 1 1 1 1 1 1 1 1 1 1 1 1 1 1 1 1 1 1 1 1 1 1 1 1 1 1 1 
##$CPDPRG= <waltz16>
##$CPDPRG1= <>
##$CPDPRG2= <waltz16>
##$CPDPRG3= <>
##$CPDPRG4= <mlev>
##$CPDPRG5= <mlev>
##$CPDPRG6= <mlev>
##$CPDPRG7= <mlev>
##$CPDPRG8= <mlev>
##$CPDPRGB= <>
##$CPDPRGT= <>
##$D= (0..31)
0 1 0 0 0 0 0 0 0 0 0 0.03 2e-05 3e-06 0 0 0 0 0 0 0 0 0 0 0 0 0 0 0 0 
0 0 
##$DATE= 1559730851
##$DBL= (0..7)
120 120 120 11 120 120 24 19 
##$DBP= (0..7)
150 150 150 150 150 150 150 150 
##$DBP07= 0
##$DBPNAM0= <>
##$DBPNAM1= <>
##$DBPNAM2= <>
##$DBPNAM3= <>
##$DBPNAM4= <>
##$DBPNAM5= <>
##$DBPNAM6= <>
##$DBPNAM7= <>
##$DBPOAL= (0..7)
0.5 0.5 0.5 0.5 0.5 0.5 0.5 0.5 
##$DBPOFFS= (0..7)
0 0 0 0 0 0 0 0 
$$ [...]
##$SUBNAM2= <"">
##$SUBNAM3= <"">
##$SUBNAM4= <"">
##$SUBNAM5= <"">
##$SUBNAM6= <"">
##$SUBNAM7= <"">
##$SUBNAM8= <"">
##$SUBNAM9= <"">
##$SW= 369.568048894756
##$SWIBOX= (0..15)
0 1 3 0 0 0 0 0 0 0 0 0 0 0 0 0 
##$SW_h= 29940.119760479
##$TD= 32768
##$TD0= 1
##$TE= 0
##$TE2= 300
##$TE3= 300
##$TEG= 300
##$TL= (0..7)
0 120 53 12 22 120 120 120 
##$TP= (0..7)
150 150 150 150 150 150 150 150 
##$TP07= 0
##$TPNAME0= <>
##$TPNAME1= <>
##$TPNAME2= <>
##$TPNAME3= <>
##$TPNAME4= <>
##$TPNAME5= <>
##$TPNAME6= <>
##$TPNAME7= <>
##$TPOAL= (0..7)
0.5 0.5 0.5 0.5 0.5 0.5 0.5 0.5 
##$TPOFFS= (0..7)
0 0 0 0 0 0 0 0 
##$TUNHIN= 0
##$TUNHOUT= 0
##$TUNXOUT= 0
##$USERA1= <user>
##$USERA2= <user>
##$USERA3= <user>
##$USERA4= <user>
##$USERA5= <user>
##$V9= 5
##$VALIST= <valist>
##$VCLIST= <CCCCCCCCCCCCCCC>
##$VD= 0
##$VDLIST= <DDDDDDDDDDDDDDD>
##$VPLIST= <PPPPPPPPPPPPPPP>
##$VTLIST= <TTTTTTTTTTTTTTT>
##$WBST= 1024
##$WBSW= 4
##$XGAIN= (0..3)
0 0 0 0 
##$XL= 0
##$YL= 0
##$YMAX_a= 37059
##$YMIN_a= -41100
##$ZGOPTNS= <>
##$ZL1= 120
##$ZL2= 120
##$ZL3= 120
##$ZL4= 120
##$ABSF1= 0
##$ABSF2= 0
##$ABSG= 0
##$ABSL= 0
##$ALPHA= 0
##$AQORDER= 0
##$ASSFAC= 0
##$ASSFACI= 0
##$ASSFACX= 0
##$ASSWID= 0
##$AUNMP= <proc_1d>
##$AZFE= 0.1
##$AZFW= 0.5
##$BCFW= 0
##$BC_mod= 2
##$BYTORDP= 0
##$COROFFS= 0
##$CY= -3
##$DATMOD= 1
##$DC= 0
##$DFILT= <>
##$DTYPP= 0
##$F1P= 0
##$F2P= 0
##$FCOR= 1
##$FTSIZE= 65536
##$FT_mod= 6
##$GAMMA= 0
##$GB= 0
##$INTBC= 1
##$INTSCL= 5.30512e-09
##$ISEN= 30
##$LB= 1
##$LEV0= 0
##$LPBIN= 0
##$MAXI= 10000
##$MC2= 0
##$MEAN= 0
##$ME_mod= 0
##$MI= 50
##$NCOEF= 0
##$NC_proc= -2
##$NLEV= 6
##$NOISF1= 182.463
##$NOISF2= 159.3651
##$NSP= 0
##$NTH_PI= 0
##$NZP= 0
##$OFFSET= 182.463
##$PC= 4
##$PHC0= -2167.852
##$PHC1= 46.39912
##$PH_mod= 1
##$PKNL= yes
##$PPARMOD= 0
##$PSCAL= 0
##$PSIGN= 0
##$REVERSE= no
##$SF= 81.0140089999434
##$SI= 65536
##$SIGF1= 159.3651
##$SIGF2= -187.1042
##$SINO= 113.3802
##$SIOLD= 16384
##$SREGLST= <1H.CDCl3>
##$SSB= 0
##$STSI= 65536
##$STSR= 0
##$SW_p= 29940.119760479
##$SYMM= 0
##$S_DEV= 0
##$TDeff= 32768
##$TDoff= 0
##$TI= <>
##$TILT= no
##$TM1= 0
##$TM2= 0
##$TOPLEV= 0
##$USERP1= <user>
##$USERP2= <user>
##$USERP3= <user>
##$USERP4= <user>
##$USERP5= <user>
##$WDW= 1
##$XDIM= 65536
##$YMAX_p= 284268396
##$YMIN_p= -1903361
$$ End of Bruker specific parameters
$$ ---------------------------------
##NTUPLES= NMR SPECTRUM
##VAR_NAME=  FREQUENCY,     SPECTRUM/REAL,   SPECTRUM/IMAG
##SYMBOL=    X,             R,               I
##VAR_TYPE=  INDEPENDENT,   DEPENDENT,       DEPENDENT
##VAR_FORM=  AFFN,          ASDF,            ASDF
##VAR_DIM=   65536,         65536,           65536
##UNITS=     HZ,            ARBITRARY UNITS, ARBITRARY UNITS
##FACTOR=    0.456856943014862, 1,           1
##FIRST=     14782.0589164792, 0,            0
##LAST=      -15158.0608439998, 0,           0
##MIN=       -15158.0608439998, -1903361,    0
##MAX=       14782.0589164792, 284268396,    0
$$ Real data points
##PAGE= N=1
##DATA TABLE= (X++(R..R)), XYDATA
$$ [...]
38047A32061q4959o8326Q383N2794K6992p411K773J4236l7685j18047j20032r466
38035b08687J18135J42972N0881n9694q7885l6674o36l8707q4311l2893R1202
38024a46297J40040M4092q1001r6649l0561m714l1732j0760Q7439J60021J25215
38013A55093L2568k7219m4146o3890r4046r4058l8569M5258R7989P9210J2426
38002F0616l2111k4381j8075o0942r5567l0186J04666J68827R7998j9470q4856
37991F6519j09490j32983j14177k851J31689J52956L4780r6473j13572k5590N7947
37980a51245O1936J5952j534L1051N1540Q074n0529l5669L8317N6573k2597q7520
37968h5651l5345O3540O7453j8144n1161K4087R3068M6241p1532j47627j50421
$$ plain form
38047 132061 47102 -21224 -12841 39953 66945 59534 62307 76543 38858 -79189 -199221 -208687
38035 -208687 -90552 52420 103301 43607 -44278 -80952 -81588 -120295 -204606 -237499 -146297
38024 -146297 -6257 37835 -43166 -139815 -170376 -175090 -206822 -217582 -130143 29878 155093
38013 155093 187661 160442 116296 52406 -41640 -135698 -174267 -129009 -31020 48190 60616
38002 60616 28505 4124 -13951 -74893 -170460 -200646 -95980 72847 170845 151375 66519
37991 66519 -42971 -175954 -290131 -292982 -161293 -8337 26443 -70030 -183602 -209192 -151245
37980 -151245 -89309 -73357 -74891 -43840 7700 15774 -34755 -70424 -32107 24466 1869 -85651
37968 -85651 -120996 -57456 9997 -8147 -59308 -35221 57847 104088 32556 -115071 -265492
37957b65492j17411o5014K685M4007L0875J8535P0469J35703J07066j441n4050
37946i4068K970N7064J0950o1498l8457N2331P9516Q663o3135n9620m820M8916
37934f1188P3074L9004n9020j43585j14165J1907J09070J09261N8979J44p9069
37923e5588j41946r7236L5221R4222Q392p6611k0200R4707J13141N8570N0679
37912F3351O7770L021r7070p7162N3740J14327M0395k6721R669O0532L3104k5013
37900B19943n0163o9480r3352n5434M3944Q5109K2679j9767L6537P4070j7162
37889A76924j32691j18877j9220K5480J3822K8393L9591k5692r4066m5660N0008
37878a01988L0539o2858l7424J07600J59351N3315j8347M8602Q5818l8765j66710
$$ plain form
37957 -265492 -382903 -447917 -445232 -401225 -370350 -351815 -281346 -145643 -38577 -40018 -94068
37946 -94068 -91098 -34034 -23084 -84582 -123039 -70708 8808 17471 -45664 -105284 -110104 -61188
37934 -61188 11886 50890 -8130 -151715 -265880 -253973 -144903 -35642 23337 23481 -55588
37923 -55588 -197534 -294770 -259549 -165327 -156935 -233546 -253746 -159039 -45898 12672 63351
37912 63351 131121 134142 37072 -40090 13650 127977 168372 141651 151320 211852 244956 219943
37900 219943 169780 100300 6948 -48486 -4542 80567 103246 83479 120016 194086 176924
37889 176924 44233 -74644 -93864 -68384 -54562 -26169 13422 -12270 -106336 -151996 -101988
37878 -101988 -71449 -134307 -171731 -64131 95220 148535 130188 178790 264608 225843 59133
37867E9133j05092N0059P5867k3688o6537j3516L939n0853o1121J2497M9398j9189
37855h9103q7253n2049K0417J5663m0774l5569M2642Q3189J9358p8128j00601
37844c02208l3912M8627R0381R7533Q8957N7315O941j6324J3849M1978j902q4183
37832G052r9182k8059K5374o998n4916k7455M6481P7171N2335K6562J7389K904
37820C8658j0394n917j3080n6304q0265k5064N3137M9468k1551n0385j6888r575
37808a48160m7553l7236M6589Q9001K3864m4247j1882N2698M0872K212N1380J41127
37796A58665J08551n8505j70918j00009M2613O4470n4017j53341j06736L8418
37786b30809J36792J14768L1665j8260k1301k6735m3710k7080K8361N9673L7231
$$ plain form
37867 59133 -45959 4100 79967 56279 -10258 -23774 -19835 -70688 -131809 -119312 -69914 -89103
37855 -89103 -176356 -228405 -207988 -192325 -233099 -268668 -226026 -142837 -123479 -201607 -302208
37844 -302208 -336120 -287493 -197112 -99579 -10622 46693 53634 37310 51159 93137 91235 7052
37832 7052 -92130 -120189 -94815 -101813 -156729 -184184 -137703 -60532 -8197 18365 35754 38658
37820 38658 28264 22347 9267 -47037 -127302 -152366 -99229 -49761 -71312 -121697 -138585 -148160
37808 -148160 -195713 -232949 -186360 -97359 -73495 -117742 -129624 -76926 -36054 -33842 17538 158665
37796 158665 267216 208711 37793 -62216 -19603 44867 -9150 -162491 -269227 -230809
37786 -230809 -94017 20751 52416 34156 12855 -13880 -57590 -84670 -56309 3364 40595
37775D0595K1063O3069J16712J06543L4383m4121r5507j03531n3631J1870M12
37764I7857q7796j12718K425J17227O8829o4778q1016K4483O6309j4956p4703
37753e8837l1809J3407j537J8624J20738J73447P8251n5637q9951o2112o4124
37742D0460o1770k556K7332n5011j35511n5691J16269J74130Q4164L950K0267
37731A56033O7168R2595J11117Q9616k6458j59268j62981o5270m7179j43965j77362
37720b65954n8061N8328L4426k5491K5892J16748Q5285l4033n7457N9347J65785
37709A04815J50178P1388K4957M566m2591j03559j13710n5026J1552K0255j4138
37698E8687j2351N6414J11108N5422q1988j72052j50008q0015l9917k2571J2480
$$ plain form
37775 40595 61658 124727 241439 347982 382365 338244 242737 139206 85575 97445 97857
37764 97857 10061 -102657 -100232 16995 85824 21046 -59970 -35487 30822 15866 -58837
37753 -58837 -90646 -77239 -78776 -60152 60586 234033 312284 256647 166696 104584 40460
37742 40460 -21310 -23866 3466 -51545 -187056 -242747 -126478 47652 131816 135766 156033
37731 156033 223201 315796 426913 516529 490071 330803 167822 102552 55373 -88592 -265954
37720 -265954 -324015 -265687 -231261 -256752 -230860 -114112 -28827 -62860 -120317 -60970 104815
37709 104815 254993 326381 351338 355904 313313 209754 96044 41018 52570 72825 58687
37698 58687 46336 102750 213858 269280 187292 15240 -134768 -214783 -254700 -277271 -264791
37687b64791O1476R7591J12639R7927M0353k6757l4196J9481M4303q267n9363
37676H0396j9012P2055J01043M5761p351L163L5701J5278o0413j08057n4666N5960
37664A59858Q7624k0072j51562j59696p0191k5682m9576k4654P3553J04442N8
37653g5898r5938m6939O2685P4434j402m2665j9379J4714N3215J04240J02031
37642A29098R720o5526k8669J4255p7958k01537j35178Q6681J93228Q6888l2581
37631b1579j5153L0489j3675n8834k769O0285J1220o6474l0215O4061N3582n2449
37619d1511q8893m281O9678L2657n0653o9769j2644N2829P2383M7786K1765K7458
37607E6805L7708j870o8500o2030L8003J01443K6735q7502p8519L0163P1752N990
$$ plain form
37687 -264791 -203315 -105724 6915 104842 145195 118438 84242 103723 148026 139759 80396
37676 80396 61384 133439 234482 280243 272892 276055 311756 327034 266621 158564 103898 159858
37664 159858 247482 227410 75848 -83848 -154039 -179721 -229297 -253951 -180398 -75956 -75898
37653 -75898 -171836 -218775 -156090 -81656 -83058 -125723 -145102 -130388 -77173 27067 129098
37642 129098 138818 73292 44623 58878 -19080 -220617 -355795 -269114 -75886 11002 -21579
37631 -21579 -36732 -6243 -19918 -78752 -81521 -21236 -10016 -76490 -106705 -42644 10938 -41511
37619 -41511 -130404 -134685 -65007 -32350 -83003 -152772 -165416 -112587 -40204 7582 29347 56805
37607 56805 94513 92643 24143 -37887 116 101559 128294 40792 -37727 -7564 64188 70178
37595G0178l3144J5386L0019o9914j53125p0973Q6556J03142m1665j41023o5355
37584b69918O6665R0284L1357K4391Q2109R3971K8294j2799K9135O3546n321j20469
37572A01245j48637o0213N4635J14522J09391O0803K342j6627J4004K2039n3497
37561B00007j44363j27296j0554O4623K4535m7499n6496k0178N126K0181L4085
37550e7829R344o2648j04546n7093J9575L2816q066l0540k1898j7719n967N1603
37538b52968J18189J05890Q919p3843o8164o812L7709M2044K5473L84l4434o7884
37526a65497p0054k1405M8796P1049J5929m5334j7866P6752J14493M5673l2938
37515A9598l1161N206m613l5581k0156K0404K5020J4216L6034M2170l6561j26681
$$ plain form
37595 70178 37034 52420 82439 12525 -140600 -211573 -125017 -21875 -63540 -204563 -269918
37584 -269918 -203253 -112969 -81612 -57221 24888 118859 147153 134354 163489 227035 221714 101245
37572 101245 -47392 -107605 -52970 61552 170943 231746 234088 217461 231465 253504 200007
37561 200007 55644 -71652 -82206 -17583 6952 -40547 -97043 -117221 -112095 -91914 -57829
37550 -57829 -48485 -111133 -215679 -272772 -253197 -220381 -228447 -258987 -280885 -298604 -304571 -252968
37538 -252968 -134779 -28889 -19970 -93813 -161977 -168789 -131080 -89036 -63563 -63179 -97613 -165497
37526 -165497 -235551 -256956 -208160 -137111 -121182 -166516 -184382 -107630 6863 52536 19598
37515 19598 -11563 -6357 -10970 -46551 -66707 -46303 -21283 -7067 28967 71137 34576 -92105
37503i2105q9103M7794J06664L5088j8756L7630Q6533O286j16602j20569j2918
37492a30058O4203N0369J2755O074R308k232j8689l4896n6292o5347l9414M959
37480a99260L3743M3407M1649J2900m0232n9807r638M5190K3044l7260k9227M0438
37468a35053M5730n6693j39571q5980L8188Q6635M3876K3099P5643J16644O6299
37457G8817k7307o8087n6728p1441j19145j01550K7344J44980R6043p6045j45576
37446c18695P372K21487K53049Q6669o9227p4756r792K37k3759N401N8550K5475
37434A62011q8599j37450m2175Q0812P4676m1267j03875l2921P1523Q1665J1565
37423C5965k8334o96K0491j6079n1693j5440M8164L3115o0070j02397j4365J10581
$$ plain form
37503 -92105 -181208 -133414 -26750 8338 -10418 27212 113745 120031 3429 -117140 -130058
37492 -130058 -65855 -15486 -2731 3343 12651 10419 -8270 -43166 -99458 -164805 -204219 -199260
37480 -199260 -165517 -122110 -80461 -67561 -107793 -167600 -177238 -132048 -109004 -146264 -175491 -135053
37468 -135053 -89323 -146016 -285587 -371567 -333379 -246744 -202868 -179769 -104126 12518 78817
37457 78817 51510 -16577 -73305 -144746 -263891 -365441 -338097 -193117 -97074 -173119 -318695
37446 -318695 -311323 -89836 163213 249882 180655 105899 96107 96344 72585 77986 136536 162011
37434 162011 73412 -64038 -106213 -25401 49275 8008 -95867 -128788 -57265 24400 35965
37423 35965 7631 6935 27426 11347 -40346 -55786 -7622 25493 -34577 -136974 -151339 -40758
37411d0758J26159K9718m3526q515P0124Q1822M116r7737j50795j19461j9289
37400a68142P3662P1985j6440p1211n414J08133J27824L4758n1918m5067J6043
37389G4213N5949N5581J9566n8587j39640j29014p842R0516L8883q9585j06506
37378a96466K2697J27771Q3830j7199k5578L9125M0012n2755j23546r3976k1354
37367b17439J7034L1025N0107L9338l0101q8332m9473M2455O0930r856m3675L0366
37355a67621J06032N0884r5981j72786j06548J5357P7264N9303J7707K296J7351
37344a96742L2638K1690J961J7390N9278M9555m4733j28032r1000K4384P8575
37333a75036L7900J536J7099J0603n0558o6802K6310J16954O9793o0263j04357
$$ plain form
37411 -40758 85401 115119 71593 63078 133202 215024 219140 121403 -29392 -148853 -168142
37400 -168142 -94480 -22495 -38935 -110146 -115560 -7427 120397 155155 103237 58170 74213
37389 74213 130162 185743 205309 146722 7082 -121932 -129774 -39258 -375 -89960 -196466
37378 -196466 -173769 -45998 37832 20633 -4945 34180 74192 21437 -102109 -196085 -217439
37367 -217439 -200405 -169380 -119273 -79935 -110036 -198368 -247841 -205386 -144456 -154312 -197987 -167621
37355 -167621 -61589 -10705 -106686 -279472 -386020 -370663 -293399 -234096 -216389 -214093 -196742
37344 -196742 -164104 -142414 -140453 -123063 -63785 -14230 -58963 -186995 -277995 -253611 -175036
37333 -175036 -137136 -135600 -118501 -107898 -158456 -225258 -198948 -81994 -12201 -72464 -176821
37322a76821k2860O4207O8908K5147j4516m6592n8682j5428N9661Q1921K7253
37311g802k5366j5522J3086K34k9173j4948L8769P6317O6820J6772n6294j13537
37299e0644r8971j2930N2162J5634p4612r8326k4384N5815N9059M177m1915m7554
37287b62489j6163M0192Q5314O2854l2331j17304j09723l4174J6071J1388J4126
37276c42239O7126J20512J03270K1421n4578p1116k8238L7811P9028O7636K8906
37265B9539J3999K3223M608m5004m8378K5288P5716N812j16749j47450p7473k7369
37253b84238m3615m6416O282N0652N2268O6628J06449Q9047n386n8206O070Q6840
37241B6375O9411M067o128J0329k9268q7540p1969r804L464k1257o207K4893r192
$$ plain form
37322 -176821 -199681 -135474 -66566 -41419 -55935 -102527 -161209 -176637 -116976 -35055 -7802
37311 -7802 -33168 -48690 -35604 -35370 -64543 -79491 -40722 35595 102415 119187 62893 -50644
37299 -50644 -149615 -162545 -110383 -94749 -169361 -267687 -292071 -236256 -177197 -173020 -214935 -262489
37287 -262489 -278652 -238460 -153146 -90292 -122623 -239927 -349650 -383824 -367753 -356365 -342239
37276 -342239 -275113 -154601 -51331 -29910 -84488 -155604 -183842 -146031 -67003 633 29539
37265 29539 43538 66761 71369 26365 -22013 3275 78991 84803 -31946 -179396 -256869 -284238
37253 -284238 -327853 -374269 -367987 -317335 -265067 -198439 -91990 -2943 -8329 -66535 -60465 26375
37241 26375 95786 99853 93725 104054 74786 -12754 -84723 -94527 -91063 -112320 -118527 -93634 -102826
37228a02826o8454l9983N0715O5109j0363m4653J257J7603l1505l0194O9989J41056
37216A7751Q7670m37j3797Q516q852l5015k5659l2466r0313j10454k3768P2115
37204a54709N3406l0404m6129R052L6127J8060J9262L9899K0687k8330m2183l0409
37192a35671o2435j30816j50252r0570j804Q2125J52830J57614N0638q3911r2552
37181c04804L8148J49953J23194J3069o0059n7814j7649J6228J2245l0357n3686
37170a71532R05Q9996J03863K4903m1413k5576J3032J583l2434l2920k1771n0401
37158a41765r9713j10102p3620k3873L2204R9128J35978R2829m008p0885o9768
37147b33595l3172R438O1032J01545P5425k5505j17112j10822j9567O7509R4528
$$ plain form
37228 -102826 -171280 -211263 -160548 -95439 -105802 -150455 -149198 -131595 -163100 -193294 -123305 17751
37216 17751 105421 104984 91187 99703 90851 55836 30177 -2289 -92602 -203056 -226824 -154709
37204 -154709 -101303 -131707 -177836 -168784 -132657 -114597 -95335 -55436 -34749 -63079 -105262 -135671
37192 -135671 -198106 -328922 -479174 -569744 -571548 -489423 -336593 -178979 -128341 -212252 -304804
37181 -304804 -266656 -116703 6491 19560 -40499 -98313 -115962 -99734 -87489 -117846 -171532
37170 -171532 -170627 -80631 23232 48135 6722 -18854 -5822 -4239 -36673 -69593 -91364 -141765
37158 -141765 -241478 -351580 -425200 -449073 -416869 -317741 -181763 -88934 -92942 -163827 -233595
37147 -233595 -266767 -257329 -196297 -94752 -19327 -44832 -161944 -272766 -292333 -224824 -130296
37136a30296P6552M4116Q847j2511Q56K8123J5872l6942n6570r14O3957N5192
37124E6282m846l5877l2100m9674q1816o1367M728K4156k3641l8534L1924Q7678
37112a23087K8867p7268r0214K643Q7231R0970M9684K1492J8530K2038N406m9367
37100a3075j15458j27322o3237J6960N6996P3284R2495Q8641M4072L10k1200o4688
37088c2222j26057j00326L9953J26374J8561j46624j31197L9812J20414K9948
37078a61364n2298j1557L4457j7829p1301k4144L5947m875p5627m4576N3767Q6027
37066b53373L7566N78p94j7770m3844k3051K3059J4921l6431k9341N8086J13084
37054a57310M8346p0765j15345n3637L2209O2517M4274L6116O0272P9506O3727
$$ plain form
37136 -130296 -53744 -9628 -781 -13292 -12436 15687 31559 -5383 -61953 -62867 1090 56282
37124 56282 51436 15559 -16541 -66215 -148031 -209398 -204670 -180514 -204155 -242689 -210765 -123087
37112 -123087 -94220 -171488 -261702 -259059 -171828 -80858 -31174 -9682 8848 30886 36292 -13075
37100 -13075 -128533 -255855 -319092 -302132 -245136 -171852 -79357 9284 53356 53666 32466 -32222
37088 -32222 -158279 -258605 -218652 -92278 -73717 -220341 -351538 -311726 -191312 -161364
37078 -161364 -213662 -225219 -190762 -208591 -279892 -304036 -268089 -272964 -348591 -393167 -339400 -253373
37066 -253373 -215807 -215229 -216023 -233793 -277637 -300688 -277629 -262708 -299139 -328480 -270394 -157310
37054 -157310 -108964 -179729 -295074 -348711 -316502 -253985 -209711 -173595 -113323 -33817 29910
37043B9910L8762L1805P398p0212j34542q0360O0991J26044M3443n8982m2411
37032d8154N3190J04632R8279J01557J04252L1706r9231j66562j03215K2040J01039
37021A99533R1642K0343n0793n1974L6021J41232J67821J03636J6475l9758n8643
37010E75535m0923R313N5896O4007N5744P0000Q2164L7996m4297q9564p9808o5553
36998F30510o2311l2862J4389J4919l2473m2004J3415L7986l2784j11612r1734
36987C05439j9340j1170n3404k8246O8530Q9461l8239j75951j52770J426J06374
36976I2110P2074j7625n4109l3715j0094q51L392r018m6902p3323m5547J5380
36964a08228M7624L4472J6411J8761K0391L895j3998k1545l6092o1774o0700j489
$$ plain form
37043 29910 68672 100477 107875 37663 -96879 -177239 -116248 9796 53239 -5743 -48154
37032 -48154 5036 109668 207947 309504 413756 445462 346231 179669 76454 98494 199533
37021 199533 291175 311518 260725 208751 244772 386004 553825 657461 673936 634178 575535
37010 575535 534612 543925 599821 663828 719572 789572 871736 909732 865435 775871 696063 630510
36998 630510 568199 535337 549726 564645 532172 490168 503583 541569 508785 397173 305439
36987 305439 286099 274929 221525 193279 261809 351270 313031 137080 -15690 -14264 92110
36976 92110 164184 146559 92450 58735 48641 47790 51182 42164 -4738 -78061 -123608 -108228
36964 -108228 -60604 -26132 -9721 9040 29431 33326 19328 -2217 -38309 -100083 -160783 -162272
36952a62272Q5384J31907J03067K6739l5709m1013k574J9359j2523n6224m0530
36941A5611K7496N7663J715o7767m7732N6726J34019J00309n042o8040k9665M5745
36929B21038M4973m9824j27289r0144P493L4237k9394o8766j1524P1119P9238
36918H1157J6629m6015p1099n8405r811M7870N5985P7n4003n3564l3215l7220
36906a61614l3604J5552N9382L1462k6819k1836M0894O8278K8829j7257l5948
36895e2681n7824q1966m8602M9720J17481P5824k3912o3012m97Q8125J03848L0797
36883A37301m7819m0414M2801R5296M8351m1713q0673o1796l7416j0199N1478
36872E5197J11580R0092m110o9120o1057m5579o2233m7528L8483J06493N9181
$$ plain form
36952 -162272 -76888 55019 158086 184825 149116 108103 105529 124888 112365 56141 15611
36941 15611 43107 100770 102485 34718 -13014 43712 177731 278040 272998 204958 175293 221038
36929 221038 266011 216187 88898 -1246 6247 40484 11090 -57676 -69200 1919 81157
36918 81157 97786 51771 -19328 -77733 -87544 -39674 16311 16388 -37615 -91179 -124394 -161614
36906 -161614 -195218 -179666 -120284 -88822 -115641 -137477 -96583 -28305 524 -16733 -52681
36895 -52681 -110505 -192471 -241073 -191353 -73872 1952 -21960 -84972 -85469 2656 106504 137301
36883 137301 89482 49068 91869 187165 235516 193803 113130 51334 13918 3719 55197
36872 55197 166777 256869 252759 183639 122582 77003 14770 -32758 5725 112218 171399
36861A71399m4906o2202K6496Q8746L3118o8451r3467l3714J6367J454l2996k2316
36849b0472K9434O8285O2805K5273j9905n5154o7250n7589m7704m5900k3641L6497
36837a15321Q9144P8393K7716P179J7122q707p5207j01077n1433Q391L6267P8493
36825i040J44403J34234m871j52369j67074q3762k6092j757N9283J20888P6507
36814I0350m6730r5404j8273O7972O9296K7074M375m643o049K8166P4761N3859
36802B44754l9255j02506p5550j6751J2677L1432N3871L6504k6259n8143k2836
36791C7938Q789j5328l4243J2684P0598N8836q32l6772m3625n8921p8392p4190
36779a53458n1073k0433K9124Q0737P5934J1255k6929R572M8097J5879m0605m6688
$$ plain form
36861 171399 126493 64291 90787 179533 212651 144200 50733 17019 33386 34840 1844 -20472
36849 -20472 8962 77247 140052 165325 145420 90266 23016 -34573 -82277 -128177 -151818 -115321
36837 -115321 -26177 52216 79932 87111 104233 95526 20319 -80758 -132191 -123800 -87533 -9040
36825 -9040 135363 269597 264726 112357 -54717 -138479 -164571 -166328 -107045 13843 90350
36814 90350 43620 -51784 -70057 -2085 67211 94285 98660 94017 87968 116134 190895 244754
36802 244754 205499 102993 27443 10692 23369 54801 108672 145176 118917 60774 37938
36791 37938 46727 31399 -2844 9840 80438 139274 138442 101670 58045 -876 -79268 -153458
36779 -153458 -204531 -224964 -195840 -115103 -39169 -27914 -54843 -45271 2826 18705 -21900 -68588
36767f8588k9120n0182q1561n6791N000L9613N4784R4022J25341Q4604J696l2399
36755H6419p487N438j7932l2195j8633m746O077L0667M3897J6732j316N1835J14878
36742B73634O2038r0451j70736q7265M0644N3406m3163j19298r9495k0995M4023
36731a57658N6575K2156j6648j1196L8539P4911N0025j5148n7418m1654J0080
36720d7436M7706M2509J3440J737J6141K3650O984k769J8543L5167J679n8755
36708I8596q1544n2659j9133j3837k0682j3119J6781O3574J02128Q7360O689p7216
36696I6938q5500j8706N1733P5481N6968J1917m8632r3531q8651m3415L929L9639
36684d1830O7744P1370M2170K5527N7978P6979q346j54551k02919r2364N2466
$$ plain form
36767 -68588 -97708 -147890 -229451 -286242 -281242 -241629 -186845 -92823 32518 117122 118818 86419
36755 86419 78932 84370 66438 34243 15610 10864 16941 47608 91505 108237 106921 158756 273634
36742 273634 335672 245221 74485 -12780 27864 81270 38107 -81191 -180686 -201681 -157658
36731 -157658 -101083 -78927 -95575 -106771 -68232 6679 56704 41556 -15862 -57516 -47436
36720 -47436 270 42779 56219 57956 74097 97747 104731 101962 120505 155672 157351 98596
36708 98596 17052 -35607 -54740 -68577 -89259 -102378 -85597 -22023 80105 167465 174154 96938
36696 96938 11438 -7268 44465 119946 176914 188831 140199 46668 -41983 -85398 -81469 -41830
36684 -41830 25914 97284 139454 164981 222959 299938 291592 137041 -65878 -158242 -105776
36673a05776R7741O4410L9658J7635n6538j37661j10846K5263J24226Q3701j9535
36662B2278n2161j3309p124n7781o6656K0213J06525Q1576j2029m8056j0040P524
36650b9040k0106o612P2630J06748K6931o2242l8775M2991M3880l9771q7185m9453
36638d0004M265K5805M0757N5078L2194j5167k0337K4021M8663K8339J7770L7046
36626B38430K4882n0019j25260j41101j15365p6177p850Q2432J28792R9832N3508
36615A12104M0895L1492n891l2377k2399l0875q4491q9731L0082J69403J56133
36604B74345N990q8513l4112M2992L573j02531j29342m8636L2477L5624M67L668
36592c998N2673Q6573N5307k1520p1136m4884J8757K8168m9310j34781j29750
$$ plain form
36673 -105776 -8035 56375 96033 113668 57130 -80531 -191377 -166114 -41888 41813 22278
36662 22278 -29883 -43192 -50316 -108097 -174753 -154540 -48015 33561 21532 -26524 -36564 -29040
36650 -29040 -49146 -55758 16872 123620 150551 88309 49534 92525 136405 96634 9449 -40004
36638 -40004 -35739 -9934 30823 85901 118095 102928 82591 106612 155275 183614 201384 238430
36626 238430 263312 213293 88033 -53068 -168433 -244610 -252460 -170028 -41236 58596 112104
36615 112104 152999 184491 178600 146223 123824 92949 8458 -81273 -51191 118212 274345
36604 274345 280335 191822 157710 200702 204275 101744 -27598 -76234 -43757 -8133 -7666 -3998
36592 -3998 48675 135248 190555 169035 97899 53015 71772 99940 50630 -84151 -213901
36581b13901m1173L1049K3440k9198o6138p2452n8534l8362o6199k11645m21473
36570a164586m84106k54669J22793L52803L35833K34073J88106J49226N5074j3009
36560d78462K1967P0282K1018n2928q132J21294J69252R2709L000m0720q7066
36549a67786j31760q5324N0486J36126R3953J7266L820P139n0998j23310j03775
36538c54163Q227J07119J14539M7475k4127m5437k3053j7140n3821o0377L6963
36527b63795J60622J42596l2386j65444r4410R2173J79587R4907m0951q7421k9716
36516d4238L5520J1831r0445j50787p7874N6696R7860J9184m7546j7184L4527
36505a72456J8848j9136Q501Q0934J05466N0900l5061r5813r5504l3013K7408
$$ plain form
36581 -213901 -255074 -224025 -200585 -229783 -295921 -368373 -426907 -465269 -531468 -743113 -1164586
36570 -1164586 -1648692 -1903361 -1780568 -1427765 -1091932 -857859 -669753 -520527 -465453 -478462
36560 -478462 -456495 -386213 -365195 -418123 -426255 -304961 -135709 -43000 -40000 -80720 -167786
36549 -167786 -299546 -384870 -334384 -198258 -104305 -87039 -83219 -76080 -127078 -250388 -354163
36538 -354163 -345936 -238817 -124278 -76803 -100930 -146367 -169420 -186560 -240381 -300758 -263795
36527 -263795 -103173 39423 7037 -158407 -252817 -160644 18943 113850 72899 -14522 -44238
36516 -44238 -8718 3113 -87332 -238119 -315993 -259297 -161437 -142253 -189799 -206983 -172456
36505 -172456 -153608 -172744 -164243 -83309 22157 73057 37996 -57817 -153321 -186334 -158926
36494a58926Q702n5517m2925O3416J21548M7931m1309j9148M6193K0739o2984
36483g2280p5729j9869k245k2829J6236J01945J03350l064p8362m1358J3975r293
36471h9523n8883m2209J9372M3048K0152Q933L2945N8007M8063j615o5839r5851
36459a23400n2439M2024J09936R6100J9526n7648q8381o8331l2149j9368k5044
36448a99174o683L5824L4113m2626j06725n9916N4241J05501O3881J8753J4072
36437h8739p447o5529p5395J1663J02186Q3896j3332o9079l8766J7781M6192N2015
36425d4554N1366L8766J4874m994k1071m5904o1171k2674O6539J25797Q3914j8957
36413A61931o9874l1766N090m0911j11462r2401J918L9264k2661o1554J5010J13679
$$ plain form
36494 -158926 -150224 -205741 -248666 -185250 -63702 -15771 -57080 -76228 -30035 -9296 -72280
36483 -72280 -148009 -167878 -170123 -192952 -176716 -74771 28579 25515 -52847 -94205 -80230 -89523
36471 -89523 -148406 -190615 -171243 -128195 -108043 -99110 -66165 -8158 39905 38290 -27549 -123400
36459 -123400 -175839 -133815 -23879 72221 91747 34099 -54282 -122613 -154762 -174130 -199174
36448 -199174 -205857 -170033 -135920 -178546 -285271 -345187 -290946 -185445 -121564 -102811 -88739
36437 -88739 -96186 -161715 -237110 -225447 -123261 -39365 -52697 -121776 -160542 -142761 -96569 -44554
36425 -44554 6812 45578 60452 55458 34387 -11517 -72688 -95362 -28823 96974 180888 161931
36413 161931 92057 60291 65381 24470 -86992 -179393 -177475 -138211 -160872 -222426 -207416 -93737
36401i3737R9580J0020j4615L5074L1697o1061j14628m0168O6632O8079k3897
36390c7024r0128p2208q267N4311R4642R2120M3176p192j5402p596l3890p0496
36378e7954m6828L0271O8199K8836j0673J2689L8770j4505r9796r5671R269R6528
36366d0865Q8727L6022M737j7320n3147o7608l6610q655k2130l0612J0666N4637
36354h2158M5790J9526J9218l660q4751j28002m5409O2570N0419j7448K2405J15816
36342b5684N7721j24022j57845K8487J65076P5341m6610P281J02028K4386j20747
36331a4588r3023N6245P0598p7218j56576o4480N0918P3627P0209J06008J25007
36320A46727P8672J1600l0208m7154k8156L0117N8964N312m9890r963N1312J904
$$ plain form
36401 -93737 5843 15863 1248 36322 68019 6958 -107670 -147838 -81206 -13127 -37024
36390 -37024 -127152 -199360 -207627 -153316 -58674 33446 76622 69430 54028 46432 12542 -57954
36378 -57954 -104782 -74511 -6312 22524 11851 24540 63310 48805 -50991 -146662 -137393 -40865
36366 -40865 47862 83884 88621 71301 18154 -49454 -86064 -94719 -116849 -147461 -136795 -82158
36354 -82158 -36368 -16842 2376 -1284 -86035 -214037 -259446 -196876 -146457 -163905 -141500 -25684
36342 -25684 32037 -91985 -249830 -221343 -56267 19074 -27536 -20255 81773 106159 -14588
36331 -14588 -107611 -51366 19232 -57986 -214562 -279042 -228124 -154497 -84288 21720 146727
36320 146727 225399 236999 206791 159637 131481 161598 220562 225874 175984 166021 217333 219237
36308B19237j00629q8706J8022L5374o3476j00273m100P5418L7838j5291R900
36297B3314M4337J4256k7562k8043k4564k4008L7555J30556J08055n6174j81155
36286A6567j34302n091P6386J15358J36378Q0724m0930p0061O6622J99539J52970
36275E94160l21q1456o7392m3013j7521L3240M7316k4268q9129m9286K3065P533
36263C32928n6832n5158m044J701k1850P456N9304L4907m9561q9045o6578n0835
36251D2393n1342k5207O771l352j6012K8024O9308J5705p4481o5292K8589O2954
36239A8058K798l7713k348L2838J9177Q743K6518J3555n0391r1070n9457l618
36227a22910K2863K9478K8726j182n5277q3404o4424k7779J5587Q3597J46925
$$ plain form
36308 219237 118608 29902 47924 83298 19822 -80451 -84551 -9133 28705 13414 23314
36297 23314 67651 81907 54345 26302 1738 -22270 15285 145841 253896 197722 16567
36286 16567 -117735 -122826 -46440 68918 205296 286020 245090 175029 241651 441190 594160
36275 594160 593839 512383 444991 401978 384457 417697 465013 440745 351616 302330 325395 332928
36263 332928 276096 220938 216894 218595 196745 204201 263505 298412 248851 159806 93228 42393
36251 42393 -8949 -34156 -27385 -30737 -46749 -18725 50583 66288 -8193 -73485 -44896 18058
36239 18058 20856 -16857 -19205 13633 32810 41553 68071 81626 31235 -59835 -119292 -122910
36227 -122910 -100047 -70569 -41843 -43025 -98302 -181706 -246130 -273909 -258322 -174725 -27800
36216b7800J30562K5684p3602q3605k5887J9856R675m0233q1941p2183j2470M1600
36204a90344L8702p175m2254m3366k9535j9437q929K0456Q3232J55855J66745
36193A23950P6533l6580n6803j268Q83p9530j20335n9509j056k0572k4875O6763
36181a32399J50177J04021K417j6539J4107k2945r7686r0454j4780J7842L489
36170h2750J9652M3730J378m9016K797Q8067M2483r3952j09167K9977J10185J3229
36158A6613j10001r6569K616N9577N8872M2205P784l4379k7780K6421M0927j6370
36146c0084o4137m6514j5021j8184k3847l270J6574K7867O1965J05062J06876
36135A17287Q9945J21539J65967J14943j6208q5640m5058Q625L0625Q4624J55484
$$ plain form
36216 -27800 102762 128446 54844 -28761 -54648 -34792 -25117 -65350 -147291 -219474 -231944 -190344
36204 -190344 -151642 -158817 -201071 -244437 -273972 -293409 -302338 -281882 -198650 -42795 123950
36193 123950 200483 163903 107100 105832 106715 27185 -93150 -152659 -153715 -174287 -199162 -132399
36181 -132399 17778 121799 124216 107677 121784 98839 1153 -89301 -104081 -86239 -82750
36170 -82750 -63098 -19368 -17990 -67006 -64209 23858 66341 -27611 -136778 -106801 3384 16613
36158 16613 -93388 -189957 -187341 -127764 -68892 -26687 -18903 -53282 -81062 -54641 -13714 -30084
36146 -30084 -94221 -140735 -155756 -173940 -197787 -201057 -184483 -156616 -94651 10411 117287
36135 117287 207232 328771 494738 609681 593473 507833 462775 471400 502025 586649 742133
36124G42133J17160l1551j07508k6470N3371j258q0010l5003O2581N3913m4208
36113G03150q7971l5171L0546M5283J4700k7597k9414L9524J03154M7919p3772
36102G30351o7576R6502J89057N8567j24126j29400r789K6547n1473j14683j26406
36091D77571j50647j66096r0716L1151N9293k7977j09193j02994l8689L7447R4528
36080A3678Q1076j3408q7326m3317N5109O7985j5379q4400q6714o5437m4215q154
36068b30502J9632O820l107M6775J05961P9960r884n1790q924N3378Q0461O2002
36056A50782q763r9865j15670k5681M5824n444p5974j1682J17648J11454l1404
36045E1225j07826m1692J5816l3930q1427k5948M4572J2996p0976p7522J8586
$$ plain form
36124 742133 859293 827742 720234 693764 747135 745877 665867 630864 693445 747358 703150
36113 703150 615179 580008 610554 655837 670537 642940 613526 653050 756204 804123 730351
36102 730351 662775 759277 948334 1006901 882775 753375 743586 770133 718660 603977 477571
36091 477571 326924 160828 70112 101263 160556 132579 23386 -79608 -118297 -80850 13678
36080 13678 94754 81346 -5980 -49297 5812 73797 58418 -25982 -112696 -178133 -222348 -230502
36068 -230502 -210870 -204050 -207157 -160382 -54421 25539 15655 -36135 -45059 8319 88780 150782
36056 150782 142019 42154 -73516 -99197 -53373 -58817 -134791 -146473 -28825 82629 51225
36045 51225 -56601 -98293 -82477 -116407 -197834 -223782 -179210 -166214 -237190 -314712 -296126
36034b96126J36588J93501J42396o746j48675j59037n9796n345n2691o9501M9815
36023b75617J98279J99396M7898j08759j67027j35071n2416M4708R8642P0311
36013g9656L576k2858l010J697l1366n4069l0312J1126L0537L6240N3766O6856
36001a7473L6718k4910n1625j3776K7580L796n2814m8883L0338R8473R6486O0554
35989A44464L2365r937p8603j17044q4199k8572n100J2377N5315P1610J3783m8255
35977d1796j9299O2478P9105J2841m5896m7080k1568P060L5681K5792m5386r4764
35965i2832k3745J08520J37487K5445r2121j07519n5578m752L2342M4602P064
35954b1087l9029j4322N0410K7433r3928j50101m3627R2988Q7299k6058q0859
$$ plain form
36034 -296126 -159538 33963 176359 169613 20938 -138099 -197895 -203240 -255931 -325432 -275617
36023 -275617 -77338 122058 169956 61197 -105830 -240901 -293317 -248609 -149967 -79656
36013 -79656 -76080 -98938 -101948 -100251 -131617 -185686 -215998 -204872 -174335 -138095 -84329 -17473
36001 -17473 19245 -5665 -57290 -71066 -43486 -39690 -92504 -141387 -111049 -12576 83910 144464
35989 144464 176829 166892 88289 -28755 -112954 -141526 -146626 -134249 -78934 -7324 6459 -41796
35977 -41796 -61095 1383 80488 93329 47433 353 -21215 -14155 21526 47318 1932 -92832
35965 -92832 -116577 -8057 129430 154875 62754 -44765 -100343 -105095 -72753 -28151 -21087
35954 -21087 -60116 -74438 -24028 3405 -90523 -240624 -284251 -191263 -103964 -130022 -210881
35943b10881l0528J6656j1631n2154j6639Q1753J49318J24429M2691r792j447
35932H1775J0595k7611p8459p2509k5317j0677k9793p376O9415J09729N2103m7990
35920B3885j04198r7212n0550J4869O3856N9843L1059M6080R1839P3149j9379
35909A33241n5273L7287J24666M4671j37830j97231n2282J30778J64839O0127
35899B52993l9011n5281l6320m3721o6313o2897l6450j9377p339L5942J02324
35888B4550J23549O1907k6660n9978k8036J5894L2833K4105L418j8189l7691o9432
35876D6270j13415j09601j222J34717J34105j4573j06212l827J40338J06217n9318
35865A53479j29898n1562K0294Q909J424K9331L344p4213o1389O5704J21605M038
$$ plain form
35943 -210881 -241409 -224753 -236384 -288538 -305177 -223424 -74106 50323 93014 83222 81775
35932 81775 92370 64759 -13700 -86209 -111526 -122203 -151996 -159372 -89957 19772 71875 23885
35920 23885 -80313 -177525 -228075 -213206 -149350 -89507 -58448 -12368 79471 152620 133241
35909 133241 77968 115255 239921 284592 146762 -50469 -102751 28027 192866 252993
35899 252993 213982 158701 122381 78660 12347 -50550 -87000 -106377 -113716 -77774 24550
35888 24550 148099 210006 183346 123368 95332 111226 144059 168164 171582 153393 115702 46270
35876 46270 -67145 -176746 -177968 -43251 90854 76281 -29931 -33758 106580 212797 153479
35865 153479 23581 -27981 -7687 1222 2646 31977 35321 -38892 -100281 -34577 87028 91066
35853I1066j16157n6352Q8225J01019k5619j10148o5949J4670L6713J2774l033
35842c2791J9707Q6539J56292J37365q280j73371k03517q2709N2870Q3969K2753
35831E8827m5558o9437n4126k0147K3459O8281R3687Q5587O2397M9964K7868m6330
35819B34472j39985j47509m0025O7561P3759K9658K4241K7661j6132l6852M2464
35808A19313J10793J0847j72134k05251p3219J5694r61L8455J66879J75897q413
35797A77900j39622l9982R2201J2228j57383j34921N5628J38215K3727r6652p8276
35786a46937Q977N8008O3050M3814q784p1519q7684m8089P634N7463R1100P8294
35774D5327K3989K264N0637R3567N9214k011j1526N507j4152n6136q1149j01961
$$ plain form
35853 91066 -25091 -81443 6782 107801 82182 -27966 -93915 -79245 -42532 -29758 -32791
35842 -32791 -13084 73455 229747 367112 358832 185461 -18056 -100765 -47895 36074 58827
35831 58827 13269 -56168 -110294 -130441 -106982 -38701 54986 140573 202970 252934 280802 234472
35819 234472 94487 -53022 -93047 -25486 48273 77931 102172 129833 113701 76849 119313
35808 119313 230106 240953 68819 -136432 -209651 -193957 -194918 -156463 10416 186313 177900
35797 177900 38278 -1704 90497 102725 -54658 -189579 -133951 4264 27991 -68661 -146937
35786 -146937 -137960 -79952 -16902 26912 18128 -53391 -141075 -189164 -181530 -124067 -32967 45327
35774 45327 69316 71580 122217 215784 274998 272987 261461 266968 252816 196680 115531 13570
35762A3570j06069j6853J46680K04295O4398r2260o4933N5766M9574o5126q1949
35751A07093L3433J02679M5928k0010k0178k6176p2836p7218o833M7237L2183
35740A45302J6256M9207P7228N4416J7849J365j9515n9181r3040j15012j32216
35729e7341j07041r832Q5134P7492J582j9210L4989P2466O2401O3239P7103L2896
35717C13878o4976j15764p7165j4919J5724J6663j9930r0908j07599N217J44953
35706E174J33968j1736r4076k6557O8415Q3763N9636M2630l537p8896j01221m7733
35694B9830L90N516J8410L7829p927r2839q4778L2938J09546O6448Q225J5211
35682A38799J3006n1491q7897l5328J2022k1714n5781j8849O339m9575q2186J4678
$$ plain form
35762 13570 -92499 -109352 37328 241623 306021 213761 148828 204594 254168 189042 107093
35751 107093 140526 243205 289133 269123 248945 222769 149933 72715 65882 113119 145302
35740 145302 161558 210765 287993 342409 360258 361623 342108 282927 189887 74875 -57341
35729 -57341 -164382 -174214 -89080 -11588 -10006 -29216 5773 78239 140640 203879 280982 313878
35717 313878 248902 133138 55973 41054 56778 73441 53511 -37397 -144996 -139779 5174
35706 5174 139142 127406 33330 6773 75188 158951 218587 261217 257680 178784 77563 29830
35694 29830 30220 35736 54146 91975 84048 -8791 -93569 -60631 48915 115363 123588 138799
35682 138799 151805 100314 12417 -22911 -10889 -32603 -88384 -107233 -100894 -150469 -232655 -217977
35670b17977J46990J62670Q5668L6945K0016l5856r7107p4056J820J9026k6370
35659B1769l7976Q555M2932L6273K8609K7455r20m0116l3482J0269J9765k2792
35647F0341n6187m2508j6095j2211j3047R181M1756N1906L3505J0694M60j0098
35635E7697l2706l6204J7119Q4482O7325l2963p6772J0623R8113M4906n7805l1054
35623A12761P3630M2481j24609j75862o519J61648J17634m4706j17070p3018j3263
35612d6893K6874N1651J9970n8307o4648M0830J02749J570j25516p9639Q6493
35601d4866J48251L5685j06875j47554q6975J9855J14251J27388M6321l7952m4510
35590B3019j2333l699J7696R2239J37313O2978n5158p4019m42M2914K3979J7558
$$ plain form
35670 -217977 -70987 91683 177351 214296 234312 198456 101349 27293 29113 48139 21769
35659 21769 -16207 -7652 35280 71553 100162 127617 126697 86581 53099 63368 83133 60341
35647 60341 4154 -38354 -54449 -66660 -79707 -70526 -28770 23136 56641 67335 67795 57697
35635 57697 24991 -11213 5906 90388 157713 124750 47978 58601 156714 201620 143815 112761
35623 112761 186391 228872 104263 -71599 -78118 83530 201164 156458 39388 -33630 -46893
35612 -46893 -20019 31632 51602 -6705 -71353 -30523 72226 73796 -51720 -131359 -44866
35601 -44866 103385 139070 32195 -115359 -202334 -182479 -68228 59160 105481 67529 23019
35590 23019 10686 6987 24683 116922 254235 317213 262055 188036 187594 230508 254487 272045
35578B72045M4658M6004M086l7486o4198q9565q9159m0818M638n490l1371j8009
35566d665n73j8686n304R9707J99257J59571K1593o7337p5994p6293o5900O168
35554A71544P4445J9143j15267j55867o2296K8964L2257O185Oj7391m3562k2718
35542h4557K5446J4301m0938k3359P9862J35466P7131J383p734N164o287R10L9121
35529B15909J9425r7124j92280j41086J4343J31840J40555P3128m447l0217K0017
35518A50063P8739L3709j16110k19885j50812L3625J63489J43215K1890q1076
35508E6847q2194J497P1209N6161j399j3743K4190M6824L6758L4747L6526r504
35496B57919q4193q8673O027R6224Q2857m893o9312o1874k110O1079P3994K0360
$$ plain form
35578 272045 316703 362707 366793 329307 265109 175544 86385 45567 50205 44715 13344 -4665
35566 -4665 -5238 -23924 -29228 70479 269736 429307 450900 383563 307569 231276 165376 171544
35554 171544 245989 265132 149865 -6002 -68298 -39334 -7077 -892 -886 -18277 -61839 -84557
35542 -84557 -59111 -44810 -85748 -109107 -29245 106221 183352 184735 177001 182165 175878 176788 215909
35529 215909 235334 138210 -54070 -195156 -180813 -48973 91582 164710 160263 130046 150063
35518 150063 228802 262511 146401 -73484 -224296 -190671 -27182 116033 137923 56847
35508 56847 -25347 -23850 47359 103520 102121 88378 112568 159392 196150 230897 267423 257919
35496 257919 173726 85053 91080 187304 270161 265268 195956 134082 131972 193051 267045 287405
35484B87405l6674j3570P3470J13921N3387k8185k3880O7327J49281J34088J9118
35473G95688j12551j64868j27423q4410r5572j12073o7254L57J306o3227j08354
35462a38381q9223k6093O3776J55361J65420L4435j48684k20659j44086k8191
35452c76325M0326O9224O9979K7357k4501j7655L4073M3211r410m5070j4759M2329
35440a61221P5188O2345j1357j16338j45061m0592P7881O4437k1061j0629P7649
35429a48759O7814n3041r5033N790P6319J5685l5041L4725R7939K7601o4136k6276
35417i6413O0806L5574n4097m0604O8417J09805L6965l1167k1342Q466J540k1376
35405E6574l0251k1569J2114N8241N3594k8829r6253m4708P7441J25418N8911
$$ plain form
35484 287405 250731 237161 310631 424552 477939 449754 425874 493201 642482 776570 795688
35473 795688 683137 518269 390846 306436 210864 98791 31537 31894 33200 -30027 -138381
35462 -138381 -227604 -253697 -189921 -34560 130860 165295 16611 -204048 -348134 -376325
35452 -376325 -335999 -266775 -196796 -169439 -193940 -211595 -177522 -134311 -143721 -188791 -203550 -161221
35440 -161221 -86033 -23688 -35045 -151383 -296444 -337036 -259155 -194718 -215779 -226408 -148759
35429 -148759 -80945 -133986 -229019 -223229 -146910 -131225 -166266 -131541 -33602 -6001 -70137 -96413
35417 -96413 -35607 -33 -54130 -94734 -26317 83488 120453 89286 67944 76410 77950 56574
35405 56574 26323 4754 16868 75109 128703 99874 3621 -41087 36354 161772 220683
35394B20683k4222m7777l9209l9193l0018R051M3505K4230m2063q9003n7456L0749
35382d0723Q0278L6304l0200j7693M5495M4449j7502n495J06748J47882P706j62423
35370A94826j59632k5537M4805P469j5162J8164J4313n1413p5479j7125K2676
35359d2095j5190l7979L0148J00288O0388l4515n2321j403o139q4139j04256k228
35347a89441R9992P3194k2627l4529N0267R8716M4954k4450k5839L184J510m181
35335G0750K7588M9353l606q8799j04511l3864M4578O6412K9283l6615p7328l8951
35323i5710M5843N6300m5562j20274m3372Q6672Q5608l2882r1009l2954J7466
35312a69874j1704m3759k1291M683J390J3254M7760N0444L2844P1438J40597J13107
$$ plain form
35394 220683 196461 148684 109475 70282 40264 49315 92820 117050 74987 -14016 -71472 -40723
35382 -40723 39555 75859 45659 27966 73461 117910 100408 94913 201661 349543 357249 194826
35370 194826 35194 9657 54462 61931 46769 64933 79246 27833 -47646 -64771 -42095
35359 -42095 -57285 -95264 -65116 35172 95560 61045 8724 7321 1182 -82957 -187213 -189441
35347 -189441 -89449 -16255 -38882 -73411 -23144 75572 120526 96076 70237 73421 74931 70750
35335 70750 98338 147691 144085 55286 -49225 -83089 -38511 27901 57184 20569 -56759 -95710
35323 -95710 -49867 6433 -39129 -159403 -202775 -116103 -30495 -63377 -154386 -187340 -169874
35312 -169874 -181578 -225337 -246628 -241945 -240555 -227301 -179541 -129097 -96253 -24815 115782 228889
35300B28889k2216j14682q4544k6391r438L6337J34497J50601M797j59115j66185
35289b7450m9245M2403O0331M8407K0875j6341j2088L9488M3998m1857j02637
35278E884l5576O6268M7448o8857j24456o2834K0556M1388J6910j613O802L7708
35266e0372O9907P5645N3405K5675n082m6452o3441j6667M6258L9489j6981k3210
35254H8174K3299K1732l8599m4726L2459O7064j3650j08455j09576m5813J3573
35243a14518N3245N0203k5288r5075l5433R7806J10179j2549o6554J5139M6719
35232B3874n4498r5668L3227J25813J6212j02739L622K06648K29030Q1900j6389
35221D51032j0411r11O891O2280Q4761q320r6040l7800N3278o175j31053j07830
$$ plain form
35300 228889 206673 91991 7447 -18944 -28382 7955 142452 293053 297850 138735 -27450
35289 -27450 -76695 -34292 26039 74446 95321 78980 66892 106380 150378 108521 5884
35278 5884 -29692 36576 84024 15167 -109289 -172123 -151567 -110179 -93269 -94882 -88080 -50372
35266 -50372 19535 95180 148585 174260 169178 122726 59285 42618 88876 128365 111384 88174
35254 88174 111473 133205 94606 49880 82339 149403 135753 27298 -82278 -128091 -114518
35243 -114518 -61273 -11070 -36358 -131433 -166866 -69060 41119 28570 -37984 -22845 23874
35232 23874 -30624 -126292 -93065 32748 48960 -53779 -50157 156491 385521 467421 451032
35221 451032 440621 439710 446601 508881 593642 585322 489282 451482 504760 498585 367532 259702
35209B59702K8177O6005o536j6372N6010O1854j2786k1874O3728J16036Q3522
35198F77466K8988m0283j45223j81059m0478J51528J80598P4530K8284N2877n892
35187G81336j33611j47617l2500L0517j0407j8783L2615J464j32885j98023j18164
35176E3942k1204Q524L9737R2144O5913m9714j16003o8360n453J352j730O623
35164E771j9640n8691k9876L6175K2513o2868q8190j9366M4743N5303M7679J5377
35152e1070n7698q0737J9890J18548O3353m2013M459J38515J27756k1757q9753
35141A29493l9623m0355r9947m5669J05864J29635m868p3241l091K0844o1147
35130A7895o3222P3982J42449L0078r6535r9814n7202k9052M9885J41892Q8279
$$ plain form
35209 259702 287879 353884 347348 330976 386986 448840 436054 414180 477908 593944 677466
35198 677466 706454 666171 520948 339889 299411 450939 631537 706067 734351 787228 781336
35187 781336 647725 500108 467608 498125 487718 468935 501550 503014 370129 172106 53942
35176 53942 32738 41262 80999 173143 239056 189342 73339 4979 -474 878 -852 5771
35164 5771 -13869 -72560 -102436 -66261 -43748 -106616 -194806 -214172 -169429 -114126 -66447 -51070
35152 -51070 -108768 -189505 -169615 -51067 12286 -29727 -25268 113247 241003 219246 129493
35141 129493 89870 49515 -50432 -96101 9763 139398 134530 61289 58198 79042 17895
35130 17895 -45327 28655 171104 201182 104647 4833 -52369 -81421 -31536 110356 198635
35119A98635p2484r4492N8758J26525j806j05815m1584K7180k7701p0248J030
35108b002N0338j5555p0929m0291l5034p4170k454J64893J76371j4647j23046
35097A3474k3088L9191p1314j16848L8488J30537k0564j51094k9337J12430J1840
35086f6285j34279m5012J16365N0536j24579j02642N8761Q4196n492J7498J28066
35075b2867J14730k478k6295L4765J2581p2600o2024J8548J4090n3799m1847K8895
35063e8301K7042k8991k7882R658N409R161P9327J17791M9197n052L9906L5088
35051B52353j12017j90396l0121J48809P5024j15583j30270j3839L295m5736J2295
35040a46186Q8894o954j47823o9689J37322J63302J4983k4182R4694J51135Q9225
$$ plain form
35119 198635 126151 31659 90417 216942 215136 109321 67737 94917 67216 -3032 -2002
35108 -2002 48336 32781 -38148 -78439 -113473 -187643 -190097 -25204 151167 136520 13474
35097 13474 -9614 29577 -41737 -158585 -120097 10440 -10124 -161218 -190555 -78125 -66285
35086 -66285 -200564 -245576 -129211 -78675 -203254 -305896 -247135 -162939 -168431 -150933 -22867
35075 -22867 91863 89385 63090 97855 110436 37836 -24188 -5640 8450 -45349 -87196 -58301
35063 -58301 -31259 -60250 -88132 -78474 -73065 -63904 15423 133214 182411 177359 217265 252353
35051 252353 140336 -50060 -80181 68628 143652 28069 -102201 -116040 -112745 -158481 -146186
35040 -146186 -57292 -64246 -212069 -281758 -144436 18866 33849 9667 104361 255496 344721
35029C44721O2098P0532k9699j76305j59603k3864j4381j29004j19730M8564J35656
35018H985N2613k6595k0094m1878j02838n7799Q8599J46856P0123J5990M1482
35007A75444L2583l0367l2119K4009J1022n2159j5722R8754J05756r800n8114
34996B49287K1213P2430J3286n2238n4571n1987o8043n1409j5256k2752m5972
34985f012j9780J4444n75M236Q0496J04351j5669j25434o9655K4074j4304o9103
34973i2931K3754J15481j954j70972j14470O1948O1040o1607k3041J36098J30693
34962F4039j7073j9188J24465J26876l5037p4517O7057J16466l4913j67926j36246
34951A4003m3002K1857O6537L1549j10972j60437L4521K20949R3645j47067r3859
$$ plain form
35029 344721 406819 477351 447652 271347 111744 87880 73499 -55505 -175235 -126671 8985
35018 8985 61598 35003 14909 -26969 -129807 -187606 -99007 47849 117972 133962 175444
35007 175444 208027 177660 145541 169550 180572 128413 112691 211445 317201 307401 249287
34996 249287 270500 342930 356216 303978 249407 197420 129377 77968 62712 39960 -6012
34985 -6012 -25792 -11348 -11923 -7687 72809 177160 161491 36057 -33598 -9524 -23828 -92931
34973 -92931 -69177 46304 44350 -126622 -241092 -179144 -118104 -179711 -202752 -66654 64039
34962 64039 46966 27778 152243 279119 244082 169565 236622 353088 318175 150249 14003
34951 14003 -28999 -7142 59395 90944 -20028 -180465 -145944 75005 168650 21583 -72276
34940g2276J56943J73630l9455p7263J06974J46976j5652k9798J71648K35261
34930G56988N7611m3901L6709J7144j66980j99899n149P7785p4833j54499l0021
34919B70955J8256j17366j44405M1435J19590n1726j54619J172J44927O5370m5588
34908A48001k3519j0534p0067j9493J34670J02686j37619k19612k5416R7162k8377
34897e2118j11557K6350J35664N3984n558O7671N4728j00778j18323O6686J27969
34886A44718m5899j34676M187Q9308p392l5644P5246N6961j02226o1572J79844
34875A62855J99545m4065q7198J43590J43205j94918k98459M0600K47093N371
34865C17619j86007J5054J68369n7465k39256l4814J67532L6802p5988R7581J73489
$$ plain form
34940 -72276 84667 258297 218842 141579 248553 395529 379877 350079 521727 756988
34930 756988 814599 770698 807407 824551 657571 457672 452523 530308 455475 300976 270955
34919 270955 289211 171845 27440 68875 188465 136739 -17880 -16708 128219 193589 148001
34908 148001 124482 113948 43881 24388 159058 261744 124125 -95487 -120903 -23741 -52118
34897 -52118 -163675 -137325 -1661 52323 46765 114436 169164 68386 -49937 16749 144718
34886 144718 98819 -35857 -31670 57638 50246 14602 89848 146809 44583 -16989 162855
34875 162855 362400 318335 231137 374727 517932 323014 24555 65155 312248 317619
34865 317619 131612 146666 315035 257570 18314 -16500 151032 187834 111846 209427 382916
34854C82916p8123j93671Q2517K18505j11717l38375k8166K82018P3370k08713
34844H0561m1427J95664K0228j94069J4672K54518M7667k19247n9420J56695l1178
34833B24664k15408P3668L69869J17011k38327p0929K43414P6657k43994j14582
34823B22043J57799O436k34610j800L29010J41438k04387o2546K39061N6974k94762
34812C54656j73581J31157J5634k18497k1765K17907n9830l64247l5008M07443
34802B53869J85981k40972o5290L03235Q4249k86127k4539L76917P8561l98489
34792B67395j41615L38896R3624l60305m4287M86668J89071l62032n6277N19950
34782I31088K02224l91930l4388O04410J98784n27069j08210P10779L15912n58649
$$ plain form
34854 382916 304793 111122 193639 412144 300427 -37948 -66114 215904 289274 80561
34844 80561 39134 234798 255026 60957 75629 330147 377814 158567 99147 255842 224664
34833 224664 9256 82924 452793 569804 331477 260548 503962 580619 336625 222043
34823 222043 379842 386278 151668 149868 478878 620316 415929 353383 592444 649418 354656
34812 354656 181075 312232 327866 109369 87604 305511 245681 -118566 -153574 253869
34802 253869 439850 198878 133588 436823 521072 234945 210406 587323 665884 267395
34792 267395 125780 464676 558300 197995 153708 640376 829447 467415 411138 931088
34782 931088 1133312 741382 706994 1311404 1510188 983119 874909 1585688 1901600 1342951
34772A342951j65542P77188M07048n53688j27132R37717N56689m20092K43451
34763B998590J494666P79431o51879K66298K266086J837186L66695J984503N244188
34754A6585764N398091M239018P526860J3043743J4454478J8310159L9037927
34747A18596040O8770256P1487946K5414154m0804963p5547185o2661711l2257609
34740G2996928j5776873j3388425j0674093n404705m121897n955607m870606j458072
34732A1346650p52909k332635j953529O4538J55040j263570r65967P08723J014500
34723F020841M81954J484348K752294J145700k250312l342956j629536m23081
34715D239252r35604j073704p9619K72766n00030o85695J47098L78311m05733
$$ plain form
34772 1342951 1177409 1954597 2361645 1807957 1680825 2618542 3175231 2755139 2998590
34763 2998590 4493256 5272687 4620808 4887106 7153192 8990378 9357073 11341576 16585764
34754 16585764 21983855 26222873 33749733 46793476 61247954 79558113 118596040
34747 118596040 187366296 258854242 284268396 243463433 167916248 105254537 72996928
34740 72996928 57220055 43831630 33157537 27752832 23630935 17675328 12804722 11346650
34732 11346650 10593741 8261106 6307577 6372115 6527155 5263585 4297618 5006341 6020841
34723 6020841 6502795 7987143 10739437 11885137 9634825 6291869 4662333 4239252
34715 4239252 3303648 2229944 2150325 2423091 1923061 1237366 1384464 1762775 1357042
34706A357042o66292M2172L18214k64353m20385K17591L99524k42779m85324J09449
34696C64859M18623m6550l26909K7750J99734j48255k50738J22680J88320k26372
34686C23142k86474J91983L42010q7172k72847P1008J94621j70842l14788K2250
34676A2891J74213r2652j47555J96734L00756j6654j34161J02993Q7472k67622
34666B16415k82889J32684K24247j69661k72385J52391L31115o2424l06271L88
34656c6390K37935m815k07364q628J18567j18036k22011Q2453K60415j1430k11357
34645a20661L6652K72986J02648j03253J795R4175r3549k07697J59J53013n659
34634A30609r8888J28360K84040P9879j16283N647J36354R725o0350J81341M10697
$$ plain form
34706 1357042 690750 732922 1051136 786783 366398 583989 983513 740734 255410 364859
34696 364859 783482 736932 410023 437773 637507 489252 238514 361194 549514 323142
34686 323142 36668 228651 570661 483489 210642 281650 476271 305429 -9359 12891
34676 12891 187104 94452 -53103 143631 444387 427733 293572 396565 484037 216415
34666 216415 -66474 66210 290457 120796 -151589 802 331917 269493 -36778 -36390
34656 -36390 201545 196730 -10634 -19262 99305 -18731 -240742 -158289 102126 90696 -120661
34645 -120661 -84009 188977 291625 188372 190167 284342 190793 -16904 -16745 136268 130609
34634 130609 31721 160081 444121 524000 407717 413364 549718 559443 499093 680434 1091131
34623A091131L39380K20440K69844K13978j20186l82760l24219k35434l34684
34614G37490l34477n2533J66535P5887l9860K6970J232k46071l22427l1948J82407
34603A63205M051j90086l9015J57195M7624j16419j0145J40685L8574j02556j4165
34592G8948Q4755m9425j67301j2829J53093N0698p9647K6308J15367o6403k09613
34581g6049N021K58501J31834j38510r7707J21509R8638j00027j11306L3631M3255
34570A68790m3382M232R6834J7455r2729J3369J71172Q1379j13756p9454R0668
34559C14578N8944j27257j44999P135N7452q125K2367J17337N4239j25445j65482
34548F0744m4204K9519K416j0357q577n4530n2769P8343J58551J6701j53025p4811
$$ plain form
34623 1091131 1430511 1650951 1920795 2134773 2014587 1631827 1307608 1072174 737490
34614 737490 403013 350480 517015 592902 553042 580012 581244 335173 12746 -19202 163205
34603 163205 167256 -22830 -61845 95350 142974 26555 16410 157095 195669 93113 78948
34592 78948 163703 114278 -53023 -65852 87241 137939 58292 84600 199967 133564 -76049
34581 -76049 -71028 187473 319307 180797 83090 204599 303237 203210 91904 125535 168790
34570 168790 125408 129640 226474 243929 151200 164569 335741 417120 303364 223910 314578
34559 314578 373522 246265 101266 108401 165853 157728 180095 297432 351671 226226 60744
34548 60744 16540 46059 48475 38118 29541 -24989 -77758 585 159136 175837 22812 -51999
34536e1999J31362J45874k0497r0620j903O1247L0357q4j1581m6941n3795k040
34524H9380j1602j18424j20811P2550J95645M1471j48255p4947J07545Q8433m9421
34513G1564k9474Q4021L0875j32560j40064o445L8037j1086J3836P4645K3909
34502A7258m1530N8003J96075J33044l5189n0154L0403k3088j33817o6101P9124
34491A64028K3992j39875r4831R7426R0383r5787r8475J06194J39274r0977k13163
34480a11811m5362J15072M0461p8681n2672k0171j11957j67036l9518J23156J44336
34469b04183R6189J06246J21767N7792k0586k7732k05J1223L2342O2295L9928
34458B75076k5010m3384j753L1324N0608R0185Q4033m3664j84495j69021m6684
$$ plain form
34536 -51999 79363 225237 204740 114120 112217 173464 203821 203737 192156 145215 91420 89380
34524 89380 77778 -40646 -161457 -88907 106738 148209 -46 -74993 32552 120985 71564
34513 71564 42090 126111 156986 24426 -115638 -122083 -84046 -95132 -81296 -6651 17258
34502 17258 -24272 33731 229806 362850 327661 277507 307910 284822 151005 84904 164028
34491 164028 188020 48145 -46686 50740 141123 45336 -53139 53055 192329 101352 -111811
34480 -111811 -157173 -42101 -1640 -80321 -132993 -153164 -265121 -432157 -471675 -348519 -204183
34469 -204183 -107994 -1748 120019 177811 157225 129493 129288 140511 172853 235148 275076
34458 275076 250066 206682 204929 236253 286861 377046 461079 417415 232920 63899 17215
34447A7215k454m0474j7871M9772J4421r3332q7909L3090P9534J2348r148N0891
34435F083M4583n2098p1783L9244J24355R0419K3969j7353q1305j47761j22662
34424a64309l6851j5750m3866m078O6527L4929l8856K1321J58172J44120n011
34413A16348m0438O7601O9840j00799j91460o6573P8047P7484L7964O2727N3963
34402A64704m5350r8841l0306L1442O510L232O8251O5570n0487j08167j8506N5258
34390D3310j1209r1340n2389K4149L3959L7392Q9960R9348J5181m1256P099M4699
34378A98903k0367q7598n7742l923p941j4442J7789J2086m7234l3195Q8121J42589
34366A87046K0239j29031j28506k6772L6161M8381O1447N6892J5942j1529j4643
$$ plain form
34447 17215 14761 -25713 -43584 6188 20609 -72723 -160632 -127542 -48008 -35660 -44808 6083
34435 6083 50666 -1432 -73215 -33971 90384 180803 204772 187419 106114 -41647 -164309
34424 -164309 -201160 -216910 -260776 -264854 -198327 -163398 -202254 -180933 -22761 121359 116348
34413 116348 75910 143511 213351 112552 -78908 -145481 -67434 10050 48014 110741 164704
34402 164704 119354 20513 -9793 21649 28159 31391 99642 165212 114725 6558 -11948 43310
34390 43310 32101 -59239 -111628 -87479 -53520 -16128 73832 173180 188361 147105 154204 198903
34378 198903 178536 90938 33196 29273 21332 6890 24679 36765 -10469 -43664 44457 187046
34366 187046 207285 78254 -50252 -77024 -40863 7518 68965 125857 141799 130270 115627
34355A15627n5331j13378p0232O8507J25703K5026q2348o6022J099J3199n458
34344d3608r438j8397r061Q2741J82373J22269o2420j34983l2794L8277j7754
34333I7205k7780Q9518J29860l2347j90480j46123k4597o453j1335Q0264J38482
34322I6214J8047j27694p8223P5751R2609j5833m1828N5194J27528J16310R6570
34311D14645Q9726M7472j2424k8576r555J0270N2558J13389J06234O120p3795
34300G16064o5037n4921r8543r8660r239L8212k8905o7487K1320Q8573K38j08635
34288C32980p2900J5539J0550r80J04734J93050Q3848r5276r5835L2919M5413
34277E54042o9965r9500N015O8288J4460m3752m6726n8724q5102n3551J0826M611
$$ plain form
34355 115627 60296 -53082 -123314 -54807 70896 95922 13574 -52448 -51349 -38150 -43608
34344 -43608 -53046 -71443 -80504 2237 184610 306879 244459 109476 76682 114959 97205
34333 97205 69425 158943 288803 256456 65976 -80147 -104744 -111197 -122532 -42268 96214
34322 96214 114261 -13433 -91656 -15905 76704 60871 19043 74237 201765 318075 414645
34311 414645 504371 551843 539419 510843 501288 511558 564116 677505 783739 789859 716064
34300 716064 651027 596106 497563 398903 389664 427876 398971 331484 352804 441377 441615 332980
34288 332980 260080 275619 286169 285189 389923 582973 666821 571545 475710 508629 554042
34277 554042 484077 384577 389592 457880 472340 428588 381862 323138 238036 184485 195311 199922
34265A99922n6242n6801M267J6709l2727m2038J5503N4265L1702n340j9303m749
34253A05168M7694R6651L4478j44694k55337j47580P0571J89033J66581Q7992
34243B50557k1698j50050j84809n8984Q8455R5431K0572J2605N4186M3237Q026
34232A57528K0938J8419o6980j21371l1396Q2759O1985j0720J1894M5312m4509
34221A23859j28808k8368J17059P2629m0014N5635K49087J85151j01196k03426
34211C01608k1044R4976l2306j34598j4728J27165R7141L1090Q2979J52073J54161
34200H38517K23092M09401N30384N83448R24469J645625K084352J460648q6668
34191H613268j527691k018936j634488j009634n91778l94157k70122j79540j60107
$$ plain form
34265 199922 143680 86879 91146 107855 75128 33090 48593 102858 134560 129220 109917 105168
34253 105168 152862 249513 283991 139297 -116040 -263620 -193049 -4016 162565 250557
34243 250557 228859 78809 -106000 -164984 -76529 18902 39474 52079 106265 149502 157528
34232 157528 178466 196885 129905 8534 -22862 59897 121882 111162 123056 168368 123859
34221 123859 -4949 -33317 83742 156371 116357 171992 421079 606230 505034 301608
34211 301608 280564 375540 343234 208636 193908 321073 418214 449304 532283 684356 838517
34200 838517 1061609 1471010 2001394 2584842 3509311 5154936 7239288 8699936 8613268
34191 8613268 7085577 5066641 3432153 2422519 1830741 1436584 1166462 986922 826815
34182H26815j68673q8599P7279J43694r970k20076k37144q2951M715m4032n8727
34171A42331L3270P1925l5420j31619p0680M8978P1065K4491J6837L4143J0744
34160B16065k1403n068J9996j374k9080j4670m010m3325p5901l8205K8050N4379
34148H5454M8692L7975N066l7742j9450N9587Q0348j5331j06063o0165O9406J29556
34136B77333P1728k8673r3951r5982m0835K3888L2449j7736n9377n6849m3504
34125c1509l8180j4086K4954L1715J819k1504l6678o9707p5852Q890J18383J16285
34113A4530J6517k8845J9368M2756P177L0244J33924J53698J1084j26933j02333
34102A71187n70K2934r965M210L9089L13r0202j29026q9565k5406K4007L8023
$$ plain form
34182 826815 658142 569543 646822 790516 780546 560470 323326 240375 245090 201058 142331
34171 142331 175601 247526 212106 80487 9807 58785 129850 154341 171178 205321 216065
34160 216065 194662 189594 209590 208216 179136 164466 160456 117131 41230 3025 31075 85454
34148 85454 134146 172121 177187 139445 119995 179582 259930 244599 138536 78371 147777 277333
34136 277333 349061 320388 226437 130455 89620 113508 145957 128221 68844 11995 -31509
34125 -31509 -69689 -83775 -58821 -27106 -25287 -46791 -83469 -153176 -229028 -220138 -101755 14530
34113 14530 31047 2202 21570 64326 71503 101747 235671 389369 400453 273520 171187
34102 171187 170617 193551 183586 187796 226885 227198 136996 7970 -81595 -107001 -82994 -44971
34090d4971k169n6976m0849M0224O7652m898o7784l7209J1128j0077m6023j0547
34078b02499N8935P5875M3833J5876k366j7783q67M8187O7683L3746K119K451
34066A25190k409j2785K3431Q3201P2233j733k4655J1930j1455r5534p8577O6384
34054A55221J27943j2430j70905j49673k6996K5916K4904O4925R9496M1735m8464
34043A31672p3636o9638r1107o6303N1641J35158P8124k952L4269J06264O7794
34032C01286j2849J5872J01817Q4956j0456k9090L5594N1145j0927n6345n1710
34021D19293l6685j587P2667J15729P4482L4913P1621Q4483k8933j58327j47850
34010D99806o0238m8336q0455l9311J7428l6590j25738q8259J8257J6218n7113
$$ plain form
34090 -44971 -47140 -104116 -144965 -104741 -37089 -41987 -109771 -146980 -135852 -145929 -191952 -202499
34078 -202499 -143564 -67689 -23856 -7980 -10346 -28129 -28996 19191 86874 120620 122739 125190
34066 125190 122781 109996 133427 216628 288861 287128 262473 274403 262948 167414 88837 155221
34054 155221 283164 270734 99829 -49844 -76840 -50924 -26020 38905 138401 180136 131672
34043 131672 58036 -11602 -102709 -169012 -117371 17787 95911 92959 127228 233492 301286
34032 301286 288437 304309 406126 491082 480626 451536 487130 538275 527348 471003 419293
34021 419293 382608 381021 453688 569417 643899 678812 750433 834916 805983 647656 499806
34010 499806 439568 391232 310777 271466 288894 252304 126566 38307 56564 72782 15669
33999A5669j8296J08641J22982J0168l9780K1050L9233l2239o1799q343J7707
33988A74993l634K5959P7647O057j52075j79376l7930N8191K752n6188j6699J7157
33976h3146j4271L761J05276J23343j7042j24997l6921J21262J40486K5284p9171
33965A63864j07684p6276K512P6072M8569o9337j30791o1695L3497N1296K5980
33954d3993J0270k0826o2052l3454O8431J29757J07059R1352J13594P3445n0140
33943C83443j13551m2187L9656K7116n999J1932L135q6964j53679j16210o2662
33932a15970o8180m8384N2783J13933M4929l5045q388L2239j7792n1089M9846
33921e1118J53760P9755q0730j09463k0145O450l5739P113J30461J55270L7616
$$ plain form
33999 15669 -2627 106014 228996 239164 199384 220434 259667 227428 165629 157286 174993
33988 174993 171359 197318 274965 281022 128947 -50429 -88359 -30168 -27416 -83604 -100303 -83146
33976 -83146 -97417 -93656 11620 134963 117921 -7076 -43997 77265 217751 243035 163864
33965 163864 56180 -20096 -17584 58488 107057 37720 -93071 -154766 -121269 -69973 -43993
33954 -43993 -33723 -54549 -116601 -150055 -81624 48133 155192 246544 360138 433583 383443
33943 383443 269892 227705 267361 294477 288478 300410 303545 216581 62902 -53308 -115970
33932 -115970 -184150 -232534 -179751 -65818 -20889 -55934 -64322 -32083 -49875 -100964 -51118
33921 -51118 102642 182397 101667 -7796 -27941 -21491 -57230 -50117 80344 235614 273230
33910B73230o3873o0015l7786n3412l5524M4610R5821O8517L2095L0018O324o3724
33898B36281j08402q5504m8074l0312P507O4748N9510k5434p4252n519Q8756P1140
33886A50445m3998j20947q7759p16N6237O0727M1079K8078K5852R806l8231q4216
33874c643o5780J3231N6607k849q9354p0645M6927J07471K8513o3300j0932J31477
33862G7723J71083O2384m0039l7589k4779r0515j43330o9013O0412R3809L1000
33851I1146j3606p968j711Q403M2830L0169q0754j58376n0405J36761J60549K1072
33839A78110m9328J7576L5725p0636j19813j2244P1127j6501j26757p5594M8221
33828a20114N9409r631m199P0654Q9649L9865J1147K0323J7591O119O479k6654
$$ plain form
33910 273230 209357 149342 111556 58144 22620 67230 163051 231568 263663 293681 300005 236281
33898 236281 127879 42375 -5699 -36011 -28504 36244 95754 70320 -3932 -9451 79305 150445
33886 150445 106447 -14500 -102259 -102975 -46738 13989 55068 83146 108998 118804 80573 -3643
33874 -3643 -69423 -56192 415 -2434 -91788 -162433 -115506 -8035 20478 -42822 -53754 77723
33862 77723 248806 311190 271151 233562 208783 118268 -25062 -94075 -33663 60146 91146
33851 91146 77540 69572 67861 76264 119094 149263 68509 -89867 -140272 -3511 157038 178110
33839 178110 128782 146358 182083 111447 -8366 -20610 50517 34016 -92741 -168335 -120114
33828 -120114 -60705 -70336 -74535 -3881 85768 125633 136780 157103 174694 180813 187292 160638
33816A60638j13026j52178n9126Q2425J30561O9103k8195j13639j37988l8129
33806a99554J23018J50531o974j35003o6127O2559N9494k445L6160R7205J4961
33795A33825j20235q9715O5600J10084J6963j8828M8795O1914j2159j9988O2156
33784B38412O1404o6743j36811n2938L9554K9099P636M5439M3558m8195r4128
33773F6287j0325O5448P363p8960m5080N2801P5191L2992J9405J9800l0692q3435
33761I0795m2863N5552Q3905Q877p5507p7276J1013J17852J24725l4077k44295
33750A8701k82767r3835J12731J36783M4370J9815P1422O1299l2345p5714m783
33739b4323P4923N5298l1068q7330q1434m3738m93L4947M3062J8637o581L438
$$ plain form
33816 160638 47612 -104566 -163692 -81267 49294 118397 90202 -23437 -161425 -199554
33806 -199554 -76536 73995 67021 -67982 -134109 -71550 -12056 -14501 21659 118864 133825
33795 133825 13590 -76125 -10525 99559 116522 97694 146489 208403 196244 176256 238412
33784 238412 299816 233073 96262 43324 82878 111977 119613 165052 208610 160415 66287
33773 66287 55962 121410 128773 49813 4733 57534 132725 165717 185122 204922 174230 90795
33761 90795 47932 103484 187389 196266 120759 43483 54496 172348 297073 262996 18701
33750 18701 -264066 -357901 -245170 -108387 -64017 -44202 27220 88519 56174 -19540 -24323
33739 -24323 50600 105898 74830 -12500 -93934 -137672 -138165 -103218 -60156 -41519 -48100 -44662
33727d4662L9492N7015L8045J7205K5950L2845j4610r0662j00787k1399M2365
33716a9203M409o2196l3604N9336O3716n7264j52302r3525M8645J13098N5699
33705g3191k8623m9152j0914K9026M3928N5055P7706P5330M925r0504r9668M990
33693f1092R5929M2667j09674j93428j18494N3256J96622K12714P9912r6986j42687
33682d1261j6068J03388M9961q4885j00126l416K5886m3555n5038L4339O3065
33671f7710l8984r5691L5320K13643K15972N4757p3461p4768l2911l6777o5471
33660C3919m7033M1811J38088J41456L5672n6129k2717N1306o954j65165j87157
33649d2903J0176J94809J36763p4156j81416j09332P001N1872K6795k8553p1209
$$ plain form
33727 -44662 -5170 51845 89890 107095 133045 165890 151280 60618 -40169 -61568 -19203
33716 -19203 -14794 -76990 -110594 -51258 12458 -44806 -197108 -290633 -241988 -128890 -73191
33705 -73191 -101814 -150966 -161880 -132854 -88926 -33871 43835 119165 124090 33586 -66082 -61092
33693 -61092 34837 77504 -32170 -225598 -344092 -290836 -94214 118500 198412 101426 -41261
33682 -41261 -57329 46059 96020 11135 -88991 -92407 -66521 -110076 -165114 -130775 -67710
33671 -67710 -106694 -202385 -167065 46578 262550 317307 243846 169078 136167 99390 33919
33660 33919 -13114 28697 166785 308241 343913 287784 265067 316373 309419 144254 -42903
33649 -42903 -32727 162082 298845 224689 43273 -66059 -59058 -7186 19609 -8944 -80153
33638h0153m5755M5637J02240N0173m2728o9173l3310M93L4325R3437J24448O8549
33626B48183j5759l3807j1903l9594r8179r3235l1433j1931m6497l9628L4624
33615a39159P9503L9556p343K0096Q3584R6463M6481j1932l7919k7721N204L3960
33603A80773K8120r201l1211K420P2290J10278O8915j9526o7469l5215J0464j3924
33591B96714p7723p2027J7858P3072J6820o4896n2331L3047P5521L8417q442j4897
33579B61133j3309m7172j00886j21055p9757r256K1429k0207q2530q7750l0327
33568c09687L1587P0777J03685J15512O9374K7r766L1093K4701m1309n9253L774
33556C0515K8094n2371j15690m6188P0979R5496N5808O2141R1668M4787m8318
$$ plain form
33638 -80153 -125908 -80271 21969 72142 29414 -39759 -73069 -72576 -38251 55186 179634 248183
33626 248183 232424 198617 186714 147120 48941 -44294 -75727 -87658 -134155 -173783 -139159
33615 -139159 -59656 -20100 -27443 -7347 76237 172700 219181 207249 169330 141609 146813 180773
33603 180773 208893 199692 168481 170901 243191 353469 422384 402858 335389 300174 310638 296714
33591 296714 218991 146964 164822 237894 254714 189818 137487 170534 246055 284472 276030 261133
33579 261133 247824 200652 99766 -21289 -101046 -110302 -88873 -109080 -191610 -279360 -309687
33568 -309687 -278100 -207323 -103638 11874 81248 81275 71509 102602 127303 85994 26741 30515
33556 30515 58609 6238 -109452 -155640 -84661 10835 66643 128784 220452 265239 216921
33545B16921o7445j5778r019n9544n0775N1520J24875P5718l0487q2714o9308
33534H3964n0416n2999m7058J519P7243J10173M9398m8202o4815J0076M4755l9289
33522G4349j35304j12119j4832K2768n866K518P0924J14027Q1419L797q5651j60399
33510a44369j56350l9769R7337J23658L6509n4258p8433m2700L3778J06392Q4214
33499c3991m8223j46550q5912L9654O0819Q325M2910J53396J56612M124j36886
33488A4278j48801j02784p7518l3926N3233J08786Q4680L4735M48m1864p4643
33477a83376k9463O7956R8351M5566L0747R4105J15983K9020o5557q2223p9197
33466D1912j00181o2404O8614J52673P5131n7605p9850j5693n789o8019r1452
$$ plain form
33545 216921 149476 133698 124679 65135 14360 65880 190755 266473 235986 153272 83964
33534 83964 33548 -19451 -66509 -64990 12253 122426 171824 123622 58807 68883 113638 74349
33522 74349 -60955 -173074 -187906 -165138 -171004 -168486 -97562 16465 97884 101681 16030 -144369
33510 -144369 -300719 -340488 -243151 -119493 -82984 -137242 -215675 -258375 -224597 -118205 -33991
33499 -33991 -82214 -228764 -314676 -275022 -214203 -205878 -162968 -9572 147040 151164 14278
33488 14278 -134523 -237307 -314825 -348751 -295518 -186732 -102052 -67317 -66869 -108733 -183376
33477 -183376 -212839 -144883 -46532 -966 29781 123886 239869 268889 203332 121109 41912
33466 41912 -58269 -120673 -52059 100614 175745 118140 38290 22597 16808 -51211 -142663
33455a42663k2925P4358J21104Q4378k1345j17501j00371K7742J27254R3453r145
33444A14339n7551l8330k1278l6075o2347q4798q3354k6718O0050Q7737K3363
33433a24962n2751o5306l8115j6059J2705N3688O1995K8248J2759L2691K1485
33422g3622l8608o4942k1618J6992K1087O5205J43599J10760o2371j63547m8171
33411a15236J04455O1313r2547j08187J8239P5441J1724j3671N5206Q6938L0787
33400A14462J3374R4935J51458R4915K2688M0477R2474Q1101L0774J7520K7686
33389G81864l730p0906j03666o7397K718N0575N1675K9224K2347K7318j699o7838
33377F50485r9029m9169K7894O9269R5779J29544J03174k6910j47601j16921K1060
$$ plain form
33455 -142663 -165588 -91230 29874 114252 92907 -24594 -124965 -97223 30031 123484 114339
33444 114339 56788 18458 -2820 -38895 -101242 -186040 -269394 -296112 -236062 -148325 -124962
33433 -124962 -177713 -243019 -281134 -297193 -284488 -230800 -168805 -140557 -127798 -95107 -73622
33422 -73622 -112230 -177172 -198790 -181798 -160711 -95506 48093 158853 96482 -67065 -115236
33411 -115236 -10781 50532 -42015 -150202 -131963 -56522 -44798 -58469 -3263 83675 114462
33400 114462 127836 222771 374229 469144 491832 532309 624783 705884 736658 754178 781864
33389 781864 778134 707228 603562 536165 538883 589458 641133 670357 692704 720022 718323 650485
33377 650485 551456 502287 530181 599450 695229 824773 927947 901037 753436 636515 657575
33366F57575R9549P0991K7182O327m3085j08826j05266m0093k3899q0869j08800
33355C50786o4827l1905n4088o4043l2726l5147r4344j08501k1203O8462N9498
33344b8038m514l4831l4611m1682l2269K0625P1950P3051M5451K0863j2640m6417
33332c062k8361L1477L6074m2711r2207l2768M5116K6843m1523m1787K0183M2538
33320h0188K270k7273o856L1825O1778P9528O7498K0165j5168j76K0336j8419
33308A35320r4817j34140j17205p8727k9507L7536R0082Q8365N5815M1494L2170
33297B6386j9956r8613j33003r9859m4274j711L5595P4076R6326Q5625L7433l8058
33285h0033r5107p4501Q495M9090j0000p7655l4001R0827J56939J10978L7359
$$ plain form
33366 657575 757124 828115 855297 861624 818539 709713 604447 564354 540455 459586 350786
33355 350786 285959 254054 199966 135923 103197 68050 -26294 -134795 -155998 -87536 -28038
33344 -28038 -32552 -67383 -101994 -143676 -175945 -155320 -83370 -10319 35132 55995 43355 -3062
33332 -3062 -31423 54 36128 -6583 -98790 -131558 -86442 -59599 -101122 -142909 -122726 -80188
33320 -80188 -77918 -105191 -112047 -80222 -18444 61084 128582 148747 133579 133403 153739 135320
33308 135320 40503 -93637 -210842 -289569 -319076 -281540 -191458 -103093 -47278 -5784 26386
33297 26386 6430 -92183 -225186 -325045 -369319 -371030 -335435 -261359 -165033 -79408 -41975 -80033
33285 -80033 -175140 -249641 -241146 -192056 -202056 -279711 -313712 -222885 -65946 45032 82391
33274H2391J4835K2580R161k7389n6942n6495j6649L9688M5872l6279j30385j07669
33262b17281M3157J76883J58746J9908r2298q6067j0058K2372k9755q6504n0011
33251a50908N4439R6188K0573o1030k8233O7400Q0711o924o9529l4859K4903K9428
33239B2159L057n10J0111J1862K6143N8061M5793m5653j31225r9710K4044J01266
33227B5398O1833j6893l0780K1721O7799O7986M5341K8989J8607R002J1088K7570
33215C37661L0908o546o9437j13319j18439j02100p9540m8280j6822o602q752
33204b01268J6590P0781R2161M0919l2431n2378j6630K6394O4342J15305J56004
33193B79789J34098N3396k0810m8168m4742k5691J5087N4690L9847l5210j04738
$$ plain form
33274 82391 97226 119806 128967 101578 44636 -11859 -28508 11180 57052 20773 -109612 -217281
33262 -217281 -174124 2759 161505 181413 89115 3048 -7010 15362 -14393 -100897 -150908
33251 -150908 -96469 -281 20292 -40738 -68971 -1571 79140 72216 2687 -32172 -7269 22159
33239 22159 25216 24706 34817 46679 72822 130883 176676 131023 -202 -99912 -75868 25398
33227 25398 87231 70338 39558 61279 129078 197064 242405 271394 290001 299003 310091 337661
33215 337661 368569 362023 292586 179267 60828 -41272 -120812 -169092 -185914 -192516 -201268
33204 -201268 -184678 -113897 -21736 19183 -13248 -65626 -82256 -55862 8480 123785 279789
33193 279789 413887 467283 446473 398305 353563 327872 342959 397649 437496 402286 297548
33182B97548j14271p9215l6050J0992N8353O8062J5556n6463q2760o2094n3121
33171c3463q0144q4488k186J23795J60402M7468r6203j03448J7366R1366L1582
33160G2047m2565j4023L6940j8577j19597j05467J5295Q3998N6642M3563P7840
33149H6096O0531k1093l7280M9921J05371O3549M0494R5868J09717L4527K8275
33138F15976J58149K35987J93146L30367Q16708J169415P45566l04627j092326
33129B868361j074878o17375l21895k63851j81257l8233K246m5086k2674N4282
33119C59640L3958p3769j09969m8420j8332n6825o4831j5784l31m1125n0308k040
33107h8136K3226J349R160O2883O6762j5831p7588k9388O3011Q1608J0670p8273
$$ plain form
33182 297548 183277 104062 68012 79004 137357 205419 220975 164512 81752 19658 -33463
33171 -33463 -113607 -198095 -200281 -76486 83916 131384 35181 -68267 -50901 40465 72047
33160 72047 29482 15459 52399 33822 -85775 -191242 -175947 -91949 -35307 8256 86096
33149 86096 146627 125534 88254 138175 243546 307095 347589 443457 553174 587701 615976
33138 615976 774125 1010112 1203258 1533625 2350333 3519748 4265314 3960687 2868361
33129 2868361 1793483 1176108 854213 590362 409105 370872 373118 328032 305358 359640
33119 359640 393598 319829 209860 161440 143108 86283 21452 5668 5337 -35788 -86096 -88136
33107 -88136 -64910 -63561 -54401 8482 75244 59413 -18175 -47563 15448 97056 107726 29453
33095B9453j23501r5635R590J35771J71947O0861j15847k03387j23899M9713J62135
33084d2799J22127q003q2810l8299N0909Q9108P2155M9284L8604K9778J4277k5167
33072B69164q8339j01135P913J53147J70079Q8711J13696K53725K70051J71815
33062A308827L83894J036168J417154P41931o49554j521642j254473n06457j63373
33053G92475k47066k62406j03188m1356j10269p7054P6097J22976J5470n9341
33043A06338l2912k0849m1711O833Q7120M4771r0018j16421l096O8561L1812J8453
33031E8881O6320L4841j01076j50443k1743J04086N6503p5137j18573o8735j9167
33020b34243P769K8202J8359j4458O618R6101J42835O7545n8296j26757j23935
$$ plain form
33095 29453 -94048 -189683 -180093 -44322 127625 188486 72639 -130748 -254647 -204934 -42799
33084 -42799 79328 71325 -11485 -49784 1125 90233 162388 211672 250276 280054 294331 269164
33072 269164 180825 79690 87603 240750 410829 499540 613236 866961 1137012 1308827
33062 1308827 1692721 2728889 4146043 4887974 4238420 2716778 1462305 955848 792475
33053 792475 545409 283003 179815 138459 28190 -48864 27233 150209 165679 106338
33043 106338 73426 52577 10866 17699 104819 149590 59572 -56849 -59945 8616 40428 58881
33031 58881 125201 160042 58966 -91477 -113220 -9134 47369 -27768 -146341 -215076 -234243
33020 -234243 -226474 -198272 -179913 -194371 -187753 -91652 51183 118728 60432 -66325 -190260
33009a90260q1726r117O3746P8437M1015K0335K1853j4810p0139m8139M0602O6603
32997h1600j237m3114p486R760k6421j2369P1762Q1554k9381q9905j862P4753
32985e5546P642n9382L2811J51427Q9209p3204j07471j8732Q016m1817j7397Q2536
32973a908R3185j6003r0389o0466k1191j6096K1756P5757K6382j13164j60107
32962b62244m0971Q8062Q6769J7334r333p691k9443m1670m838L8123M6962N7834
32950f1106Q7567O7253l6596j26914j02505j1591J6915m7630j08768p4315L5843
32939c61847J09353N9645o2365j06097j4755P7206K9474q5935r5096p228N05j12902
32927e70042j78122j11741p7277k17564l88428l28854o306L55549N36100M85358
$$ plain form
33009 -190260 -271986 -281103 -217357 -138920 -97905 -77570 -55717 -70527 -140666 -188805 -148203 -81600
32997 -81600 -82837 -125951 -133437 -123677 -150098 -162467 -90705 -9151 -38532 -128437 -130299 -55546
32985 -55546 -47904 -107286 -74475 76952 166161 92957 -14514 -33246 -25230 -67047 -84444 -1908
32973 -1908 91277 75274 -15115 -75581 -96772 -112868 -91112 -15355 11027 -102137 -262244
32962 -262244 -303215 -215153 -128384 -111050 -120383 -128074 -157517 -199187 -204025 -165902 -118940 -61106
32950 -61106 26461 93714 57118 -69796 -172301 -183892 -166977 -214607 -323375 -397690 -361847
32939 -361847 -252494 -192849 -255214 -361311 -376066 -298860 -269386 -355321 -450417 -457645 -457140 -570042
32927 -570042 -748164 -859905 -937182 -1154746 -1543174 -1872028 -1878334 -1522785 -986685 -501327
32917e01327K89576R1706J5869O9394J32462J04195J8150m0547o4064q9455j01784
32906g5825o2975P711O6538J13646J48165J11346k5477j61148j64160m8765N1020
32895c9924O3944L4244P941j7348k4946J9990P4934L7810q9455j56801o1477R0987
32883f0101J18469R706o9838j6392P6498O7404l0281q0581k4078N3388O0569J7461
32871A22224j1346k0875l1419j1819O5920J29687P6420o3822j43343r9046l3243
32860b0662m6629q9460n5591M5380J01407N4562l2534o5551k5071K3903J1641
32849i8605m9196o8911K739R2696R5027K2068k2079j0035j7726o3057n1758N2967
32837a15870J33417Q6909j3683m3524j8922l2893o9465l7342M7857P3014J4910
$$ plain form
32917 -501327 -211751 -120045 -104176 -34782 97680 201875 220025 179478 115414 25959 -75825
32906 -75825 -138800 -131089 -64551 49095 197260 308606 283129 121981 -42179 -90944 -39924
32895 -39924 24020 58264 66205 48857 23911 43901 118835 156645 67190 -89611 -151088 -60101
32883 -60101 58368 68074 -1764 -18156 58342 125746 95465 14884 -9194 44194 104763 122224
32871 122224 110878 90003 58584 46765 112685 242372 318792 254970 111627 12581 -20662
32860 -20662 -67291 -156751 -212342 -166962 -65555 -10993 -43527 -109078 -134149 -110246 -98605
32849 -98605 -147801 -216712 -213973 -121277 -26250 -4182 -26261 -36296 -54022 -117079 -168837 -115870
32837 -115870 17547 104456 90773 47249 28327 -4566 -74031 -111373 -63516 9498 24408
32826B4408k8660j1212l547n2054r4243o6356O614P6961J35748J61989J11152
32815B60800J4572j0970O5279J00811k7077k11678k33768o0313J08440J04650
32805A10746j3428q1039m5273J3425K4751O833N653K1793K2743k403k7814k4870
32793A1117N119L6202M7630L9709K2667K982j4774k7089m1462o9183r2784o5664
32781a45530K2753J02695R6585K8922o09L6515N4826m389o8779m2924M1387P6249
32769A97701L8926k569k2036n6265r5178p6007j0260Q512l4929l7597L9450Q3220
32757C2968J7787m7690Q041J04289Q0967l6442p7239k478M4761j6052p9029l2415
32745b532P0049R8703K4100o6454p8888L422J08956J37025O3994k0629l1448n504
$$ plain form
32826 24408 -4252 -15464 -19011 -71065 -165308 -231664 -225050 -148089 -12341 149648 260800
32815 260800 275372 264402 329681 430492 403415 191737 -42031 -102344 6096 110746
32805 110746 97318 16279 -28994 -15569 9182 16015 21668 43461 66204 63801 35987 11117
32793 11117 16236 52438 100068 139777 162444 165426 150652 123563 82101 12918 -79866 -145530
32781 -145530 -122777 -20082 76503 105425 104816 141331 196157 191768 122989 80065 121452 197701
32769 197701 236627 234058 212022 155757 60579 -15428 -25688 -17176 -52105 -89702 -50252 32968
32757 32968 50755 3065 11106 115395 196362 159920 82681 80203 124964 108912 29883 -2532
32745 -2532 67517 166220 190320 123866 44978 48400 157356 294381 358375 337746 306298 300794
32733C00794k8457q4548q8713m2947l4218p8795r5774m9065M206K3768K8860J8349
32721a26540l0414p0810k4263P7196J20229R1819Q0815R0135K8815q1434r7015
32710E8533p051J8983p5213j17341p288R3570L8743n0894j3161O6464K4858p6593
32698d6390p1413J2838L1715K501M3167J09529O5256l7466k6879O4720L6737j09693
32686G4622j33251N2757K20128J66405j3337j15496r6121k7731M7151R6861O9593
32675C41581j1032l6415J7606L8305k7018o3172J9320J13062O5399r0226j79100
32664A88310j08558M4908J32381O3948j05136j95199q6839J03971J46739O597
32654A91122j14488q4682j2110k2458m9968Q258Q1245M2253o7770j11312p4217
$$ plain form
32733 300794 272337 187789 99076 56129 21911 -56884 -152658 -201723 -197517 -173749 -144889 -126540
32721 -126540 -156954 -227764 -252027 -174831 -54602 37217 118032 208167 236982 155548 58533
32710 58533 51482 70465 -4748 -122089 -129377 -35807 2936 -47958 -61119 5345 30203 -46390
32698 -46390 -117803 -104965 -73250 -70749 -27582 81947 147203 109737 82858 147578 184315 74622
32686 74622 -58629 -5872 214256 380661 367324 251828 155707 127976 175127 271988 341581
32675 341581 330549 294134 311740 350045 323027 259855 279175 392237 457636 367410 188310
32664 188310 79752 124660 257041 320989 215853 20654 -66185 37786 184525 191122
32654 191122 76634 -8048 -20158 -42616 -92584 -84326 -3081 39172 -28598 -139910 -214127
32643b14127m4185k6930M0771J24800J13587O525o8903m5790Q805L1831M9604
32632b4012Q4791Q8247K3203n9568q8053n9981k4333j1043j4400j8576j2293N571
32620a10447K1481K0688O080r789k3936l7667m4134l9188k9739j4862J8174N8450
32608a84889O3538K1226j0149K8870J04129J16681L2962o0862o3272R809M0554
32597I8597l3248j19637q3718N7821J34853M6817r6646j28596m5265K9351M3619
32586i6052M9215N6920J3945n9651o1473K2181P3578L0989j4794J3434M8717J4789
32574I1798k8938P17N2250K8352m0237m9340m75J1165l9010p6494n1241J3546
32562h7907P9851J09227M9588q7519j67897p6053R9078J50421L0529r0147p2578
$$ plain form
32643 -214127 -258312 -285242 -244471 -119671 -6084 441 -68462 -114252 -105447 -73616 -24012
32632 -24012 60779 149026 172229 112661 24608 -35373 -59706 -70749 -85149 -103725 -116018 -110447
32620 -110447 -88966 -68278 -62198 -71987 -95923 -133590 -177724 -216912 -246651 -261513 -243339 -184889
32608 -184889 -121351 -100125 -110274 -81404 22725 139406 172368 111506 48234 58043 98597
32597 98597 65349 -54288 -138006 -80185 54668 101485 4839 -123757 -169022 -139671 -96052
32586 -96052 -46837 10083 24028 -35623 -97096 -74915 -1337 29652 14858 28292 77009 91798
32574 91798 62860 63577 115827 144179 103942 54602 54127 65292 26282 -50212 -101453 -87907
32562 -87907 -8056 101171 150759 63240 -104657 -180710 -81632 68789 99318 9171 -63407
32551f3407J3982K9027l2908o8088l5573m195l5334r0416q1832J1272J09143J22798
32539a25531N9561M697M368J9100O883j1109n468J419j5337k5588K133L4975K9448
32526b0449P954J2570K5731J3421M909M2614Q8428P3816J5171j6748j6181k7464
32514B03772l3904J9651R9026J00643J4773m9153k8363J3523Q192k3940m7581
32503B76639p6937j10179r3906j6218N0240O2318P6576J29995J39063K3754j29395
32492C31950j49590p232J48702J80631J01901J5110j0995K2941P5123R3030N0433
32481H52004k3525p5705r4457j10219j28041j10111m8848o363l2112p5367m5943
32470A01313M6414Q7283J3721r3813j23857q0817m6464l4232J7556J07560J33640
$$ plain form
32551 -63407 -49425 -20398 -53306 -121394 -156967 -161162 -196496 -286912 -368744 -357472 -248329 -125531
32539 -125531 -65970 -61273 -56905 -37805 -30922 -42031 -47499 -46080 -61417 -87005 -84872 -49897 -20449
32526 -20449 -12495 75 25806 39227 44136 86750 175178 248994 264165 247417 231236 203772
32514 203772 169868 189519 288545 389188 403961 354808 326445 339968 348160 324220 276639
32503 276639 199702 89523 -4383 -20601 29639 91957 168533 298528 437591 461345 331950
32492 331950 182360 175128 323830 504461 606362 621472 610477 633418 708541 801571 852004
32481 852004 828479 752774 658317 548098 420057 309946 261098 254735 222623 147256 101313
32470 101313 147727 235010 248731 154918 31061 -49756 -96220 -130452 -112896 -5336 128304
32459A28304L8152r1435j31486p3699P71N0779R5166J26584R5864k901r7599j17134
32447B1366o7587j0171N439l2500j07510j78783j87322r8227M3240J24565P8742
32436d08748k0394l3489N8006J17590N4821l0047m330P3083M1854q3455j16082
32425c51191O866J24662J09788L6117k890n4157j46051j49007J6241J73332J14633
32414a21657o5756j00450M2721J27278K3925j14513j06589K2263J33249J54833
32404d696R6773P11o1486l3774L9222N7483Q974k8764k9754m2621o6436l8228
32392a02596L2227N0086o465m5162j6884J3516r58j2741J2216K9043J1872M162
32380c1684J9530N642m3328n5855j4973K715k6727k3540L5702N0192k5209p1042
$$ plain form
32459 128304 166456 75021 -56465 -130164 -129393 -78614 16552 143136 239000 236099 138500 21366
32447 21366 -46221 -56392 -50953 -83453 -190963 -369746 -557068 -655295 -612055 -487490 -408748
32436 -408748 -429142 -462631 -404625 -287035 -232214 -262261 -266591 -193508 -151654 -235109 -351191
32425 -351191 -344325 -219663 -109875 -73758 -76648 -130805 -276856 -425863 -409622 -236290 -121657
32414 -121657 -187413 -287863 -245142 -117864 -93939 -208452 -315041 -292778 -159529 -4696
32404 -4696 92077 92788 31302 -2472 36750 94233 103207 74443 44689 2068 -64368 -102596
32392 -102596 -70369 -20283 -26748 -71910 -88794 -75278 -76236 -88977 -76761 -47718 -35846 -31684
32380 -31684 -12154 -6512 -49840 -105695 -120668 -117953 -144680 -168220 -132518 -82326 -107535 -178577
32368a78577J4013J39614J54459N5801m7793r9656j07115o3122K9525J04287R4156
32357I5592J1344r0925j73397j87313r2781M5677R3044L4518M553N5321N5963
32346a48404o5954j52621n2429J14325J28362Q797l8686M8102J24512Q7929l438
32335E0495o8344r4845p9172j1095O4820Q6451O9134O1358L8047m0928j05871
32324b9950n7080N4244P7120j5383j00660j00421n2929N853P8304J14186M3303
32313A6587p5608r1084K1035J16969R9494K8881k0516o3479j04380p8611K6270
32302a24442J09383R4481K9143j5673m0414n2512k0225L9983M1293l0683o2400
32291c2066J1410Q0703J6549j29459j96060j24876J127Q7410J03608O4999J8589
$$ plain form
32368 -178577 -164564 -24950 129509 185310 137517 37861 -69254 -132376 -102851 1436 95592
32357 95592 106936 16011 -157386 -344699 -437480 -391803 -298759 -264241 -259688 -204367 -148404
32346 -148404 -214358 -366979 -419408 -305083 -176721 -167924 -206610 -158508 -33996 53933 50495
32335 50495 -17849 -112694 -191866 -202961 -138141 -51690 17444 78802 116849 75921 -29950
32324 -29950 -87030 -32786 44334 28951 -71709 -172130 -225059 -219206 -140902 -26716 16587
32313 16587 -59021 -150105 -129070 -12101 87393 116274 95758 32279 -72101 -150712 -124442
32302 -124442 -15059 79422 108565 92892 52478 -34 -20259 19724 61017 30334 -32066
32291 -32066 -20656 60047 76596 -52863 -248923 -373799 -372672 -285262 -181654 -116655 -98066
32280i8066J8235N2798M2048l9480r7151m9332L7783M4599k1882n2618j4595J1837
32268a65824k1989n7269l0264K8918M6960Q882l3914l2661J2789O5071Q5537O3051
32256c0713J9064j2668j4854j297m470l8482p1388n6010L7K9615J218k2202K5323
32243a76827R7498R1504L618o3334n4843k9401l7577l2479L7508J19131J14774
32232F9572J6224q5222j03688l2617O4853J06801N6693l7401q9790p5191m3933
32221a53699l2004j2920L5624P6562O7309K3117j6040m3660p1687r1005q4184
32210c02587n1177J413O3393R8101O5333j1569n6292m1608j8627j7276L552N9535
32198b07809P8740R226q1046r7261n3050k0439L486O9177J45312J40382N5855
$$ plain form
32280 -98066 -79831 -27033 15015 -24465 -121616 -170948 -133165 -88566 -110448 -163066 -177661 -165824
32268 -165824 -187813 -245082 -275346 -246428 -199468 -190586 -224500 -257161 -244372 -179301 -93764 -30713
32256 -30713 -11649 -24317 -39171 -40468 -44938 -83420 -154808 -210818 -210781 -181166 -179948 -202150 -176827
32243 -176827 -79329 12175 15793 -47541 -102384 -131785 -169362 -201841 -164333 -45202 69572
32232 69572 85796 574 -103114 -135731 -70878 35923 92616 55215 -34575 -109766 -153699
32221 -153699 -185703 -198623 -162999 -86437 -19128 3989 -12051 -55711 -127398 -218403 -302587
32210 -302587 -353764 -352351 -288958 -190857 -125524 -137093 -193385 -234993 -253620 -270896 -267344 -207809
32198 -207809 -129069 -119843 -200889 -298150 -351200 -371639 -368153 -298976 -153664 -13282 42573
32187D2573J982L2394O5204J8849n8015o4582j966L5293P715j1113M4449J11448
32175B24231O9493p5391j62431q2566N2738M7162j02674j91273r1555P0223J03746
32164a38297J3006m7444n166P0711J11607J22784J12563O2222r698m4920l4844
32153B12524l5269o9087r1210p5103n4129m4348r534N0175N7946k3636j06439
32142a88110r0458j0897K2376k966L105P2631J23942R2432K2710j6098k7924m2240
32130d1497l6497J4434N7062J9002o8755r9696m2697K1673L0763J8280K8179L2227
32118f7522r146o5112p7186m1428O020M4109N6875J7081n9828r3447l8710L6106
32106b92188M4036L976j1848l189j3478k2297J6281O3240N0496J6684M3521Q3986
$$ plain form
32187 42573 44555 76949 142153 161002 102987 38405 36439 71732 79447 68334 112783 224231
32175 224231 293724 218333 55902 -26664 26074 73236 -29438 -220711 -312266 -242043 -138297
32164 -138297 -125291 -172735 -177901 -107190 4417 127201 239764 301986 292288 247368 212524
32153 212524 177255 108168 16958 -58145 -112274 -156622 -166156 -115981 -58035 -81671 -188110
32142 -188110 -278568 -289465 -267089 -270055 -266950 -194319 -70377 22055 44765 28667 743 -41497
32130 -41497 -77994 -63560 -6498 12504 -56251 -155947 -198644 -176971 -146208 -127928 -99749 -67522
32118 -67522 -76668 -141780 -218966 -260394 -254374 -210265 -153390 -136309 -196137 -289584 -328294 -292188
32106 -292188 -248152 -244176 -256024 -259213 -272691 -294988 -278707 -215467 -164971 -148287 -104766 -20780
32094b0780K7283p4562n2714P8147R8790n2703j41742j0106J41250O5136j18733
32083f0734j06666R9045J95232N6684r4964o8373K0834q653r1168l5593J50872
32072E6516K54758J50341m8658j58579j42776r9662q9391n9003L9613J27608Q1937
32061A12704p1901j57644q0824L8575M5445l1540n7242j4957k844l4626q486J02628
32049a60712J76723J17770n515o3823l1358J6130J1225m5865r8080p7931J5777
32038a45659Q6684M6151n6433q8926k0564M6593M0441K620j9008m4947p9459o2251
32026b94758K4342R4354P9568K7568N486o111l9591m8754P529O5095M8196L52
32014c6724N358L3864j42o8882o1611K3193N9411j2633j01043j09027n6348o693
$$ plain form
32094 -20780 6503 -68059 -120773 -42626 56164 3461 -138281 -148387 -7137 57999 -60734
32083 -60734 -167400 -68355 126877 183561 88597 20224 41058 32405 -58763 -94356 56516
32072 56516 311274 461615 412957 254378 111602 11940 -77451 -136454 -96841 30767 112704
32061 112704 40803 -116841 -197665 -159090 -113645 -145185 -202427 -217384 -220228 -254854 -263340 -160712
32049 -160712 16011 133781 128266 64443 33085 49215 60440 14575 -83505 -161436 -145659
32038 -145659 -58975 -12824 -69257 -158183 -178747 -132154 -91713 -89093 -108101 -153048 -232507 -294758
32026 -294758 -270416 -176062 -96494 -68926 -63440 -69551 -109142 -157896 -150367 -85272 -37076 -36724
32014 -36724 -31366 2498 2356 -66526 -128137 -104944 -45533 -58166 -159209 -268236 -324584 -331277
32002c31277K9066N9221O0992K6828N41J0598J8818j2367m9839m1171L667L4343
31990a90580L1685J1448j1050j7150J6972P1097P2071n276o8618j9301R1864J14240
31978I7402L589j17648j31932o6752j3156J3133M8886P7069M3421l4300o6928
31967a47216k0786L1151J7833l0790l9511N60L2740K6922J4376K8298N5378O3074
31955C2029M4468J5528j2074l3510l8741k2943o539j9523n6265o5882o911R6333
31943g4030J69588J58336P0111m2149j18642j25052p7319l1962k1962j1318M2587
31932f1812R4456N6664m8187q0830J1957Q8401Q033j41630j56089j4006R4227
31921a48816M8414m9911o1793n777K0340M104o44J5158K4500L4793O0388O4095
$$ plain form
32002 -331277 -302211 -242990 -181998 -155170 -154629 -144031 -125213 -137580 -187419 -228590 -224923 -190580
31990 -190580 -158895 -147447 -158497 -175647 -158675 -87578 -15507 -20783 -89401 -108702 -16838 97402
31978 97402 100991 -16657 -148589 -215341 -228497 -215364 -166478 -89409 -45988 -80288 -147216
31967 -147216 -168002 -136851 -119018 -149808 -189319 -188759 -156019 -129097 -114721 -86423 -31045 32029
31955 32029 76497 92025 79951 46441 7700 -15243 -21782 -41305 -97570 -163452 -170363 -74030
31943 -74030 95558 253894 324005 281856 163214 38162 -39157 -71119 -93081 -104399 -61812
31932 -61812 32644 89308 41121 -39709 -27752 60649 68682 -72948 -229037 -243043 -148816
31921 -148816 -100402 -150313 -212106 -217883 -197543 -193439 -194083 -178925 -154425 -119632 -59244 4851
31909D851Q516o4502p8339j9774O5107J35758J60494J03970j8083j16584j33328
31898D8086j18423j28395j12788r413J04809R7503q673n7279L314N2252P608l7758
31886a59157K4963J34832J44162K8970q9025j12022o7510k7794k81N2325J09927
31875C9390Q1924o6784k18483k09198l7001J18388J17604K0530l2444j1416K0186
31864a77304M1149P3189Q7842L5837m5228o5143j8699J2912q156m5975p8310j04322
31852b92208p7567M0364J58934J33497j5599j02272l5956N8545M6638k6522m1318
31841a53464J5494P6109J08288J07849M9962n4346j15955p6937q966j0512n4646
31830a17124l8702M7276J05939Q1292L0198K5774N5651N1729r579p1511o6663
$$ plain form
31909 4851 13367 -51135 -129474 -149248 -84141 51617 212111 316081 297998 181414 48086
31898 48086 -70337 -198732 -311520 -320933 -216124 -118621 -127294 -184573 -181259 -129007 -121399 -159157
31886 -159157 -134194 638 144800 173770 84745 -27277 -94787 -122581 -122862 -70537 39390
31875 39390 121314 54530 -163953 -373151 -410152 -291764 -174160 -153630 -186074 -197490 -177304
31864 -177304 -136155 -62966 24876 60713 15485 -49658 -68357 -55445 -63601 -109576 -187886 -292208
31852 -292208 -369775 -329411 -170477 -36980 -52579 -154851 -190807 -132262 -85624 -112146 -153464
31841 -153464 -137970 -61861 46427 154276 204238 149892 33937 -43000 -51966 -62478 -117124
31830 -117124 -155826 -108550 -2611 78681 108879 134653 190304 242033 232454 160943 94280
31819I4280p235K3819j7192p3779p4187l2501n346Q374M1196O7094M1027M056
31807F9606L0833Q4756N8491l8454p8806k7339K660m8778q3038j5392Q2151R9161
31795A35851L7020l7625q4866p2385J8347J04173N3695r8941j47107j2838J11800
31784G124N3318p7932p9639K7226P2950K4751r612J762o614l9588l9232j5664
31772h1150k3310l4753J3179P9890P4528J5059j2316j3922n5223j04250p3122
31761b15390R244L2102n781m688M6462N6652J0200n880L5810O4644M7966K4547
31749I5888O34m4897o1189J1270Q8348L0685j12405j39169j775J17970Q9077l19
31737G4118k6107m982P74M133K3635J7149k9963n7738l8156k2740l3432k0831
$$ plain form
31819 94280 87045 110864 93672 19893 -54294 -86795 -92141 -83767 -42571 24523 65550 69606
31807 69606 100439 185195 243686 205232 126426 99087 101747 52969 -30069 -45461 36690 135851
31795 135851 172871 135246 50380 -22005 -3658 100515 154210 55269 -91838 -104676 7124
31784 7124 60442 -17490 -97129 -69903 3047 27798 18186 19948 13334 -26254 -65486 -81150
31772 -81150 -104460 -139213 -126034 -46144 28384 43443 31127 17205 -38018 -142268 -215390
31761 -215390 -206146 -174044 -179825 -184513 -138051 -81399 -71199 -77079 -41269 23375 71341 95888
31749 95888 96522 51625 -9564 1706 90054 120739 8334 -130835 -132610 -14640 74437 74118
31737 74118 48011 43029 43803 47936 71571 88720 58757 1019 -37137 -59877 -93309 -114140
31725a14140K3142L2998n658k5398r974k1271n6440l1258M9447P0843J1012j4096
31713i0793K7759J8003p0469q1281M6379J24423J5082j17491o8542O6993O5478
31702f4459m3613m3638R0425J57107O5803m0762l7459J9982L9352K5644N159m0151
31690A33390r5200q7385n351N5504K7164l4229m4236j2007l047k9694m1955p088
31678a44134M8573P4971M9592r686o6587q7268m6938M8846J32060J10363j1057
31667I8735r3806l4288P5021O7146m5267q8805p202N5141r17p5837n6858L555
31655a03382J5394J4557N7126P3782j0508j08558q8442J3667N9066K5560J694
31644e0044J1148M854n042L5932Q8530N7053l7987o7276J3237R9013Q8346k253
$$ plain form
31725 -114140 -90998 -58000 -63658 -89056 -99030 -120301 -176741 -207999 -158552 -87709 -76697 -90793
31713 -90793 -63034 -45031 -115500 -196781 -150402 -25979 -10897 -128388 -196930 -129937 -64459
31702 -64459 -108072 -151710 -61285 95822 161625 120863 83404 103386 142738 168382 173541 133390
31690 133390 38190 -49195 -54546 958 28122 -6107 -50343 -62350 -65397 -95091 -137046 -144134
31678 -144134 -95561 -20590 29002 19316 -47271 -134539 -181477 -132631 -571 109792 98735
31667 98735 4929 -29359 45662 112808 67541 -21264 -28466 26675 25758 -50079 -106937 -103382
31655 -103382 -87988 -73431 -16305 57477 46969 -61589 -150031 -136364 -77298 -51738 -50044
31644 -50044 -38896 -34042 -39084 -3152 85378 142431 104444 37168 50405 149418 237764 235511
31632B35511q9946j14258o9433p032Q798j2312K51M1465J2733q9757j10780J6780
31620a77980J12502J5561j28578q0313J02880J58350L7946n6745m0077l6897q1500
31609a74851l2246J25897J84016M6967q8463n1659L4958q932j16457j10746J672
31598a89844Q0763Q6907P4638M1218l7473q9654l7573M9016M7099j9203k6879
31587b0985L4775N6869L45n0628l0508L0638Q1498J02372P7782L925o9221p6665
31575A40197k3762K4330K9506M816k7364m6329k7530J9177L5377p888n5102m6274
31563A9154p133O339L802K1413L3169n015n6905n2271j0466j4363o8196q5645
31551b16117l0056L0532L3834O389L541L2646O7235Q2261N0825l7606j28811j32413
$$ plain form
31632 235511 145565 31307 -38126 -45158 -36360 -48672 -48421 -6956 5777 -83980 -194760 -177980
31620 -177980 -65478 -49917 -178495 -258808 -155928 2422 40368 -16377 -56454 -93351 -174851
31609 -174851 -207097 -81200 102816 149783 61320 9661 44619 35687 -80770 -191516 -189844
31598 -189844 -109081 -22174 52464 93682 56209 -33445 -71018 -22002 25097 5894 -20985
31587 -20985 13790 70659 71004 20376 -10132 20506 102004 204376 282158 286083 216862 140197
31575 140197 116435 140765 170271 175087 147723 101394 73864 93041 128418 120530 65428 19154
31563 19154 12021 18360 22162 43575 76744 71729 14824 -37447 -47913 -62276 -130472 -216117
31551 -216117 -246173 -215641 -181807 -175418 -171877 -139231 -71996 10265 61090 23484 -105327 -237740
31539b37740l8409M5697K5952m6808m1214P0400J61449J12032k8951r8979k7313
31528a03884P7135O9077n0854j47366j18919J340J06532J25168O6071j425r001
31517A3874L2800L1639o3421j61195j29317J6441J21756J00839K5567k0629n7632
31506h9278j12852j22042k6534J05208J57138J18409O4058K6378j7425n8167n2977
31495h084m420L6583M3609K8228p060o5812j17137j17832o9679q702M5500Q4282
31483a60524Q3080L6283q750j2057n268l0304n0229o301O1735N4472k7832o7323
31471a33018K738R9636J08547L2779l0631k7414q5j1488n7440p7894m4464l493
$$ plain form
31539 -237740 -276149 -230452 -204500 -251308 -292522 -222122 -60673 51359 22408 -76571 -103884
31528 -103884 -26749 42328 -8526 -155892 -274811 -273471 -166939 -41771 24300 22875 13874
31517 13874 46674 78313 14892 -146303 -275620 -259179 -137423 -36584 -11017 -31646 -89278
31506 -89278 -202130 -324172 -350706 -245498 -88360 30049 94107 120485 103060 44893 -8084
31495 -8084 -12504 24079 67688 95916 88856 23044 -94093 -211925 -281604 -290306 -244806 -160524
31483 -160524 -77444 -41161 -49911 -61968 -67236 -97540 -147769 -154070 -92335 -37863 -65695 -133018
31471 -133018 -130280 -30644 77903 110682 80051 52637 52552 41064 -16376 -94270 -138734 -142227
$$ [...]
##END NTUPLES=NMR SPECTRUM
##END=
