##TITLE=31Pdec_ANY-156E-4
 D2O, 24 sc
 6.2.2019
##JCAMPDX= 6.0         $$ Bruker NMR JCAMP-DX V2.0
##DATA TYPE= NMR SPECTRUM
##DATA CLASS= NTUPLES
##ORIGIN= UXNMR, Bruker Analytische Messtechnik GmbH
##OWNER= root
$$ XWIN-NMR		Version 3.5
$$ Wed Feb  6 15:02:32 2019 Russian Standard Time (UT+4h)  she@DPX200
##.OBSERVE FREQUENCY= 81.013821
##.OBSERVE NUCLEUS= ^31P
##.ACQUISITION MODE= SIMULTANEOUS
##.ACQUISITION SCHEME= undefined
##.AVERAGES= 24
##.DIGITISER RES= 17
##SPECTROMETER/DATA SYSTEM= spect
##.PULSE SEQUENCE= zgpg30
##.SOLVENT NAME= CDCl3
##.SHIFT REFERENCE= (INTERNAL, CDCl3, 0, 182.463)
##AUDIT TRAIL= $$ (NUMBER, WHEN, WHO, WHERE, WHAT)
$$ ##TITLE= Audit trail, XWIN-NMR		Version 3.5
$$ ##JCAMPDX= 5.01
$$ ##ORIGIN= Bruker BioSpin GmbH
$$ ##OWNER= she
$$ F:/spectra/data/she/nmr/P31/1/pdata/1/auditp.txt
$$ ##AUDIT TRAIL=  $$ (NUMBER, WHEN, WHO, WHERE, WHAT)
(   1,<2019-02-06 15:01:20.75 +0400>,<she>,<DPX200>,
      <created by zg, POWCHK disabled, PULCHK disabled
       configuration hash MD5:
       00 E9 B6 7A A2 85 ED C7 34 08 36 98 17 FE 4E 26
       data hash MD5: 32K
       57 84 05 01 3F A2 B4 62 3F 54 BF 9C 78 2E 33 59>)
(   2,<2019-02-06 15:01:25.12 +0400>,<she>,<DPX200>,
      <Start of raw data processing
       efp BC_mod = 2 LB = 1 FT_mod = 6 PKNL = 1 PHC0 = -1466.711 PHC1 = 113.399 SI = 64K 
       data hash MD5: 64K
       AE D4 BF CC 6B 4D 2A 31 49 39 64 28 ED CF 8C BE>)
(   3,<2019-02-06 15:01:49.42 +0400>,<she>,<DPX200>,
      <pk PHC0 = -17.8686 PHC1 = -22.8 
       data hash MD5: 64K
       82 61 25 60 20 A3 51 C6 79 CE EF D4 3E FE 86 B3>)
(   4,<2019-02-06 15:01:52.98 +0400>,<she>,<DPX200>,
      <abs ABSG = 5 
       data hash MD5: 64K
       39 9D F7 E5 F8 D4 06 E8 8A BF C4 73 1A 7F ED DD>)
$$ ##END=
$$ 
$$ hash MD5
$$ 9E 90 D8 36 C3 AE CD E7 B5 4E 22 FF 8E 4D FC EC
##$RELAX= 
##$RELAX= 
##$RELAX= 
##$RELAX= 
##$RELAX= 
##$RELAX= 
##$RELAX= 
##$RELAX= 
$$ Bruker specific parameters
$$ --------------------------
##$DU= <F:/spectra>
##$EXPNO= 1
##$NAME= <P31>
##$PROCNO= 1
##$TYPE= <nmr>
##$USER= <she>
##$AMP= (0..31)
100 100 100 100 100 100 100 100 100 100 100 100 100 100 100 100 100 100 
100 100 100 100 100 100 100 100 100 100 100 100 100 100 
##$AQSEQ= 0
##$AQ_mod= 1
##$AUNM= <au_zg>
##$AUTOPOS= <>
##$BF1= 81.014009
##$BF2= 200.13
##$BF3= 200.13
##$BF4= 200.13
##$BF5= 200.13
##$BF6= 200.13
##$BF7= 200.13
##$BF8= 200.13
##$BYTORDA= 1
##$CFDGTYP= 0
##$CFRGTYP= 5
##$CHEMSTR= <none>
##$CNST= (0..31)
1 1 145 1 1 1 1 1 1 1 1 1 1 1 1 1 1 1 1 1 1 1 1 1 1 1 1 1 1 1 1 1 
##$CPDPRG= <waltz16>
##$CPDPRG1= <>
##$CPDPRG2= <waltz16>
##$CPDPRG3= <>
##$CPDPRG4= <mlev>
##$CPDPRG5= <mlev>
##$CPDPRG6= <mlev>
##$CPDPRG7= <mlev>
##$CPDPRG8= <mlev>
##$CPDPRGB= <>
##$CPDPRGT= <>
##$D= (0..31)
0 1 0 0 0 0 0 0 0 0 0 0.03 2e-05 3e-06 0 0 0 0 0 0 0 0 0 0 0 0 0 0 0 0 
0 0 
##$DATE= 1549450880
##$DBL= (0..7)
120 120 120 11 120 120 24 19 
##$DBP= (0..7)
150 150 150 150 150 150 150 150 
##$DBP07= 0
##$DBPNAM0= <>
##$DBPNAM1= <>
##$DBPNAM2= <>
$$ [...]
##$SUBNAM3= <"">
##$SUBNAM4= <"">
##$SUBNAM5= <"">
##$SUBNAM6= <"">
##$SUBNAM7= <"">
##$SUBNAM8= <"">
##$SUBNAM9= <"">
##$SW= 369.568048894756
##$SWIBOX= (0..15)
0 1 3 0 0 0 0 0 0 0 0 0 0 0 0 0 
##$SW_h= 29940.119760479
##$TD= 32768
##$TD0= 1
##$TE= 0
##$TE2= 300
##$TE3= 300
##$TEG= 300
##$TL= (0..7)
0 120 53 12 22 120 120 120 
##$TP= (0..7)
150 150 150 150 150 150 150 150 
##$TP07= 0
##$TPNAME0= <>
##$TPNAME1= <>
##$TPNAME2= <>
##$TPNAME3= <>
##$TPNAME4= <>
##$TPNAME5= <>
##$TPNAME6= <>
##$TPNAME7= <>
##$TPOAL= (0..7)
0.5 0.5 0.5 0.5 0.5 0.5 0.5 0.5 
##$TPOFFS= (0..7)
0 0 0 0 0 0 0 0 
##$TUNHIN= 0
##$TUNHOUT= 0
##$TUNXOUT= 0
##$USERA1= <user>
##$USERA2= <user>
##$USERA3= <user>
##$USERA4= <user>
##$USERA5= <user>
##$V9= 5
##$VALIST= <valist>
##$VCLIST= <CCCCCCCCCCCCCCC>
##$VD= 0
##$VDLIST= <DDDDDDDDDDDDDDD>
##$VPLIST= <PPPPPPPPPPPPPPP>
##$VTLIST= <TTTTTTTTTTTTTTT>
##$WBST= 1024
##$WBSW= 4
##$XGAIN= (0..3)
0 0 0 0 
##$XL= 0
##$YL= 0
##$YMAX_a= 11459
##$YMIN_a= -12364
##$ZGOPTNS= <>
##$ZL1= 120
##$ZL2= 120
##$ZL3= 120
##$ZL4= 120
##$ABSF1= 182.463
##$ABSF2= -187.1042
##$ABSG= 5
##$ABSL= 3
##$ALPHA= 0
##$AQORDER= 0
##$ASSFAC= 0
##$ASSFACI= 0
##$ASSFACX= 0
##$ASSWID= 0
##$AUNMP= <proc_1d>
##$AZFE= 0.1
##$AZFW= 0.5
##$BCFW= 0
##$BC_mod= 2
##$BYTORDP= 0
##$COROFFS= 0
##$CY= -3
##$DATMOD= 1
##$DC= 0
##$DFILT= <>
##$DTYPP= 0
##$F1P= 0
##$F2P= 0
##$FCOR= 1
##$FTSIZE= 65536
##$FT_mod= 6
##$GAMMA= 0
##$GB= 0
##$INTBC= 1
##$INTSCL= 5.30512e-09
##$ISEN= 30
##$LB= 1
##$LEV0= 0
##$LPBIN= 0
##$MAXI= 10000
##$MC2= 0
##$MEAN= 0
##$ME_mod= 0
##$MI= 50
##$NCOEF= 0
##$NC_proc= -5
##$NLEV= 6
##$NOISF1= 182.463
##$NOISF2= 159.3651
##$NSP= 0
##$NTH_PI= 0
##$NZP= 0
##$OFFSET= 182.463
##$PC= 4
##$PHC0= -1484.58
##$PHC1= 90.599
##$PH_mod= 1
##$PKNL= yes
##$PPARMOD= 0
##$PSCAL= 0
##$PSIGN= 0
##$REVERSE= no
##$SF= 81.0140089999434
##$SI= 65536
##$SIGF1= 159.3651
##$SIGF2= -187.1042
##$SINO= 113.3802
##$SIOLD= 16384
##$SREGLST= <1H.CDCl3>
##$SSB= 0
##$STSI= 65536
##$STSR= 0
##$SW_p= 29940.119760479
##$SYMM= 0
##$S_DEV= 0
##$TDeff= 32768
##$TDoff= 0
##$TI= <>
##$TILT= no
##$TM1= 0
##$TM2= 0
##$TOPLEV= 0
##$USERP1= <user>
##$USERP2= <user>
##$USERP3= <user>
##$USERP4= <user>
##$USERP5= <user>
##$WDW= 1
##$XDIM= 65536
##$YMAX_p= 388587586
##$YMIN_p= -59519893
$$ End of Bruker specific parameters
$$ ---------------------------------
##NTUPLES= NMR SPECTRUM
##VAR_NAME=  FREQUENCY,     SPECTRUM/REAL,   SPECTRUM/IMAG
##SYMBOL=    X,             R,               I
##VAR_TYPE=  INDEPENDENT,   DEPENDENT,       DEPENDENT
##VAR_FORM=  AFFN,          ASDF,            ASDF
##VAR_DIM=   65536,         65536,           65536
##UNITS=     HZ,            ARBITRARY UNITS, ARBITRARY UNITS
##FACTOR=    0.456856943014862, 1,           1
##FIRST=     14782.0589164792, 0,            0
##LAST=      -15158.0608439998, 0,           0
##MIN=       -15158.0608439998, -59519893,   0
##MAX=       14782.0589164792, 388587586,    0
$$ Real data points
##PAGE= N=1
##DATA TABLE= (X++(R..R)), XYDATA
$$ [...]
40115 1454679 1959649 2061198 1703758 1239058 983740 867296 725667 675149 888170 1214797
40105 1214797 1399950 1535514 1879313 2274093 2197898 1494745 679814 324101 394954 420406
40095 420406 149386 -157259 -63105 509152 1098906 1130567 562863 -55161 -323706 -510591
40085 -510591 -970259 -1324654 -888524 113638 547734 -116836 -1020073 -1162947 -808004
40076 -808004 -843417 -1176014 -789772 580897 1815108 1825877 895927 61944 -301918 -590038
40066 -590038 -913743 -738515 247931 1452872 1945804 1486379 683985 261340 452660
40057 452660 1055368 1693365 1914467 1383289 287456 -630551 -781600 -397622 -196889
40048 -196889 -476157 -920439 -1267165 -1640133 -2092091 -2351941 -2330704 -2395370 -2706015 -2708127
40038 -2708127 -1877675 -690707 -158395 -480602 -856513 -714039 -451722 -680181 -1268651
40029 -1268651 -1558551 -1212477 -487193 158904 467519 527373 692151 1204970 1810784 1964751
40019 1964751 1512996 872795 421004 74954 -314039 -563854 -503038 -354551 -356151 -294223
40009 -294223 101732 557314 630292 530971 895110 1739770 2341577 2309441 2080769 2019864
39999 2019864 1701817 693161 -423734 -573974 388692 1455872 1707635 1212899 549401
39990 549401 -35439 -649231 -1272306 -1627979 -1445682 -674577 437009 1357759 1590605
39981 1590605 1179057 716153 640867 725303 512984 29724 -333735 -483069 -652092 -781684
39971 -781684 -432031 472613 1273543 1283227 548977 -388555 -1170755 -1661880 -1629179 -986105
39961 -986105 -296407 -418275 -1436586 -2383126 -2309801 -1354137 -438313 -119742 -110474 101206
39951 101206 504976 612552 101104 -768334 -1396031 -1428578 -1039580 -635936 -369309 -51984
39941 -51984 417097 690458 271430 -747448 -1488850 -1169837 -136277 422813 -24178
39932 -24178 -622507 -359132 417304 503787 -299333 -869046 -544924 -184395 -766212 -1809621
39922 -1809621 -2164445 -1779733 -1509309 -1448619 -782913 580624 1476848 1087898 137898
39913 137898 -151002 403305 1083105 1380304 1296520 939599 459536 129970 -10976 -332377
39903 -332377 -977397 -1407952 -1117134 -478261 -271867 -601288 -919820 -960242 -917250 -736364
39893 -736364 7323 1266152 2129713 1702798 175455 -1240215 -1415213 -328887 945885
39884 945885 1349997 946034 668246 927147 1003151 180916 -1102485 -1922114 -2226980 -2621214
39874 -2621214 -3005299 -2530866 -1078510 236850 509063 206767 304930 839477 1026990
39865 1026990 521794 -108044 -154037 376907 750595 248690 -999108 -1946755 -1650367
39856 -1650367 -341601 879407 1401445 1607999 1924282 2050232 1552015 679558 70651
39847 70651 -26571 179532 393744 298508 -321254 -1065812 -1014090 60399 1004785 589370
39837 589370 -808635 -1693097 -1462849 -971965 -1011688 -1235404 -990643 -410504 -92360 -221655
39827 -221655 -583370 -1065624 -1596832 -1835937 -1466126 -693182 -26944 338447 525516 462336
39817 462336 -102661 -964596 -1328856 -690084 358057 604102 -419835 -1836366 -2378004
39808 -2378004 -1776530 -897299 -527840 -469672 -92970 573845 854939 471123 5877 102438
39798 102438 596739 790131 364683 -303167 -639387 -420907 95419 369546 2037 -781291
39788 -781291 -1149257 -481180 852865 1863098 2127060 2194329 2620462 3052225 2757579
39779 2757579 1824314 1186297 1368460 1785117 1606840 881602 315939 218429 250012 164933
39769 164933 188083 479462 727298 598832 261938 118890 251920 451002 596808 677554
39759 677554 568016 149963 -400355 -740915 -738885 -480920 -31170 511104 836543 715166
39749 715166 420348 428438 673839 589313 24456 -386555 -99025 496307 557850 -57241
39739 -57241 -574147 -257454 701258 1355465 969994 -208878 -1157584 -1146268 -563879 -414746
39729 -414746 -962693 -1311246 -643238 495487 718420 -473798 -2046222 -2652078 -2051697
39720 -2051697 -1045468 -352495 8244 334231 690208 905089 872001 620307 166151
39711 166151 -489870 -1175901 -1546409 -1423809 -1061010 -870358 -885809 -708660 -107870 505287
39701 505287 453645 -366211 -1257354 -1463377 -1003063 -589456 -764963 -1338908 -1758256 -1797638
39691 -1797638 -1621690 -1302549 -711169 -5461 212933 -384336 -1227134 -1413230 -812829
39682 -812829 -116824 215400 461964 877337 1029024 420083 -583053 -1084390 -846336
39673 -846336 -579631 -954644 -1780077 -2350066 -2254291 -1609720 -758183 -24376 362173 380977
39663 380977 255337 221143 266173 189190 -134440 -661811 -1308859 -2000470 -2550590 -2642505
39653 -2642505 -2102114 -1210410 -605552 -734540 -1413449 -2036885 -2206282 -1995983 -1604049
39644 -1604049 -1039348 -361944 24239 -268339 -981480 -1330735 -886285 -68385 364503
39635 364503 79628 -698584 -1519213 -1935186 -1674442 -927007 -319593 -275218 -502661 -456696
39625 -456696 -181205 -225309 -718658 -1079834 -865348 -431613 -388800 -770817 -1211271 -1667434
39615 -1667434 -2375961 -3160649 -3408582 -2906154 -2200931 -1846234 -1677766 -1226089 -580719
39606 -580719 -344871 -728691 -1094727 -608190 819554 2391880 3173382 2871518 1907364
39597 1907364 875641 94860 -352943 -431666 -228219 -57859 -182242 -468589 -624199
39588 -624199 -715299 -1064940 -1625020 -1918698 -1726362 -1332100 -901161 -203712 691538 1097708
39578 1097708 686803 222739 514564 1078345 849487 -15286 -253780 478783 948000
39569 948000 212660 -903856 -1007710 -25532 1001090 1479599 1652859 1685266 1333285
39560 1333285 596502 -40762 -223850 -121730 -80654 -230302 -478309 -593562 -319870 288721
39550 288721 718095 517572 -95183 -487838 -377107 21546 485213 978226 1403631 1604952
39540 1604952 1626625 1600159 1428149 988391 538975 397761 312432 -185815 -783228 -536892
39530 -536892 687104 1659151 1178782 -473563 -1970938 -2415587 -1876025 -828948 286144
39521 286144 1076685 1321829 1160195 886659 647186 558006 864155 1566584 2095631 1882250
39511 1882250 1187691 827411 1045563 1239314 967435 635941 779831 1140619 1071736 628059
39501 628059 521481 908488 949509 28531 -1108339 -1158227 -45117 885324 625414 -255623
39491 -255623 -572355 -143643 227958 75632 -226956 -274048 -223246 -359785 -590065 -662775
39481 -662775 -557334 -423559 -385614 -529461 -811454 -914799 -544163 57919 283570 -41069
39471 -41069 -450205 -560580 -521634 -553713 -551938 -435657 -402805 -507654 -466474 -231281 -224378
39460 -224378 -569594 -655297 -20519 873405 1425662 1897401 2767005 3547437 3337252 2347126
39450 2347126 1705982 1689434 1326953 116531 -979125 -902363 -25893 483013 268977
39441 268977 -48754 -10687 154993 87780 -206613 -490118 -562724 -348061 51826 375078
39431 375078 432590 299167 191657 245959 447257 608029 403014 -290047 -1026783 -1145102
39421 -1145102 -633150 -245162 -495380 -946880 -879133 -295306 233689 465851 650778 916417
39411 916417 1088346 1143932 1282966 1406468 1046646 79405 -921703 -1382977 -1444689 -1585392
39401 -1585392 -1814489 -1760188 -1435149 -1296466 -1426909 -1261676 -492565 261411 274387 -117164
39391 -117164 66422 916043 1388578 869539 152099 254657 914697 1105851 653653 328581
39381 328581 404981 167841 -854453 -2027162 -2481520 -2229488 -1845949 -1494649 -907100
39372 -907100 -115841 387814 267142 -241338 -603216 -540899 -303777 -373207 -779144 -839720
39362 -839720 45978 1393160 1965455 1243290 -22276 -948075 -1518322 -1992564 -2034065
39353 -2034065 -1248574 -178664 158680 -368331 -894148 -803970 -357949 25213 384030
39344 384030 838298 1161707 1085433 681544 193880 -225432 -450032 -371262 -119026 25367
39334 25367 88454 430995 1130322 1706965 1745603 1473667 1393476 1595525 1806798 1920768
39324 1920768 2044192 2108735 1912396 1605743 1665161 2142117 2333467 1628790 482619 13719
39314 13719 605402 1419576 1516290 977503 527906 451755 473206 467456 587347 720600 523061
39303 523061 88037 -94982 6806 -90827 -342399 67116 1377600 2462860 2168355
39294 2168355 875675 -93442 -194825 74808 269816 402362 448086 375342 592252 1472112
39284 1472112 2444580 2448281 1363201 149237 -527621 -913473 -1239829 -1135620 -387220
39275 -387220 481303 887471 908065 926103 1029608 1076451 949644 556596 -16277 -323393
39265 -323393 -89935 128679 -411063 -1322881 -1366618 -236281 927295 1143385 701386
39256 701386 253296 -103723 -236889 405051 1719448 2459001 1799656 606335 154027
39247 154027 349686 293836 -97668 -240897 -115977 -123723 -97018 365192 901517 883926
39237 883926 605912 790264 1194382 981136 286879 71299 464214 639516 409145 549758
39227 549758 1309502 1935567 2039780 2147737 2465815 2390873 1806631 1606844 2180410 2503118
39217 2503118 1623828 132282 -758147 -823062 -645273 -502464 -346224 -381958 -825866 -1433711
39207 -1433711 -1890711 -2233301 -2363621 -1794363 -574828 196893 -300152 -1258886 -1193057
39198 -1193057 61696 1236594 1365169 752837 233865 222121 584472 890174 720528
39189 720528 111952 -407372 -554767 -760982 -1422606 -2060158 -1917799 -1164284 -710900 -894757
39179 -894757 -1114329 -871856 -479621 -472743 -826039 -1048700 -756277 49799 1053231 1824451
39169 1824451 2073304 1782740 1105803 254460 -486903 -882144 -976827 -965925 -796676 -284259
39159 -284259 340852 553522 341655 244427 366337 146527 -510052 -785085 -263095 209746
39149 209746 -160049 -773553 -644100 16717 407020 626721 1148018 1363735 338729
39140 338729 -1259994 -1777144 -1141839 -986567 -1877673 -2322199 -1276863 108849 368644
39131 368644 -120155 -176555 142854 24234 -391360 -310355 143764 119594 -353862 -274670
39121 -274670 704912 1677204 1803990 1394159 1294537 1798770 2485516 2724419 2102628 698267
39111 698267 -821204 -1596899 -1316209 -523872 -110207 -463442 -1109284 -1229485 -578213
39102 -578213 275561 763290 1068531 1645783 2257212 2165782 1233582 111229 -703166 -1216210
39092 -1216210 -1264274 -437798 978625 1905767 1812252 1343534 1110689 762510 -60605 -768559
39082 -768559 -718250 -295973 -131457 53462 714233 1244282 749783 -348774 -809216 -437680
39072 -437680 -172420 -416264 -616835 -554302 -700215 -1039643 -816791 100942 747950 514506
39062 514506 85258 282022 812238 885358 436489 40157 50279 400598 916838 1383462
39052 1383462 1593780 1620762 1713171 1796776 1571022 1192852 1175016 1413748 1152580 296084
39042 296084 -135354 493930 1271138 920866 -417951 -1515359 -1766306 -1642054 -1612399
39033 -1612399 -1545425 -1256434 -921634 -750022 -718136 -733324 -687999 -371395 249730 687897
39023 687897 355893 -590715 -1271132 -1099816 -449671 -115432 -379781 -823893 -906097 -510850
39013 -510850 53228 439809 545801 441633 195438 -91447 -199382 5910 308678 333203
39003 333203 1605 -431802 -742049 -801843 -368864 692388 1896532 2371412 1832031
38994 1832031 897235 238116 -131031 -485389 -824801 -1007203 -985526 -577677 491635
38985 491635 1903442 2638714 2141677 1164120 812464 1095009 1107474 416348 -494684 -1083122
38975 -1083122 -1342343 -1447708 -1365588 -987971 -331000 456283 1059409 1100167 572272 22436
38965 22436 -31622 293395 512171 391797 -11610 -588605 -1033672 -871242 -165542 206545
38955 206545 -338593 -1094051 -960584 -7320 791793 1126746 1544248 2096271 1994543 933819
38945 933819 -257998 -759786 -732026 -692713 -666291 -484874 -328043 -408281 -532374 -396539
38935 -396539 1866 460122 690948 307698 -708490 -1492622 -1065221 221149 945278
38926 945278 617295 339210 954390 1699129 1559842 933276 793490 996591 702762 -24188
38916 -24188 -348220 -129753 -44097 -354320 -696819 -1026271 -1653455 -2318459 -2339541 -1810944
38906 -1810944 -1564591 -1732676 -1461954 -435689 390465 158471 -660533 -1061328 -839790
38897 -839790 -480368 -265539 -132501 -4897 255473 835783 1472254 1435654 521231 -409074
38887 -409074 -447932 204164 728931 958181 1397468 2168032 2711751 2642103 2297272 2236990
38877 2236990 2531254 2708497 2253848 1151677 24094 -417585 -165880 101456 -41431
38868 -41431 -289905 -337612 -499019 -1024172 -1300777 -590424 694003 1375601 1147135 895084
38858 895084 1247602 1713842 1626072 1117586 637093 174255 -371612 -557448 108262 1259238
38848 1259238 1920983 1618957 767656 22468 -333400 -405553 -477970 -781038 -1198404 -1288471
38838 -1288471 -851555 -308585 -196817 -474738 -710658 -767522 -806545 -729813 -205795 685124
38828 685124 1334316 1286577 693243 37456 -244413 82788 798317 1140077 541795 -492739
38818 -492739 -883275 -445489 -122474 -505512 -989823 -914173 -690318 -985633 -1450199 -1276227
38808 -1276227 -616424 -343159 -555310 -451575 211502 607598 125220 -741510 -1238915
38799 -1238915 -1302102 -1108068 -398344 985191 2325051 2608809 1778627 770770 318786
38790 318786 248874 37361 -411304 -786569 -889918 -815822 -646529 -230497 537341 1316770
38780 1316770 1549250 1210373 965368 1250425 1555309 1156761 305168 -47654 357815
38771 357815 766120 600964 182526 -15972 -43710 -13030 271295 712148 681784 20383
38761 20383 -402300 121490 974655 1088234 468078 -83917 -345323 -705946 -1078413 -899584
38751 -899584 -191734 408560 724332 1130346 1473793 987978 -391662 -1594860 -1748550
38742 -1748550 -1146156 -482235 80191 597706 863118 827198 899653 1262500 1419770 986242
38732 986242 429341 447446 1008079 1523692 1614553 1234545 444897 -436985 -812892 -391849
38722 -391849 485749 1391600 2192156 2600346 2072059 705660 -458038 -741282 -759165
38713 -759165 -1214262 -1486150 -588716 965251 1643959 1114122 604166 887516 1217104
38704 1217104 747876 -92356 -370616 -15670 327649 340600 284043 464509 908034 1415557
38694 1415557 1685654 1553171 1228928 1082670 1170927 1268476 1271602 1131731 541898 -643183
38684 -643183 -1730925 -1778799 -1008082 -738078 -1558657 -2436449 -2181422 -1037293 -147523
38675 -147523 -80971 -619506 -1461658 -2309087 -2628802 -2160070 -1454434 -1209738 -1287566 -1095937
38665 -1095937 -708527 -763121 -1311931 -1618997 -1235026 -564060 -155843 -35253 15990 1790
38655 1790 -196314 -615147 -1261461 -2039319 -2530114 -2232643 -1188516 -64975 508500 430814
38645 430814 -37449 -537461 -654641 -156542 624511 1023248 853746 645293 871480 1318183
38635 1318183 1505760 1410588 1378867 1514939 1569896 1418118 1294275 1417342 1570709 1292807
38625 1292807 536231 -56960 178660 998035 1381258 835673 158514 426055 1500786
38616 1500786 2185003 1782680 827334 164588 -11861 43574 177978 294616 230675 77303
38606 77303 218008 672353 838884 356670 -200319 -88548 470389 639039 297430 232065
38596 232065 877237 1599317 1609801 1060103 687379 631617 224198 -940143 -2200890 -2498564
38586 -2498564 -1681196 -683065 -311051 -330572 -114226 222773 5732 -823630 -1492501 -1496728
38576 -1496728 -1182785 -945255 -596477 -40484 125375 -568663 -1534436 -1849487 -1578984
38567 -1578984 -1488881 -1653500 -1365853 -491743 105184 -136279 -559031 -212433 842799
38558 842799 1693126 1708351 1063070 327332 -82947 -130256 -76491 -176024 -424680 -705879
38548 -705879 -1054166 -1487599 -1711687 -1431454 -908036 -704052 -881329 -1017013 -1040246 -1355529
38538 -1355529 -1969216 -2253022 -1927219 -1564894 -1648274 -1793035 -1493612 -1026907 -905598 -926010
38528 -926010 -541312 171786 696055 946895 1186031 1290274 927052 328786 75577 175076
38518 175076 170750 94016 370695 735815 318094 -865439 -1537192 -878814 245098 558462
38508 558462 194554 315871 1299923 2272294 2390719 1770574 995398 364153 -102111 -351385
38498 -351385 -318305 -58417 285611 497433 256465 -605238 -1697591 -2231653 -1837252 -1024778
38488 -1024778 -539855 -403549 -14111 764138 1125631 318794 -1191688 -2112878 -1825225
38479 -1825225 -942671 -295421 1712 145316 -38006 -715547 -1398553 -1448344 -1074654 -1072107
38469 -1072107 -1594423 -1966021 -1808254 -1542351 -1486516 -1234092 -446093 343520 363460 -299420
38459 -299420 -824922 -676217 -11873 737148 1236976 1314893 1087665 991060 1351071 1958672
38449 1958672 2317629 2233459 1939065 1756869 1838433 2077300 2088098 1505753 545500 -14519
38439 -14519 263091 848522 907284 356705 -191112 -374216 -459625 -802789 -1367414 -1842138
38429 -1842138 -1939284 -1577603 -1003625 -649653 -644442 -637263 -373194 -165588 -384639 -755418
38419 -755418 -739065 -444496 -499382 -1030215 -1435237 -1292673 -884328 -599115 -365615 -6721
38409 -6721 253205 33610 -613662 -1121042 -904187 39699 953787 940290 -10265 -891566
38399 -891566 -952793 -697460 -963133 -1395073 -872098 617022 1716909 1634003 1186223 1338743
38389 1338743 1725249 1488059 769648 315096 116000 -445269 -1337712 -1795705 -1460868
38380 -1460868 -736233 31758 899149 1717124 1953672 1432418 697587 344034 377736 431761
38370 431761 225310 -362748 -1274168 -2099236 -2258573 -1605172 -631870 66378 309992 219609
38360 219609 -103505 -558438 -906290 -897581 -511093 19802 398069 517201 606562 1021917
38350 1021917 1743282 2229294 2018439 1344508 844094 770236 880154 1002226 1191143 1273780
38340 1273780 826190 -126357 -863476 -820943 -360058 -242726 -544463 -596623 -7525 734860
38330 734860 905349 494421 172488 357757 681939 580549 154639 29562 381266 600480
38320 600480 176943 -492710 -616842 -83313 475662 582128 359496 81786 -194324 -401732
38310 -401732 -332119 2124 189414 -130226 -822172 -1444178 -1714490 -1671346 -1527053 -1447326
38300 -1447326 -1327305 -799365 284723 1389789 1674503 940346 -112477 -691620 -650674
38291 -650674 -307447 64132 288488 158038 -391226 -1098451 -1596749 -1715262 -1471133 -972732
38281 -972732 -454699 -179199 -160732 -187784 -177784 -227894 -278707 -147069 -12485 -363764
38271 -363764 -1195479 -1757550 -1500235 -843749 -554697 -731503 -930341 -999617 -1192230 -1567379
38261 -1567379 -1794868 -1553536 -822031 114495 722533 563988 -123737 -544185 -382166
38252 -382166 -264513 -716268 -1232956 -1124396 -758140 -971617 -1569216 -1540528 -706525 -4903
38242 -4903 -11703 -285944 -438623 -738549 -1219026 -1248546 -619676 -150772 -493357 -1126861
38232 -1126861 -1265237 -1016148 -844462 -595691 23930 588282 565151 317256 472906 710541
38222 710541 295805 -452748 -468642 350993 967895 867117 697635 934494 1066142 676098
38212 676098 331342 649686 1233130 1305683 865199 469963 322247 285889 463622 1006656
38202 1006656 1544639 1510676 981700 601535 654548 714576 273141 -671568 -1697018 -2317550
38192 -2317550 -2263853 -1689488 -1100153 -861735 -847146 -755466 -573438 -404962 -65779 671115
38182 671115 1496988 1729758 1127621 145701 -705323 -1380089 -2031604 -2545659 -2573357 -1903052
38172 -1903052 -703857 508090 1179298 1182414 962113 1051458 1495467 1923389 2049003 1831253
38162 1831253 1298540 589718 66649 -26117 64352 -4945 -39028 346976 836410 658690
38152 658690 -134313 -484737 201163 1184981 1547469 1485533 1713974 2149755 2108025 1492992
38142 1492992 884859 579057 387502 330842 658621 1123626 1108602 677877 670979 1410805
38132 1410805 2085316 1893186 1162834 769403 950250 1309061 1603854 1871396 1994525
38123 1994525 1782881 1425053 1354786 1687630 2194795 2757387 3384872 3803394 3555084 2703038
38113 2703038 2053743 2356531 3404251 4164991 3829474 2612083 1425054 808483 426902
38104 426902 -197792 -767412 -576647 257857 678315 96865 -747761 -864360 -350635 43480
38094 43480 197712 533147 907463 673156 -103029 -514884 -214771 -5266 -544490 -1262971
38084 -1262971 -1220576 -433863 353488 763413 915511 807654 354124 -94746 -5451 543977
38074 543977 924626 876186 837297 1257520 2037562 2762284 3080416 2765078 1835434 774515
38064 774515 224273 256023 276630 -144638 -696213 -822014 -485566 -88748 180512 531482
38054 531482 1114014 1679531 1822816 1467981 1034325 1077871 1710056 2407725 2541318 2101747
38044 2101747 1717732 1873896 2302223 2317465 1644299 711844 128969 21305 -17069 -343110
38034 -343110 -753633 -698728 -24111 698446 759827 110297 -650643 -984407 -837756 -421733
38024 -421733 62609 404095 439767 314518 415208 842042 1157867 876709 45587 -842071
38014 -842071 -1365419 -1439675 -1212785 -890607 -579476 -199921 313901 697393 530258 -130150
38004 -130150 -644078 -610822 -473294 -874899 -1635859 -1901892 -1273462 -281193 355410 501293
37994 501293 454872 399126 309734 220608 272533 492232 687367 624960 280555 -141830 -482136
37983 -482136 -857201 -1455657 -2098740 -2284055 -1823719 -1172659 -860225 -818082 -603635 -113141
37973 -113141 328629 500991 498443 417837 209058 -122559 -461537 -724145 -788768 -403207
37963 -403207 457995 1271197 1500657 1389116 1612751 2125751 2060085 1018903 -185729
37954 -185729 -501272 126374 869939 992200 376351 -509071 -845112 -81717 1318765
37945 1318765 2157293 1841242 985755 366035 -52198 -494836 -552694 109503 762785 468036
37935 468036 -321572 -210676 1039059 2033828 1695759 627156 -24266 -160939 -411636
37926 -411636 -823254 -789581 -102769 659940 856064 422687 -258527 -804325 -1049359 -1033687
37916 -1033687 -877089 -638774 -332536 -66845 -8804 -142644 -230154 -128523 -26246 -230414
37906 -230414 -759936 -1232728 -1193638 -603368 29716 186305 31568 258419 1076668 1776136
37896 1776136 1676664 1115543 905177 1101282 1062015 625034 393030 721938 1185014 1296031
37886 1296031 1097627 736918 103391 -723032 -1230217 -1124669 -777756 -618885 -492870
37877 -492870 -18892 754127 1381663 1405864 540322 -1040965 -2418134 -2576387 -1663426
37868 -1663426 -927064 -1044093 -1333386 -1161251 -1155420 -2073919 -3249111 -3365113 -2327927
37859 -2327927 -1148043 -258959 750902 1794502 2009339 1109583 -67609 -728673 -919641
37850 -919641 -833602 -282050 640576 1189839 875643 118798 -519074 -1151933 -2031293 -2749890
37840 -2749890 -2708590 -2065484 -1550570 -1471698 -1435801 -987499 -110541 845516 1405301 1217295
37830 1217295 387373 -462914 -708786 -270059 483785 1222353 1810853 2082314 1778055
37821 1778055 848767 -304731 -1057290 -1114448 -801699 -673267 -859894 -1044091 -1095763 -1296239
37811 -1296239 -1687385 -1684906 -858262 247119 701300 395201 -6229 -150724 -274608 -443515
37801 -443515 -352697 -4188 203531 236744 476404 774829 352395 -918421 -1953084 -1804327
37791 -1804327 -916563 -362678 -373474 -357291 10276 464828 723312 748491 528739 41068
37781 41068 -647705 -1487480 -2389000 -2860413 -2207771 -527680 980379 1256897 572926
37772 572926 -65030 -306704 -584727 -1124909 -1560771 -1494891 -918828 -126227 416156 309850
37762 309850 -269723 -592817 -329147 -96899 -510864 -1132296 -1144806 -734612 -835161 -1586634
37752 -1586634 -2030308 -1503193 -492366 204246 473263 647544 791475 680729 255496
37743 255496 -234158 -492720 -508355 -623724 -1122403 -1673649 -1557640 -695343 20780 -116663
37733 -116663 -634180 -688892 -406282 -524703 -1025322 -1168249 -817098 -653669 -946984 -1131653
37723 -1131653 -875980 -596312 -517272 -137369 823747 1714654 1805781 1253939 636983 84447
37713 84447 -489836 -760053 -353043 349568 441092 -424271 -1573474 -2035962 -1548502 -788742
37703 -788742 -605786 -1012982 -1163910 -517973 346770 574641 323384 433789 1012796 1332862
37693 1332862 1193189 1322399 2107845 2895712 3012690 2613068 2032093 1202639 309378
37684 309378 103720 785239 1380428 1111540 642530 972637 1761986 1929499 1433211 1152958
37674 1152958 1218589 807316 -275114 -1051996 -831901 -240498 -235799 -759013 -945599 -304881
37664 -304881 768937 1478633 1345313 571824 -179384 -442840 -343727 -229014 -120711 169251
37654 169251 569247 785263 709962 453445 107138 -162283 8201 716104 1360511 1238698
37644 1238698 530154 103061 295278 483190 43827 -797897 -1410791 -1650493 -1872630
37635 -1872630 -2180549 -2063269 -983059 758806 2013903 1908816 888933 245776 544378
37626 544378 1015487 749113 -48882 -466976 -136159 530170 1091996 1454178 1570294 1337765
37616 1337765 852615 418397 270739 448727 764010 767215 139528 -635850 -525600 700778
37606 700778 1922077 2036734 1330579 789391 627311 399929 107784 123886 290205 130187
37596 130187 -224409 -334867 -452574 -1063689 -1615706 -1041489 398809 1186560 705762
37587 705762 -23320 -163238 -232181 -830593 -1474745 -1535809 -1283671 -1124640 -732652 146137
37577 146137 832493 608656 -155789 -620799 -634459 -498338 -192352 349913 758984 824689
37567 824689 1025560 1688711 2218538 2002255 1485471 1428402 1657000 1536425 1149357 932078
37557 932078 628536 -197600 -979343 -778957 56091 172304 -805007 -1765368 -1767660 -1119628
37547 -1119628 -560494 -350809 -482131 -920103 -1294321 -1065074 -284746 404756 652372
37538 652372 641378 466908 73940 -159348 296193 1108058 1291017 642410 8721 -136706
37528 -136706 -318129 -841673 -1063677 -546018 33445 -55802 -436306 -400759 -141478 -234371
37518 -234371 -457685 -179385 416696 526541 11431 -439918 -418234 -235193 -189822 -136178
37508 -136178 44337 129923 -82512 -526968 -1074052 -1589142 -1742120 -1200972 -128919 882562
37498 882562 1489150 1877622 2272984 2477418 2087812 1043540 -112710 -498972 380494
37489 380494 1947001 2804140 2084290 460285 -573257 -371135 333906 546452 118326
37480 118326 -429818 -715084 -740964 -575084 -172277 450806 1059129 1329539 1162045 820235
37470 820235 624750 486670 13679 -755985 -1085158 -421800 705454 1252875 1013820
37461 1013820 734470 833193 772678 24658 -1039646 -1745238 -2042347 -2204727 -2045213 -1215873
37451 -1215873 -59048 658532 814908 949442 1166694 892577 5250 -634416 -338425
37442 -338425 359675 472613 -98156 -709028 -1102399 -1545251 -1977100 -1888953 -1181646 -433786
37432 -433786 -98321 -15259 88903 219778 464158 1070433 1814451 1906987 1036598 -19047
37422 -19047 -380800 -191636 -129778 -259551 -156339 141098 191812 30154 87588 246504
37412 246504 -108054 -948848 -1438122 -1208846 -942103 -1194875 -1442281 -930196 113091
37403 113091 786576 601235 -321941 -1667783 -2901908 -3285752 -2661601 -1877741 -1705170
37394 -1705170 -1723694 -1140999 -292729 -147456 -506673 -112964 1221403 2033945 1409771
37385 1409771 470991 658343 1539388 1600166 561998 -473691 -867207 -1019941 -1135341
37376 -1135341 -791752 -55616 235289 -168302 -395412 27404 165442 -858510 -2221759
37367 -2221759 -2416248 -1396526 -437147 -70258 458686 1489053 2010267 1090441 -655356
37358 -655356 -1818348 -1893654 -1505820 -1278418 -1191802 -984823 -635099 -340940 -295308 -503014
37348 -503014 -717447 -693217 -584408 -816684 -1410701 -1791694 -1549012 -1029894 -795109 -792256
37338 -792256 -544178 50253 611167 865814 855183 597702 36000 -609450 -840070 -389376
37328 -389376 481310 1240304 1473113 1098713 451446 82093 227167 531908 485463 -23149
37318 -23149 -772048 -1533626 -2021951 -1879428 -1210123 -796191 -1144572 -1583947 -1098995 75584
37308 75584 616406 -48295 -993749 -1198059 -822073 -598709 -678933 -745664 -779625 -1009647
37298 -1009647 -1326682 -1315004 -803869 -51098 530177 632699 240076 -262846 -372251 1838
37288 1838 492093 779973 824093 634721 315159 298728 881740 1466697 1096995 -38027
37278 -38027 -577951 77388 783395 322563 -807914 -1235155 -682016 -37183 120699 4318
37268 4318 -147530 -327030 -341121 15562 456388 609877 733282 1214953 1606299 1119238
37258 1119238 -17075 -711615 -563317 -284773 -448894 -754595 -778852 -626277 -555548 -647143
37248 -647143 -995941 -1543891 -1687916 -883299 323383 815051 538983 527364 1096399 1294128
37238 1294128 610100 -52470 129033 584020 475016 137593 303900 703034 629308 308994
37228 308994 488833 1074137 1362464 1353932 1640825 2112977 1944384 953889 -64426 -572239
37218 -572239 -933308 -1541210 -2092144 -2122793 -1706412 -1238878 -897848 -574017 -101692 542615
37208 542615 1084714 1084640 488157 -130988 -219671 80115 274652 231118 88622 -168593 -457803
37197 -457803 -316101 391129 870698 415101 -317251 -116472 895171 1429463 1033041
37188 1033041 535852 318691 -328758 -1526926 -1963964 -763767 932080 1441090 801624
37179 801624 372091 766984 1412335 1805302 2031975 2125644 1915035 1552308 1419877 1504761
37169 1504761 1479923 1275208 968925 395070 -401577 -643524 284562 1584157 1749321
37160 1749321 574746 -570432 -653625 -145218 57671 -111031 -255093 -347175 -531925
37151 -531925 -638490 -480661 -259684 -218397 -259491 -254517 -298491 -321992 31346 712177 966298
37140 966298 257641 -930633 -1742392 -1994152 -2023167 -1893085 -1424028 -773552 -350244 -276208
37130 -276208 -421755 -745093 -1090475 -969817 -215869 390134 -85966 -1400018 -2340554
37121 -2340554 -2253396 -1625461 -1126341 -847737 -649676 -519265 -313146 235492 986669 1426348
37111 1426348 1438968 1460678 1669990 1708939 1485710 1501370 1941984 2170014 1686888 949912
37101 949912 583624 388091 -111763 -674643 -782375 -649150 -830602 -1127106 -920707 -432655
37091 -432655 -478981 -916618 -577522 843356 1964054 1478963 -108264 -1300745 -1473266
37082 -1473266 -1041053 -302637 806303 1954522 2436088 2140630 1748059 1700060 1609765
37073 1609765 1023767 219643 -227490 -316073 -534686 -1047718 -1428062 -1238422 -567506 92028
37063 92028 317226 84052 -220225 -136470 338323 624734 225479 -526863 -776664 -284390
37053 -284390 216750 107076 -132058 412190 1673983 2584145 2505169 2017078 1989684 2401116
37043 2401116 2498101 1812502 632996 -340614 -544853 19541 676848 677476 134999 -35002
37033 -35002 569615 1100207 613049 -485499 -973898 -582373 -288137 -758394 -1381283 -1201795
37023 -1201795 -166821 967281 1475593 1057575 -131819 -1411314 -1887650 -1282476 -269370
37014 -269370 262843 48599 -596526 -1237056 -1466415 -1047854 -320236 -97517 -713966 -1481027
37004 -1481027 -1548647 -976389 -404006 23905 677650 1513447 1910395 1569580 935480 513879
36994 513879 337734 359744 775503 1504687 1836301 1232859 260294 38440 771355 1503129
36984 1503129 1542940 1424583 1867503 2323796 1547590 -439011 -2040772 -2195824 -1792845
36975 -1792845 -2104965 -2626018 -1862384 16975 980706 -23938 -1530380 -1719316 -878972
36966 -878972 -466408 -644144 -328125 714214 1453802 1378007 1201979 1395078 1309610 472904
36956 472904 -335553 -215539 417247 517998 26772 -224203 59928 347308 422790 810706
36946 810706 1715065 2340740 1877835 722700 68409 402581 982414 907983 251979 -204705
36936 -204705 -98473 131885 14475 -270032 -290813 -155249 -392098 -1073374 -1557825 -1327313
36926 -1327313 -714828 -462842 -758025 -1082407 -989738 -670488 -586894 -754129 -656356 66299
36916 66299 1015922 1341884 702064 -265319 -619460 -176086 352923 275165 -298857 -705105
36906 -705105 -538110 -3775 441500 590236 591670 675301 842592 851815 510409 -69731
36896 -69731 -579161 -840297 -933183 -1013044 -1125235 -1208617 -1154655 -835300 -204964 559044
36886 559044 1113116 1211481 866094 252981 -407891 -835430 -722244 13166 994392 1547559
36876 1547559 1235564 279141 -621531 -979316 -1004100 -1265140 -1893682 -2366105 -2203529 -1653239
36866 -1653239 -1409468 -1749300 -2198504 -2053138 -1069225 329043 1369559 1516273 915777
36857 915777 245961 7585 51479 -82736 -555743 -1193877 -1880747 -2619265 -3234590 -3333052
36847 -3333052 -2631577 -1229923 307712 1025927 134324 -2029884 -3852140 -3885514 -2399074
36838 -2399074 -927224 -375546 -302501 -94418 79980 -129277 -513721 -781247 -1166319
36829 -1166319 -1868799 -2327882 -1836423 -664222 164496 161700 -185156 -269667 -68253 123397
36819 123397 145556 -22311 -336955 -601864 -611407 -512921 -703457 -1202424 -1452128 -1010441
36809 -1010441 -210818 203385 26312 -147955 311606 1263975 1919194 1699216 825532
36800 825532 52432 -44060 522941 1272153 1636171 1335018 572442 -133333 -413152 -303203
36790 -303203 -5449 391982 771213 823508 422285 31622 285739 1142968 1872035 1949936
36780 1949936 1584189 1239153 1021898 712990 143120 -580813 -1052437 -844941 -88644
36771 -88644 431733 216155 -160294 123605 746514 668504 -89913 -323333 385435 875633
36761 875633 288429 -501390 -365940 236749 227491 -114112 301550 1304516 1607943 968842
36751 968842 621561 1264185 2001004 1812124 942464 210895 -152691 -329957 -270410 154671
36741 154671 808992 1494995 2069430 2177399 1508126 552295 369846 1222154 2106635 2062308
36731 2062308 1288725 538546 76649 -216652 -308110 -179946 -85030 -147013 -166900 -211923
36721 -211923 -751497 -1696874 -2042311 -1206692 -90685 86347 -516565 -800498 -456438
36712 -456438 -173783 -324687 -547212 -643458 -843544 -1023258 -647794 210255 689614 376455
36702 376455 -64405 38515 381916 362234 115295 147162 315201 -29338 -979144 -1827390
36692 -1827390 -1974134 -1572160 -1109453 -737523 -262527 415030 1113153 1577569 1715306
36683 1715306 1601711 1355695 1064903 780214 491834 113583 -393530 -832775 -848165 -339085
36673 -339085 285066 468078 138669 -190581 -9277 643808 1283705 1480495 1129086 353085
36663 353085 -589501 -1253078 -1145516 -227086 809277 1113261 624693 114352 111659 200306
36653 200306 -240406 -978563 -1246131 -917080 -603486 -558965 -330833 228551 449978 -104610
36643 -104610 -769940 -665470 38422 494720 429774 198187 -123970 -768845 -1481557 -1633085
36633 -1633085 -1247749 -1078523 -1452606 -1828843 -1766713 -1538921 -1402972 -1063161 -421521 -157437
36623 -157437 -814133 -1801002 -2090300 -1584681 -1024221 -763940 -457362 122943 766933 1411004
36613 1411004 2266147 3122050 3212156 2178982 700930 -219186 -224385 404056 1228178 1706303
36603 1706303 1262087 -25138 -1043859 -677521 805882 1997831 2021950 1353250 854568
36594 854568 692190 579184 496110 574070 605146 291139 -162886 -249651 105043 499194
36584 499194 713170 909530 1151088 1231803 1090858 908626 655965 63297 -748308 -1140602
36574 -1140602 -800612 -227560 38522 220657 798197 1562707 1843030 1498955 1036756
36565 1036756 766922 450905 -138531 -819190 -1282285 -1374645 -1058008 -497331 -161144 -306927
36555 -306927 -379327 381282 1590538 1817734 490317 -1065933 -1235254 -208430 443826
36546 443826 -12023 -719422 -721310 -177694 278700 557504 859148 983787 631667 115429
36536 115429 64465 484332 730684 471260 98493 1921 -56450 -498292 -1201226 -1604103
36526 -1604103 -1380724 -698667 85371 705551 1021944 1034186 876376 666403 417935 196019
36516 196019 178857 374058 480100 312654 169544 396836 762980 750732 386644 209557
36506 209557 379105 438775 151562 -48796 221838 673672 858537 813745 701541 295270
36496 295270 -525295 -1151905 -918979 -220008 -126161 -872569 -1520186 -1316123 -674087 -459148
36486 -459148 -863947 -1395824 -1554009 -1140175 -270868 514895 473368 -569686 -1837932
36477 -1837932 -2361741 -1955936 -1137153 -340614 292396 526825 105030 -644829 -834495
36468 -834495 -33122 1046718 1284172 436647 -680141 -1250924 -1287837 -1272377 -1352875 -1249152
36458 -1249152 -789998 -151575 459612 1030147 1538154 1804015 1711146 1380345 976032 524759
36448 524759 60555 -269322 -406275 -454725 -397203 -58344 420077 510840 142001 145778
36438 145778 1155106 2370850 2395347 1274442 610327 1267912 2037205 1389502 -237220
36429 -237220 -1044456 -411437 402296 215441 -530921 -729321 -278375 35871 -65876 12809
36419 12809 674906 1436995 1635898 1328138 1031169 872431 540580 -6428 -361680 -339026
36409 -339026 -318584 -607922 -845033 -476358 400991 1150202 1444259 1528992 1643787 1667858
36399 1667858 1485090 1296466 1333794 1517313 1590142 1402192 934311 247106 -468822 -972156
36389 -972156 -1182407 -1142221 -805598 -192009 263245 17841 -748127 -1138106 -693115 -19461
36379 -19461 202885 311464 1014764 1981074 2034274 834939 -508577 -851375 -336935 149505
36369 149505 249088 203369 65294 -374622 -957335 -1167371 -900613 -642022 -681421 -684366
36359 -684366 -347857 -6325 -137968 -595346 -827657 -686167 -523811 -586258 -766515 -934534
36349 -934534 -1077215 -1113392 -982197 -896186 -1058398 -1161608 -723715 44671 351073 -50751
36339 -50751 -529694 -642512 -799716 -1416450 -2083623 -2209010 -1949088 -1837900 -1916152 -1868196
36329 -1868196 -1612294 -1121369 -128637 1258989 2143944 1895039 1173311 950632 976330
36320 976330 392215 -522236 -671877 -86809 48172 -519529 -644196 94814 450252 -410108
36310 -410108 -1335390 -939163 210862 554812 -74450 -473820 -60347 523227 669564
36301 669564 498748 236233 -134317 -451835 -370629 63772 383771 319048 6775 -378249
36291 -378249 -769855 -1042217 -1065264 -845322 -379905 347412 983084 904185 136644 -346054
36281 -346054 174428 1128506 1469055 1042204 416794 -183152 -877815 -1395236 -1300229 -820901
36271 -820901 -596657 -723424 -833345 -919856 -1205861 -1376841 -931459 -224784 -150530 -746729
36261 -746729 -1108773 -801567 -392771 -419042 -768424 -1276620 -1950064 -2326031 -1641787 -100404
36251 -100404 949335 653936 -289878 -764265 -696029 -777882 -1305222 -1927489 -2190337 -1861993
36241 -1861993 -1054412 -338579 -345860 -993905 -1533976 -1534290 -1265597 -966246 -467284 148564
36231 148564 311916 -126119 -466004 -185501 281597 402129 508667 1132674 1888439 1890579
36221 1890579 1025072 52232 -407728 -365788 -83360 204638 243722 -74745 -511636 -760616
36211 -760616 -829160 -895277 -993417 -1092374 -1211877 -1200196 -738833 109567 718874 646242 236036
36200 236036 95706 290447 447886 340271 -37280 -644809 -1248582 -1423983 -1113430 -831033
36190 -831033 -902300 -926769 -508515 -68601 -230194 -693982 -515674 539584 1584543 1653209
36180 1653209 717683 -405179 -866041 -505866 45149 90108 -255790 -249679 329115 810541
36170 810541 722809 552134 843559 1197231 956663 387726 232651 408677 155593 -620326
36160 -620326 -1114005 -820318 -144152 347029 578700 689440 696941 656783 706074 822918
36150 822918 901646 1028570 1256260 1228751 603552 -210807 -371922 278626 978532 1021585
36140 1021585 481767 -106924 -336759 -141534 174694 149565 -232132 -334528 246564 890882
36130 890882 751927 112318 34942 715370 1194287 910571 562680 972582 1856523 2262630
36120 2262630 1717923 526179 -633304 -1092645 -646160 85336 170900 -516181 -1159954
36111 -1159954 -1160940 -860084 -821908 -979499 -907908 -496922 57836 591486 977242 1111962
36101 1111962 1118186 1211286 1219120 696037 -302296 -1076706 -1168426 -895235 -761009 -832515 -943148
36090 -943148 -984732 -753416 -69502 716968 972894 756059 764843 1018025 562538 -916294
36080 -916294 -2184326 -2052198 -1061437 -517569 -505070 -123250 686673 914426 97841 -1006076
36070 -1006076 -1594271 -1720330 -1736777 -1609314 -1127585 -269700 834635 1860575 2225572
36061 2225572 1666183 863958 795606 1395362 1608240 910547 -20345 -410282 -345241 -202984
36051 -202984 104132 701735 1148652 958975 388880 105190 330444 832657 1472548 2179476
36041 2179476 2606469 2445017 2005778 1910080 2212781 2347002 1938817 1163780 292433 -532378
36031 -532378 -978805 -647106 213534 708281 422574 11160 153550 444954 79915 -700727
36021 -700727 -801860 76999 918823 818457 134688 -274783 -295796 -367685 -537598 -504433
36011 -504433 -381838 -612124 -1105955 -1181691 -552787 171931 223097 -483248 -1422829 -2018753
36001 -2018753 -1928865 -1151101 -138872 417273 201304 -423454 -849416 -846614 -673276 -712946
35991 -712946 -1085781 -1532667 -1685106 -1515535 -1365679 -1366210 -1110918 -289851 610206 815234
35981 815234 359039 23846 213179 611964 1032465 1711227 2438368 2301764 954326
35972 954326 -558793 -1031216 -662802 -553632 -975865 -1104833 -421867 513886 915980
35963 915980 716277 342924 45743 -174733 -238848 40638 670415 1315132 1492618 1020127
35953 1020127 323034 138757 731852 1514572 1653120 973037 66110 -423410 -389923 -155892
35943 -155892 26829 256829 747200 1323882 1361418 508200 -626012 -972699 -282493 582785
35933 582785 824545 625583 520150 388483 -268192 -1315756 -1938198 -1612953 -644586
35924 -644586 321723 920711 1125523 1020247 689073 235120 -160548 -277008 -128930 -141340
35914 -141340 -670155 -1314004 -1246253 -441542 70617 -367011 -966728 -541203 820771 1936710
35904 1936710 2127784 1765856 1310144 725028 81826 -35379 786413 2069335 2810568
35895 2810568 2487202 1564313 1035551 1390742 1999835 1796496 705527 -94213 286246
35886 286246 1185268 1361707 800287 600419 1192951 1693855 1272403 324758 -159877 128875
35876 128875 608057 583023 139 -439336 43783 1284862 2078100 1578496 541241
35867 541241 459451 1617755 2861871 3313337 3334960 3522127 3704103 3524815 3281218 3466572
35857 3466572 3899338 3934180 3308823 2319414 1348271 597898 152172 5478 84545 323775
35847 323775 594901 653303 461911 427838 829955 1135193 556045 -719272 -1624639 -1648304
35837 -1648304 -1324771 -1087463 -599598 308225 978914 918505 668047 862013 1052372 412696
35827 412696 -801525 -1445891 -957340 150026 1106258 1497346 1218062 539649 159167
35818 159167 540122 1248685 1484088 1109997 567448 12522 -653665 -1029671 -466360 760267
35808 760267 1439243 964013 123471 -99616 195611 390442 575171 1293045 2283272 2486533
35798 2486533 1573429 702278 1170746 2695948 3677239 3082490 1481764 124616 -395041
35789 -395041 -225057 425987 1401451 2262609 2529486 2296982 2099581 2125322 2057875 1729355
35779 1729355 1361365 1034522 508025 -197109 -577324 -316123 269498 708872 852702
35770 852702 660646 82738 -546750 -608363 -99944 156694 -314354 -884193 -805932 -329400
35760 -329400 -102138 -52714 209517 344156 -275276 -1267916 -1518449 -794526 -61361 17278
35750 17278 -89289 172028 443465 127574 -558003 -891578 -708273 -536195 -751921 -1072540
35740 -1072540 -981759 -395688 262945 599232 679372 766564 739486 192657 -749724 -1235560
35730 -1235560 -740257 84944 241063 -208094 -314596 233686 623123 175616 -648076
35721 -648076 -965052 -653764 -255843 -17090 333576 861010 1037937 380983 -777338
35712 -777338 -1531729 -1445691 -1009241 -843697 -795313 -334154 321814 263717 -716006 -1547714
35702 -1547714 -1218672 -105514 656638 669156 396754 146124 -226682 -691240 -912240
35693 -912240 -801072 -594400 -378324 -89734 79116 -105168 -360739 -206921 208021 298996
35683 298996 31798 -76634 14526 -250491 -879741 -969678 33762 1393579 1925457 1303703
35673 1303703 115732 -928916 -1438269 -1359114 -921565 -352936 408158 1334254 1777581
35664 1777581 1084517 -200839 -698558 -68193 457697 -88892 -1066402 -1474291 -1550421
35655 -1550421 -2009274 -2436622 -1814482 -321951 748868 888268 941540 1540172 2083625
35646 2083625 1804577 987527 458892 408724 370707 64587 -332542 -647393 -966459 -1380923
35636 -1380923 -1773785 -1956853 -1857028 -1483161 -834974 -14757 588875 495305 -270694 -975195
35626 -975195 -964867 -576665 -713273 -1427688 -1623516 -581892 825529 1142052 187643
35617 187643 -848710 -1037769 -679803 -599907 -1124775 -1912935 -2309373 -1782221 -482006
35608 -482006 618280 703975 244052 418503 1332434 1734215 917074 -71934 87230 1077272
35598 1077272 1571450 1269518 1067800 1342924 1355272 606609 -347961 -911241 -1273856 -1628918
35588 -1628918 -1485199 -600423 149453 -150710 -1000432 -1162792 -482780 63973 -29006 -316130
35578 -316130 -545747 -1061819 -1742188 -1697141 -632684 414651 414280 -309272 -760304 -674443
35568 -674443 -504069 -513170 -620208 -766231 -816492 -480822 110653 234128 -409778 -1031370
35558 -1031370 -817917 -144716 76855 -241399 -543853 -688283 -826378 -657523 75725
35549 75725 674545 291793 -534343 -439877 705177 1595879 1458851 926258 690146 532413
35539 532413 104273 -426049 -917685 -1444749 -1617297 -799316 627552 1348865 912142
35530 912142 320274 390932 746331 970691 1414826 2062596 1936602 669535 -511878
35521 -511878 -513032 -12780 -154842 -603405 -314527 538980 895839 529577 66224 -291132
35511 -291132 -748862 -1022034 -727604 -327975 -437721 -590574 -43181 590968 68977 -1315923
35501 -1315923 -1955982 -1396377 -950985 -1518777 -2302335 -2253955 -1477655 -538373 458408 1349405
35491 1349405 1477740 629743 -308386 -421615 16110 55719 -610317 -1442552 -1894233 -1978992
35481 -1978992 -2112166 -2591578 -3113354 -2888901 -1608185 -132800 368820 -89767 -396788
35472 -396788 79161 820401 1228422 1468492 1830620 1999640 1548232 690123 31920 -130886
35462 -130886 72205 385510 557149 417871 43768 -325827 -558637 -591405 -246527 519581
35452 519581 1302257 1647995 1644045 1607080 1395042 702104 -133188 -428117 -209974 -129839
35442 -129839 -331163 -314656 -7073 5290 -478356 -920033 -992338 -981754 -992245 -708194
35432 -708194 -257263 -269976 -657281 -424225 698707 1521705 1090660 138448 -118411 194481
35422 194481 103986 -461117 -596353 112402 1042961 1469107 1347096 1140285 1294403 1820854
35412 1820854 2156163 1693803 635988 -137307 -248050 -237705 -521702 -723127 -522597
35403 -522597 -308355 -294717 147680 1361369 2345188 1951423 651027 -49827 323446
35394 323446 828318 629992 -145855 -1043351 -1742607 -1807655 -908920 473964 1341264 1418319
35384 1418319 1466766 2100777 2875628 2903558 1991295 812081 93014 -120023 -301075 -580461
35374 -580461 -345921 876344 2362544 2812492 2093850 1389894 1306423 1019090 9666
35365 9666 -604649 286151 1773280 2076131 1087126 169489 -199301 -832962 -1926519 -2509384
35355 -2509384 -2165282 -1748914 -1842403 -1858751 -1325032 -816450 -842992 -879775 -353654 290039
35345 290039 351632 -30452 -343553 -581230 -875376 -881125 -364636 118792 -24848 -415475
35335 -415475 -245686 496258 1115419 1225492 939889 350251 -393084 -723856 -248282 419470
35325 419470 281138 -580300 -1045596 -622406 -153293 -453517 -1054811 -1002542 -366235 -76589
35315 -76589 -402753 -476455 390580 1584768 1953338 1351412 743589 772149 927615 494530
35305 494530 -223580 -261185 626480 1588030 1753802 1166557 453120 3991 -219802 -345991
35295 -345991 -410169 -452022 -567829 -822463 -1137294 -1252633 -880568 -22074 920213 1466510
35285 1466510 1416534 812171 -182480 -1129378 -1401097 -901104 -452064 -856060 -1711472 -1872559
35275 -1872559 -1046083 -113038 248762 337473 478167 268607 -535321 -1165429 -792595 170587
35265 170587 684257 678854 1004962 1885556 2493033 2277859 1773461 1657006 1760581 1542005
35255 1542005 972325 405019 -3903 -204830 31265 694013 1102025 572416 -561176
35246 -561176 -1227820 -941348 -275804 53631 11840 -36831 88865 351887 625813 616134
35236 616134 69799 -694408 -935061 -470898 245 -51543 -220563 -11441 183261 -184626
35226 -184626 -601231 -123432 970793 1378858 718593 82253 299827 781839 683959 229941
35216 229941 82420 166843 706 -341357 -434799 -307857 -301871 -442167 -587598 -853294
35206 -853294 -1245234 -1270296 -627782 74238 61728 -470926 -772782 -756447 -878717 -1048340
35196 -1048340 -733542 -141310 -188081 -1067816 -1841086 -1824970 -1498953 -1506433 -1538619 -956451
35186 -956451 -49082 147831 -767894 -1966181 -2329298 -1671982 -792164 -420545 -409999 -139135
35176 -139135 491077 885529 601532 -90649 -653033 -826790 -519241 314981 1310330 1720665
35166 1720665 1277602 578267 198096 -31063 -349691 -348750 315257 1047845 1075424 698058
35156 698058 883160 1891973 3147501 4160155 4724309 4525707 3493500 2281410 1515146
35147 1515146 921053 135196 -177572 697334 1864869 1719513 397588 -284356 507864
35138 507864 1601461 1805474 1405422 1100690 814759 308404 -119620 -281607 -573329
35129 -573329 -1190536 -1644265 -1518461 -975021 -225168 658613 1217606 910705 180036 119744
35119 119744 810680 1162934 739013 444846 934541 1614586 1813480 1703014 1459540 780745
35109 780745 -97240 -196124 627073 1153327 655240 20432 164883 608656 617784 534346
35099 534346 893791 1359139 1619750 2223050 3368089 3976602 3208566 1913084 1330566
35090 1330566 1283353 894866 205134 -194025 -295980 -227303 487518 1960215 3078146
35081 3078146 2901262 2143961 2007464 2345762 2315257 2046015 2199673 2465410 1938247 633711
35071 633711 -536084 -928471 -436007 796967 2093676 2470188 1959282 1778698 2433595
35062 2433595 2896788 2549499 2397107 3155447 3742085 3163641 2357073 2508019 3041352
35053 3041352 3016182 2982467 3600604 4006664 3558771 3569892 5096962 6645380 6462314 5490994
35043 5490994 5507760 5994305 5639989 5296210 6396767 7965480 8328098 8271767 9266663
35034 9266663 10218087 9508524 8561114 9622092 11820926 13406394 15714937 20385397 25124728
35025 25124728 27574370 30692731 38053122 46855383 53358943 62066808 79783395 104010604
35017 104010604 130868422 172370365 245170522 334437652 388587586 367675256 287788522
35010 287788522 201974031 144571193 110805808 84694385 63877428 52062011 45437444
35003 45437444 37899818 30362722 26045921 22892879 17743418 12822801 11630330 12385218
34995 12385218 11257785 8818598 8028842 8482520 7592490 5591058 4880658 5654756 5950767
34986 5950767 5168456 4391333 3963407 3374564 2851824 2897910 2998422 2534748 2024030 1962059
34976 1962059 1676689 787242 362379 1086091 1773719 1323850 639964 951173 1723383
34967 1723383 1946334 1997673 2453083 2538645 1656197 1008553 1696306 2548422 2004292 959406
34957 959406 1410645 3146013 4121990 3601345 2735222 2334415 2060126 1699569 1489760
34948 1489760 1220329 503648 -175630 -22707 644336 801024 334051 69515 421001
34939 421001 1094131 1835492 2450504 2453991 1703022 950631 839159 906182 518716 31861
34929 31861 -71231 -314610 -1156532 -1617069 -590367 1070287 1474688 340245 -916029
34920 -916029 -1440350 -1608719 -1565117 -852219 298733 868080 598832 339752 503346 418102
34910 418102 -352775 -1145169 -1178018 -583536 -17747 109341 -274170 -968938 -1422753 -1113480
34900 -1113480 -206682 574234 785508 603595 403626 387634 535212 616791 432644 201416
34890 201416 289827 426131 -71678 -993238 -1139659 -70213 1131263 1571093 1812114
34881 1812114 2404993 2475149 1258247 -97777 -71033 774810 864347 477447 1279521 3222880
34871 3222880 4249165 3338619 1757969 804830 258359 -287888 -401844 -13858 -54348
34862 -54348 -884011 -1403644 -745293 270655 397359 -223910 -501878 19914 863251 1406799
34852 1406799 1356436 862400 547363 907534 1499032 1428184 787357 664579 1452823 2180687
34842 2180687 1977378 1233246 770866 756063 977011 1347359 1578259 1186203 393618 207472
34832 207472 1023808 1938957 2011429 1416179 782093 219021 -351972 -694029 -762228 -995266
34822 -995266 -1468666 -1498165 -721160 193219 565874 634155 764420 612798 -82401 -693062
34812 -693062 -644993 -453065 -821088 -1364244 -1276135 -688191 -271401 9040 590010 1171256
34802 1171256 1091508 599863 561413 1001708 1094207 612394 287619 551242 902814 802752
34792 802752 376190 -56586 -438961 -655622 -350786 561484 1563572 1962927 1481720
34783 1481720 446714 -362153 -219984 808631 1799180 2003643 1703046 1569700 1545215
34774 1545215 1076718 249483 -188943 23905 299974 173843 -70624 -47315 61901 -109268
34764 -109268 -470574 -623777 -412545 330 456104 929712 1383380 1679159 1689319 1454056
34754 1454056 1182002 1056942 1103823 1331771 1854187 2599874 3050254 2726169 1926289 1449677
34744 1449677 1506258 1500159 1054065 566107 448734 501932 438073 343803 180500 -406646
34734 -406646 -1213279 -1242608 -128383 982756 907219 83627 -300948 -175239 -288186 -550731
34724 -550731 -171850 709036 1029579 590461 456303 1200227 1924592 1543935 148424
34715 148424 -1360914 -2263747 -2308806 -1679858 -958306 -604803 -438989 -163241 -116424 -648966
34705 -648966 -1104464 -637389 183006 53150 -838831 -976253 -104447 273274 -400995 -574026
34695 -574026 735570 1964683 1348296 -243292 -698876 146033 685650 260036 -240366
34686 -240366 -196148 72020 363443 760918 786478 -95579 -1123682 -908903 390021 1040710
34676 1040710 169876 -1183764 -1812741 -1730613 -1297892 -359656 913849 1464770 615740
34667 615740 -845837 -1668887 -1606681 -1225211 -917648 -819081 -1091219 -1548120 -1505831 -711837
34657 -711837 41454 -79386 -787902 -1240441 -1311390 -1459803 -1634372 -1266165 -344559 330382
34647 330382 184357 -401784 -638281 -267712 218703 161870 -497950 -1011731 -586811 572858
34637 572858 1389050 1280933 903003 1086671 1560204 1415580 540207 -221460 -288476 10419
34627 10419 137470 73989 85763 186903 149389 -120987 -396545 -317163 156287 475718
34617 475718 14065 -1000387 -1515198 -996618 -268731 -441060 -1428078 -2277163 -2604615
34608 -2604615 -2755753 -2726563 -2047912 -877003 -142138 -252452 -582457 -625347 -721446 -1117573
34598 -1117573 -1246490 -702662 -146594 -339888 -889417 -908845 -448514 -218878 -205167 295853
34588 295853 1290206 1829848 1359881 424411 -260698 -632545 -817547 -615380 -1268 424633
34578 424633 126279 -556610 -858263 -645858 -485178 -722980 -1025760 -951117 -597963 -438352
34568 -438352 -658499 -908657 -743498 -178010 320766 379999 121751 -38062 139187 538687
34558 538687 848200 754084 130418 -765314 -1394615 -1456079 -1213323 -1084656 -1023358 -615643
34548 -615643 247166 1117883 1451287 1066593 174037 -756991 -1157227 -761101 22175 447364
34538 447364 290605 85981 336872 794026 817923 278071 -258284 -223653 337554 924934
34528 924934 1130600 871140 230726 -610559 -1234485 -1123506 -268042 565558 618899 122020
34518 122020 -34393 365927 523167 -129352 -1026293 -1329391 -1111249 -1033948 -1294829 -1607695
34508 -1607695 -1879393 -2152683 -2177971 -1828924 -1635531 -2010878 -2265887 -1509213 -329931
34499 -329931 -224683 -1243902 -1668448 -503493 1084709 1582426 1152466 854270 856362
34490 856362 608123 99883 -238228 -468346 -909042 -1281423 -1069224 -479275 -122660 40103
34480 40103 537526 1367508 2036221 2447771 2832860 2921707 2195109 980342 302427 481310
34470 481310 794190 753882 787407 1237293 1539509 1040348 99811 -272184 340921 1339685
34460 1339685 1823186 1433595 552355 -154745 -365680 -282338 -209896 -162315 -9523 235478
34450 235478 476126 613619 403168 -344236 -1169088 -1170495 -257304 479003 309632 70824
34440 70824 850075 2081824 2217547 982182 -354425 -836259 -622856 35697 1154398
34431 1154398 2111128 1861968 562594 -336632 -182377 -5334 -623292 -1181126 -569652
34422 -569652 803138 1763210 2014813 1948247 1580462 823735 202372 207009 428687 315605
34412 315605 231216 724308 1329213 1267925 854072 924350 1257147 942303 116048 -134362
34402 -134362 372594 593863 62701 -349556 33948 581851 432421 -248384 -785644 -1048325
34392 -1048325 -1296780 -1508334 -1469805 -1178306 -701603 7022 785653 1115479 654199 -348382
34382 -348382 -1377773 -2087719 -2305004 -2047070 -1665150 -1483585 -1212182 -367574 571254
34373 571254 307825 -1469159 -3218112 -3245271 -1734807 -270404 256073 318508 512437
34364 512437 649540 338478 -260723 -665532 -659612 -372683 -70886 -69170 -546447 -1203304
34354 -1203304 -1354351 -651824 427342 1083736 1087642 890745 898396 993826 922108 820800
34344 820800 1037231 1561694 2012039 2164728 2129026 1944469 1445585 719967 243592 199506
34334 199506 77540 -526427 -1059755 -695461 258708 491407 -551845 -1792702 -1875731
34325 -1875731 -857476 63909 197933 62120 415980 1146054 1411437 707218 -483828
34316 -483828 -1166134 -874536 -108742 313300 134528 -326423 -847550 -1529538 -2294840 -2645153
34306 -2645153 -2222714 -1318559 -501260 43409 458118 674394 388697 -364674 -987309
34297 -987309 -876739 -48000 969200 1729911 2157821 2261996 1862199 841172 -420703
34288 -420703 -1202404 -1203088 -933610 -1090861 -1657157 -1951301 -1601506 -1122088 -1287650 -2108354
34278 -2108354 -2741760 -2482974 -1616833 -1065265 -1246523 -1579479 -1259103 -246475 820367
34269 820367 1478033 1724568 1574536 979069 303282 201820 706836 1065098 862674 615347
34259 615347 699863 490337 -551925 -1591369 -1405227 -282258 368273 176815 181015 871743
34249 871743 1320357 808140 52200 -9682 352725 355568 14537 -188969 -328618 -751828
34239 -751828 -1223160 -1257538 -986608 -890178 -981954 -1029433 -1221074 -1757814 -2095310 -1553493
34229 -1553493 -520084 -90587 -551602 -1140006 -1324799 -1371848 -1481089 -1323955 -810686
34220 -810686 -505556 -776145 -1137096 -965662 -439125 -260476 -718851 -1435035 -1886475 -1886906
34210 -1886906 -1639723 -1507152 -1677245 -2003301 -2224758 -2249248 -2072352 -1610717 -891902 -218571
34200 -218571 193710 520186 871912 853860 174888 -581092 -582629 -427 277441 151599
34190 151599 451531 1317554 1581040 412479 -1307239 -2106547 -1820287 -1520791 -1918527
34181 -1918527 -2606846 -2726632 -1806485 -121342 1340268 1565441 643405 -157392 39989
34172 39989 516820 32222 -1289085 -2060873 -1492739 -221148 784869 1290298 1528287
34163 1528287 1606907 1567363 1548619 1587030 1610573 1767731 2298133 2926687 2934056 2108015 1133087
34152 1133087 709879 749260 816235 918823 1346125 2032431 2608725 2896575 2874086 2333126
34142 2333126 1130343 -257530 -978507 -731701 -46918 468115 746825 950638 965837
34133 965837 602266 76078 -129565 124071 472669 545850 347825 41882 -368600 -905314
34123 -905314 -1332924 -1338141 -984541 -694349 -697092 -766259 -643768 -445600 -393932 -387256 -205913
34112 -205913 -4182 -148343 -564251 -707144 -310674 260576 615344 864579 1210186 1401808
34102 1401808 1125143 700638 767704 1273792 1391799 655247 -334035 -694188 -401982 -194857
34092 -194857 -520146 -1063287 -1331958 -1278051 -1152760 -1036203 -802901 -462874 -267542 -399662
34082 -399662 -701368 -841810 -726491 -610427 -741044 -995408 -1043899 -869512 -896393 -1442190
34072 -1442190 -2198498 -2519272 -2198571 -1686379 -1470259 -1538230 -1635846 -1755338 -1982930 -2008856
34062 -2008856 -1320198 -19124 1017974 1141509 769563 786651 1314752 1661568 1466472
34053 1466472 1198702 1208401 918831 -366331 -2149863 -3022730 -2341394 -980181 -155071
34044 -155071 -47499 -31695 146100 68984 -522204 -1181775 -1275953 -739899 -66572 314144
34034 314144 422338 533435 780372 1013849 974818 524299 -259971 -1084512 -1495581 -1116912
34024 -1116912 -56836 979971 1257034 733323 5528 -486572 -856358 -1271966 -1518793
34015 -1518793 -1408159 -1255663 -1439158 -1680068 -1338828 -394619 425477 602275 439517
34006 439517 559442 1172136 2009181 2630320 2645087 1985822 1122186 666120 651369 611684
33996 611684 446928 589075 1053233 1080963 328015 -241006 469518 1980511 2705476 2050717
33986 2050717 1070423 853952 1178365 1193338 697898 116596 -312796 -658419 -817154 -506275
33976 -506275 271103 1125815 1652901 1667595 1167547 343636 -421508 -832466 -953542 -1010631
33966 -1010631 -996172 -735617 -312622 -98679 -257811 -500881 -520934 -450238 -595601 -837490
33956 -837490 -683659 -11438 614246 639365 250129 -17382 -194371 -775364 -1663792 -1976147
33946 -1976147 -1280423 -356891 -89296 -153377 308160 1072251 1042657 96298 -465803 249809
33936 249809 1449321 1860631 1397238 815602 406069 10840 -136330 278703 694249
33927 694249 196491 -901512 -1123434 143602 1648719 1894907 996266 204105 158389
33918 158389 465932 713848 992241 1356726 1511902 1302484 1037580 1023398 1093770 920650
33908 920650 604234 614642 1135150 1710240 1707589 1059898 361310 165212 380380 560939
33898 560939 600382 725336 853556 545136 -180985 -570527 -159174 396935 174137 -677131
33888 -677131 -1242706 -1275556 -1318897 -1386142 -701719 802467 1873197 1655814 1101213 1539203
33878 1539203 2529919 2517243 1305690 344861 396094 425747 -557805 -1832746 -2093489 -1386218
33868 -1386218 -849444 -1013939 -1351815 -1278130 -760709 -53633 487472 438463 -234909 -876243
33858 -876243 -839857 -302059 153293 422313 664540 573354 -191270 -1036125 -961143 -60403
33848 -60403 565886 512205 531139 999324 1157669 519867 -89423 156315 598386 16138
33838 16138 -1485246 -2581041 -2460601 -1544348 -655707 -307851 -661714 -1368900 -1523040
33829 -1523040 -547057 881192 1519642 1176508 874289 1320377 1999156 2050439 1395851
33820 1395851 636761 303241 509011 971094 1127462 579805 -379266 -1002180 -988011 -776072
33810 -776072 -791497 -840240 -540124 8769 358521 331409 182721 200558 341193 281236
33800 281236 -185567 -774783 -861226 -181689 743554 1156733 918108 523436 422173 700651
33790 700651 1273754 1875798 1967471 1266626 363432 144865 544377 604042 -45661 -601509
33780 -601509 -375660 142058 152659 -148388 82474 1054363 2142381 2766224 2839147 2494959
33770 2494959 1935910 1437421 1032285 386894 -518490 -893972 -35622 1447991 2119579
33761 2119579 1479987 495551 185898 417699 453719 83201 -299753 -370158 -157667 124633
33751 124633 181491 -243622 -1025072 -1582922 -1446059 -773618 -79638 404522 804024 1161257
33741 1161257 1275250 999385 442151 -161135 -573809 -581003 -187686 139626 -220032 -1239265
33731 -1239265 -2000438 -1634470 -400013 592499 740630 528308 543652 491539 -230188 -1297541
33721 -1297541 -1614574 -783203 309828 717718 658771 981381 1789629 2281382 1899753
33712 1899753 1049493 483630 374940 295580 -43108 -340176 -102640 630378 1200236 1086170
33702 1086170 543578 203210 187890 75750 -288866 -522673 -406021 -279655 -430212 -635803
33692 -635803 -735478 -1072470 -1784097 -2184301 -1632666 -638484 -230774 -489977 -668614 -629378
33682 -629378 -1035296 -1959516 -2446657 -1935767 -1164162 -1007186 -1198653 -984285 -469483 -428004
33672 -428004 -1025591 -1519926 -1212037 -165915 995448 1621737 1444280 791237 300598
33663 300598 189280 44740 -400997 -678547 -229278 657675 1121550 778887 -23764 -844991
33653 -844991 -1464614 -1668973 -1352049 -867893 -712463 -772613 -440022 406508 1097853 1078054
33643 1078054 598923 211895 18682 -190513 -407758 -459882 -381251 -319382 -182792 227881
33633 227881 758042 917368 455482 -294125 -744914 -611043 -76976 468594 781497 903613
33623 903613 1044401 1328471 1625860 1645807 1262739 754007 592107 902627 1248005 1137112
33613 1137112 653306 289841 207554 69797 -288149 -506889 -309780 -19783 -24274 -85781
33603 -85781 230525 671559 515747 -361128 -1283608 -1704744 -1717399 -1505663 -943909 -59237
33593 -59237 661211 851290 766334 821122 989859 1077486 1248339 1761176 2354291 2415952
33583 2415952 1770663 916640 434699 427400 580326 571964 361382 158623 131563 182681
33573 182681 139891 92434 250263 491728 459769 177745 77242 244735 216103 -173515
33563 -173515 -380682 -93655 81879 -376815 -817174 -343894 539805 474442 -616536 -1267997
33553 -1267997 -687786 67535 -146015 -742920 -451399 560552 901859 62744 -916057
33544 -916057 -1004915 -386485 253777 764875 1258419 1391597 684079 -617285 -1609035 -1727242
33534 -1727242 -1275715 -899157 -894754 -1179885 -1588333 -1898123 -1775677 -1080566 -211804 189147
33524 189147 -31288 -382824 -410057 -217595 -131325 -177861 -247616 -499169 -1110834 -1756056
33514 -1756056 -1873351 -1484641 -1199314 -1257562 -1126784 -375855 535433 853378 628666 622874
33504 622874 1162965 1653996 1428745 670879 132783 119750 183356 -92643 -390289 -112720
33494 -112720 623437 984409 554991 -23762 66468 703629 1135491 1134981 1147697 1356247
33484 1356247 1356415 934384 495048 416143 527197 554304 581920 722555 789360 664540 565290
33473 565290 588381 435732 -33763 -449221 -528461 -531080 -665581 -613971 -209564 9973
33463 9973 -360512 -779486 -644638 -461626 -1064658 -2051955 -2225240 -1442654 -748037 -582347
33453 -582347 -198014 778209 1453029 1009835 -11106 -508516 -179698 569527 1415836
33444 1415836 2134849 2373253 2089422 1813987 1902059 1953891 1533339 990661 905332 1079599
33434 1079599 798373 -110828 -1099963 -1663314 -1777745 -1693160 -1688523 -1905862 -2130978 -1972180
33424 -1972180 -1501743 -1321109 -1662506 -1931360 -1612548 -1097269 -975946 -997798 -521444 356558
33414 356558 987898 1269389 1654994 2131932 2075882 1265850 301641 -207717 -299936 -333247
33404 -333247 -507777 -866654 -1345782 -1700611 -1722806 -1545189 -1414497 -1280503 -1008028 -807360
33394 -807360 -938562 -1162617 -1072369 -809830 -798309 -890620 -519963 336929 1069350 1296917
33384 1296917 1132889 666025 -17601 -365037 148688 1007828 1124579 444337 33232
33375 33232 349526 567455 13175 -861608 -1454616 -1824591 -1906770 -1121429 362372 1107287
33365 1107287 262854 -995174 -1078172 -223886 180194 -182229 -471197 -367142 -317383 -312570
33355 -312570 121070 732317 724743 205119 138996 726697 1146386 1120357 1323098 1827976
33345 1827976 1618130 374692 -591503 -217498 578045 239977 -1090178 -1849150 -1275146
33336 -1275146 -198087 286485 -15067 -584937 -814519 -362611 556502 1213584 1105834
33327 1105834 564113 229258 153505 -47011 -366614 -424915 -249477 -320548 -701810 -792099
33317 -792099 -255436 320514 138128 -708937 -1266359 -799145 420957 1425258 1498374
33308 1498374 771510 -67378 -536575 -705111 -817949 -870137 -753007 -604264 -681486 -954905
33298 -954905 -1141629 -1149494 -1184879 -1349776 -1417967 -1179534 -814878 -702252 -888275 -904573
33288 -904573 -183124 1334547 3002676 3938081 3759378 2878787 2055370 1706436 1671623
33279 1671623 1539977 1098820 509819 148826 266674 745574 1184165 1222846 766115 -28674
33269 -28674 -822206 -1192667 -919620 -257377 277968 490579 673851 1115564 1697726 2129257
33259 2129257 2282422 2091067 1440286 487062 -181519 -126330 372693 718399 805278 969192
33249 969192 1246147 1229918 724461 69450 -298450 -233335 218509 862141 1196073 691811
33239 691811 -526919 -1637550 -1965147 -1579137 -935127 -355755 -83582 -382794 -1205556
33230 -1205556 -2068901 -2604172 -2947215 -3282444 -3354800 -2851988 -1992306 -1286662 -917789 -749741
33220 -749741 -716872 -771397 -686540 -395898 -294447 -658074 -1000286 -681915 -16977 15360
33210 15360 -797342 -1530072 -1368167 -534847 258967 612710 393688 -396402 -1264105 -1347239
33200 -1347239 -438216 585413 851017 542656 349546 389801 364946 347908 603306 889192
33190 889192 770587 487117 674321 1266702 1535509 1291235 1168903 1477297 1615358 1074106
33180 1074106 311048 56328 253844 281910 -100323 -557093 -715430 -474792 40575 491442
33170 491442 499579 154510 109823 795522 1745158 2115990 1709897 1051395 585916 282997
33160 282997 22626 -86884 88222 483337 938864 1342426 1606299 1644648 1404837 867845
33150 867845 120798 -500316 -586212 -195777 21816 -411083 -1096554 -1235925 -724996 -330967
33140 -330967 -734335 -1758078 -2623056 -2687259 -1920790 -951767 -626949 -1165372 -1742386 -1333698
33130 -1333698 -28288 984567 902905 269720 105218 530837 781651 362091 -370851
33121 -370851 -783262 -673059 -275164 110124 278784 98915 -415952 -996397 -1246703 -1015278
33111 -1015278 -615140 -538067 -871530 -1121748 -782628 -3574 560744 597654 553224 1012741
33101 1012741 1846239 2267125 1769769 785183 236391 512913 1092940 1257671 971367
33092 971367 791915 1007834 1265317 1156835 773592 399833 10232 -521863 -965295 -957703
33082 -957703 -553774 -80084 434019 1138480 1736719 1623132 776200 -63706 -319140 -167375
33072 -167375 -1757 139486 296969 296234 171996 416388 1259710 2035358 1852506 758955
33062 758955 -264533 -423656 144055 698005 684397 231213 -9800 348589 789311 432661
33052 432661 -697780 -1560392 -1534059 -1241944 -1388920 -1552850 -1047877 -378036 -613994 -1601316
33042 -1601316 -2115056 -1840327 -1850861 -2739903 -3545534 -3260845 -2400762 -2133083 -2534485 -2688886
33032 -2688886 -2142648 -1371306 -951175 -976630 -1233637 -1414728 -1257189 -901665 -920754 -1545781
33022 -1545781 -2137058 -1978451 -1346861 -1119270 -1460918 -1641120 -1160687 -347783 282896
33013 282896 584427 500873 -77649 -838603 -1026198 -367697 425387 568292 240313 168557
33003 168557 480584 652188 510079 558989 1099474 1610569 1446017 810073 537597 997744
32993 997744 1685995 1987742 1923020 1867120 1849905 1575929 1046261 674040 653561 627014
32983 627014 244061 -271596 -477864 -411132 -486879 -795033 -960795 -761350 -456227 -342589
32973 -342589 -335639 -227162 -95775 -173137 -443241 -645529 -652838 -658864 -939712 -1481492 -1888186
32962 -1888186 -1750760 -1167151 -719360 -728581 -745371 -188475 653585 880554 317094 -116424
32952 -116424 285945 989469 1050819 422467 -276623 -832404 -1385980 -1608822 -1020755 -158560
32942 -158560 -278592 -1492992 -2219719 -1181572 822965 1986850 1785425 1264050 1345758
32933 1345758 1860700 2273979 2444166 2349167 1774691 762256 -51292 -29668 682987 1304830
32923 1304830 1259861 664179 52179 -166359 35097 427816 787617 991156 944548 609713
32913 609713 155957 -121313 -160822 -199425 -312423 -183429 354436 822893 611398 -154373
32903 -154373 -745103 -758955 -420870 -5186 443416 749820 611968 187245 101363 585383
32893 585383 1137803 1357075 1525085 1915589 2098091 1570588 665648 106429 -64735 -347807
32883 -347807 -709485 -471478 601465 1797459 2318864 2155465 1832632 1684991 1646117
32874 1646117 1458181 868931 -113076 -974103 -997509 -59868 1091653 1607406 1427916
32865 1427916 1191647 1398891 1932673 2357579 2423682 2177638 1733387 1129919 462822 4133
32855 4133 -30123 152536 31084 -610664 -1384602 -1806911 -1878135 -1863814 -1718844 -1204596
32845 -1204596 -540362 -406114 -1078986 -1935872 -2128972 -1572525 -962688 -868565 -1069257 -916407
32835 -916407 -239750 346081 184146 -542427 -1010611 -827427 -449652 -375140 -438067 -299523
32825 -299523 -148961 -309471 -503064 -247350 235056 331867 183442 590154 1653575 2431978
32815 2431978 2273911 1652422 1237776 949935 513871 212618 330853 414799 -91029 -870540
32805 -870540 -1221914 -1218207 -1521811 -2186555 -2501372 -2062477 -1260736 -597429 -174142 -13954
32795 -13954 -281084 -929736 -1568842 -1866688 -1755548 -1206984 -271931 581711 718666 158867
32785 158867 -285360 45448 925241 1673277 1954874 1883213 1640084 1327035 1022695 736659
32775 736659 415223 123943 50589 196587 252749 -74160 -755937 -1538889 -2153397 -2354427
32765 -2354427 -1981796 -1118587 -69747 833625 1272912 948446 -49734 -933209 -831047
32756 -831047 118583 787990 429967 -415375 -690228 -73507 900493 1581215 1615427 957122
32746 957122 -16808 -596583 -408831 144904 478236 592083 824444 1148345 1325166 1514039
32736 1514039 1992041 2377568 1954950 842017 11300 -58015 69735 -103456 -242878
32727 -242878 -87180 -239995 -1141557 -1906089 -1381814 -98422 153988 -1146847 -2395627
32718 -2395627 -2086270 -831894 -240914 -537100 -529937 302434 1011839 754056 66351 -111013
32708 -111013 81109 -172385 -888662 -1255987 -1037518 -977231 -1478192 -1794162 -1194053 -230206
32698 -230206 59927 -205807 4421 841574 1212267 558729 -113047 237200 968979 656725
32688 656725 -746065 -1832223 -1773702 -1252454 -1062957 -877016 -106080 780830 765407 -178941
32678 -178941 -939032 -718978 17335 297481 -109080 -533756 -338674 294722 607164 212750
32668 212750 -392487 -458456 14594 283910 -83126 -645809 -836369 -798060 -998604 -1344056
32658 -1344056 -1317937 -912244 -778498 -1300476 -1991530 -2069635 -1375181 -529980 -313121 -921706
32648 -921706 -1718495 -1772985 -849230 242571 528281 -25475 -610670 -643569 -294245 3167
32638 3167 95243 87746 157861 451731 861329 962609 565814 203968 527434 1291074 1619635
32627 1619635 1292256 966182 955713 672380 -298282 -1362294 -1752516 -1565207 -1348333
32618 -1348333 -1223112 -1074196 -1090907 -1374087 -1427022 -819638 -25177 201803 -877 95684
32608 95684 537425 653722 287176 135285 669411 1480598 1966728 2023565 1761547 1111300
32598 1111300 90585 -914106 -1455926 -1414194 -967317 -442636 -219630 -443816 -793385
32589 -793385 -848240 -664435 -604444 -663810 -471616 14456 351478 276580 41467 -88630
32579 -88630 -229529 -560481 -959197 -1139647 -906859 -229128 651055 1212651 1150335 845157
32569 845157 911371 1318118 1466707 1114730 645035 395184 353421 600663 1360459 2402926
32559 2402926 3040456 2968279 2536854 2015483 1272731 432539 66891 297978 409753 -105789
32549 -105789 -705043 -567254 271498 1103919 1448580 1265899 696227 63944 -259129 -421677
32539 -421677 -1052183 -2207604 -2931318 -2450525 -1299231 -589894 -626001 -925899 -1168000
32530 -1168000 -1305678 -1078114 -256635 779597 1422974 1619822 1645850 1409498 757223
32521 757223 209260 475984 1311386 1711277 1274866 575670 149200 -66375 -165684 23021
32511 23021 402213 451812 -60696 -707964 -964818 -719940 -132646 529197 825485 459741
32501 459741 -205701 -452130 -136130 187369 164956 95833 308988 632736 727979 517641
32491 517641 98298 -374497 -593782 -328062 151734 306841 59068 -180142 -224674 -292655
32481 -292655 -427064 -385624 -228717 -333845 -632567 -538185 92819 624042 599138 354886
32471 354886 287368 198394 -136759 -387501 -209263 186040 530432 985882 1537086 1515890
32461 1515890 500386 -797132 -1360305 -1188266 -935679 -637865 127124 986613 928587
32452 928587 -52551 -591916 189254 1321901 1252383 -87216 -1329156 -1546165 -1201205
32443 -1201205 -1114704 -1250379 -1003090 -279011 303163 232934 -337680 -945695 -1337758 -1474573
32433 -1474573 -1358449 -1109058 -958595 -939782 -832751 -610487 -535910 -524983 29529 1228718
32423 1228718 2007169 1375310 -22039 -613546 -18714 651157 615801 313458 198089
32414 198089 -85403 -757627 -1262209 -1277308 -1358509 -1800121 -1874853 -1155752 -612096 -1193299
32404 -1193299 -2127224 -2003017 -986759 -495630 -970599 -1452968 -1334297 -1116645 -1237691
32395 -1237691 -1373706 -1223830 -954716 -583694 131478 951083 1245456 1046845 1026917 1202198
32385 1202198 784360 -276836 -781824 -15543 1002537 873729 -306369 -1289284 -1324143
32376 -1324143 -638488 294194 1152573 1675689 1829700 1916894 2103964 2125281 1793519 1357120
32366 1357120 953388 264998 -747295 -1354764 -995544 -201441 170360 182457 432090
32357 432090 791404 546630 -321911 -974953 -911734 -508805 -226757 -12921 314230 697173
32347 697173 1025517 1182821 871795 -21955 -877810 -850801 -50728 501356 278803 -136216
32337 -136216 -142986 -62438 -473458 -1197300 -1542890 -1217451 -515232 130888 425843 317210
32327 317210 93935 62639 -21602 -666960 -1583360 -1683044 -638237 361165 187947 -595215
32317 -595215 -720459 -254917 -316131 -969261 -938185 268026 1334661 1003130 -79000
32308 -79000 -328208 598556 1576264 1657806 1080740 663576 823174 1263200 1284935 436445
32298 436445 -922213 -1872071 -1954192 -1629541 -1479940 -1417633 -1137910 -883566 -1081574 -1516704
32288 -1516704 -1599490 -1293342 -1043926 -882901 -387827 427281 956124 902742 658160 582237
32278 582237 556541 453833 380935 206743 -432228 -1299952 -1477267 -645522 190364 -71420
32268 -71420 -1149515 -1798537 -1358173 -246022 791367 1261506 989273 265604 -177358
32259 -177358 85925 548477 393754 -421255 -1236483 -1628628 -1647423 -1303235 -585656 55126
32249 55126 55100 -331304 -225984 532799 1012371 521954 -339406 -481389 298257 1236105
32239 1236105 1580920 1203805 473457 -81906 -148408 43380 -89398 -771629 -1575489 -1984417
32229 -1984417 -1911311 -1444725 -525786 700670 1560537 1429078 517645 -351786 -657264
32220 -657264 -468725 14432 676793 1218820 1210662 630061 -8846 -278491 -305820 -408356
32210 -408356 -556894 -532994 -427611 -529779 -693686 -287433 919538 2124452 2252613
32201 2252613 1330795 572905 868796 1663826 1804103 1148647 643309 839844 1107861
32192 1107861 626550 -442113 -1280794 -1538952 -1540660 -1538520 -1375649 -985148 -734226 -983265
32182 -983265 -1535191 -1790348 -1390267 -551894 215576 606018 689333 654421 503183 116031
32172 116031 -402481 -642899 -320419 288948 543824 125235 -605452 -1040961 -1032930 -989145
32162 -989145 -1252314 -1603315 -1589597 -1220408 -974570 -1025758 -834529 147612 1565048 2401270
32152 2401270 2187244 1583647 1525474 2013894 2114550 1209219 -50645 -391134 474102
32143 474102 1321431 883361 -487257 -1310737 -1068093 -851054 -1552786 -2386193 -2092824
32134 -2092824 -935618 -289410 -548676 -746233 -315843 64936 -198926 -608508 -545088
32125 -545088 -298724 -316743 -204242 579613 1558578 1743778 1013629 142261 -322942 -400152
32115 -400152 -100551 572937 1081559 699904 -411974 -1218069 -1121365 -652860 -610726 -1080312
32105 -1080312 -1585691 -1703579 -1215840 -114803 1165601 1870141 1647295 924050 287089
32096 287089 -228744 -914319 -1715942 -2219204 -2209115 -1878421 -1482586 -1079669 -644888 -206000
32086 -206000 196280 516080 645732 524889 324953 302682 389508 178945 -485305 -1140453
32076 -1140453 -1240351 -906720 -724873 -847670 -849666 -592042 -594403 -1156638 -1699441 -1601030
32066 -1601030 -1227621 -1339031 -1795613 -1813182 -1361790 -1211117 -1472843 -1272671 -296305 454924
32056 454924 143538 -632491 -903344 -834049 -1152417 -1724630 -1842504 -1508291 -1280217 -1104501
32046 -1104501 -473233 373636 606476 238752 236855 941129 1451813 1004995 37242 -602833
32036 -602833 -708525 -488127 -17199 532842 733769 504771 350381 545475 685109 546145
32026 546145 701416 1545499 2308667 1975815 818102 -1951 -187604 -565953 -1445257
32017 -1445257 -1833506 -888693 696300 1624446 1799462 2164102 2891937 2944735 1829951
32008 1829951 690380 711061 1226533 745859 -482901 -564630 1102774 2609338 2145284
31999 2145284 483735 -407669 -168484 99590 33734 251966 680458 484976 -211997
31990 -211997 -269511 481069 832349 295009 -49111 459299 801142 56192 -974571 -1157369
31980 -1157369 -826144 -842193 -903988 -293066 515944 553634 61352 -38998 121131 -237089
31970 -237089 -761138 -332419 857762 1322604 591190 -92256 196726 793378 825882 593640
31960 593640 780598 1258100 1456459 1265480 975960 863672 1173589 1895344 2339514 1720795
31950 1720795 392263 -394242 -219558 35385 -205363 -350982 4559 126407 -524127
31941 -524127 -1107503 -734157 -63656 -236160 -892493 -754437 172290 489065 -484141 -1804429
31931 -1804429 -2336835 -2014693 -1400882 -913529 -795455 -1087464 -1346514 -1014446 -224618
31922 -224618 371948 614897 919307 1302329 1211569 537148 -77976 -241089 -266814 -288760
31912 -288760 136240 986097 1254863 267206 -1192764 -1904929 -1789596 -1596544 -1542447 -1270585
31902 -1270585 -849580 -748768 -890335 -686393 -68248 386574 439616 448480 485656 92486
31892 92486 -746842 -1200289 -675750 294065 792161 674736 467717 487984 602080 613613
31882 613613 427483 2476 -500857 -725349 -588206 -499749 -781864 -1161682 -1247433 -1208681
31872 -1208681 -1453316 -1816295 -1665251 -814035 167552 639424 516488 149809 -96516
31863 -96516 -90073 1537 -126469 -503051 -743702 -557706 -195039 -47370 -29292 163620
31853 163620 355254 55460 -704851 -1326613 -1498051 -1481157 -1419599 -1040056 -337813 76154
31843 76154 -228756 -837831 -1102465 -1022929 -1011745 -1111319 -1047451 -892434 -1069741 -1677975
31833 -1677975 -2293643 -2546406 -2511185 -2388678 -2111797 -1510140 -722709 -194152 -197431 -492465
31823 -492465 -631855 -596282 -854766 -1612101 -2291276 -2187855 -1487228 -1086112 -1386793 -1837071
31813 -1837071 -1795477 -1259376 -502070 364608 1047520 919711 -137170 -1162658 -1115417
31804 -1115417 -207914 448103 373074 157880 379760 828526 1026651 929006 800319 817115
31794 817115 1073266 1634824 2302366 2594423 2261406 1621291 1112916 675957 -108837 -1303830
31784 -1303830 -2346212 -2619092 -2132469 -1477526 -1155655 -1118450 -1001449 -629730 -148089
31775 -148089 212195 284089 -21219 -577300 -952633 -768721 -200877 152952 -26855 -457837
31765 -457837 -669309 -468355 28564 518289 647277 368350 150785 425234 871344 819370
31755 819370 350575 265862 821057 1325270 1318873 1280141 1635119 1898341 1518954 891146
31745 891146 728804 997090 1229800 1349037 1389747 1026634 263430 -52761 548313 1057766
31735 1057766 346551 -931785 -1261453 -681858 -577968 -1164494 -1065629 232761 1311808
31726 1311808 968031 -74316 -548834 -491867 -647138 -1038635 -1249374 -1377510 -1671007
31717 -1671007 -1782612 -1329485 -706473 -480244 -426217 1650 656322 968089 866578 643042
31707 643042 214573 -690109 -1856602 -2805024 -3428524 -3746934 -3377172 -2079104 -589240
31698 -589240 6726 -301515 -494827 -51677 411155 266662 -115741 12580 619221 930162
31688 930162 530919 -39429 11169 654410 1021112 528205 -331802 -636465 -169519 559331
31678 559331 1170147 1620036 1704593 1198301 549516 544655 1077600 1171024 527563 63487
31668 63487 425033 1013000 1158924 1223575 1590357 1533377 339913 -1089917 -1145523 232090
31658 232090 1400981 1111719 -213189 -1298089 -1311638 -360440 657066 777016 58498
31649 58498 -360698 198066 944820 891214 433609 603246 1323742 1686189 1536219 1406340
31639 1406340 1165474 247788 -880758 -1069567 -401558 -196833 -858155 -1316947 -1048052
31630 -1048052 -975094 -1641572 -2039777 -1269466 -56267 491730 531252 743178 943721 687066
31620 687066 436217 811596 1287062 969771 240848 261987 1067215 1473062 915613 186609
31610 186609 134536 639427 1179556 1566978 1730488 1426855 613277 -275830 -730770 -615520
31600 -615520 -134648 343317 398549 -138436 -914378 -1381457 -1427626 -1381045 -1419429 -1377992
31590 -1377992 -1190283 -1078543 -1119540 -983716 -388602 407071 853741 768279 494140 408137
31580 408137 493511 519136 474960 567255 781315 767774 360281 -67997 -111998 -8807 -326851
31569 -326851 -1023249 -1357669 -904236 -162082 134861 -63308 -253981 -163255 10735 29160
31559 29160 -67442 -96835 31724 285353 586473 841757 920439 716798 353048 227671
31549 227671 570292 942049 624392 -322156 -938692 -684586 -256537 -447981 -793385 -321543
31539 -321543 746138 1247172 902911 616191 820035 840091 297248 -118043 88535 298703
31529 298703 -84900 -583397 -619370 -672461 -1413326 -2337708 -2346745 -1293422 -29232 746477
31519 746477 871573 357059 -501536 -970151 -641851 -65169 91445 57447 341897 619813
31509 619813 263004 -398874 -476590 20269 236616 -96108 -363223 -224761 -43727 -57978
31499 -57978 -73109 -105057 -429529 -851867 -783761 -184783 386125 730946 1147324 1528546
31489 1528546 1304896 489054 -160617 -288796 -371114 -737741 -1061520 -1087980 -974827 -660757
31479 -660757 110185 863433 637404 -418728 -903236 -213796 538895 492680 557672 1728453
31469 1728453 3019551 2708094 958291 -449136 -658148 -389428 -178106 358202 1204903
31460 1204903 1417794 536776 -584301 -978784 -663310 3529 1023608 2040243 1885486
31451 1885486 302 -2236010 -2808889 -1537796 -156875 65602 -354612 -492834 -572710
31442 -572710 -1313255 -2429854 -2854683 -2274158 -1514727 -1312518 -1502799 -1657625 -1749227 -1740071
31432 -1740071 -1215912 -113148 689793 361313 -529587 -539447 731545 2063848 2183471
31423 2183471 1198209 132512 -366252 -401779 -348662 -479240 -813939 -992552 -546839 412448
31413 412448 1101346 990561 496926 350163 594469 725476 574782 451529 470331 333017
31403 333017 -101210 -485119 -429163 -16001 265594 -53846 -1042513 -2171743 -2549328 -1687116
31393 -1687116 -95550 1169424 1588828 1500361 1325435 964508 231284 -521258 -691258
31384 -691258 -212179 365537 551076 323580 -116615 -595497 -856706 -621339 -23883 331313
31374 331313 90024 -328086 -327029 -26502 -8470 -292303 -272928 188620 354098 -313477
31364 -313477 -1288325 -1761999 -1763836 -1786439 -1688109 -882294 468871 1364417 1261610 733822
31354 733822 560259 781310 982526 972894 805363 559830 445690 701453 1071976 873668
31344 873668 19626 -500724 206537 1585925 2144735 1246944 -222597 -1041794 -947578
31335 -947578 -562048 -461165 -637555 -703023 -363993 291033 874503 1050802 786481 249462
31325 249462 -408941 -1048115 -1437399 -1397761 -1061983 -805537 -829494 -917953 -720322 -257001
31315 -257001 -43432 -609692 -1866612 -3028968 -3270872 -2464823 -1243974 -392494 -227828
31306 -227828 -484051 -677825 -617276 -583665 -894447 -1300511 -1166890 -448555 -54679 -733616
31296 -733616 -1859872 -2021980 -834554 512677 767606 137857 -109771 731972 2017586
31287 2017586 2534304 1841091 740874 397409 1018508 1655803 1424692 519902 -336345
31278 -336345 -975234 -1608180 -1915902 -1311816 -149807 322913 -459257 -1652793 -2200880
31269 -2200880 -2001039 -1494039 -873408 -245988 94136 145898 392310 975966 1280626 908026
31259 908026 438911 545415 960131 1100065 1115697 1393211 1524618 868232 -161826 -508128
31249 -508128 -85002 136295 -250056 -467883 96747 857285 853620 -10916 -1053303 -1696464
31239 -1696464 -1845022 -1667508 -1349621 -936098 -298859 574987 1301653 1422796 1005844
31230 1005844 576269 443372 457738 442157 439364 454768 365296 222957 287780 590079 768172
31219 768172 535358 74124 -228204 -276087 -309787 -514088 -737589 -674862 -299670 25414
31209 25414 -15129 -309400 -608303 -977807 -1511695 -1770221 -1193068 -78753 636742 717926
31199 717926 848091 1238317 1101009 108249 -715471 -476385 160497 138678 -218459 89632
31189 89632 916261 1315027 1292414 1651624 2251369 2009081 767189 -304569 -469531 -293882
31179 -293882 -405292 -571031 -426508 -89189 304824 728614 739709 -105956 -1160475 -1234840
31169 -1234840 -485849 -396205 -1474207 -2414474 -2169623 -1430382 -1209951 -1289386 -1073352 -801474
31159 -801474 -813728 -669987 -133227 -32013 -916350 -1753249 -1296412 -26612 632447 431144
31149 431144 236508 328823 195405 -220573 -429476 -470401 -843526 -1374868 -1286377 -464339
31139 -464339 352408 705040 792237 700008 244437 -291467 -200859 619281 1428306 1623394
31129 1623394 1313451 812167 235804 -246034 -366291 -144916 111619 209033 76486 -423189
31119 -423189 -1157824 -1451096 -827907 160428 586429 427145 381369 588720 498939 1591
31109 1591 -314732 -182918 -13356 -16251 139678 504208 544328 58261 -373075 -282802 14017
31098 14017 103285 194961 643221 1246099 1549811 1487205 1266112 942500 526838 258935
31088 258935 374468 735476 973445 900711 632970 446428 585863 1008624 1264257 875860
31078 875860 -78889 -977043 -1275611 -927620 -210391 581011 1233134 1616782 1640648 1191615
31068 1191615 331221 -410151 -406691 136919 193380 -694210 -1629663 -1656301 -1249231 -1570557
31058 -1570557 -2640630 -3343889 -3069993 -2245344 -1293547 -213579 709090 908782 521943
31049 521943 348548 552778 400807 -389298 -1070877 -1091861 -935166 -1210138 -1762077 -2215364
31039 -2215364 -2594336 -2870682 -2667244 -1950589 -1300181 -1032422 -839232 -707647 -1222871
31030 -1222871 -2368866 -3048521 -2583056 -1744984 -1427748 -1246180 -531664 165463 -103678
31021 -103678 -961546 -1188800 -622588 -262488 -612024 -1130309 -1339768 -1365036 -1274104 -911685
31011 -911685 -567196 -867407 -1732594 -2246557 -1882257 -1190610 -948997 -1161028 -1217725 -692694
31001 -692694 227321 881058 725869 49236 -134207 669661 1565706 1285762 -104768
30992 -104768 -1263333 -1292121 -617746 -47531 258005 549206 854295 1013284 973501 734334
30982 734334 277377 -229560 -422597 -119358 502820 1194571 1847288 2333035 2408335 1945393
30972 1945393 1124132 303587 -239407 -478240 -620070 -838489 -992775 -815857 -405489
30963 -405489 -166649 -167193 -48905 205198 51132 -634350 -1024325 -485303 323373 373691
30953 373691 -132360 -114153 647753 1207855 932191 274410 -134638 -299611 -458672 -595469
30943 -595469 -683167 -840868 -988356 -850583 -470082 -201910 -110290 44563 148483 -243170
30933 -243170 -1057825 -1588295 -1478637 -1168106 -1075622 -1014074 -775333 -657381 -939316 -1324993
30923 -1324993 -1367051 -1069726 -694885 -316027 86795 369991 354243 28223 -468079 -834376
30913 -834376 -674794 12975 545846 331535 -192402 -134697 433073 583848 117173 -61043
30903 -61043 546407 1214888 1211471 833376 624143 479082 226479 232216 650289 850945
30893 850945 382845 -233851 -430461 -469941 -551007 16326 1575803 2880775 2482020 840122
30883 840122 -328690 -420299 -240780 -245560 -46663 350607 375556 191671 735944 2049721
30873 2049721 2864535 2404342 1491992 1260001 1701545 2075139 1900961 1027076 -465405
30864 -465405 -1890245 -2299156 -1740739 -1382120 -1841193 -2282828 -1848335 -1068930 -931807
30855 -931807 -1281814 -1222154 -608289 -65274 180622 451429 749703 717087 442981 425472
30845 425472 652398 538701 -66617 -563050 -530869 -324016 -414988 -688856 -749876 -510459
30835 -510459 -107814 432777 1044110 1319598 794983 -424979 -1561486 -1819948 -1130240
30826 -1130240 -173977 352684 427335 517775 798440 910941 632216 357151 524420 849573
30816 849573 659266 -106015 -763221 -821776 -562096 -505801 -712645 -869889 -809667 -654249
30806 -654249 -572899 -589861 -566217 -288185 311438 959277 1217054 926915 357234 -111687
30796 -111687 -261886 -5541 596211 1145798 1080498 341590 -336038 -173580 678615 1267417
30786 1267417 965627 146775 -399146 -432857 -363402 -500480 -566922 -118110 728672 1260167
30776 1260167 946444 93681 -476552 -381326 -88401 -244099 -761908 -866755 -61778 1239357
30766 1239357 2209986 2492275 2280139 1708991 691492 -524808 -1173923 -778778 147955
30757 147955 681895 585886 328838 169419 -79606 -320426 -7753 907302 1563064 1297556
30747 1297556 636674 483021 755080 688820 235432 154670 678136 1081349 903699 698577
30737 698577 1031944 1466916 1250446 503495 -41372 -187210 -379212 -778799 -995948 -851334
30727 -851334 -745413 -976265 -1169180 -801206 -62996 234979 -330995 -1164962 -1262213 -410225
30717 -410225 509611 599239 44460 -281160 -142419 -207087 -867401 -1534673 -1551622 -1187837
30707 -1187837 -1070995 -1072700 -561776 425325 1057353 780965 -91167 -901157 -1227443 -959676
30697 -959676 -340108 57946 -102374 -420424 -340750 -80739 -291740 -927681 -1298919 -1223982
30687 -1223982 -1170369 -1180438 -768707 -155385 -377245 -1597398 -2483032 -2094027 -1324175 -1432820
30677 -1432820 -2096982 -2192063 -1767625 -1769781 -2191736 -2019450 -993663 -70516 58036 -244378
30667 -244378 -477699 -676061 -863516 -752191 -304715 150262 542341 1035121 1324687 905970
30657 905970 150249 27848 503644 399528 -690045 -1587656 -1352349 -714117 -693688 -837204
30647 -837204 -123795 1071694 1359053 414501 -604347 -735480 -239760 163270 175258
30638 175258 -165977 -706442 -1076475 -937505 -495543 -301254 -478836 -641015 -591891 -561746
30628 -561746 -652718 -597806 -254910 108369 220655 141078 29911 -99265 -257798 -376745
30618 -376745 -427101 -429361 -318352 -36387 243382 242766 -74670 -498994 -841295 -973974 -772073
30607 -772073 -361531 -260989 -817505 -1579428 -1717699 -1056924 -194858 418863 959768 1629364
30597 1629364 2110024 1940810 1122407 92425 -665878 -818327 -260917 743455 1653068
30588 1653068 2062557 1992741 1745610 1576209 1494368 1279812 761517 183373 90985 642045
30578 642045 1283256 1442773 1263967 1175774 1003747 209024 -1043936 -1822968 -1628048 -1020864
30568 -1020864 -756838 -813943 -669817 -179900 232376 136222 -383125 -743306 -464072 120207
30558 120207 3581 -1249093 -2675946 -2962025 -2152770 -1550326 -1911858 -2630335 -2886657
30549 -2886657 -2700239 -2434917 -2095834 -1677192 -1531424 -1796009 -1999340 -1769001 -1391511
30540 -1391511 -1169456 -849772 -290073 -40085 -503055 -1077714 -959179 -304693 260707
30531 260707 792330 1622414 2180437 1464962 -323929 -1760879 -1958085 -1357781 -608206
30522 -608206 276178 1249823 1738325 1448992 980036 991973 1289409 1289489 954551 689839
30512 689839 649221 672332 671285 630887 439033 108575 -66242 29753 -36068 -682839 -1550050
30501 -1550050 -1792791 -1114111 -83284 586575 706835 538988 437218 666681 1233164
30492 1233164 1723379 1598031 857161 184178 179741 651797 982947 1028584 1168907 1473059
30482 1473059 1414578 722797 -9367 -119529 75618 -264083 -1149875 -1678898 -1379695 -809164
30472 -809164 -520950 -272131 225952 541335 270397 -37653 382375 1228994 1559103 1285267
30462 1285267 1205375 1527872 1446808 512722 -498148 -639266 -74750 290078 44601 -430397
30452 -430397 -695012 -788824 -1014534 -1426858 -1651590 -1303715 -614642 -332266 -703988 -926254
30442 -926254 -165989 1157225 1850511 1526348 816318 98147 -860876 -1780251 -1639783
30433 -1639783 -250503 969108 708100 -448241 -884065 -103120 930347 1292116 1051227
30424 1051227 831910 1092562 1730372 1931856 758490 -1543889 -3260618 -3009113 -1474625
30415 -1474625 -483973 -647359 -949954 -563261 109087 426084 503771 701602 845578 540826
30405 540826 -144612 -732933 -852806 -530070 -206336 -465769 -1375754 -2149938 -1933318 -862600
30395 -862600 189622 816743 1316068 1768119 1759817 1218637 679790 411330 66839 -438446
30385 -438446 -548200 -56657 337549 115106 -147458 311461 1219598 1751003 1700948 1367576
30375 1367576 761913 -131059 -694359 -312515 547972 899276 728266 854281 1329571
30366 1329571 1210889 203218 -669652 -628634 -340716 -718720 -1313595 -953275 437628
30357 437628 1735823 2253459 2461007 2847069 2954016 2171692 977423 571373 1280262
30348 1280262 2002697 1581837 291019 -575426 -387905 203792 414281 362520 555612
30339 555612 933997 1110719 1197277 1591204 2073978 1949996 1164118 510986 521985 846390
30329 846390 1007172 1058979 1111442 901567 375090 70022 284164 417601 -100931 -708811
30319 -708811 -442955 515788 1040626 739805 422065 717417 1202236 1290552 1157278 1207628
30309 1207628 1289674 1112156 974543 1332670 1884659 1833843 1041425 266164 108981 251665
30299 251665 43409 -516529 -797299 -442110 129012 264914 -114858 -550698 -766418 -926417
30289 -926417 -1054729 -730079 177537 891596 604086 -208414 -255355 678335 1311681 764247
30279 764247 -109763 -67050 665217 959919 675106 663176 1057087 925216 -82925 -960446
30269 -960446 -786693 4396 468248 463137 359846 121076 -422890 -856066 -712201 -462543
30259 -462543 -969528 -2017978 -2394825 -1607643 -597818 -363474 -695763 -889447 -1071730
30250 -1071730 -1967932 -3544863 -4686222 -4405707 -2917643 -1279949 -287924 9818 -96956
30241 -96956 -457139 -998329 -1466793 -1575903 -1410403 -1345458 -1425661 -1182951 -398006 275657
30231 275657 5975 -1005174 -1648784 -1362831 -811936 -798438 -1115739 -1056987 -610971 -387604
30221 -387604 -530562 -513992 -118989 127970 -192310 -699079 -825019 -677330 -745726 -1047574
30211 -1047574 -1170807 -1038413 -996050 -1094342 -903950 -268522 302288 356130 178860 293802
30201 293802 612558 630375 257772 -149355 -500697 -1049931 -1709653 -1996960 -1905786 -2133047
30191 -2133047 -2977784 -3621910 -3152313 -1866537 -829426 -424650 -168270 173107 203556
30182 203556 -224157 -607021 -605714 -530878 -581706 -283113 688997 1634584 1551576 508118
30172 508118 -405303 -435807 121765 589230 701135 564477 267834 -181847 -722896 -1227300
30162 -1227300 -1568634 -1676302 -1588478 -1399642 -1095866 -590309 -7549 334116 421353 700714
30152 700714 1378165 1852108 1353409 34995 -1046014 -993897 215669 1873318 2900873
30143 2900873 2352764 307793 -1778974 -2370399 -1563155 -787895 -788862 -888818 -516594 -298557
30133 -298557 -874338 -1562531 -1270976 -195481 475171 292481 -28318 147026 621852
30124 621852 939594 921435 521242 -144352 -498870 42205 1116501 1594725 1004662 154355
30114 154355 -11538 414516 734060 753911 869053 1267857 1595675 1410306 675930 -191275
30104 -191275 -636875 -431551 88836 405532 476005 734336 1349574 1842703 1661284 848009
30094 848009 -101507 -809174 -1227490 -1516443 -1914808 -2507297 -2943308 -2661250 -1595610
30085 -1595610 -370531 430039 867863 1286341 1716725 1982836 2032413 1759378 869548
30076 869548 -539244 -1561117 -1311068 -79262 940571 1053266 629155 277341 105546
30067 105546 2511 91803 520120 1079036 1339545 1041779 248586 -703978 -1346651 -1384730
30057 -1384730 -943730 -364191 185262 656390 824904 475994 -123611 -402547 -222457
30048 -222457 -1274 10826 90677 458235 800349 714324 284773 -104071 -240871 -84689
30038 -84689 387450 985356 1256070 1038442 843117 1242502 2016265 2329845 1726849 609096
30028 609096 -242138 -361181 96856 472419 134016 -807780 -1431819 -972224 256221
30019 256221 1232029 1381915 940652 294604 -441047 -1118748 -1422836 -1313379 -1178529 -1237030
30009 -1237030 -1134146 -486945 406453 780444 256087 -756245 -1454393 -1315258 -501909
30000 -501909 258969 342689 -127720 -485432 -423182 -331436 -536187 -651631 -157119 698709
29990 698709 1172887 1066427 850438 761697 457892 -230627 -839109 -933172 -760516 -813710
29980 -813710 -1089288 -1186153 -854243 -90325 972063 1870463 1932493 1167382 670456 1388108
29970 1388108 2715924 3194867 2509833 1799021 1849506 2076357 1750684 1210273 1063201
29961 1063201 993020 358806 -505222 -645987 37533 635363 542982 118771 -66791 71471
29951 71471 339571 584306 667479 594054 691225 1165700 1554565 1243247 472241 71272
29941 71272 169553 48902 -546206 -910327 -582868 -136844 -184751 -418325 -358229 -336229
29931 -336229 -846908 -1450922 -1294785 -447120 183440 141063 -161515 -264792 -171661 -16888
29921 -16888 147524 209242 172079 436866 1357862 2564546 3283347 3288104 2966070 2527229
29911 2527229 1824478 954889 314934 -50206 -460023 -826804 -613814 182636 755750
29902 755750 603567 269299 456809 955882 1056007 644205 252248 212187 340256 387649
29892 387649 317493 112594 -306099 -867395 -1282351 -1287248 -889121 -377374 -99450 -132715
$$ [...]
##END NTUPLES=NMR SPECTRUM
##END=
