##TITLE=31Pdec_ANY-156B-21
 CDCl3, 24 sc
 12.3.2019
##JCAMPDX= 6.0         $$ Bruker NMR JCAMP-DX V2.0
##DATA TYPE= NMR SPECTRUM
##DATA CLASS= NTUPLES
##ORIGIN= UXNMR, Bruker Analytische Messtechnik GmbH
##OWNER= root
$$ XWIN-NMR		Version 3.5
$$ Tue Mar 12 15:41:28 2019 Russian Standard Time (UT+4h)  she@DPX200
##.OBSERVE FREQUENCY= 81.013821
##.OBSERVE NUCLEUS= ^31P
##.ACQUISITION MODE= SIMULTANEOUS
##.ACQUISITION SCHEME= undefined
##.AVERAGES= 24
##.DIGITISER RES= 17
##SPECTROMETER/DATA SYSTEM= spect
##.PULSE SEQUENCE= zgpg30
##.SOLVENT NAME= CDCl3
##.SHIFT REFERENCE= (INTERNAL, CDCl3, 0, 182.463)
##AUDIT TRAIL= $$ (NUMBER, WHEN, WHO, WHERE, WHAT)
$$ ##TITLE= Audit trail, XWIN-NMR		Version 3.5
$$ ##JCAMPDX= 5.01
$$ ##ORIGIN= Bruker BioSpin GmbH
$$ ##OWNER= she
$$ F:/spectra/data/she/nmr/P31/1/pdata/1/auditp.txt
$$ ##AUDIT TRAIL=  $$ (NUMBER, WHEN, WHO, WHERE, WHAT)
(   1,<2019-03-12 15:40:27.01 +0400>,<she>,<DPX200>,
      <created by zg, POWCHK disabled, PULCHK disabled
       configuration hash MD5:
       00 E9 B6 7A A2 85 ED C7 34 08 36 98 17 FE 4E 26
       data hash MD5: 32K
       EA 9C B4 29 07 FC B0 08 94 18 F4 E2 AC 4D AE 3F>)
(   2,<2019-03-12 15:40:31.29 +0400>,<she>,<DPX200>,
      <Start of raw data processing
       efp BC_mod = 2 LB = 1 FT_mod = 6 PKNL = 1 PHC0 = -1994.815 PHC1 = 524.999 SI = 64K 
       data hash MD5: 64K
       E3 34 95 18 01 9F A8 CE 0A 60 8D 6C 11 FA 9A BC>)
(   3,<2019-03-12 15:40:47.18 +0400>,<she>,<DPX200>,
      <pk PHC0 = 3.656211 PHC1 = 0 
       data hash MD5: 64K
       8F 66 E8 A7 58 21 61 FE BC 27 08 AC 2A 53 27 D3>)
(   4,<2019-03-12 15:40:50.56 +0400>,<she>,<DPX200>,
      <abs ABSG = 5 
       data hash MD5: 64K
       FF E0 EF 1A 63 B9 9B EF 88 9D 46 89 DE B4 09 F3>)
$$ ##END=
$$ 
$$ hash MD5
$$ 7B 63 AE CB CA AA A3 14 18 AD E1 13 18 62 F6 EE
##$RELAX= 
##$RELAX= 
##$RELAX= 
##$RELAX= 
##$RELAX= 
##$RELAX= 
##$RELAX= 
##$RELAX= 
$$ Bruker specific parameters
$$ --------------------------
##$DU= <F:/spectra>
##$EXPNO= 1
##$NAME= <P31>
##$PROCNO= 1
##$TYPE= <nmr>
##$USER= <she>
##$AMP= (0..31)
100 100 100 100 100 100 100 100 100 100 100 100 100 100 100 100 100 100 
100 100 100 100 100 100 100 100 100 100 100 100 100 100 
##$AQSEQ= 0
##$AQ_mod= 1
##$AUNM= <au_zg>
##$AUTOPOS= <>
##$BF1= 81.014009
##$BF2= 200.13
##$BF3= 200.13
##$BF4= 200.13
##$BF5= 200.13
##$BF6= 200.13
##$BF7= 200.13
##$BF8= 200.13
##$BYTORDA= 1
##$CFDGTYP= 0
##$CFRGTYP= 5
##$CHEMSTR= <none>
##$CNST= (0..31)
1 1 145 1 1 1 1 1 1 1 1 1 1 1 1 1 1 1 1 1 1 1 1 1 1 1 1 1 1 1 1 1 
##$CPDPRG= <waltz16>
##$CPDPRG1= <>
##$CPDPRG2= <waltz16>
##$CPDPRG3= <>
##$CPDPRG4= <mlev>
##$CPDPRG5= <mlev>
##$CPDPRG6= <mlev>
##$CPDPRG7= <mlev>
##$CPDPRG8= <mlev>
##$CPDPRGB= <>
##$CPDPRGT= <>
##$D= (0..31)
0 1 0 0 0 0 0 0 0 0 0 0.03 2e-05 3e-06 0 0 0 0 0 0 0 0 0 0 0 0 0 0 0 0 
0 0 
##$DATE= 1552390826
##$DBL= (0..7)
120 120 120 11 120 120 24 19 
##$DBP= (0..7)
150 150 150 150 150 150 150 150 
##$DBP07= 0
##$DBPNAM0= <>
##$DBPNAM1= <>
##$DBPNAM2= <>
$$ [...]
##$SUBNAM3= <"">
##$SUBNAM4= <"">
##$SUBNAM5= <"">
##$SUBNAM6= <"">
##$SUBNAM7= <"">
##$SUBNAM8= <"">
##$SUBNAM9= <"">
##$SW= 369.568048894756
##$SWIBOX= (0..15)
0 1 3 0 0 0 0 0 0 0 0 0 0 0 0 0 
##$SW_h= 29940.119760479
##$TD= 32768
##$TD0= 1
##$TE= 0
##$TE2= 300
##$TE3= 300
##$TEG= 300
##$TL= (0..7)
0 120 53 12 22 120 120 120 
##$TP= (0..7)
150 150 150 150 150 150 150 150 
##$TP07= 0
##$TPNAME0= <>
##$TPNAME1= <>
##$TPNAME2= <>
##$TPNAME3= <>
##$TPNAME4= <>
##$TPNAME5= <>
##$TPNAME6= <>
##$TPNAME7= <>
##$TPOAL= (0..7)
0.5 0.5 0.5 0.5 0.5 0.5 0.5 0.5 
##$TPOFFS= (0..7)
0 0 0 0 0 0 0 0 
##$TUNHIN= 0
##$TUNHOUT= 0
##$TUNXOUT= 0
##$USERA1= <user>
##$USERA2= <user>
##$USERA3= <user>
##$USERA4= <user>
##$USERA5= <user>
##$V9= 5
##$VALIST= <valist>
##$VCLIST= <CCCCCCCCCCCCCCC>
##$VD= 0
##$VDLIST= <DDDDDDDDDDDDDDD>
##$VPLIST= <PPPPPPPPPPPPPPP>
##$VTLIST= <TTTTTTTTTTTTTTT>
##$WBST= 1024
##$WBSW= 4
##$XGAIN= (0..3)
0 0 0 0 
##$XL= 0
##$YL= 0
##$YMAX_a= 12536
##$YMIN_a= -12616
##$ZGOPTNS= <>
##$ZL1= 120
##$ZL2= 120
##$ZL3= 120
##$ZL4= 120
##$ABSF1= 182.463
##$ABSF2= -187.1042
##$ABSG= 5
##$ABSL= 3
##$ALPHA= 0
##$AQORDER= 0
##$ASSFAC= 0
##$ASSFACI= 0
##$ASSFACX= 0
##$ASSWID= 0
##$AUNMP= <proc_1d>
##$AZFE= 0.1
##$AZFW= 0.5
##$BCFW= 0
##$BC_mod= 2
##$BYTORDP= 0
##$COROFFS= 0
##$CY= -3
##$DATMOD= 1
##$DC= 0
##$DFILT= <>
##$DTYPP= 0
##$F1P= 0
##$F2P= 0
##$FCOR= 1
##$FTSIZE= 65536
##$FT_mod= 6
##$GAMMA= 0
##$GB= 0
##$INTBC= 1
##$INTSCL= 5.30512e-09
##$ISEN= 30
##$LB= 1
##$LEV0= 0
##$LPBIN= 0
##$MAXI= 10000
##$MC2= 0
##$MEAN= 0
##$ME_mod= 0
##$MI= 50
##$NCOEF= 0
##$NC_proc= -4
##$NLEV= 6
##$NOISF1= 182.463
##$NOISF2= 159.3651
##$NSP= 0
##$NTH_PI= 0
##$NZP= 0
##$OFFSET= 182.463
##$PC= 4
##$PHC0= -1991.159
##$PHC1= 524.999
##$PH_mod= 1
##$PKNL= yes
##$PPARMOD= 0
##$PSCAL= 0
##$PSIGN= 0
##$REVERSE= no
##$SF= 81.0140089999434
##$SI= 65536
##$SIGF1= 159.3651
##$SIGF2= -187.1042
##$SINO= 113.3802
##$SIOLD= 16384
##$SREGLST= <1H.CDCl3>
##$SSB= 0
##$STSI= 65536
##$STSR= 0
##$SW_p= 29940.119760479
##$SYMM= 0
##$S_DEV= 0
##$TDeff= 32768
##$TDoff= 0
##$TI= <>
##$TILT= no
##$TM1= 0
##$TM2= 0
##$TOPLEV= 0
##$USERP1= <user>
##$USERP2= <user>
##$USERP3= <user>
##$USERP4= <user>
##$USERP5= <user>
##$WDW= 1
##$XDIM= 65536
##$YMAX_p= 329175375
##$YMIN_p= -6382880
$$ End of Bruker specific parameters
$$ ---------------------------------
##NTUPLES= NMR SPECTRUM
##VAR_NAME=  FREQUENCY,     SPECTRUM/REAL,   SPECTRUM/IMAG
##SYMBOL=    X,             R,               I
##VAR_TYPE=  INDEPENDENT,   DEPENDENT,       DEPENDENT
##VAR_FORM=  AFFN,          ASDF,            ASDF
##VAR_DIM=   65536,         65536,           65536
##UNITS=     HZ,            ARBITRARY UNITS, ARBITRARY UNITS
##FACTOR=    0.456856943014862, 1,           1
##FIRST=     14782.0589164792, 0,            0
##LAST=      -15158.0608439998, 0,           0
##MIN=       -15158.0608439998, -6382880,    0
##MAX=       14782.0589164792, 329175375,    0
$$ Real data points
##PAGE= N=1
##DATA TABLE= (X++(R..R)), XYDATA
$$ [...]
##PAGE= N=2
##DATA TABLE= (X++(I..I)), XYDATA
41700A20187L20655r4644k91542j94562r8464j05587M8243M18105N74548K56834
41690I53773j43351k11045j90867m57248o96204l64943K82172M62495P7248j86000
41680d73970p634J53865o72p5628K54181O17915N38255J41806j47271k22408k17665
41669E60774j57820m5782k6498j61099k64290j81242J2268K20295M25878M67860
41659H50344J21205m26963o08678k18179K72711L80013J84073n901j23207j71119
41649B54299j1911L04120L88498P9174k10733j05736J41704J19801m3188K2104
41639I38132K10106J09059k64811m55693k44566J20445L40427L23564Q2012k52447
41629I06228l64016o8377L52295M59808K26102m8451k55636m89325o16928l52232
$$ y = [120187, 440842, 346198, 54656, -139906, -238370, -343957, -295714, 122391, 696939, 953773, 810422, 599377, 408510, -48738, -744942, -1109885, -827713, -365218, -287970, -473970, -481604, -327739, -328411, -404039, -149858, 468057, 1006312, 1148118, 1000847, 778439, 560774, 402954, 357172, 330674, 169575, -94715, -275957, -263689, -43394, 382484, 850344, 971549, 544586, -64092, -282271, -9560, 370453, 554526, 548625, 425418, 254299, 242388, 546508, 935006, 1014180, 803447, 697711, 839415, 959216, 916028, 938132, 1148238, 1257297, 992486, 536793, 292227, 412672, 753099, 1076663, 1158675, 906228, 542212, 473835, 826130, 1285938, 1512040, 1463589, 1207953, 718628, 101700, -250532]
41619b50532J85303M63904K54497m7704k5415J82089J75243q9507l06752l17671
41609B23455k70033k76533k03221N7155K94227K13974q3239j53651J55794M14164
41599C72092K00732k43347l39599j6094K35516J35792m4135l3898K0437q8985
41589A98511k57582k94518j92288L0730L96855O80626M83205j26931m82788j79707
41579B56113L40956M58236K13277L0146j4652j05058j83968j09576o5234k45808
41569E74432l60230m6192M06535L90041p6387l81233k54541k9982L3101N7479
41559C13023J03338J6375j47388r2424J60845J95196j45044m68030m04586p6223
41549e44918J83633K37169J34041K202K5921K37742L39144P6489k74414k50880
$$ y = [-250532, -65229, 398675, 653172, 605468, 580053, 762142, 937385, 847878, 541126, 223455, -46578, -323111, -526332, -469177, -174950, 39024, -44215, -197866, -42072, 372092, 572824, 329477, -10122, -26216, 209300, 345092, 300957, 267059, 287496, 198511, -59071, -353589, -545877, -515147, -118292, 562334, 1045539, 918608, 435820, 256113, 597069, 1055305, 1268582, 1298728, 1284076, 1179018, 995050, 885474, 820240, 574432, 214202, 168010, 574545, 964586, 888199, 506966, 252425, 222443, 255544, 313023, 416361, 432736, 285348, 192924, 353769, 548965, 403921, -64109, -468695, -544918, -361285, -124116, 9925, 12127, 38048, 275790, 614934, 691423, 417009, 166129]
41539A66129M4849J02261j13282j06925K20905L24289n9850m20248k80907R2783
41529b9996K18903J13630M7062M7475Q2897K99132O30099N94985l0474p15170
41519A258543q30257m56587o6580K06464M31978M01056m5370m68896l12815K19530
41509C37066M30255J65516q1691n0915N024m2319K2704J96524J28197k14772l47634
41498E47955l1390K96099K00008j03674j71257j2419P1852J8799n6680j95002
41488E64291m20043m39905m005N52913O20424J60746k22962j46373P9471K3626
41478G68183k06504k04884P5064K66527J28305j62668k98954k17883r9661r2830
41468d5305j28533j0830L10057N87526N05861R0156k54553k23312N739M1509j73361
$$ y = [166129, 210978, 313239, 199957, 93032, 313937, 638226, 578376, 158128, -122779, -29996, 188907, 302537, 349599, 397074, 479971, 779103, 1409202, 2004187, 1973713, 1258543, 428286, -28301, -94881, 111583, 543561, 944617, 899247, 430351, 117536, 337066, 767321, 932837, 851146, 800231, 805255, 762936, 785640, 982164, 1110361, 895589, 547955, 516565, 812664, 1012672, 908998, 737741, 725322, 797174, 815973, 759293, 564291, 144248, -295657, -299662, 253251, 873675, 1034421, 811459, 665086, 744557, 768183, 561679, 356795, 431859, 698386, 826691, 664023, 365069, 147186, 47525, -45305, -173838, -184668, 125389, 712915, 1218776, 1308932, 1054379, 831067, 836806, 878315, 704954]
41457G04954l18590j65425J45052L17717K06062j15574l97485l47145N7203M03681
41447D90450K79485j37980k80119k1038J35691j27572m20043k62063J84099M23033
41437B63943L44741J86358M5366r6003r4905J03604J58360j85839n17161k86058
41427g7594K53231L69497M7797K421M01023N04116o7994n82535l09954L00462
41417H40470L16298k68349o32860m11908p8728m5478q7147J23460M20126M18462
41407E94346J19244r6052j7375J07625m1771l31408k97573J48228M71075K39780
41397H96119j92911j91249J87474L20626N1473j21847P498j4004m12824o54623
41387a24268k81509L16240N16415L42316J45679r9928n14670p30451l57714K29644
$$ y = [704954, 386364, 220939, 365991, 683708, 889770, 774196, 376711, 29566, 86769, 490450, 769935, 631955, 351836, 330798, 466489, 338917, -81126, -343189, -159090, 263943, 608684, 795042, 840408, 744405, 649500, 753104, 911464, 725625, 208464, -77594, 175637, 545134, 592931, 595352, 996375, 1500491, 1432497, 849962, 540008, 840470, 1156768, 888419, 255559, -156349, -235077, -280555, -367702, -244242, 175884, 594346, 713590, 617538, 600163, 707788, 666017, 334609, 37036, 185264, 656339, 896119, 703208, 511959, 699433, 1020059, 1071532, 949685, 957183, 943179, 530355, -124268, -405777, -89537, 426878, 769194, 914873, 814945, 300275, -430176, -787890, -558246]
41377e58246L39765K7551m3138K85922M64880J89189j71727k52241j67737j07557
41367F661J1386K40167L69249K33655n4094k98722l76384j83587K28800M91550
41357F68681K88282j25565k21639j522K7681k71226m13978j12910K18744J07295
41347A63843k73880m06358j39943K26902L88943L05414J49490J20713K11646J83554
41337I30324n3785j88244K9737K49736j9438n20557n07145O4274L75739Q875m19508
41326d9992k87373J03277J91085J07935K66601M87445L14379j10485k53174q0778
41316F88920j8254j23267l6783K41158K40660j68414m68218k31408K97103N89763
41306A011260M46885L5461l52573m20604o3892L89236M25496m171l65526k33667
$$ y = [-558246, -218481, -190930, -234068, 51854, 516734, 705923, 534196, 281955, 114218, 6661, 18047, 258214, 627463, 861118, 807024, 508302, 131918, -51669, 177131, 668681, 956963, 831398, 609759, 608237, 635918, 364692, -49286, -162196, 56548, 163843, -110037, -516395, -656338, -429436, -40493, 264921, 414411, 535124, 746770, 930324, 876539, 688295, 718032, 967768, 948330, 427773, -79372, -15098, 360641, 369516, -49992, -337365, -234088, -43003, 64932, 331533, 818978, 1133357, 1022872, 769698, 688920, 670666, 547399, 510616, 751774, 992434, 824020, 355802, 124394, 421497, 1011260, 1458145, 1493606, 1141033, 720429, 656537, 1045773, 1471269, 1467098, 1101572, 867905]
41296H67905J81587L98856K79989L3799j69954k97414k98025j44949K0641K1671
41286H94106r3613j20650k6235q377j73950l24197j87571K04244N03895M33830
41276A101482J00551j49619j52616q2667j39114k14902n2641L12669N00174K65647
41266A488964j50598l33994k29033j29660j89243k27804r4637O0986O1811J0580
41256B67372O9068J19588j3490j36694P9029M58302M27296j00953m69173k07066
41246D93279K54540K47443j45462l36274k02180j45209k75037k21198J43171M05570
41236B18643K60894m3311j58445j11173p0074j4209Q3299O3225j37290k69670
41226a78111j07878K15450M17689L95213J81802j51221l78489k12366K68968N83352
$$ y = [867905, 1049492, 1448348, 1728337, 1762136, 1592182, 1294768, 996743, 851794, 872435, 894106, 800493, 679843, 653608, 645231, 471281, 147084, -40487, 163757, 667652, 1101482, 1202033, 1052414, 899798, 817131, 678017, 463115, 410474, 723143, 1223317, 1488964, 1338366, 1004372, 775339, 645679, 456436, 228632, 133995, 194981, 256792, 267372, 336440, 456028, 442538, 305844, 384873, 843175, 1270471, 1169518, 700345, 493279, 747819, 995262, 849800, 513526, 311346, 166137, -108900, -330098, -186927, 218643, 479537, 436226, 277781, 166608, 96534, 82325, 165624, 228849, 91559, -178111, -285989, -70539, 347150, 742363, 924165, 772944, 394455, 182089, 451057, 1034409]
41216A034409M62518J96603J19262J03626j04633l85366m69056m00732l78062
41207A78569l46415j57783N4601O6465j9555O7327L07044M36582L39659Q4267
41197A010761k63761n58329n22400j32404J80362R8975p3341P1827L17933J83791
41187C13414k13709l22020n9846J22614N4172K2233J06165K7973k11714k21403
41177c82121P5953K63783J68185J32695K98271K69201j36401m25157j84946K28878
41167C08341K80000P0291J4323O8730j00539m17506m67421j78977P6898O3340
41157b82520m6028R678K57252M89985M28494o977m58067m07721J10058M07199
41147E01353N1993m65926m19406J01097L72328J16148k08101j84004M7668J76362
$$ y = [1034409, 1496927, 1693530, 1812792, 1916418, 1811785, 1426419, 957363, 556631, 178569, -167846, -325629, -271028, -204563, -224118, -156791, 150253, 586835, 926494, 1010761, 747000, 188671, -333729, -466133, -285771, -186796, -260137, -188310, 129623, 313414, 99705, -222315, -282161, -159547, -105375, -83142, 23023, 50996, -160718, -382121, -306168, -42385, 125800, 258495, 556766, 825967, 689566, 264409, 79463, 308341, 588341, 658632, 672955, 741685, 641146, 223640, -243781, -422758, -345860, -282520, -328548, -318870, -61618, 428367, 856861, 849884, 391817, -15904, 94154, 501353, 553346, 87420, -331986, -230889, 141439, 257587, 49486, -134518, -86850, 89512]
41137H9512J67056J32685R1132K5050l9613j14070k13894k27997n0633J66533
41127B5761J75532M5763Q9884L32788M11943J31216k19003k82168j00967N0870
41117F61619P8557P4718P6568M5439N210K0787Q3957J29467J01158n8738l59084
41106H59658o14398n17550k0226M80427N29433J35445k62200l13720p9849J62711
41096C59731K58741K40883J75498O8242q1199k10340k33472j44821l9546m249
41086C89468j6751p44M3221L6290l7062o4247N7133K47736K86050N2806k88956
41075G04944m15612j85048J75419L01391J15337q6640l0771J60782J33444k02187
41065F71059n13128m52289r5379J68633J41030L8527J45213L83247M21371J75224
$$ y = [89512, 256568, 389253, 480385, 505435, 465822, 351752, 137858, -90139, -140772, 25761, 201293, 247056, 336940, 669728, 1081671, 1212887, 993884, 711716, 610749, 661619, 740176, 814894, 891462, 936901, 942111, 962898, 1046855, 1176322, 1277480, 1218742, 859658, 245260, -272290, -292516, 187911, 717344, 852789, 590589, 276869, 197020, 359731, 618472, 859355, 1034853, 1103095, 1021896, 811556, 578084, 433263, 393717, 389468, 372717, 371973, 415194, 451484, 414422, 350175, 407308, 655044, 941094, 993900, 704944, 289332, 104284, 279703, 581094, 696431, 609791, 579020, 739802, 873246, 671059, 157931, -294358, -389737, -221104, -80074, -41547, 103666, 486913, 908284, 1083508]
41055A083508n2135l1108M0749j11407l17359j60686L27944N81744K41751l39443
41045A263558n58826k85110J20972L15914K37811q662k62913l53010k28809j8194
41035B22731J56434K96935L61941K06079j17054k45313O44K50781R3118k53641
41025I72655k54037Q3412K24805r247j86374l4202J17102m0173k36537j10115
41015E27289J47799J13814j63368k78318j42670n2704j22182j16627O8948J74751
41005A56732Q89k28473j63134J74466M17120L21278J8943k09516k54481j79613
40995E4211k0215K33863M52899L89806K2335l14658l47828k48246l10438m11095
40985d99366k08454J95808L26949J25511O3703K69432K02627l61899o82963r2461
$$ y = [1083508, 1031373, 1000265, 1041014, 929607, 612248, 451562, 779506, 1361250, 1603001, 1263558, 704732, 419622, 540594, 856508, 1094319, 1085657, 822744, 469734, 240925, 222731, 379165, 676100, 1038041, 1244120, 1127066, 881753, 882397, 1133178, 1226296, 972655, 718618, 802030, 1026835, 1017588, 831214, 797012, 914114, 873941, 637404, 527289, 675088, 788902, 625534, 347216, 204546, 151842, 29660, -86967, -18019, 156732, 157621, -70852, -233986, -59520, 357600, 678878, 697821, 488305, 233824, 54211, 33996, 267859, 720758, 1110564, 1132899, 818241, 470413, 222167, -88271, -499366, -707820, -512012, -185063, -59552, 4151, 273583, 476210, 114311, -568652, -661113]
40975f61113P99379Q45578P2790l57244O9016N08444J81109m41081m93260n1320
40965D72298J82367O7294M6550J97313J10321k60642l93118m4869L14853K27408
40955I19775r7983k10886j09558q6138j61007j23808J3351M4993n568P8054K31377
40944D92602J11510k94303m85618j47219L11725L06616n6701j46061K23634N03036
40934H19221K47816k11685k73055P0790K91068J18611j55898k03669r1120l8232
40924E73847m0081L4434J39177R9099r5667k54981k56562j85077j55416j22132
40914b63359L9400L13338N05084M42993J61279j52696l42751l58292k08502K5827
40904A62321J51090J6334k26594k13770J42962M47730L13613r3372k85783j24026
$$ y = [-661113, 138266, 983844, 1056634, 699390, 768406, 1276850, 1457959, 1016878, 523618, 472298, 654665, 721959, 768509, 965822, 1076143, 815501, 422383, 377514, 692367, 919775, 821792, 610906, 501348, 415210, 254203, 130395, 143746, 188739, 183171, 261225, 492602, 604112, 309809, -175809, -323028, -11303, 295313, 238612, 92551, 316185, 819221, 1067037, 855352, 582297, 653087, 944155, 1062766, 906868, 703199, 612079, 573847, 533766, 568200, 707377, 806476, 710809, 455828, 199266, 14189, -141227, -263359, -223959, 89379, 594463, 1037456, 1198735, 1046039, 703288, 344996, 136494, 162321, 313411, 329745, 103151, -110619, 32343, 480073, 793686, 700314, 414531, 290505]
40894B90505Q6744J32374J31876J75458J13646j13763k73011j92080m0370n320
40884C06059M1389K58528M58190L69195R9820m0625n5294j95294m58119n71137
40874B12712m63775l35236k18353P9111M88591N91867K41052j29048j02636J32734
40864D97019J44236p8072k13269j85339k05197l05124k66331n3466P3703J5004
40854e76836N4411M04296P70710O70266R0245m36942m46486m3219K80398K03926
40844I70769j46267m18596m08613j91467K3844R9432N6099J3386M0158N1569r2878
40833b564l49873m42608j71630K70897M52391J84702k59900m36588j36999M59811
40823d32361R01411P71174J09218m71840l71664K29618N10530O7062n29881n27143
$$ y = [290505, 377249, 509623, 641499, 816957, 930603, 816840, 543829, 351749, 311379, 306059, 347448, 605976, 1064166, 1433361, 1533181, 1492556, 1437262, 1241968, 783849, 212712, -251063, -586299, -804652, -725541, -236950, 354917, 595969, 466921, 364285, 497019, 641255, 563183, 349914, 164575, -40622, -345746, -612077, -665543, -591840, -576836, -522425, -118129, 652581, 1322847, 1413092, 976150, 529664, 486445, 766843, 970769, 824502, 405906, -2707, -194174, -170330, -70898, -14799, -1413, 38745, 90314, -2564, -352437, -795045, -966675, -695778, -243387, -58685, -318585, -755173, -892172, -432361, 469050, 1240224, 1349442, 877602, 505938, 735556, 1246086, 1313148, 783267, 256124]
40813B56124l036L56566K68820Q2592N3599r521k28944l20690p4847K21479J95482
40802G97624n7664j89445j43512j00792m1867J97075M80694M37688N0716k18935
40792A211582q4047J23561n6733n04559o54951k83807J84027K45781m6769k12995
40782g8910J6072L92108M93025K12727j72078l33403j91007P8598K31437J54328
40772H02897m8120j53181o0152Q4028O9838r6628k17562j88776r9107k1760R4072
40761A65549K32987K23816Q207j80311j24831L7735N2750j1671R1735K72527J61027
40750I29520k47795m53901j68925K15873J96032j22956k64309j23058j4556p4780
40740a28855q0834Q8996K24180J36693o5932j95461k17884j61774k7019J15018
$$ y = [256124, 253088, 609654, 878474, 961066, 1014665, 1005144, 776200, 455510, 380663, 602142, 797624, 739960, 550515, 407003, 306211, 264344, 461419, 942113, 1379801, 1430517, 1211582, 1127535, 1251096, 1194363, 689804, 34853, -248954, -64927, 180854, 134085, -78910, -62838, 329270, 822295, 1035022, 862944, 529541, 338534, 417132, 648569, 802897, 754777, 601596, 541444, 625472, 695310, 598682, 381120, 192344, 93237, 71477, 165549, 398536, 622352, 630559, 450248, 325417, 363152, 415902, 404231, 495966, 768493, 929520, 681725, 227824, 58899, 274772, 470804, 347848, 83539, -39519, -54075, -128855, -209689, -120693, 103487, 240180, 174248, -21213, -239097, -400871, -427890, -312872]
40730c12872J55475J55316K68627M06788L05684K3607k6438K56895L83135q814
40720A607403n13374m88015K4962L83850K20890k18061n32574n48073k75747J20869
40710b17870L35448K28301O4034J13320J71462q3598m11521k77771K44937M95422
40700F62164K18200j17721j49041r1192j31723m2671K22222K00398l10651p32071
40690b72086n15934K2552K79719K86318L76651L82377k6553m97249l66374K54504
40680g6075O00052M07900J40302N1972j06030l41285k55771J12936J18696m28885
40670B23812p78155l24811M46515O94729L86705J04995Q5145J02148O6328R0356
40660A097767Q1715j49420m11554k95691J37891L25817J659l76414k51527K38891
$$ y = [-312872, -157397, -2081, 266546, 673334, 979018, 1002625, 976187, 1233082, 1616217, 1607403, 1094029, 606014, 630976, 1014826, 1235716, 1017655, 485081, -62992, -338739, -217870, 117578, 345879, 409913, 523233, 694695, 611097, 199576, -78195, 166742, 662164, 880364, 762643, 613602, 522410, 390687, 348016, 570238, 770636, 459985, -272086, -788020, -765468, -485749, -199431, 177220, 559597, 533044, 35795, -330579, -76075, 523977, 931877, 1072179, 1124151, 1018121, 676836, 421065, 534001, 652697, 223812, -554343, -879154, -432639, 262090, 648795, 753790, 838935, 941083, 1007411, 1097767, 1179482, 1030062, 618508, 322817, 460708, 786525, 788184, 411770, 160243, 399134]
40650C99134M18777k4095n75974n05744J85950P14697N02266p6829k31264J75439
40640I82357N27972L74058n1721l09625l09601j98327o4375L2350K9435J2199
40630A024722J08750J71221m9207l59938k90535P6867R3826l67077n40724L6901
40620i5194O74516N46239m2460k39577j0777M3849q9811J14489N39871L91851
40610A832996m60958j087188p97859n2026L58743L39305K30696J09074j07576
40601C65207k58947j61427L2703Q5458M4653N1106L9534n9307q0533R6930K76699
40590D32076K54804J69216K30498L27696K33510J4248j01986j21487k21346l88656
40580H28573m24772k59549k8859J07501N7743j77108m01250l07161J29862M99675
$$ y = [399134, 817911, 793816, 217842, -287902, -101952, 612745, 1115011, 1038182, 806918, 982357, 1510329, 1884387, 1832666, 1523041, 1213440, 1015113, 950738, 983088, 1012523, 1024722, 1133472, 1304693, 1255486, 895548, 605013, 681880, 775706, 408629, -132095, -95194, 579322, 1125561, 1083101, 843524, 832747, 876596, 786785, 901274, 1441145, 1832996, 1372038, 284850, -513009, -565035, -206292, 133013, 363709, 472783, 365207, 106260, -55167, -22464, 62994, 107647, 158753, 198287, 138980, 58447, 155377, 432076, 686880, 856096, 1086594, 1414290, 1647800, 1662048, 1560062, 1438575, 1217229, 828573, 403801, 144252, 115393, 222894, 280637, 103529, -297721, -604882, -475020, 24655]
40570B4655M35661R7012q0173K6442J68049J51988K4904j19645k37580k58034
40560B33279j52840o1717j25175k25428j25709J55486L44052K78157N7369j60095
40550B17379k75913j83829J39389M37095L55416o4993l32960j09723L29763M42509
40540I54133R8746l00363l46082p0512J65628J06617j55599l31132k57193m3621
40530a79378R5559J02140J04213J96806K81872J94639m8531k26676j76320k639
40520C41685O5830K806J9148K21453L95925K89173k480j49001o3626o125j47200
40509I67588k89521j92402K4530M4516j76103l50121k64984k8663J43549K09810
40499H8199K59059K99250K37014O2490o3810J1641K05195K46476Q465k95593l54256
$$ y = [24655, 460316, 557328, 477155, 503597, 671646, 823634, 848538, 728893, 491313, 233279, 80439, 18722, -106453, -331881, -457590, -302104, 41948, 320105, 377474, 217379, -58534, -242363, -102974, 334121, 689537, 624544, 291584, 181861, 511624, 954133, 1052879, 752516, 406434, 335922, 501550, 608167, 452568, 121436, -135757, -179378, -83819, 18321, 122534, 319340, 601212, 795851, 747320, 520644, 344324, 341685, 407515, 410321, 429469, 650922, 1046847, 1336020, 1333540, 1184539, 1120913, 1114788, 967588, 678067, 485665, 510195, 554711, 378608, 28487, -236497, -265160, -121611, 88199, 347258, 646508, 883522, 946012, 882202, 893843, 1099038, 1345514, 1353979, 1058386, 704130]
40488G04130j52805K5106k520r7716p0141J4494l0403j79409k20313q7448N1238
40477d5787P6958P3136J00708M2732j35398j61992J92499O26586N60851m6774
40467A283519n43368m57110j38283j41339l10058p6956M80814O19657Q3512m33899
40457C66489l27974L8355K1430k35183j14879L62528N05239K2206n23491n08192
40447c93472k2911L63253L05135m0351k61350j20830J78925K29581k921q3480
40437A51579K00405M19549J71000k21059k52192j33212l64015o58164k60896O76730
40427b70275J080011N27343j50594k22614l7899j16931j90258J08780L64554O5907
40417A158024m05023l64186L2187J28337q6785q8191J49036J35176j82785l00855
$$ y = [704130, 551325, 576431, 573911, 476195, 406054, 420548, 390145, 210736, -9577, -97025, -45787, 31171, 104307, 205015, 247747, 112349, -49643, 142856, 769442, 1330293, 1283519, 740151, 283041, 144758, 3419, -306639, -383595, 97219, 716876, 800388, 366489, 38515, 76870, 98300, -136883, -251762, 110766, 616005, 638211, 114720, -393472, -416383, -53130, 252005, 211654, -49696, -170526, 8399, 237980, 235059, 151579, 351984, 771533, 942533, 721474, 469282, 336070, -27945, -686109, -947005, -270275, 809736, 1337079, 1186485, 963871, 925972, 809041, 618783, 727563, 1092117, 1158024, 753001, 388815, 421002, 549339, 462554, 374363, 523399, 658575, 475790, 174935]
40407A74935k8116K55915K83324J91373P6068j42320l47265k80225j0980J57745
40397C30454K16788L28670K89423j89778p16211n49150K06758N86544J72965l16413
40387C60050k13302J36590J19745j30771j24888R6997J60910R5988K03470M03715
40377A108504L36908J1032k02152j85235k00633l65521m22878j49853K96847N66713
40367G93732M85556J81066o7001j02499n9871j69956l78128l60058j5665L07238
40357F14414K80678N4237j9489Q0386J07202R974l4524m388p2174k23608k01694
40346E91014L6233J41031j06413l57493j34986M09626N99247J64435l28214k42781
40336G71699K37432M05180O6244k30941o5470K55522K16936j72974n07429n56143
$$ y = [174935, 146819, 402734, 686058, 877431, 953499, 811179, 463914, 183689, 172709, 330454, 547242, 875912, 1165335, 975557, 259346, -289804, -83046, 503498, 676463, 360050, 146748, 283338, 403083, 272312, 147424, 244421, 405331, 501319, 704789, 1108504, 1445412, 1456444, 1254292, 1069057, 868424, 502903, 80025, -69828, 227019, 793732, 1279288, 1460354, 1393353, 1290854, 1230983, 1061027, 682899, 322841, 307176, 614414, 895092, 949329, 929840, 1010226, 1117428, 1127402, 1092878, 1088490, 1016316, 792708, 591014, 627247, 768278, 661865, 304372, 169386, 579012, 1178259, 1342694, 1014480, 771699, 1009131, 1414311, 1480555, 1249614, 1184144, 1439666, 1656602, 1483628, 976199, 420056]
40326D20056l65959j6421L51692M42839J31425k41244k55781J9647K04395J87009
40316H77658J20685r16k65644m45723k29528J82439K81800O2938J9783K65262
40306H68754L32946N2557q0855K21624M44659N9524n92005q01230n19195k49839
40296b63060j46238J13601N75006P57379L56511k26050l47886P2898M80682L78486
40286A751329r6512m10060l46597k39504m00800o10660m69381n2353K04688J84226
40276d85624J80477L08264L20961J34008L9535J86254K80654P5351k09998k36703
40266E93179j5545K17684L12810J91035j56253m45609k47093L76787P39542L70980
40256A937517l24452o07901l37693J5732P8307q7188k34117k03560R449K55453
$$ y = [420056, 54097, 37676, 389368, 832207, 963632, 722388, 466607, 486254, 690649, 877658, 998343, 997427, 731783, 286060, 56532, 238971, 520771, 583709, 603492, 868754, 1201700, 1254257, 1173402, 1395026, 1839685, 1899209, 1307204, 505974, -13221, -263060, -409298, -295697, 279309, 1036688, 1393199, 1167149, 819263, 892161, 1372843, 1751329, 1654817, 1244757, 898160, 658656, 257856, -352804, -822185, -874538, -669850, -485624, -305147, 3117, 324078, 458086, 497621, 683875, 964529, 1039880, 829882, 593179, 577634, 795318, 1108128, 1299163, 1142910, 697301, 450208, 826995, 1566537, 1937517, 1613065, 1005164, 667471, 683203, 761510, 674322, 440205, 236645, 246094, 501547]
40246E01547L49654K82168J86443Q6407q8782k41527j97146p7217j65048l56608
40236B79891k45600J58873L77328K60626J89742K73675J13342k98295k92026L19537
40226A137093O45402L3530p66922o86692K9669L19141j0224k16467j9263Q2552
40216E47819j21682k14571j7805J00771j9009m9866J49717K82230K17275K00617
40206A075496K84080J72647j76619l89762k87160j17108m5282L8962R9367p1583
40196E83038l22320k00891K81170N47365L19841r973q9416o7555q2218Q6690M75363
40185A521094O07280J63845m36884n73683k25255J28708J51063j05886l61607
40176H68675k97640J56262N73244L96833k87357p41235n39299j09872j5698j24515
$$ y = [501547, 851201, 1133369, 1319812, 1406219, 1317437, 1075910, 878764, 801547, 636499, 279891, 34291, 193164, 570492, 831118, 1020860, 1294535, 1407877, 1109582, 817556, 1137093, 1782495, 1816025, 1049103, 362411, 392080, 711221, 700997, 484530, 465267, 547819, 426137, 211566, 193761, 294532, 275523, 225657, 375374, 657604, 874879, 1075496, 1359576, 1532223, 1355604, 965842, 678682, 561574, 516292, 555254, 654621, 583038, 260718, 59827, 340997, 888362, 1208203, 1198230, 1108814, 1041259, 959041, 1045731, 1521094, 2128374, 2292219, 1855335, 1281652, 1056397, 1185105, 1336168, 1230282, 868675, 571035, 727297, 1300541, 1697374, 1410017, 668782, 129483, 19611, 3913, -120602]
40166a20602N4357M88348O01628J12156n12877n94236o3012M52818M15111O5975
40156H99666L3813L18578K25671m64873r18056m00758N32039Q00220L43813k3784
40146A346329k4663j00645k91544j05556L64646L63384j95624m46158k9170K88473
40136A169472M213k29750J54052N46227K28995l39680l36130L7848M2656k68902
40126A009001k92195l9374l495j31310M3805M17206M33842R7854n2050P1506J9793
40115A574583k89689m32845l01712k63980l87994k70730J85762N18740M39892
40106G72027K18321J19529K5396j62268k55716j65445j06855j85917j66493J18033
40096B10612M47727N25893L53492J31021q932o2263j06899k29887l73889l38764
$$ y = [-120602, -66245, 422103, 1023731, 1135887, 623010, 28774, -34238, 418580, 833691, 899666, 933479, 1252057, 1477728, 1012855, 94799, -305959, 226080, 1026300, 1370113, 1346329, 1321666, 1221021, 929477, 823921, 1188567, 1551951, 1356327, 910169, 880999, 1169472, 1173685, 943935, 1097987, 1644214, 1873209, 1533529, 1197399, 1235247, 1277903, 1009001, 716806, 677432, 673937, 542627, 586432, 1003638, 1437480, 1535334, 1483284, 1554790, 1574583, 1284894, 852049, 550337, 286357, -101637, -372367, -186605, 332135, 772027, 990348, 1109877, 1135273, 973005, 717289, 551844, 444989, 259072, 92579, 210612, 658339, 1184232, 1537724, 1668745, 1659813, 1597550, 1490651, 1260764, 886875, 548111]
40086E48111r8915O0139l1322r5988J43171M20161K91885j28721l27997j81124
40076E99400m6179j03034j39751l3257O4179R3807J86888L11847K49998K248j71551
40065A014595j73906j53425j48489m1924J19554J63613J42815K34215L31216J93674
40055A681938n5091j00021l5335j91929m16743k45085J77261J70949l05192m51136
40045B29616M5599L82868n9845o14654l40432M62187P18379K21438j95896n9682
40035G89578J37723p1189l41715j48807L37032N18412K52385k454J24566M24322
40025B019853M10002n4554n67455o24615j70960L39387M22510M3655l97136m94442
40015I26245k09958J47549K66481J40073J5651N4100J31956M1429k04193l81496
$$ y = [548111, 449196, 509335, 478013, 382025, 525196, 945357, 1237242, 1108521, 780524, 599400, 553221, 450187, 310436, 277179, 341358, 435165, 622053, 933900, 1183898, 1186146, 1014595, 840689, 687264, 538775, 496851, 616405, 780018, 922833, 1157048, 1488264, 1681938, 1626847, 1526826, 1491491, 1299562, 882819, 637734, 814995, 985944, 680752, 229616, 275215, 658083, 598238, -16416, -356848, 105339, 823718, 1045156, 849260, 789578, 927301, 856112, 514397, 365590, 702622, 1221034, 1473419, 1470965, 1595531, 2019853, 2429855, 2375301, 1807846, 1183231, 1012271, 1351658, 1774168, 1817823, 1420687, 926245, 716287, 863836, 1130317, 1270390, 1286041, 1340141, 1472097, 1513526, 1309333, 927837]
40005I27837l31052j14211Q1864J17870J3579o0828L7217K23580K77880J60546
39995A334282N8926N6661K018j65890k37997q7630P5655O5162M5502J75365K10548
39984A532602j08201n01198m79650q6951J93351J78796J20299J37459N9151j35131
39974I10527k17778j36959q5788q1418O8170L01644K86399j2968k06460p7621
39964G47748J11226Q3013p2945j53533j24206m027K02448L56128K95046J38449
39954A579347J12087R1800j94270n19791l39810K76771N71070J92368k88939l08524
39944A172109j07963j48790k99874j84790Q0111R5330j31894k33474n8687K02882
39934C84960L42950K82867P1639n3841J36450M39007L57298j30647m24977k11924
$$ y = [927837, 596785, 482574, 564438, 682308, 695887, 635059, 672276, 895856, 1173736, 1334282, 1393208, 1449869, 1451887, 1285997, 1048000, 960370, 1036025, 1101187, 1146689, 1322054, 1532602, 1424401, 923203, 443553, 356602, 549953, 728749, 849048, 986507, 1045658, 910527, 692749, 555790, 470002, 388584, 456754, 758398, 1044797, 1031829, 825369, 747748, 858974, 941987, 869042, 715509, 591303, 587276, 789724, 1145852, 1440898, 1579347, 1691434, 1783234, 1588964, 1069173, 729363, 1006134, 1577204, 1769572, 1480633, 1172109, 1064146, 915356, 615482, 430692, 510803, 606133, 474239, 240765, 182078, 384960, 727910, 1010777, 1082416, 1028575, 1165025, 1604032, 1961330, 1830683, 1405706, 1193782]
39924A193782L6726j08157k93470p1343K04517n4470n73959n48802Q9548N82452
39914D56824N11909K60317J81885O3263l01212n98119m54265k2423K57616K48451
39904F04246J66749J85619K30636J42865q6974k70437k08199O8487L13572L55523
39894A502087K51244J03778q8916k96764l68642k34582k7815J25408K46444L22545
39884A534787K33731R58j66647k16186l20077m49987k98187J41148L80147J65804
39874A005491p5641M7364K18353M275l29915k75206P752j2329k63761j97234K31699
39863C60848M97949M03263K72067K15270l5429m40740n47602k65042m8211p9880
39853C32493L0069M24860N83719J65579l37448l22688K4173J21593p3462j18006
$$ y = [1193782, 1230508, 1122351, 828881, 757538, 962055, 907585, 333626, -215176, -125628, 456824, 968733, 1229050, 1410935, 1474198, 1172986, 574867, 120602, 98179, 355795, 604246, 770995, 956614, 1187250, 1330115, 1243141, 972704, 764505, 832992, 1146564, 1502087, 1753331, 1857109, 1768193, 1471429, 1102787, 868205, 840390, 965798, 1212242, 1534787, 1768518, 1769476, 1602829, 1386643, 1066566, 616579, 318392, 459540, 839687, 1005491, 929850, 977214, 1195567, 1199842, 869927, 594721, 602473, 590144, 326383, 129149, 360848, 858797, 1262060, 1534127, 1749397, 1713968, 1273228, 725626, 460584, 412373, 332493, 362562, 787422, 1371141, 1536720, 1199272, 876584, 900757, 1022350, 948888, 830882]
39843H30882J34617L62885L26979J38129l6838j94301l60820m73970m54714k81937
39833i088l960K49347L28479K09872J1826j60564k72200k57645n0444K37880L57889
39822F41392K17407j8017j51795j06494J39442N01333O58709L15654l03038n64625
39812A329968k25789K07044J67725k11563l64455j03708K10652K34497K0863j79053
39802A086181k24286j29837J1961R5427R6752J10385J91820K13909L8236k01236
39792A289312j97816R3753L26101J93599j52224l02450j20871J31566J78541J7581
39782A457092k00702l53824l30387p9108J90871J32086k10757l00062J39382N81579
39772A026170M01276j48398l08493j7760N1383k98860m34105k7498L06131K9308
$$ y = [830882, 965499, 1328384, 1655363, 1793492, 1756654, 1562353, 1201533, 727563, 272849, -9088, -13048, 236299, 564778, 774650, 786476, 625912, 353712, 96067, 45623, 283503, 641392, 858799, 840782, 688987, 582493, 721935, 1223268, 1881977, 2197631, 1894593, 1329968, 1104179, 1311223, 1478948, 1267385, 902930, 799222, 1009874, 1244371, 1265234, 1086181, 861895, 732058, 744019, 839446, 936198, 1046583, 1238403, 1452312, 1490548, 1289312, 1091496, 1185249, 1511350, 1704949, 1552725, 1250275, 1129404, 1260970, 1439511, 1457092, 1256390, 902566, 572179, 493071, 683942, 816028, 605271, 305209, 444591, 1026170, 1427446, 1279048, 970555, 952795, 1004178, 705318, 271213, 243715, 549846, 579154]
39762E79154m12017l52361M3971K25543K25925L97580N83697L91566J058j11798
39752A572318j0695n6991j04170J70900L76511j07812q55958p53061K59405R38835
39742A429282N44925j94101l73839j58554j11844j64198j1592J22234r0553l65891
39732F25869k34050J70241L75734L28058K93895K82158J18881j06811j68262j02630
39722A583083p5609m2633Q0958J38291j6599k22032k98070l42669l95682j71984
39712B37054M24434Q68681O37985J0868l06424j54404L3232N418o2831m5907m6101
39701A602005p9603m0495M734j01060k32111j07265J91473K57012p893j97631
39691A289166j726L24427K97451j60031n97722n12696R5711O50290N72643l0073
$$ y = [579154, 167137, -185224, -141253, 84290, 310215, 707795, 1291492, 1683058, 1684116, 1572318, 1561623, 1504632, 1400462, 1571362, 1947873, 1840061, 984103, 231042, 490447, 1429282, 1974207, 1780106, 1406267, 1247713, 1135869, 971671, 960079, 1082313, 991760, 625869, 391819, 562060, 937794, 1265852, 1559747, 1841905, 1960786, 1853975, 1685713, 1583083, 1507474, 1464841, 1545799, 1684090, 1667491, 1445459, 1147389, 804720, 409038, 237054, 661488, 1530169, 2168154, 2179022, 1872598, 1718194, 1751426, 1756844, 1694013, 1648106, 1602005, 1522402, 1481907, 1486641, 1385581, 1153470, 1046205, 1237678, 1494690, 1486797, 1289166, 1287440, 1611867, 1909318, 1749287, 1151565, 638869, 734580, 1384870, 1957513, 1927440]
39681A927440m47411k35888K52475M12450J74176p6445j41844j56142j78246o7516
39671A463049J89725L58625K68894N3741j0516J78558M01426K87991k33872o78780
39661B278841m88735J51735M05236q3616o12884m10996K22522L86807o9432m02166
39651A377312j49959K56466K43795j23911m01934l79988j42834J73240M01884
39642A254071L54721O8014j21809K8008L25000L97157J90049o811J706O6035l8168
39631B517973k31296k04827J14811L74511K28268j70703l69702k51187j36835
39622A871013k20495k78367j08535J05824J38682J14560K29774L33835J67014
39613B353305j59882l09338k31090j64020j92860j60625q434J14207R9423n526
$$ y = [1927440, 1480029, 1244141, 1496616, 1909066, 2083242, 2006797, 1864953, 1708811, 1530565, 1463049, 1652774, 2011399, 2280293, 2334034, 2323518, 2502076, 2903502, 3191493, 2957621, 2278841, 1790106, 1941841, 2347077, 2263461, 1650577, 1239581, 1462103, 1848910, 1779478, 1377312, 1227353, 1483819, 1727614, 1603703, 1201769, 821781, 678947, 852187, 1254071, 1608792, 1676806, 1554997, 1583005, 1908005, 2305162, 2495211, 2488400, 2490106, 2556141, 2517973, 2286677, 2081850, 2196661, 2571172, 2799440, 2628737, 2259035, 2007848, 1871013, 1650518, 1372151, 1263616, 1369440, 1508122, 1622682, 1852456, 2186291, 2353305, 2193423, 1884085, 1652995, 1488975, 1296115, 1135490, 1127056, 1241263, 1340686, 1335160]
39603A335160j36666k61515l20765l00979k89927k90222j23975K52599N11773
39594C75483L32866j08359l44594k14989M8372K26084K66336J23290j87707m06477
39584A10305k60556J09548K80512J15106r9229r0480J08212L19844M03919K76754
39574A273935Q277j31020J6323J97958P3788k38976l10493n3063J74447J41965
39564A153141J6958k1509l5162o0919K6445K03365J94621q8728l05245j51817
39554I31150J51675J60546j39545l05721p8357K32973J63816k47721m67126j80974
39544B20716K32029J95148k40077m50619j48208K23482K02041j8096N191K17920
39534D39527K24433l714r0876J04790K73672J44819j52175l14305k19211J7268
$$ y = [1335160, 1198494, 936979, 616214, 315235, 25308, -264914, -388889, -136290, 375483, 708349, 599990, 255396, 40407, 88779, 314863, 581199, 704489, 516782, 110305, -150251, -40703, 239809, 354915, 255686, 165206, 273418, 593262, 997181, 1273935, 1282212, 1151192, 1167515, 1365473, 1439261, 1200285, 889792, 836729, 1011176, 1153141, 1170099, 1148590, 1113428, 1052509, 1078954, 1282319, 1476940, 1388212, 1082967, 931150, 1082825, 1243371, 1103826, 798105, 719748, 952721, 1116537, 868816, 401690, 220716, 452745, 647893, 407816, -42803, -191011, 32471, 234512, 216416, 221607, 439527, 663960, 660246, 569370, 674160, 947832, 1092651, 940476, 626171, 406960, 424228]
39524D24228J87070J81313J14280J65941K56328J15539k13760k92017O7155M33761
39514A439838L78247Q4110o0890j12894l01831m41776k11214K02620L38291J68340
39504A482841O171j00766k80547l37129j2803L96276L78844M5101p9888K6140
39494A524240n9394l24322l34606r0618n629l9035K17651N62901L37416l09833
39484A478771m40017J02501L26566k16391n93198o9006O05179M53956j19586j24589
39474A404186L36441L93201m4521k77761j32822j40545m25475m42801K8279M66599
39464A164781M06302J7960k92402l57304j95198Q3012K41681J57871O5371J99764
39454A491838L29851J04124k70997k62147J37617L82422K29291K2895J3898j8803
$$ y = [424228, 611298, 792611, 906891, 1072832, 1329160, 1444699, 1230939, 938922, 1006077, 1439838, 1818085, 1902195, 1841305, 1728411, 1426580, 984804, 773590, 976210, 1314501, 1482841, 1489012, 1388246, 1107699, 770570, 757767, 1154043, 1532887, 1577988, 1498100, 1524240, 1464846, 1140524, 805918, 715300, 709671, 670636, 888287, 1451188, 1788604, 1478771, 1038754, 1141255, 1467821, 1251430, 658232, 589226, 1194405, 1648361, 1528775, 1404186, 1740627, 2133828, 2089307, 1811546, 1678724, 1538179, 1112704, 669903, 698182, 1164781, 1571083, 1589043, 1296641, 939337, 744139, 827151, 1068832, 1226703, 1292074, 1491838, 1821689, 1925813, 1654816, 1392669, 1530286, 1912708, 2141999, 2164894, 2178792, 2159989]
39444B159989k40569l72255j47331K18661L35189J48760j18891l16480l88526
39435A278547k42517J27175M62848M30202O015m38155m81202p6661L63401L64975
39425A794628o9842m18778k58159J92688L68660J18642j53255j34015j6859p8039
39415A345671j74143k4205K07649R1081l10536l69910J94673P85548P04703J42625
39405B593156j47956J6389R2432k07876m71678l43857r9071r0188j66477p5479
39395A099395L6370k624K3289K39480K62581j41117m56404j91687K05999N6968
39385A132250l31292j54406M48585N66285M5591k96738q2699J24842n3292k47987
39375A151139k01423j86516k36868M8011N62602N73763l4547m19775j66416N4455
$$ y = [2159989, 1919420, 1547165, 1399834, 1618495, 1953684, 2102444, 1983553, 1667073, 1278547, 1036030, 1163205, 1626053, 2056255, 2062270, 1624115, 1142913, 1066252, 1429653, 1794628, 1724786, 1306008, 1047849, 1240537, 1609197, 1727839, 1574584, 1440569, 1423710, 1345671, 1171528, 1147323, 1354972, 1446053, 1135517, 765607, 960280, 1745828, 2450531, 2593156, 2445200, 2461589, 2554021, 2346145, 1874467, 1530610, 1431539, 1341351, 1174874, 1099395, 1135765, 1133141, 1156430, 1395910, 1658491, 1517374, 1060970, 869283, 1075282, 1132250, 800958, 646552, 1095137, 1661422, 1707013, 1410275, 1327576, 1452418, 1399126, 1151139, 949716, 763200, 526332, 574343, 1136945, 1710708, 1676161, 1256386, 1089970, 1144425]
39365A144425k09379l45735J03864M66068J13961l49485j45163K95800J55257
39356A229613k76729j70052L18188L55756o4052j62129K47297N32293L50454J2705
39346B373344k38609m58879n35718k68603J22080K41109J63754K07139K72381
39337A877998Q5682j66222j59978j04667l17944m56086m1621N27974M73904m9921
39327A669119j56920L26401O27318K91146k58300n35172n21432k71769K03235
39318A373626N42092K92418l05061n08239j46383K02336J79761O5653J12078J62724
39308A971005R5175K7437m6926k79047n50280n49310k67119N2331L32473N46434
39298A332173M45149J815k21076J23165M01449o1527p04185n01742L03024N35258
$$ y = [1144425, 935046, 589311, 693175, 1159243, 1273204, 923719, 778556, 1074356, 1229613, 952884, 782832, 1101020, 1456776, 1392724, 1230595, 1477892, 2010185, 2360639, 2373344, 2134735, 1675856, 1140138, 871535, 993615, 1234724, 1398478, 1605617, 1877998, 1963680, 1797458, 1637480, 1532813, 1214869, 758783, 717162, 1245136, 1719040, 1669119, 1512199, 1838600, 2465918, 2757064, 2498764, 1963592, 1442160, 1170391, 1373626, 1915718, 2208136, 1903075, 1394836, 1248453, 1450789, 1630550, 1696203, 1808281, 1971005, 2066180, 2093617, 2046691, 1767644, 1217364, 668054, 400935, 453266, 785739, 1332173, 1777322, 1779137, 1558061, 1681226, 2082675, 2021148, 1316963, 815221, 1118245, 1653503]
39288A653503J1650k57225J50998M81530K45305p3316j12540j89723l54696j10322
39278A445164M55251M77413j96255n39293j7364M76569J53940l45699j36343L90978
39268B164361L31447j82978l17339O6075L61130K70571M6973j12827k17386j95193
39258B214834q764J18369J776j88679k13347q8614P7499K26507K09697l8606j52675
39247B157997K24780O50590L51114m43907o47206j8832M07478K3829m10936j64812
39237B130095K88581L02285J83999L30597K44235m67435r96082n02162L28372
39228A842485K51831n19944o92758m152M67523J32863k90045r3842L56374L74598
39218A824933K6317r2296K35341N82053M33890j66692n96518l70627J94108L71180
$$ y = [1653503, 1665153, 1407928, 1558926, 2040456, 2285761, 2212445, 2099905, 1910182, 1555486, 1445164, 1900415, 2377828, 2181573, 1642280, 1624916, 2101485, 2255425, 1909726, 1773383, 2164361, 2495808, 2312830, 1995491, 2061566, 2422696, 2693267, 2740240, 2627413, 2410027, 2214834, 2206070, 2324439, 2326215, 2137536, 1924189, 1835575, 1913074, 2139581, 2349278, 2310672, 2157997, 2382777, 3033367, 3384481, 2940574, 2293368, 2274536, 2682014, 2705843, 2294907, 2130095, 2418676, 2720961, 2904960, 3235557, 3479792, 3012357, 2016275, 1514113, 1842485, 2094316, 1574372, 881614, 877462, 1344985, 1477848, 1187803, 1093961, 1450335, 1824933, 1851250, 1758954, 1994295, 2576348, 3010238, 2843546, 2247028, 1876401, 2070509, 2441689]
39208B441689N7459j21145J56325M26305K74075k6190j06218j04040k14731k47079
39198B536450r8367o4663k11125r3554L87637N81573J31367l21729j74026J38045
39188B811608k9537l85083k86919J19593K79545K40190L61035M53879J34741l27155
39178C371897l82197j06116M4542K9421M6756k5265k83195l64174q3964M2315
39168B290020l14742n41047r1566M29366K35765k52055j56233L02628K69187j88878
39158A982445k99061j4247P2160l4512J51359M76242L95912J08015J93021L96239
39148C427573P2988m39572l07673K01429J33020l44564k11294M01003K95024n50672
39138B677262p15304K46413R47759M33640l71950l69354M7545L9645k15774j70982
$$ y = [2441689, 2499148, 2378003, 2534328, 2960633, 3234708, 3208518, 3102300, 2998260, 2783529, 2536450, 2438083, 2373420, 2162295, 2068741, 2456378, 3037951, 3169318, 2847589, 2673563, 2811608, 2782071, 2396988, 2110069, 2229662, 2509207, 2749397, 3110432, 3564311, 3699052, 3371897, 2989700, 2883584, 2928126, 2957547, 3004303, 2979038, 2695843, 2331669, 2247705, 2290020, 1975278, 1434231, 1342665, 1772031, 2007796, 1755741, 1599508, 1902136, 2171323, 1982445, 1683384, 1669137, 1741297, 1706785, 1858144, 2334386, 2730298, 2838313, 3031334, 3427573, 3500561, 3060989, 2753316, 2954745, 3087765, 2743201, 2531907, 2932910, 3227934, 2677262, 1961958, 2208371, 3156130, 3589770, 3217820, 2848466, 2896011, 2935656, 2719882, 2548900]
39128B548900R981J1077J24385N38867O86087J65881m33079m65430k48772l34881
39118B603016m81580k22822J66006J64236m5475K3560K45027J78194o7690m7370
39108B515102J98173K45410M3465n3054R7463K74146K92729J78107J3426j15297
39098C689670j19006k0050N2165M0634l1747j82075l38923k39333J68702M23481
39088C443518J60468k05059o5221L35144K64552k35912m21600j41258j7318k27547
39078B889767k01199K21657M18678J42948k267K92396M39437M1863l73737l16267
39068C553276j25324j74090j49803J77955L08274r8278m33807q2561M99534M98774
39058C973950Q598k57307r6404J29413K41033L16746K73842O277k69754l15950
$$ y = [2548900, 2558881, 2569958, 2694343, 3233210, 3919297, 4085178, 3652099, 3186669, 2937897, 2603016, 2121436, 1898614, 2064620, 2228856, 2183381, 2206941, 2451968, 2630162, 2562472, 2515102, 2713275, 2958685, 3002150, 2949096, 3046559, 3320705, 3613434, 3791541, 3804967, 3689670, 3570664, 3550614, 3602779, 3643413, 3611666, 3429591, 3090668, 2851335, 3020037, 3443518, 3603986, 3398927, 3333706, 3668850, 3933402, 3697490, 3275890, 3134632, 3117314, 2889767, 2688568, 2910225, 3328903, 3471851, 3469584, 3761980, 4201417, 4243280, 3869543, 3553276, 3427952, 3253862, 3104059, 3282014, 3590288, 3492010, 3058203, 2975642, 3475176, 3973950, 3982548, 3725241, 3628837, 3758250, 3999283, 4316029, 4589871, 4596148, 4326394, 4010444]
39048D010444k74518l39090l33210n5109K69920L15866J52109L1991k7863j16918
39038C633622j72154j48468j54139j86373o8946J60653J99822l150j12670L9379
39028C187576K10380K17148J87983K12746K10506K26416L67022M36294J97381
39019E453452p1492M6978K90114P6449m30546n59631l35657l61681n47618k10331
39009C350037M78930N23401j73842n24445p3118L32995J75006P6960L68279L48271
38999D882474k20331l79753L07545P54794J60515n43356k87453L45550K76922
38990E296907k24777k65387M5245P9123m468K20328L64838l7136m23614j10025
38980D941034L95360K53561k13186j93146J04244m3196m20016k85358K26984M05903
$$ y = [4010444, 3735926, 3396836, 3063626, 3008517, 3278437, 3594303, 3746412, 3778403, 3750540, 3633622, 3461468, 3313000, 3158861, 2972488, 2903542, 3064195, 3264017, 3260867, 3148197, 3187576, 3397956, 3615104, 3803087, 4015833, 4226339, 4452755, 4819777, 5256071, 5453452, 5381960, 5428938, 5719052, 5795501, 5364955, 4805324, 4469667, 4107986, 3560368, 3350037, 3828967, 4352368, 4178526, 3654081, 3580963, 3913958, 4088964, 4165924, 4534203, 4882474, 4662143, 4282390, 4589935, 5344729, 5505244, 4961888, 4674435, 5019985, 5296907, 5072130, 4806743, 4851988, 4931111, 4926643, 5146971, 5511809, 5474673, 5051059, 4941034, 5336394, 5589955, 5376769, 5183623, 5287867, 5244671, 4824655, 4539297, 4766281, 5172184]
38970E172184K43165K10529J95870j51222m52892j62028L35453L16272k6370m1438
38960E639523J55125N3068j58228k7760J42162r9102k74198K46445R17854P76991
38950G371880O1277k43370l9004K2813r8684L5334K14539o7104m48764k19112
38940F589805L21919L45669J4579J38710N89717M92346j53652m44024j17415J65780
38930G943434R0571L3846J23747M8798j57781r5866K36459M27674K75330j85076
38920H741136q90151j404523j016305J36484Q52282N53834J90559N50001Q80176
38911H593493L86459j71947J34851O20088K42122m35198l18833J86408Q2819k41780
38901I078482J22134O53265L13678l96389l08363K77024L26071J09639M45152
$$ y = [5172184, 5415349, 5625878, 5821748, 5670526, 5217634, 5055606, 5391059, 5707331, 5680961, 5639523, 5794648, 5847716, 5689488, 5661728, 5803890, 5704788, 5430590, 5677035, 6594889, 7371880, 7433157, 7189787, 7150783, 7173596, 7074912, 7110246, 7324785, 7257681, 6808917, 6589805, 6911724, 7257393, 7271972, 7410682, 8000399, 8492745, 8339093, 7895069, 7777654, 7943434, 8034005, 8067851, 8191598, 8240396, 8082615, 7986749, 8223208, 8650882, 8926212, 8741136, 7850985, 6446462, 5430157, 5566641, 6418923, 6972757, 7163316, 7713317, 8593493, 8979952, 8808005, 8942856, 9562944, 9805066, 9369868, 9051035, 9237443, 9320262, 9078482, 9200616, 9853881, 10167559, 9771170, 9462807, 9739831, 10065902, 10175541, 10620693]
38892A0620693P92799K66492l81019m4088M61860j57318j005585m56779P09601
38883A0806656N74084l75071j21739J093971J191513P6173l09257L74383M88229
38874A3798942k66458l87030L90246O74298K39926L00079Q49846O69249k4186
38865A6244912J16953P54946M17352m22548n5516J052853J014217K19994N69192
38856A9912355J502425Q73954o55637m75311J063489J221191Q3076K56421J550193
38847B5332156J268599k14028J62153K038390J932527l5186j07632J897513K172417
38838C4446909M63547P03101L052525L178781Q83088J013782L967287M386282
38830E2095302J594253J412369M709536M996829J086767K57623M260533N428688
$$ y = [10620693, 11413492, 11679984, 11298965, 11254877, 11716737, 11559419, 10553834, 10097055, 10806656, 11380740, 11005669, 10883930, 11977901, 13169414, 13245587, 12936330, 13310713, 13798942, 13532484, 13145454, 13535700, 14209998, 14449924, 14750003, 15599849, 16269098, 16244912, 16361865, 17116811, 17534163, 17111615, 17056099, 18108952, 19123169, 19343163, 19912355, 21414780, 22288734, 21633097, 21157786, 22221275, 23442466, 23525542, 23781963, 25332156, 26600755, 26386727, 26548880, 28587270, 30519797, 30484611, 30376979, 32274492, 34446909, 34910456, 35613557, 38666082, 41844863, 42727951, 43741733, 47709020, 52095302, 53689555, 55101924, 59811460, 64808289, 65895056, 66152679, 70413212, 75841900]
38822G5841900K402232M460550J2566303J4036103P130585R329074K2406165J2225462
38814A60398374m5181039j11769785j20843606o1640990O179171K9611300J8656958
38807a24589617J1251651J5843844J5559951O813890K370994N122529N239466
38800f2387292P21853q7115M196343N596954K094395M86037K977385L942850J446043
38791d1012547L74264K362974K970420P92135M0967K072258K857441R04999j36740
38782b8773829J232788J790467K92702j41730J558628K117794K37344q52916N17141
38773b2021611J506951L21647n90231N48845J591063P47593k38053K41100P59527
38764a7133169N8036m71388K32472P72915K24469J174Q63686J170970K7183q12123
$$ y = [75841900, 78244132, 82704682, 95270985, 109307088, 116437673, 125766747, 148172912, 160398374, 115217335, 3447550, -117396056, -179037046, -172857875, -143246575, -124589617, -113337966, -97494122, -81934171, -75120281, -72749287, -67626758, -62387292, -61665439, -61752554, -57556211, -51959257, -49864862, -49378825, -46401440, -42458590, -41012547, -40638283, -38275309, -35304889, -34512754, -34471787, -32399529, -29542088, -28637089, -28773829, -27541041, -25750574, -25457872, -25599602, -24040974, -21923180, -21685836, -22538752, -22021611, -20514660, -20193013, -20783244, -20234399, -18643336, -17895743, -18133796, -17892696, -17133169, -17075133, -17546521, -17314049, -16541134, -16316665, -16315491, -15451805, -14280835, -14253652, -15065775]
38754a5065775p3179Q17538M92495n0470K99353P15954L70129P5348M14856M66748
38744a1537003j73280l43673L79784O28578k02354o81134K7420N98343M9942m79620
38734a1732997K5741O19105L40808l8778K46953M35773o9582l66058J56726N38412
38724i843897J46652k4120O46056J007452K36042n35662k43976K45136p4331m29608
38714h870256J28841P93401M66464k16956r1275N23352O56487M15488L22660J9556
38704e852238q41992j445357j025584k81827j90511l80735n9178M21973L32206
38695i323243R354J49751M49096K77682l2825J46453M80170K86688k04812l25501
38685h087187j03612M9345J59664L19481J98999k44275l54754J25817M36007Q5137
$$ y = [-15065775, -15138954, -14321416, -13828921, -13879391, -13580038, -12864084, -12493955, -12418607, -12003751, -11537003, -11710283, -12053956, -11674172, -11045594, -11247948, -11929082, -11901662, -11303319, -11253377, -11732997, -11707256, -11088151, -10747343, -10786121, -10539168, -10103395, -10172977, -10539035, -10382309, -9843897, -9697245, -9721365, -9075309, -8067857, -7831815, -8367477, -8611453, -8366317, -8440648, -8870256, -8741415, -7948014, -7481550, -7698506, -7789781, -7266429, -6609942, -6194454, -5871794, -5852238, -6694230, -8139587, -9165171, -9446998, -9637509, -10018244, -10077422, -9655449, -9323243, -9313889, -9164138, -8715042, -8437360, -8470185, -8323732, -7843562, -7556874, -7761686, -8087187, -8190799, -8141454, -7981790, -7662309, -7463310, -7707585, -8062339, -7936522, -7500515, -7415378]
38675g415378k11069K09313P58246O57448K37585J47714J82181o2000k37770R078
38665e724652K03434o2908k75292M679K31129n0891k38768J63585M76289R3145
38655e180250k76885J06748N47212J33352n47877m39186J16938J24922k07493
38646e622519j9097M17604J66561n45393o42844p0428K30894L1996n608K55000
38636e803834K78354Q3804K45598O44369N17634j66806n96000m60223k71298k36718
38626e765120M7351N88275P41855K62021k66674l32301j17410J767k9616r2201
38616d962053o9529J66674N42483O63203L20492j06603j99080j27145k32599l61683
38606d365840j94982J19120K48176K27251J78157p1600n07112n83880k6198N54371
$$ y = [-7415378, -7626447, -7417134, -6658888, -6001440, -5763855, -5616141, -5433960, -5495960, -5733730, -5724652, -5521218, -5584126, -5859418, -5854739, -5623610, -5674501, -5913269, -5749684, -5273395, -5180250, -5457135, -5350387, -4803175, -4669823, -5217700, -5656886, -5539948, -5415026, -5622519, -5641616, -5224012, -5057451, -5602844, -6245688, -6316116, -6085222, -6053226, -6058834, -5803834, -5525480, -5441676, -5196078, -4551709, -4034075, -4200881, -4796881, -5257104, -5528402, -5765120, -5717769, -5129494, -4387639, -4125618, -4392292, -4724593, -4842003, -4840236, -4869852, -4962053, -5031582, -4864908, -4322425, -3659222, -3338730, -3445333, -3644413, -3771558, -4004157, -4365840, -4560822, -4441702, -4193526, -3966275, -3788118, -3859718, -4366830, -4950710, -4976908, -4422537]
38596d422537N21390J47354p826k8314j82025j94450J49492L37576j0602l00787
38586c990729K0433L43603n3657n57662j72780O66202P18777k6638m56588k28815
38576c737854n7156j97943j27679K10344K10882j86080l16607K3118L20124L53688
38566c505163L84228L24394j51745o63667m63994K25879M03805j07845m42928
38557c997036j98148N9164j2427j5013K35165L43512J93814J46897K00701j4457
38547c057828l04415j10486K83505K5076o78747o32039L26449Q55559K18569n74867
38537c649224m77888N8165J55181l4536N2534K42725J08494j12339Q93K27523
38527c428472J57928n2160p2950l9649j72494k48722k9544K43547K68118J41949
$$ y = [-4422537, -3901147, -3753793, -3761619, -3789933, -3971958, -4166408, -4016916, -3679340, -3689942, -3990729, -3970296, -3626693, -3680350, -4238012, -4410792, -3744590, -3025813, -3052451, -3509039, -3737854, -3795010, -3992953, -4120632, -3910288, -3699406, -3885486, -4202093, -4178975, -3858851, -3505163, -3120935, -2796541, -2948286, -3611953, -4075947, -3850068, -3446263, -3554108, -3997036, -4195184, -4136020, -4148447, -4163460, -3928295, -3584783, -3390969, -3244072, -3043371, -3057828, -3362243, -3472729, -3189224, -3164148, -3842895, -4474934, -4148485, -3292926, -3074357, -3649224, -4127112, -4068947, -3913766, -3948302, -3895768, -3653043, -3544549, -3656888, -3655995, -3428472, -3270544, -3322704, -3395654, -3435303, -3607797, -3856519, -3886063, -3642516, -3374398, -3232449]
38517c232449K9772j09038j65420J07709M55647K65208l40498m53539J53181N14220
38507b775207J9311n50430l23185K79008M02952J79538K13815L39968K5548m69576
38497b658258m70140r0426J3481j42230L3278N07601N65135Q998m86918m03972
38487c123451j6677J97640J79920J06358N5206N0827J14102J62422R3257m6126
38477b226522j79124l55889n40694m57420R651M63040M40075N9688j81418j21942
38467c090555j6382N774J06034L43542N02602M06838J49702n9111j10709m5988
38457a808253j1797j35307l43141l83872j30945K28825L99252K76661k783k04030
38447b115390j59493P1708K19706J23488m0459m3908K2232l7860j03205N3945
$$ y = [-3232449, -3202677, -3311715, -3477135, -3369426, -2913779, -2648571, -2989069, -3442608, -3289427, -2775207, -2755896, -3306326, -3629511, -3350503, -2947551, -2768013, -2554198, -2214230, -2188682, -2658258, -3128398, -3218824, -3205343, -3347573, -3314295, -2806694, -2241559, -2232561, -2719479, -3123451, -3140128, -2942488, -2762568, -2656210, -2601004, -2550177, -2436075, -2273653, -2180396, -2226522, -2405646, -2761535, -3302229, -3759649, -3749998, -3286958, -2846883, -2787195, -2968613, -3090555, -3106937, -3101163, -2995129, -2651587, -2148985, -1742147, -1592445, -1651556, -1762265, -1808253, -1820050, -1955357, -2298498, -2682370, -2813315, -2584490, -2185238, -1908577, -1911360, -2115390, -2274883, -2203175, -1983469, -1859981, -1900440, -1944348, -1922116, -1959976, -2063181, -2009236]
38437b009236K60922J48342k05035l72203k84785k44588k42100M7957N13020N86252
38427a801454J76460j15538K6185J70658p550j54013L0164J61400j57417o00622
38417b271727o30461k90227N0766L24645N98516O52928K82450k37917m54667l04562
38407b280256m4607J38863J72465L7659r1109K9426K78901K69357O162p1845J26538
38396a428446J51769j65851l90223k79989j90552l07359k46378J26139K72091
38387b458799o7693k98855K859K82268k2133m39969k74719J97043K68201J6745
38377b795052K8859L14583M07326K26608L5405j40883l30007k49304J59675L17918
38367b024872j13226m98190k11118K59803J63046j84320m2929L41600K52217n0102
$$ y = [-2009236, -1748314, -1599972, -1805007, -2177210, -2461995, -2706583, -2948683, -2900726, -2387706, -1801454, -1624994, -1740532, -1714347, -1543689, -1551239, -1705252, -1675088, -1513688, -1671105, -2271727, -2902188, -3192415, -3141649, -2817004, -2218488, -1565560, -1283110, -1521027, -1975694, -2280256, -2324863, -2186000, -2013535, -1975876, -2066985, -2037559, -1758658, -1489301, -1483139, -1554984, -1428446, -1276677, -1442528, -1832751, -2112740, -2303292, -2610651, -2857029, -2730890, -2458799, -2526492, -2825347, -2822488, -2540220, -2562353, -3002322, -3277041, -3079998, -2811797, -2795052, -2766193, -2451610, -2044284, -1817676, -1782271, -1923154, -2253161, -2502465, -2342790, -2024872, -2138098, -2636288, -2847406, -2587603, -2424557, -2608877, -2651806, -2310206, -2057989, -2108091]
38357b108091K07719P25441N07173l23719o15015j15873K00690q1665k27182J24005
38347a706517K88334q5832l15253J5644K65049m8838l47065p9104K75807J20729
38337a617046k05175j32343J14916M8466j48994n3688J45279K6751k33793j69913
38327b225540J55701L09496K01106M7682j11703l04732k86031J17967N15866L61309
38317a218879k39200o09561l65028J87479N02757L66190k64k22426j52545J181
38307a750296j5731j46044j66265p1957o729P2821K50464K83954r0440n50895
38297b191118m99659J0176L22766K22860J91752M48150N26625J50928k15494j48477
38287a181491M9011o1991l33889m09199l25053k42935m0913L18184M52587J23793
$$ y = [-2108091, -1900372, -1174931, -667758, -991477, -1606492, -1722365, -1521675, -1603340, -1830522, -1706517, -1418183, -1504015, -1819268, -1803624, -1538575, -1587413, -1934478, -2013582, -1737775, -1617046, -1822221, -1954564, -1839648, -1791182, -1940176, -1993864, -1848585, -1821834, -2055627, -2225540, -2069839, -1760343, -1559237, -1511555, -1623258, -1927990, -2214021, -2096054, -1580188, -1218879, -1458079, -2067640, -2432668, -2245189, -1742432, -1376242, -1376506, -1598932, -1751477, -1750296, -1766027, -1912071, -2078336, -2150293, -2157022, -2084201, -1833737, -1549783, -1640223, -2191118, -2690777, -2680601, -2357835, -2134975, -1943223, -1495073, -968448, -817520, -1033014, -1181491, -1132480, -1194471, -1528360, -1937559, -2262612, -2505547, -2546460, -2228276, -1775689, -1651896]
38277a651896k59402k20282O7633J58829O9987P6850R4592j31916m28189l68081
38267b591875M7688L83995L82695J80555j7610j33582j31958j3450J45582K83022
38257a464938L59288K47980r2506l17358k6232N01006M84246k06955p33588m95759
38247a744816J2148Q6331j08193n5470Q8605j30273m60499k69985L10631N13688
38237a757833J84087J222L12494N72245K51858l53701o24422m50058j75391k7487
38227b066986M2463J16426J92076K54591L06831L31006K66686M5715k82367m64204
38217a257763k63562J62411L41246P9134k69166l04919r4142N7413O4836J6601
38207a467911q1019j99449j55888R5533K62906J28214p8916o6712J7065j17343
$$ y = [-1651896, -1911298, -2131580, -2063947, -1905118, -1835131, -1758281, -1663689, -1795605, -2223794, -2591875, -2544187, -2160192, -1777497, -1596942, -1614552, -1748134, -1880092, -1893542, -1747960, -1464938, -1105650, -857670, -950176, -1267534, -1293766, -792760, -308514, -515469, -1249057, -1744816, -1732668, -1646337, -1754530, -1810000, -1721395, -1851668, -2312167, -2582152, -2271521, -1757833, -1573746, -1572524, -1260030, -687785, -435927, -789628, -1414050, -1864108, -2039499, -2066986, -2024523, -1908097, -1716021, -1461430, -1154599, -823593, -556907, -511192, -793559, -1257763, -1521325, -1358914, -1017668, -938534, -1207700, -1512619, -1606761, -1549348, -1484512, -1467911, -1548930, -1748379, -1904267, -1808734, -1545828, -1417614, -1496530, -1563242, -1546177, -1663520]
38197a663520l28395k39596J28447L73955K82265r724l18514n06938l86588P3540
38187b595068N15585N31810J67554k06725l72604l06898J1496M31834N09856M7544
38177a265616m40781l35262J81190M04265J70379k3733O0996P5316j89410l86449
38167a749105k05068J20912K08756P3689m282Q6684K11859J84535p0015m01303
38157a543338m82289j65079K55336L70694J88183N5569J30099K30709J70950n1849
38147h41015l35913m82941k71344J82835L57752o81l97518k69074J31073J58160
38137a768666j37789j32165K54709M14894J13686j52331p1969J4448j19601j27142
38127a711926J85810L79135J32646j38107Q489K49044M9592m06953n19689k18724
$$ y = [-1663520, -1991915, -2231511, -2103064, -1729109, -1446844, -1456568, -1775082, -2282020, -2668608, -2595068, -2079483, -1547673, -1380119, -1586844, -1959448, -2266346, -2254850, -1823016, -1313160, -1265616, -1706397, -2041659, -1860469, -1456204, -1285825, -1309558, -1248562, -1173246, -1362656, -1749105, -1954173, -1833261, -1624505, -1550816, -1555098, -1468414, -1256555, -1072020, -1142035, -1543338, -2025627, -2190706, -1935370, -1564676, -1376493, -1320924, -1190825, -960116, -789166, -841015, -1176928, -1659869, -1931213, -1748378, -1390626, -1391307, -1788825, -2057899, -1926826, -1768666, -1906455, -2038620, -1783911, -1369017, -1255331, -1407662, -1479631, -1465183, -1584784, -1711926, -1526116, -1146981, -1014335, -1152442, -1143953, -894909, -845317, -1252270, -1771959, -1990683]
38117a990683L7181N4437Q1918K29760K48487k3132l63192m34649j51957K45647
38107b066183L78794P6297l53242l68732J37452O26630N60367N3908l45433l43326
38097a643468r8610J19755J99602J63119Q5768L4646N715k5992j226J21487J82833
38086h56371l630k85586k95043J1169K80314L04385K35312J56744r1532m65718
38076a009956n77921k88363J5837N1336P7735L24388M71192K09681j14462k9207
38066h69740K31733R2465l92471o13750l50692Q017J57897J92922K10284J56633
38056a176702J08865J97405K35101m5693l83877k37147K78489L82299j96403p03293
38046a540956m33431K32805M11710m0722m59097l65061J7780K40419J79920O498
$$ y = [-1990683, -1953502, -1899065, -1817147, -1587387, -1338900, -1362032, -1725224, -2159873, -2311830, -2066183, -1687389, -1611092, -1964334, -2333066, -2195614, -1568984, -1008617, -954709, -1300142, -1643468, -1742078, -1622323, -1422721, -1259602, -1173834, -1139188, -1133473, -1159465, -1160691, -1039204, -856371, -860001, -1145587, -1440630, -1429461, -1149147, -844762, -609450, -452706, -544238, -1009956, -1587877, -1876240, -1860403, -1809067, -1731332, -1406944, -935752, -726071, -840533, -869740, -638007, -545542, -938013, -1551763, -1902455, -1894438, -1736541, -1543619, -1333335, -1176702, -1067837, -870432, -635331, -681024, -1064901, -1302048, -1023559, -641260, -837663, -1540956, -1974387, -1741582, -1329872, -1370594, -1829691, -2194752, -2176972, -1936553, -1756633, -1750135]
38036a750135j10923j16964j9063J59224L67151M75564L12349j07555m25654k63297
38026a479303K40810M99039K20812k03716k88024j14438o6858j46926m0559K29262
38016a149901K53568p6874l33688k10269J2108l5161k08121j56707M1848M3295
38006a819902j17442o6900K38225M09672K85901J77133K64807K64645o439k04561
37996e74861k8607J91784J3895l27911k82633O0056Q4275l08516n04369j75875
37986a852762K12161J98973K8688J28399L58183K89488o9794l20234k70967p9174
37976a377039R3972K03161J76254k4501k36181k39483l3380K03626L32216K91442
37966f09913Q3099j23142p7269J68935K14362j21290m58264l95030j03444O021
$$ y = [-1750135, -1861058, -1978022, -1997085, -1837861, -1470710, -995146, -682797, -790352, -1216006, -1479303, -1238493, -739454, -518642, -722358, -1010382, -1124820, -1191678, -1338604, -1379163, -1149901, -896333, -973207, -1306895, -1517164, -1505056, -1540217, -1748338, -1905045, -1863197, -1819902, -1937344, -2004244, -1766019, -1356347, -1070446, -893313, -628506, -363861, -370300, -574861, -603468, -411684, -397789, -725700, -1008333, -948277, -864002, -1172518, -1676887, -1852762, -1640601, -1441628, -1412940, -1284541, -926358, -636870, -706664, -1026898, -1297865, -1377039, -1283067, -1079906, -903652, -928153, -1164334, -1403817, -1437197, -1233571, -901355, -609913, -526814, -649956, -727225, -558290, -343928, -465218, -923482, -1318512, -1421956, -1415935]
37956a415935l9107Q7576L65412M47540K63671R1742L0490j01187k91012k58831
37946h19641K1676J89263O2484p3907L5363K10374J82848K4590o2027j18818k74149
37935f21944l91554k19324J63240L41424O5816m09626n84682k68895J93993L27645
37925a403907J21410L7312L22726N79144L15720k62903m77492j49500J45643o4534
37915h36381m97526n83174k23068K37669N30803O11931M67311J28031j92372k60734
37905f17510j03631P1572J66321K03970J46169n3520k53496k39005m9281M2416
37895f85995p6204k00254j35110K3124Q2787O9941J31683K08986P5152k50763
37885g56653l90494r4338L37965M02967Q2375j47305k5677J41460J7263k28542
$$ y = [-1415935, -1455042, -1367466, -1002054, -554514, -290843, -199101, -168611, -269798, -560810, -819641, -797965, -608702, -546218, -620125, -584762, -374388, -191540, -166950, -228977, -347795, -621944, -1013498, -1232822, -1069582, -728158, -662342, -1071968, -1656650, -1925545, -1731552, -1403907, -1282497, -1245185, -922459, -343315, -27595, -290498, -767990, -917490, -771847, -836381, -1333907, -1917081, -2140149, -1902480, -1371677, -759746, -292435, -164404, -356776, -617510, -721141, -649569, -483248, -279278, -133109, -186629, -440125, -679130, -728411, -685995, -762199, -962453, -1097563, -1074439, -991652, -921711, -790028, -581042, -505890, -756653, -1147147, -1241485, -903520, -500553, -418178, -565483, -591160, -449700, -432437, -660979]
37875f60979k33438m1921Q953j26492j58681J0004J16503j5810j87876j21811
37865a411548J76855M62999N00003K30847j41283k77910j02773K5619j86764m41471
37855a165426k41957K73605M48392R8845k24378j54470n0217k63806m64077k20540
37845a964029K01910K60218L3448M3744L44960M50910J53530j85466k46186j53552
37835a060513j37752j99871k50250k46406j02228K18320M60968K99228j27895
37826a146399k95409m5930J58109l5330l01828j72041J93881K50524n5851j75582
37816a625856K04653O52204N71517K1232l88238l12404l0667P3364M0962J02967
37806f90266J75290l655l10683k76404K04553O14946M85335j9446m30995n51575
$$ y = [-660979, -894417, -936338, -927385, -1053877, -1212558, -1202554, -1086051, -1101861, -1289737, -1411548, -1234693, -771694, -271691, -40844, -182127, -460037, -562810, -537191, -723955, -1165426, -1407383, -1133778, -685386, -586541, -810919, -965389, -1015606, -1279412, -1743489, -1964029, -1762119, -1501901, -1468453, -1424709, -1079749, -628839, -475309, -660775, -906961, -1060513, -1198265, -1398136, -1648386, -1894792, -1997020, -1778700, -1317732, -1018504, -1146399, -1441808, -1487738, -1329629, -1364959, -1666787, -1838828, -1644947, -1394423, -1450274, -1625856, -1421203, -768999, -197482, -176250, -564488, -876892, -907559, -834195, -793233, -690266, -514976, -518631, -829314, -1105718, -901165, -286219, 199116, 179670, -251325, -802900]
37796h02900m00446L1538N40309N75634o3426o47676l31614N60689Q48772J66326
37786D77206n12869l25678K86444L85651o7881l54093j86363q724j61909l96391
37776h64607l47617n5198J68993J29535j12758l19274k54145O2653K99528J80266
37766a112624j27233j90766J21931M65500M53222J06959k16066k57113j21968
37757h78158j02243k76983l99927k57693m282O7958j0174L3960K08797K37037
37747a381708R5541J07179L22024L15123q9412l98426k03514J07553k2723l66929
37737a515292k98858J12717K01594j64381l59974l2234L80753M03312J69195J9325
37727a083843j9756m6744j9468M3678m625r2820N0889L40859L10360j12948l84902
$$ y = [-802900, -1203346, -1171808, -631499, -55865, -119291, -766967, -1098581, -537892, 310880, 477206, -35663, -361341, -74897, 310754, 242873, -111220, -297583, -306307, -468216, -864607, -1212224, -1267422, -1098429, -968894, -1081652, -1400926, -1655071, -1592418, -1292890, -1112624, -1239857, -1430623, -1308692, -843192, -389970, -283011, -499077, -756190, -878158, -980401, -1257384, -1657311, -1915004, -1919286, -1851328, -1861502, -1827542, -1618745, -1381708, -1286167, -1178988, -856964, -541841, -631253, -1029679, -1233193, -1125640, -1148363, -1515292, -1814150, -1701433, -1499839, -1664220, -2024194, -2056428, -1675675, -1272363, -1103168, -1083843, -1103599, -1150343, -1169811, -1126133, -1130758, -1223578, -1172689, -831830, -521470, -634418, -1019320]
37716a019320k26442j03058l63158n36739j45020L44651K00728l08672k59644
37707b416674M63077R67318O90094R7416j79316j79931k26441k67688p1492K64825
37697h58812M07446K34605p3552k88817l17458k17681j16776m7086Q8892K71859
37687i17380K45975q8358l33500o1812M65569N55180Q7210k79933q0753L02374
37677a05428K64146j60404m47782l32585k4845J66473J14763j24285l46755l05009
37667a301711K6916L48061L33792o539l58255m13042j13123K99748M53265K02029
37657e28859j74601k89495j31588j3438p2213j17985K727J98745L34323L43436
37647d48948J30477l02769o27621m98074j14797Q13j57811p1812L35255M34895
$$ y = [-1019320, -1245762, -1348820, -1711978, -2248717, -2393737, -2049086, -1848358, -2157030, -2416674, -1953597, -986279, -296185, -198769, -378085, -558016, -784457, -1052145, -1123637, -858812, -451366, -216761, -290313, -579130, -896588, -1114269, -1231045, -1278131, -1189239, -917380, -671405, -759763, -1093263, -1155075, -689506, -134326, -47116, -327049, -407802, -105428, 158718, -1686, -449468, -782053, -806898, -640425, -525662, -649947, -996702, -1301711, -1274795, -926734, -592942, -599481, -957736, -1370778, -1483901, -1184153, -730888, -528859, -703460, -992955, -1124543, -1137981, -1210194, -1328179, -1325452, -1126707, -792384, -448948, -318471, -621240, -1248861, -1746935, -1861732, -1860919, -2018730, -2090542, -1755287, -1320392]
37637a320392m9031m35724j10066M52042M04557j56528m05471o7385L15586L26359
37627a046053J44944K5265o4896j51369j13166K4894N8942m9178j39497j72291
37617a482405k12910j39004K03057N61879M76877l2478m24372l69598j02970N8602
37607a463322J23613K04845K66018K53707J90858M8266j87785l03372p5323K82311
37597f60184L14801J6467j46711Q423J29961N082o6182J31983K70703K2432l37500
37586c10725l39407m4925J00663l9692j92256j74343j00098p6988j3695J78858
37576a012608L74215L30781o454l44304k97108J03007L30312M4333l48964k36451
37566a063241K34096L24157j25011l96379l4802M13059K86256j40681j59713K00641
$$ y = [-1320392, -1369423, -1805147, -1915213, -1463171, -1058614, -1215142, -1620613, -1687998, -1372412, -1046053, -901109, -875844, -940740, -1092109, -1205275, -1180381, -1121439, -1170617, -1310114, -1482405, -1695315, -1834319, -1631262, -1069383, -592506, -624984, -1049356, -1418954, -1521924, -1463322, -1339709, -1134864, -868846, -615139, -424281, -376015, -563800, -867172, -942495, -660184, -345383, -328916, -475627, -467204, -337243, -332161, -398343, -266360, 4343, 26775, -310725, -650132, -695057, -594394, -634086, -826342, -1000685, -1100783, -1177771, -1191466, -1012608, -638393, -307612, -314066, -658370, -955478, -852471, -522159, -477826, -826790, -1063241, -829145, -504988, -629999, -1026378, -1061180, -648121, -361865, -502546, -662259, -461618]
37556d61618K59291j98637n95361m31581O6131L47561K13882r4482k55007j64723
37546a314544R489L8813p3718j00208N9413K27277K57523K37430K14672M5015
37536c98838k35358k49765J28815L82036N0507m59494m06243J31331L59020J9909
37526f78080k25734J21378O30376O26717J27943l36667m66267l29791n3499K23120
37516c60504K80052P2466j06521m0122K5037k25619n69926n03452l1737K91510
37506a168816J85233J4261J41368L42799K16916j34550k70554j07513j763j39245
37496i21864k60345j09829J82141L45642L22677J82151n8939l01185k99073k4883
37486i43507J21325j71092n58526m30727K00227O66381N48445J55194n3595r0323
$$ y = [-461618, -202327, -400964, -996325, -1427906, -1361775, -1014214, -800332, -894814, -1149821, -1314544, -1305055, -1266242, -1339960, -1440168, -1380755, -1153478, -895955, -658525, -443853, -398838, -634196, -883961, -755146, -373110, -322603, -782097, -1188340, -1057009, -697989, -678080, -903814, -782436, -152060, 474657, 602600, 265933, -200334, -530125, -583624, -360504, -80452, -7986, -114507, -154629, -129592, -355211, -925137, -1428589, -1460326, -1168816, -983583, -969322, -827954, -485155, -268239, -402789, -673343, -780856, -782619, -921864, -1182209, -1292038, -1109897, -764255, -441578, -259427, -318366, -619551, -918624, -943507, -822182, -993274, -1551800, -1982527, -1782300, -1115919, -567474, -412280, -465875, -556198]
37476e56198k04295l49842k62064P0994L35421K97999Q9702K1301J81410K89023
37466h6549L1028m54043o34343k64207K35911L40035J09649n0937q5704k06654
37456a065814l03053q8370K25513J32752k43771k30824K36422M05117k0546k99039
37446a251613J18188O22480M41055j14425k35315R6812K92826K07138J18558j7497
37436B78207m05307p24827m86826P1383K69014M2532p3482R3343K25785K47931
37426d62247L45903L39402q8985n80152m41149J78540M12209N8735j63043Q7890
37416c12897K65874K7944j95800j36484j99954n32769n33496O7357N22231K04055
37406h23939l39882k77835K16974M13494K20825P2339L0411j32447k57812k8336
$$ y = [-556198, -760493, -1110335, -1372399, -1301405, -965984, -667985, -578283, -556982, -375572, -86549, -55521, -509564, -1143907, -1408114, -1172203, -832168, -722519, -773456, -859160, -1065814, -1368867, -1457237, -1231724, -1098972, -1342743, -1573567, -1337145, -932028, -952574, -1251613, -1133425, -510945, -69890, -184315, -419630, -322818, -29992, 177146, 295704, 278207, -127100, -851927, -1338753, -1267370, -998356, -955824, -1029306, -935963, -710178, -462247, -116344, 223058, 134073, -446079, -887228, -708688, -296479, -237744, -400787, -312897, -47023, -19079, -214879, -351363, -551317, -1084086, -1617582, -1550225, -1027994, -823939, -1163821, -1441656, -1224682, -811188, -590363, -518024, -487613, -620060, -877872, -906208]
37396i06208L28398L13135j0217j39120K0259P9326j19706l04640k72058r9901
37386a110732J03696K58659K16632j7166j20771J10019L70234K84736j1032j64974
37376h0699j98975l01009l11666o582L34050K60970j04852k81805k17460k22061
37366a130089k54986J008M02322M26182N1228j47870Q3011L25929K38512L7841
37356C3088J092K8613l1395q5291o2448p3759j13399j0887J63222R1777k15627
37345b75014l21539n6671J66341K8674j62428M971L61477M14168N7884l42122
37335a24259m33132j67356K45114M61312K47734k11370m24102j79413J76549K25476
37325a83447Q702j40575q2596O2727J72870J96842Q7018j19654k36924j36034
$$ y = [-906208, -577810, -264675, -274892, -414012, -393753, -314427, -434133, -738773, -1010831, -1110732, -1007036, -748377, -531745, -548911, -669682, -559663, -189429, 95307, 84275, -80699, -279674, -580683, -892349, -898931, -564881, -303911, -408763, -690568, -908028, -1130089, -1385075, -1384067, -981745, -555563, -504335, -652205, -569194, -243265, -4753, 33088, 34180, 62793, 31398, -53893, -116341, -190100, -303499, -314386, -151164, -59387, -275014, -596553, -653224, -486883, -458209, -620637, -615666, -254189, 159979, 217863, -124259, -557391, -724747, -479633, -18321, 229413, 18043, -406059, -585472, -408923, -183447, -174745, -315320, -397916, -335189, -162319, 34523, 121541, 1887, -235037, -371071]
37315c71071N5286J21760N1998K973L4614M0750o3813k07773k53816j86707j59413
37304i35212k82229l75521j09728M93246Q99988O54122r631m36082l46055l5689
37294d82791J60254K19554K19497J48956L7908k3002p5465k36837m14989l78388
37284h25303j31945J03615K82060N06616O22274L38392j64398l17835m0880O3140
37274D35736l15621o21193k97698K94128M13241J8951l06302k72124j04251R664
37264g45469J12662J58534K1476j62609j16170J03504J68580L3430p931J34756
37254b99237J83715p912j89597j26594M5489Q5932J1016k9545m9377j66272l35811
37243h78193l43395p6158K92140M36151K12999j60178l38975k55642j42095j26629
$$ y = [-371071, -315785, -194025, -142027, -139054, -104440, -63690, -127503, -335276, -589092, -775799, -935212, -1217441, -1592962, -1702690, -1209444, -309456, 344666, 335035, -101047, -447102, -482791, -322537, -102983, 116514, 265470, 303378, 280376, 204911, -31926, -446915, -825303, -957248, -853633, -571573, -64957, 557317, 895709, 731311, 413476, 372596, 435736, 120115, -501078, -798776, -504648, -91407, -72456, -378758, -650882, -755133, -745469, -632807, -474273, -452797, -615406, -731576, -628072, -459492, -426062, -433993, -299237, -115522, -123434, -313031, -439625, -394136, -308204, -297188, -326733, -376110, -542382, -878193, -1221588, -1297746, -1005606, -569455, -356456, -516634, -855609, -1111251, -1253346, -1379975]
37233a379975n5971J48092K44397N7005j45148l0823K06714J04218k99091m49976
37223a600558j14128K64654K41015k529j222K96725N09380L56351n6010m22935
37213e29257n21689l42140o9461R3367J44148K42281M16889M64134K28303j49412
37203b2837l79478l28206r3035J22128J42712l7469j89217p1128K16100K96952
37193c43478M4680k03299j38021N1457j8739l31411n16129m00919j58010P9102
37183a934767L66966O49544O65536L32300n0929j78517j01113k9915O28M7624
37173b32643L7798q5993j43540L5298K27282M0614m61865p17170l62517K94585
37163a368151O70310N60569K28996J924k6517L6255M3082n0162j39061j08230
$$ y = [-1379975, -1435946, -1287854, -1043457, -986452, -1131600, -1162423, -955709, -851491, -1150582, -1600558, -1714686, -1450032, -1209017, -1211546, -1212768, -916043, -406663, -50312, -106322, -529257, -1050946, -1393086, -1462547, -1369180, -1225032, -982751, -565862, -101728, 126575, -22837, -402315, -730521, -823556, -701428, -558716, -596185, -785402, -856530, -640430, -343478, -298798, -502097, -640118, -588661, -607400, -938811, -1454940, -1855859, -2013869, -1934767, -1567801, -918257, -252721, 79579, 28650, -149867, -250980, -280895, -280267, -232643, -194845, -280838, -424378, -389080, -161798, -121184, -583049, -1300219, -1662736, -1368151, -697841, -137272, 91724, 93648, 67131, 103386, 146468, 96306, -42755, -150985]
37153a50985j7486l3828j61938k09128p5893R4240J37893P2481j2234p7071n9750
37142d93699J01449K60705J43096k10167l64851r3274K38674J89788j12368k13524
37132e54171j0367K10962K54568J41311q9048l02126j85309K88842N23435K5753
37122C03850o73783n78519K91506Q01265L05559m55467m94554Q0362M43669K63495
37112B87383j04149l17966l50155k48479q2275j4068o9199m739K70815L96319
37102b36513O3424m18603n05745j78248J32249K15959K18731K14943J18290k6824
37092d02337q3698j09801k19428k44651L5199L93208L65094l8721l09393j84237
37082g98765M9045R5650M6674N5758L2463j02199j74176k9003J79494K05832O1328
$$ y = [-150985, -168471, -202299, -364237, -573365, -649258, -555018, -417125, -344644, -356878, -433949, -493699, -392250, -131545, 11551, -198616, -563467, -656741, -418067, -228279, -340647, -554171, -564538, -353576, -99008, 42303, -46745, -348871, -534180, -245338, 278097, 303850, -369933, -948452, -656946, 144319, 449878, -5589, -500143, -419781, 23888, 287383, 183234, -134732, -484887, -733366, -815641, -829709, -898908, -903647, -632832, -236513, -173089, -591692, -1097437, -1275685, -1143436, -927477, -708746, -493803, -375513, -402337, -486035, -595836, -815264, -1059915, -1024716, -631508, -266414, -305135, -614528, -798765, -749720, -654070, -607396, -551638, -519175, -621374, -795550, -824553, -645059, -439227, -377899]
37071c77899m6941j9560M2344o343j81574l23468k38419N3896K92557K91138J61266
37060c53003Q9739O8363M5891J36184L72646M47950Q7458m46961o45291m51708
37050f48732k38395j54071n611K18969K56871Q5605N432P4139j5588l11838l93216
37039a126435n3064L03092K74629L3915q3408j28712k52724k44308J34327O03137
37029e39551O61480K86616j06893k86893l54407l63418k33482m1950j0425j45330
37019a134253k13256j26755n0792m8197P8127M24404O95032N15662l1428m10975
37009c02431k58018J38320J75557k35775m72169m2917O14620O25155j08771p19211
36999e85640n44929L4836K68942Q8047r754J51393K36450N0146j56778j51157
$$ y = [-377899, -424840, -444400, -402056, -408399, -589973, -913441, -1151860, -1097964, -805407, -514269, -353003, -263264, -194901, -149010, -12826, 359820, 807770, 895228, 448267, -197024, -648732, -887127, -1041198, -1046809, -827840, -570969, -485364, -479932, -405793, -421381, -733219, -1126435, -1179499, -876407, -601778, -567863, -651271, -779983, -1032707, -1277015, -1142688, -539551, 121929, 408545, 301652, 14759, -339648, -703066, -936548, -978498, -988923, -1134253, -1347509, -1474264, -1525056, -1573253, -1495126, -1070722, -375690, 139972, 108544, -302431, -560449, -422129, -246572, -482347, -954516, -997433, -382813, 242342, 133571, -585640, -1130569, -1095733, -826791, -738744, -748498, -597105, -360655, -310509, -467287, -618444]
36989f18444p7318j44265k33093p8019K85618M99691L28605l5001k09589r1987
36979c73802O9969P3981J6946L0880M134j67089k45277L7220M34325M19749k7522
36968B73514l57595k55289j0446O6347O6242Q1074p8884m23254n43467k45898
36958a427656N2671J6654j2020L32723O63922M20634j34242k78805K9639J85126
36948a51354j7069j77632j24117j28300k06510n487M21772M95217N3020k95801
36938a36261j35324J00354r8923m60816m07738K4322L20722K74212J11040L187
36928d05225p3701q3494O8945K97473L84474K64162P3389l3513n508P0390p460
36917E49932l20060n75805l78536J61174M42348J86789j46612n2384K74820K88773
$$ y = [-618444, -695762, -840027, -1073120, -1151139, -865521, -365830, -37225, -72226, -281815, -373802, -303833, -229852, -212906, -182026, -177892, -344981, -590258, -553038, -118713, 301036, 273514, -84081, -339370, -349816, -283469, -217227, -136153, -215037, -638291, -1181758, -1427656, -1374985, -1358331, -1370351, -1037628, -373706, 46928, -87314, -366119, -336480, -151354, -168423, -346055, -470172, -598472, -804982, -810469, -388697, 106520, 159540, -136261, -271585, -171231, -270154, -730970, -1138708, -1114386, -793664, -519452, -408412, -405225, -478926, -562420, -493475, -196002, 188472, 452634, 526023, 492510, 487002, 557392, 549932, 229872, -345933, -724469, -563295, -120947, 65842, -80770, -133154, 141666, 430439]
36907D30439o7237l26304j97454J09439K51424J39515o7850j65727j02194o8507
36897f4456k78656n94064o08718k40754P7977L9046n9710J69022N06002M31984
36887f22327m0238l54144j99318J36406K47023P8652j37235j42223J68826N82944
36877b81634O42950J65053m02019m65229o1612K25714Q1302k18925l12839j79147
36867h06386J1142J17012L1742k13479l20321m4334L48643L58094P892j55836
36857f65831P3593K45288K2331k61283j83661O9420N5240j90781k62437n2102
36847a150223J42819J20083O093j0764Q7118J83795J33509j14566l77086l64258
36837a343480p8641J16332j839j86712j25132R3571K09016K36925L12388L04264
$$ y = [430439, 363202, 36898, -160556, -51117, 200307, 339822, 271972, 106245, 4051, -64456, -343112, -937176, -1545894, -1786648, -1708671, -1669625, -1729335, -1560313, -1054311, -622327, -662565, -1016709, -1216027, -1079621, -832598, -753946, -891181, -1033404, -864578, -281634, 361316, 526369, 124350, -340879, -402491, -176777, -95475, -314400, -627239, -806386, -795244, -678232, -646490, -859969, -1180290, -1224624, -875981, -517887, -509995, -665831, -592238, -346950, -324619, -585902, -769563, -700143, -644903, -835684, -1098121, -1150223, -1007404, -887321, -881228, -891992, -804874, -621079, -487570, -602136, -979222, -1343480, -1422121, -1305789, -1307628, -1494340, -1619472, -1525901, -1316885, -1079960, -767572, -463308]
36827d63308L3682k61381j68315K31100M09545J53209j70860k06953o5170k3318
36817e31769j09260j71131j23989K3335J98074K42409O8226j34807j00113Q8238
36807e50787R3124r8885r8118K31710M48465J59681l45938m68271j05349K75373
36797d58995K88020K4419j93847k03478q9690l1000q5476r2974J35804M94258
36787b12959O03203K71331k21280m45553k96498j116J98815K00364J8288j84983
36777g0388j59476J28415L39711J34577l52336o28788m25466L1579L36201L23016
36767c42955J40202K2406M1046N1448r5547l03124l10537o1437J72228J28719
36757e57551j30681l49798l60865j35702K55474N97334O35961L88077J47422M5914
$$ y = [-463308, -429626, -691007, -859322, -628222, -218677, -65468, -236328, -443281, -508451, -531769, -641029, -812160, -936149, -912814, -714740, -472331, -404105, -538912, -639025, -550787, -457663, -556548, -654666, -422956, 25509, 185190, -160748, -629019, -734368, -458995, -170975, -146556, -340403, -543881, -633571, -664571, -750047, -843021, -707217, -212959, 390244, 661575, 440295, -5258, -301756, -302872, -104057, 96307, 114595, -70388, -229864, -101449, 238262, 372839, 20503, -608285, -1033751, -1002172, -665971, -342955, -202753, -180347, -139301, -87853, -183400, -486524, -797061, -858498, -686270, -557551, -688232, -1038030, -1398895, -1534597, -1279123, -681789, -45828, 342249, 489671, 535585]
36747E35585j16558m12358n08168j86212J73023Q4950k83826l58822k1037K98171
36737g95252L27804K31661J54159J2711j59843j41573O2282J40876l2596k01571
36727d01342j53485M013J13873J66703J25743p0622k31309n0974L43676M24967
36717B71243J7195m21283m73068k68306p8820J18039L56021M15819K21033R5978
36707B53851K41122L43263J19448j55659j44025p1423k89723n47438l58896J16440
36697d93040K61498k2932k13077m4491J54318J19743L5618N0657n1620l98851
36687f02177o53507m36978J17398N31623N55967L45721J58471O8026j7565j44128
36677g7149j82112J5755L31123M27897J75649j65854l19379l14999k56649n8984
$$ y = [535585, 419027, 6669, -501499, -687711, -514688, -429738, -713564, -1072386, -1093423, -795252, -467448, -235787, -81628, -68917, -228760, -370333, -308051, -167175, -199771, -401342, -554827, -550814, -436941, -270238, -144495, -215117, -446426, -497400, -153724, 271243, 288438, -132845, -605913, -874219, -953039, -835000, -478979, -63160, 157873, 253851, 494973, 838236, 957684, 802025, 658000, 586577, 296854, -250584, -609480, -493040, -231542, -254474, -467551, -512042, -357724, -237981, -202363, -151706, -203326, -602177, -1255684, -1692662, -1575264, -1043641, -487674, -141953, 16518, 84544, 66979, -77149, -259261, -243506, 87617, 515514, 691163, 525309, 205930, -109069, -365718, -424702]
36667d24702K73078L87212M1299l81131l10397J61014L90956J28464j87314j52294
36657g3815O8745J14198n5059k21657k35928j13433J3634j4638j79937k19461
36647i17351J3122K42861J47078j05922j09324J03668J40304m2230q1065R3589
36637e15270J01815j96476m27351l33659j43814n6419J13232M45544N70620K23574
36627b18204k40015l10772k6748J73038P2619j72535l24644k39123O6896L31187
36617h88301K51700q3352k53856j14093L0324p187p388J48835J93073J0475l8206
36606g57976K48831M41546J49618k59765k08046J60385K25286j38466m55497m06101
36596a000185j34221J39226L21387L08360P0698j65184j78872r3564j13091j11752
$$ y = [-424702, -151624, 235588, 276887, -104244, -414641, -253627, 137329, 265793, 78479, -73815, -5070, 109128, 54069, -167588, -403516, -516949, -503315, -517953, -697890, -917351, -904229, -661368, -514290, -620212, -729536, -625868, -485564, -527794, -608859, -515270, -413455, -609931, -1037282, -1370941, -1514755, -1571174, -1457942, -1012398, -441778, -218204, -458219, -768991, -795739, -622701, -550082, -722617, -1047261, -1286384, -1219488, -888301, -636601, -719953, -973809, -1087902, -1057578, -1064765, -1072153, -923318, -730245, -719770, -757976, -509145, -67599, 82019, -177746, -385792, -225407, -121, -138587, -594084, -1000185, -1134406, -995180, -673793, -365433, -294735, -459919, -638791, -732355, -845446, -957198]
36586i57198J09112L59720L17881O0938j33259l02014n68859o24888j19520N53088
36576a304999O12915O0802k65349N7232M57686L21504j33534l28363j66627L0059
36566f58674Q7528P8521P1580Q7229J54209K13328J28466p2659j61349k6366J66795
36555F8608K25993J42896r910j78368k68972k00964n5441J1928j3417o0958j36067
36544d74672j83946J5534M62445O68764K62230l40936m63915j94870j47035l09354
36534g05755p0290N24662N92070j31410o55361j90659O21280P20341J63710k45381
36524F23207l13558m41381n91152l13224K77999N00876J69711j37458l0472J74831
36514h0621J06075j02952j66677q6870J6631J30935J97034P0039j91624l03106
$$ y = [-957198, -848086, -488366, -170485, -109547, -242806, -544820, -1113679, -1738567, -1858087, -1304999, -692084, -631282, -896631, -839399, -381713, -60209, -193743, -522106, -688733, -658674, -571146, -492625, -421045, -333816, -179607, 33721, 162187, 89528, -71821, -98187, 68608, 294601, 437497, 427587, 249219, -19753, -220717, -276158, -264230, -277647, -338605, -474672, -658618, -643084, -180639, 488125, 750355, 409419, -54496, -249366, -396401, -705755, -776045, -251383, 340687, 209277, -446084, -636743, -15463, 704878, 868588, 623207, 309649, -131732, -722884, -1036108, -758109, -257233, -87522, -224980, -255452, -80621, 25454, -77498, -244175, -331045, -314414, -183479, 13555, 83594, -108030, -411136]
36504d11136j57869L9751J45141K44046L39470K31081j08789l57692k62378R226
36494b89149J32178L0891j48784k74250k69777j03205J20920K00875P2420j40190
36484f68071l37982m92127m59736q4502M17102N42840J87563j14688P3874M40176
36474d95551L94217m5410l14934j48485J26020J60150J5882j03780j89171k87307
36464h88369k94125j07513J68772L49316L77299K88183J08226p6713j07837J9324
36454a63437N5183j69525m27614l65421k0863K13419J41954k4159q5105j58816
36444a004384l66977m76380j77954L80212O69688M27887k6701k18055n4412J86283
36434f60793K67252K06422J26498O9261J2564l1751k3707L4316R9731J42255J24739
$$ y = [-411136, -569005, -529254, -384113, -140067, 199403, 430484, 321695, -35997, -298375, -289149, -156971, -126080, -274864, -549114, -818891, -922096, -801176, -600301, -527881, -668071, -1006053, -1498180, -1957916, -2042418, -1625316, -1082476, -894913, -1009601, -935727, -495551, -101334, -146744, -461678, -610163, -484143, -323993, -308111, -411891, -601062, -888369, -1182494, -1290007, -1121235, -771919, -394620, -106437, 1789, -74924, -182761, -163437, -108254, -277779, -705393, -1070814, -1091677, -878258, -736304, -760463, -845568, -1004384, -1371361, -1847741, -2025695, -1645483, -975795, -547908, -574609, -792664, -847076, -660793, -393541, -187119, -60621, 8640, 21204, -10547, -34254, 62, 99793, 242048, 366787]
36423C66787l7946l65493o34169n04980K4915M61825L45402j52915m41645k76267
36413a214486J7730J12479Q3479J07434J25307M8072n672M8962M7681j15169k21603
36402i65786q1178J08498R3236l458M1851J07856K782q6531O2207J80238n4485
36391e94770k92507J5602N73285N52061m8529l31721K5065K63656q4064l54398
36381b76320L7511M59667O5066p37283q67668k39189K24695P9745j41089J8204
36371a376661K65885J82955j40951l54691k78280O4172M65449N48380J61128k54959
36361g17573j49138L15878M55105Q6068k37921j34304Q2397K7422j45081j02799
36351e19946J09805K31007J97676J03211j6321j12585o7622R6329J69523O6515
$$ y = [366787, 328841, -36652, -670821, -1175801, -1150886, -689061, -343659, -496574, -938219, -1214486, -1196756, -1084277, -1000798, -893364, -768057, -719985, -725657, -676695, -629014, -744183, -965786, -1046964, -938466, -845230, -848688, -806837, -698981, -696199, -782730, -720523, -540285, -594770, -887277, -871675, -298390, 253671, 205142, -126579, -101514, 162142, 78078, -276320, -238809, 220858, 285924, -451359, -1319027, -1558216, -1333521, -1253776, -1394865, -1376661, -1110776, -927821, -1068772, -1423463, -1701743, -1637571, -1172122, -623742, -462614, -717573, -866711, -550833, -95728, -9660, -247581, -381885, -299488, -272066, -417147, -519946, -410141, -179134, 18542, 121753, 105432, -7153, -74775, 21554, 191077, 257592]
36341B57592n8012j16630k07256l00528j73654J58769L26304J54559m1167Q73
36331H50M5606j61096l40314j02349L35336M03478L2327k86854k61495j02732
36321d37243j6636J05997L17417L61693P0619k87273l45246j35204K2497l389
36311c46768m9538K7415J61496K03661P3909k02160m64346m65309j36333K15939
36301i82034K18338l7437p1738K55321M45320Q2906m56678m91677m8591J96308
36291h89962q087j27173K19557N88868M34531K388q9404J57192K08211o9941k35375
36280A90805m7085J93342K12214J49480J68886J30463q9889l07393l22826k38730
36270C9267k37601k72357k12032j10386j02146j57618j29178L6131K50248L78633
$$ y = [257592, 199580, 82950, -124306, -424834, -598488, -439719, -113415, 41144, -23, 850, 46456, -114640, -454954, -557303, -221967, 181511, 213838, -73016, -334511, -437243, -453879, -347882, -30465, 331228, 401847, 114574, -230672, -365876, -343379, -346768, -396306, -368891, -207395, -3734, 70175, -131985, -596331, -1061640, -1197973, -982034, -763696, -801133, -872871, -617550, -172230, -89324, -546002, -1037679, -1086270, -889962, -898049, -1025222, -805665, -216797, 217734, 220122, 130718, 287910, 496121, 426180, 190805, 143720, 337062, 549276, 698756, 867642, 998105, 908216, 600823, 277997, 39267, -198334, -470691, -682723, -793109, -895255, -1052873, -1182051, -1145920, -895672, -517039]
36260e17039L28989J46716L3509J27283K64410J43857k54598n99066n73033j61911
36250a060883L86437P07047N20636m9932m53383k93750J55823L41927J75997l5181
36240C94738k20586n06546o44523k21578M80520O24654N8390l58449l8640M73659
36230D1639M47293P2493m5851N6947p0457l85837m36228j55366Q3867R2044p114
36219c06570j31851k50784k19919m8429o0825l40829l84181J32688O57436N42574
36209d10690J12619Q7752K99552M0353n08128m20722L29358O35444J0847o09073
36199d32688l90674J39764J32927j86231r5099L10926L90081J36308R9908L22097
36189D27319K76309j41510l92775j99297K6750j09321l85764l63118j2728L29680
$$ y = [-517039, -188050, -41334, -7825, 119458, 383868, 527725, 273127, -325939, -898972, -1060883, -674446, 32601, 553237, 503305, 49922, -243828, -88005, 253922, 429919, 394738, 174152, -332394, -976917, -1198495, -717975, -93321, -34931, -393380, -432020, 41639, 488932, 561425, 515574, 572521, 502064, 116227, -320001, -475367, -391500, -299456, -306570, -438421, -689205, -909124, -957553, -1018378, -1359207, -1743388, -1610700, -953264, -410690, -298071, -210319, 89233, 129586, -378542, -799264, -469906, 165538, 176385, -432688, -823362, -683598, -550671, -736902, -832001, -521075, -130994, 5314, 105222, 427319, 703628, 562118, 169343, -29954, -3204, -112525, -498289, -861407, -874135, -544455]
36179e44455M13413K61935M2310j11026j89139k54200k66257o8498L40550O54207
36169B78840N70537J67925k19276l98362l84733j92595J56860M62820M60990J39713
36159A042719k57448n28830o17404m74460r6347K89605L54936P4399k11959k25669
36149f50458m8438Q7087J03749N0238o2011k16917k86427j43435J34245L02084
36139g30283K15753r120j29241l2929J54858K24455J24093J5389N7565J70555
36129F1095R6155k67036o49319o31036j13510N08122P38947N14470K00311P1502
36119E29701J4994j45086k80906j81682L3336O6125p9174j37977p3020r5590j72825
36108e22104j2092L26090L51031l7095k15759K02077O00119K21972n75719p69592
$$ y = [-544455, -131042, 130893, 173203, 62177, -126962, -381162, -647419, -715917, -375367, 278840, 849377, 1017302, 798026, 399664, 14931, -177664, -20804, 442016, 903006, 1042719, 785271, 256441, -360963, -835423, -931770, -642165, -287229, -212830, -424789, -650458, -698896, -611809, -508060, -457822, -519833, -736750, -1023177, -1166612, -1032367, -730283, -514530, -523650, -652891, -685820, -530962, -306507, -182414, -167025, -109460, 61095, 157250, -109786, -759105, -1390141, -1503651, -995529, -256582, 257888, 458199, 529701, 544695, 399609, 118703, -62979, -29643, 36482, -42692, -180669, -253689, -349279, -522104, -534196, -208106, 142925, 105830, -109929, 92148, 692267, 914239, 338520, -431072]
36098d31072k11155J95531m7476l17235P630N08398M31659j14172l83528j23936
36088d85356K06969K54548J77781J90746J95863L9569j93038k96696j76471R4262
36078H177L01527K22314q9712k53540m1800K21791R0874k91568l68973m0613J78892
36067f2631q593k42706j67511k6886j77278m13047l07056L7540J48712k0313l1198
36056a270967K88396N67216M98778K68045J50831O2144k01409n16873n49158k14117
36046i17114K05657L83207K50040R53j18459l7264J13736K11014K78408L10926
36036F81104J11302m24380r26071q22205q2477O26127O86008J97360k44267k25873
36026d23372J62096M82841L23449k78984p14874m03229L91469P33022K01106n23382
$$ y = [-431072, -642227, -446696, -494172, -811407, -803777, -295379, 136280, 22108, -361420, -485356, -278387, -23839, 153942, 344688, 540551, 580120, 387082, 90386, -86085, 8177, 309704, 532018, 442306, 188766, 146966, 368757, 459631, 168063, -200910, -241523, -62631, -71224, -313930, -481441, -508327, -685605, -1098652, -1405708, -1368168, -1219456, -1239769, -1270967, -982571, -415355, 83423, 351468, 502299, 564443, 363034, -153839, -702997, -917114, -711457, -328250, -78210, -77257, -195716, -232980, -119244, 91770, 370178, 681104, 792406, 368026, -558045, -1380250, -1462727, -836600, -150592, 46768, -197499, -423372, -261276, 221565, 545014, 266030, -448844, -852073, -460604, 272418, 473524, -49858]
36016d9858n89998q5090K67881J93813N3405Q8654J06454k6024r6177O1336K52345
36005A76741K01517q0559l43407l69605j55657P5286R3170n157J38321N57207
35995B87857P16627K14123n18924p11914l06892M6604K489q9922R9241L60169
35985I9458L60939J17101j84821m35168m85081j89649K40898L41992M1614k12597
35975c05314j59058p0194j50631j28698J76574L89519J63962j83725j62556J05597
35965c24524J41582j07012k95374l00234k62493j61592J11696L63526L03929O7907
35955d62589K0505J23575M1995j72729j09076K56017M43471K39786L334K125o350
35944C80064k45962m56898l19517L1383K72213L57822L77285K35267j34897m65078
$$ y = [-49858, -639856, -724946, -457065, -263252, -209847, -121193, -14739, -40763, -136940, -75604, 176741, 378258, 297699, -45708, -415313, -570970, -495684, -402514, -407671, -269350, 287857, 1004484, 1218607, 699683, -12231, -319123, -272519, -270030, -359952, -260711, 99458, 460397, 577498, 392677, -42491, -527572, -717221, -476323, -134331, -92717, -305314, -464372, -534566, -685197, -813895, -637321, -247802, -83840, -267565, -430121, -324524, -182942, -289954, -585328, -885562, -1148055, -1309647, -1197951, -834425, -530496, -462589, -442084, -318509, -276514, -449243, -558319, -302302, 141169, 380955, 384289, 386414, 380064, 134102, -322796, -642313, -610930, -338717, 19105, 396390, 631657, 496760, 31682]
35934C1682m60214k53873j66097j39689J37933N90116P08575K81767k39019l43153
35924A48028j32973p1998k36994k18878K00979O35955N76752Q3952k97796k62177
35914D24850o6440n5660j55322o9149J97310L20945J43748j09597j73692q3713
$$ y = [31682, -428532, -682405, -848502, -988191, -850258, -260142, 448433, 730200, 491181, 148028, 15055, -56943, -293937, -512815, -311836, 324119, 900871, 984823, 687027, 424850, 358410, 302750, 147428, 78279, 275589, 596534, 740282, 630685, 456993, 373280]
$$ [...]
##END NTUPLES=NMR SPECTRUM
##END=
