##TITLE=31Pdec_ANY-156-p
 CDCl3, 24 sc
 8.4.2019
##JCAMPDX= 6.0         $$ Bruker NMR JCAMP-DX V2.0
##DATA TYPE= NMR SPECTRUM
##DATA CLASS= NTUPLES
##ORIGIN= UXNMR, Bruker Analytische Messtechnik GmbH
##OWNER= root
$$ XWIN-NMR		Version 3.5
$$ Mon Apr  8 14:40:09 2019 Russian Standard Time (UT+4h)  she@DPX200
##.OBSERVE FREQUENCY= 81.013821
##.OBSERVE NUCLEUS= ^31P
##.ACQUISITION MODE= SIMULTANEOUS
##.ACQUISITION SCHEME= undefined
##.AVERAGES= 24
##.DIGITISER RES= 17
##SPECTROMETER/DATA SYSTEM= spect
##.PULSE SEQUENCE= zgpg30
##.SOLVENT NAME= CDCl3
##.SHIFT REFERENCE= (INTERNAL, CDCl3, 0, 182.463)
##AUDIT TRAIL= $$ (NUMBER, WHEN, WHO, WHERE, WHAT)
$$ ##TITLE= Audit trail, XWIN-NMR		Version 3.5
$$ ##JCAMPDX= 5.01
$$ ##ORIGIN= Bruker BioSpin GmbH
$$ ##OWNER= she
$$ F:/spectra/data/she/nmr/P31/1/pdata/1/auditp.txt
$$ ##AUDIT TRAIL=  $$ (NUMBER, WHEN, WHO, WHERE, WHAT)
(   1,<2019-04-08 14:37:43.32 +0400>,<she>,<DPX200>,
      <created by zg, POWCHK disabled, PULCHK disabled
       configuration hash MD5:
       00 E9 B6 7A A2 85 ED C7 34 08 36 98 17 FE 4E 26
       data hash MD5: 32K
       7E 89 D4 B1 EC 45 4C 50 28 34 96 7E 41 A0 1B 47>)
(   2,<2019-04-08 14:37:45.75 +0400>,<she>,<DPX200>,
      <Start of raw data processing
       efp BC_mod = 2 LB = 1 FT_mod = 6 PKNL = 1 PHC0 = -1817.674 PHC1 = 98.999 SI = 64K 
       data hash MD5: 64K
       0E E8 A7 C3 49 BD 4F B7 38 16 90 70 BE D0 86 5D>)
(   3,<2019-04-08 14:38:02.06 +0400>,<she>,<DPX200>,
      <pk PHC0 = 1.341551 PHC1 = 0 
       data hash MD5: 64K
       50 64 7F FD C4 C4 B9 21 8E 9E 00 30 CB 80 0C 4A>)
(   4,<2019-04-08 14:38:06.29 +0400>,<she>,<DPX200>,
      <abs ABSG = 5 
       data hash MD5: 64K
       60 41 84 7A 8E CA CB DF E1 B9 AF D9 DA BF 78 5D>)
$$ ##END=
$$ 
$$ hash MD5
$$ A3 26 C7 A0 17 99 EC 9A 5A 55 F1 27 26 EE 0A E7
##$RELAX= 
##$RELAX= 
##$RELAX= 
##$RELAX= 
##$RELAX= 
##$RELAX= 
##$RELAX= 
##$RELAX= 
$$ Bruker specific parameters
$$ --------------------------
##$DU= <F:/spectra>
##$EXPNO= 1
##$NAME= <P31>
##$PROCNO= 1
##$TYPE= <nmr>
##$USER= <she>
##$AMP= (0..31)
100 100 100 100 100 100 100 100 100 100 100 100 100 100 100 100 100 100 
100 100 100 100 100 100 100 100 100 100 100 100 100 100 
##$AQSEQ= 0
##$AQ_mod= 1
##$AUNM= <au_zg>
##$AUTOPOS= <>
##$BF1= 81.014009
##$BF2= 200.13
##$BF3= 200.13
##$BF4= 200.13
##$BF5= 200.13
##$BF6= 200.13
##$BF7= 200.13
##$BF8= 200.13
##$BYTORDA= 1
##$CFDGTYP= 0
##$CFRGTYP= 5
##$CHEMSTR= <none>
##$CNST= (0..31)
1 1 145 1 1 1 1 1 1 1 1 1 1 1 1 1 1 1 1 1 1 1 1 1 1 1 1 1 1 1 1 1 
##$CPDPRG= <waltz16>
##$CPDPRG1= <>
##$CPDPRG2= <waltz16>
##$CPDPRG3= <>
##$CPDPRG4= <mlev>
##$CPDPRG5= <mlev>
##$CPDPRG6= <mlev>
##$CPDPRG7= <mlev>
##$CPDPRG8= <mlev>
##$CPDPRGB= <>
##$CPDPRGT= <>
##$D= (0..31)
0 1 0 0 0 0 0 0 0 0 0 0.03 2e-05 3e-06 0 0 0 0 0 0 0 0 0 0 0 0 0 0 0 0 
0 0 
##$DATE= 1554719862
##$DBL= (0..7)
120 120 120 11 120 120 24 19 
##$DBP= (0..7)
150 150 150 150 150 150 150 150 
##$DBP07= 0
##$DBPNAM0= <>
##$DBPNAM1= <>
##$DBPNAM2= <>
$$ [...]
##$SUBNAM3= <"">
##$SUBNAM4= <"">
##$SUBNAM5= <"">
##$SUBNAM6= <"">
##$SUBNAM7= <"">
##$SUBNAM8= <"">
##$SUBNAM9= <"">
##$SW= 369.568048894756
##$SWIBOX= (0..15)
0 1 3 0 0 0 0 0 0 0 0 0 0 0 0 0 
##$SW_h= 29940.119760479
##$TD= 32768
##$TD0= 1
##$TE= 0
##$TE2= 300
##$TE3= 300
##$TEG= 300
##$TL= (0..7)
0 120 53 12 22 120 120 120 
##$TP= (0..7)
150 150 150 150 150 150 150 150 
##$TP07= 0
##$TPNAME0= <>
##$TPNAME1= <>
##$TPNAME2= <>
##$TPNAME3= <>
##$TPNAME4= <>
##$TPNAME5= <>
##$TPNAME6= <>
##$TPNAME7= <>
##$TPOAL= (0..7)
0.5 0.5 0.5 0.5 0.5 0.5 0.5 0.5 
##$TPOFFS= (0..7)
0 0 0 0 0 0 0 0 
##$TUNHIN= 0
##$TUNHOUT= 0
##$TUNXOUT= 0
##$USERA1= <user>
##$USERA2= <user>
##$USERA3= <user>
##$USERA4= <user>
##$USERA5= <user>
##$V9= 5
##$VALIST= <valist>
##$VCLIST= <CCCCCCCCCCCCCCC>
##$VD= 0
##$VDLIST= <DDDDDDDDDDDDDDD>
##$VPLIST= <PPPPPPPPPPPPPPP>
##$VTLIST= <TTTTTTTTTTTTTTT>
##$WBST= 1024
##$WBSW= 4
##$XGAIN= (0..3)
0 0 0 0 
##$XL= 0
##$YL= 0
##$YMAX_a= 7921
##$YMIN_a= -7880
##$ZGOPTNS= <>
##$ZL1= 120
##$ZL2= 120
##$ZL3= 120
##$ZL4= 120
##$ABSF1= 182.463
##$ABSF2= -187.1042
##$ABSG= 5
##$ABSL= 3
##$ALPHA= 0
##$AQORDER= 0
##$ASSFAC= 0
##$ASSFACI= 0
##$ASSFACX= 0
##$ASSWID= 0
##$AUNMP= <proc_1d>
##$AZFE= 0.1
##$AZFW= 0.5
##$BCFW= 0
##$BC_mod= 2
##$BYTORDP= 0
##$COROFFS= 0
##$CY= -3
##$DATMOD= 1
##$DC= 0
##$DFILT= <>
##$DTYPP= 0
##$F1P= 0
##$F2P= 0
##$FCOR= 1
##$FTSIZE= 65536
##$FT_mod= 6
##$GAMMA= 0
##$GB= 0
##$INTBC= 1
##$INTSCL= 5.30512e-09
##$ISEN= 30
##$LB= 1
##$LEV0= 0
##$LPBIN= 0
##$MAXI= 10000
##$MC2= 0
##$MEAN= 0
##$ME_mod= 0
##$MI= 50
##$NCOEF= 0
##$NC_proc= -5
##$NLEV= 6
##$NOISF1= 182.463
##$NOISF2= 159.3651
##$NSP= 0
##$NTH_PI= 0
##$NZP= 0
##$OFFSET= 182.463
##$PC= 4
##$PHC0= -1816.332
##$PHC1= 98.999
##$PH_mod= 1
##$PKNL= yes
##$PPARMOD= 0
##$PSCAL= 0
##$PSIGN= 0
##$REVERSE= no
##$SF= 81.0140089999434
##$SI= 65536
##$SIGF1= 159.3651
##$SIGF2= -187.1042
##$SINO= 113.3802
##$SIOLD= 16384
##$SREGLST= <1H.CDCl3>
##$SSB= 0
##$STSI= 65536
##$STSR= 0
##$SW_p= 29940.119760479
##$SYMM= 0
##$S_DEV= 0
##$TDeff= 32768
##$TDoff= 0
##$TI= <>
##$TILT= no
##$TM1= 0
##$TM2= 0
##$TOPLEV= 0
##$USERP1= <user>
##$USERP2= <user>
##$USERP3= <user>
##$USERP4= <user>
##$USERP5= <user>
##$WDW= 1
##$XDIM= 65536
##$YMAX_p= 318476242
##$YMIN_p= -12683814
$$ End of Bruker specific parameters
$$ ---------------------------------
##NTUPLES= NMR SPECTRUM
##VAR_NAME=  FREQUENCY,     SPECTRUM/REAL,   SPECTRUM/IMAG
##SYMBOL=    X,             R,               I
##VAR_TYPE=  INDEPENDENT,   DEPENDENT,       DEPENDENT
##VAR_FORM=  AFFN,          ASDF,            ASDF
##VAR_DIM=   65536,         65536,           65536
##UNITS=     HZ,            ARBITRARY UNITS, ARBITRARY UNITS
##FACTOR=    0.456856943014862, 1,           1
##FIRST=     14782.0589164792, 0,            0
##LAST=      -15158.0608439998, 0,           0
##MIN=       -15158.0608439998, -12683814,   0
##MAX=       14782.0589164792, 318476242,    0
$$ Real data points
##PAGE= N=1
##DATA TABLE= (X++(R..R)), XYDATA
$$ [...]
41659a2330N64847P45000k29669j025870o11075J39012P3533l33604m3458N74225
41649a59389L51436o06995r58951j55740Q15574Q89775J67911n19392n60720J08575
41639f27916J020035J377246P79564j87992o03475m28504m30002q32416q64695
41630g98155k8347Q89142P44756l53530j074298n11832P26537J306586P24265
41621A625124k57493o50515l58540n6153j77144m16754k99275J12967L45099J79398
41611D6714r8063j30186M5128P7091k20685o08995p11220m82144k20266j28017
41601b430643j03298j1970J60244N26392J192968J691745J155357l77165j453587
41592C50043q86578N18327R87817K18490n08214n35596n88100j004804q63629
$$ y = [-12330, 552517, 1297517, 1067848, 41978, -569097, -430085, -356552, -690156, -733614, -159389, 192047, -414948, -1373899, -1529639, -714065, 175710, 343621, -175771, -736491, -627916, 392119, 1769365, 2548929, 2360937, 1757462, 1328958, 898956, 66540, -798155, -826502, 62640, 807396, 453866, -620432, -1132264, -405727, 900859, 1625124, 1367631, 717116, 358576, 302423, 125279, -291475, -590750, -477783, -132684, 46714, -51349, -181535, -136407, -59316, -280001, -888996, -1600216, -2082360, -2302626, -2430643, -2533941, -2545911, -2385667, -1859275, -666307, 1025438, 2180795, 1803630, 350043, -536535, -18208, 969609, 1188099, 679885, 144289, -443811, -1448615, -2312244]
41583b312244K89781J241958Q02590l54668p77018l35189L1140J6499O3657K05652
41573a127842R2000q1897J37993M50004K11584l21015l38777P5000Q0523l63106
41563a185533l59383L45725Q66046N79996m0942l74556m45834m06513j34035K39281
41553i15748K35878j20838j56203L69869Q02877O32208K38063J47810K35011J32755
41543A601682j48955m40616p09688q08992m82935J00422M01173L02382K20429
41534C4902K82377J61550j18387j19564O7933j47924o11403l90120N42991R15824
41524F18179J73900m49576R3063Q80964N43286m84830p71761k14683P1723k40394
41514B19871l86446m4059K51574K00480K9210k28599o01303n34587L69045J187412
$$ y = [-2312244, -2022463, -780505, 22085, -332583, -1109601, -1444790, -1413650, -1397151, -1333494, -1127842, -1035842, -1117739, -979746, -529742, -318158, -639173, -977950, -902950, -822427, -1185533, -1544916, -1199191, -333145, 246851, 205909, -168647, -614481, -1020994, -1155029, -915748, -679870, -800708, -956911, -587042, 215835, 848043, 1086106, 1233916, 1468927, 1601682, 1452727, 1012111, 302423, -506569, -989504, -889082, -487909, -185527, 34902, 317279, 478829, 360442, 240878, 308811, 160887, -450516, -840636, -297645, 618179, 792079, 342503, 435566, 1316530, 1859816, 1374986, 603225, 388542, 460265, 219871, -166575, -210634, 40940, 241420, 270630, 42031, -559272, -1093859, -724814, 462598]
41504D62598O75553o97668j256809o52178j68846l23229q0572R32444J393212
41495B84505N41517k69541K76078J185314P40596o93486j310198o85482r1985
41486b2682k18507l64142m5915J89452j0536q4490L55465P40034M68621j45881
41476H61419m22966k28061J06698K86906J52174k61928n34148k43470L20219M70459
41466E07302K46255L46910P24055L77326q33062j366742j18396J569300J487072
41457B940020l19644j607990j076834J32366M48069o3793m15160l51364k81903
41448e96233k69667r6992N5889j19456l44009p1775O11159J067059R79834N62783
41438A778592K5142n56019r12680p56870k79024O6940K40195M97126O52718J89976
$$ y = [462598, 1138151, 440483, -816326, -1468504, -1637350, -1960579, -2041151, -1108707, 284505, 826022, 556481, 832559, 2017873, 2758469, 2064983, 754785, 69303, -22682, -241189, -605331, -651246, -461794, -472330, -556820, -201355, 538679, 1007300, 861419, 438453, 210392, 317090, 603996, 756170, 494242, -39906, -283376, 36843, 507302, 753557, 1100467, 1824522, 2201848, 1368786, 2044, -116352, 1452948, 2940020, 2620376, 1012386, -64448, 67918, 515987, 452194, 37034, -314330, -596233, -865900, -962892, -907003, -1026459, -1370468, -1442243, -831084, 235975, 1215809, 1778592, 1803734, 1247715, 335035, -421835, -700859, -633919, -393724, 103402, 756120, 946096]
41428I46096p49630j209921o08037M66020J019208P86876K22644k26543l74178
41419B72535j28306L99991P26472L91384m26286j000719q41365j75953M11528
41410c70719O24319N70367L58019r9068p05456r09393k83966O65939Q82209J39107
41400H71358n76636m61507k044m2490l92830l23945J5735j22900n87339m14113
41390b036711M74914R83981N83825N4788q214j11529n40890m53975O04816J433297
41380I84302Q04536m85592p42868L5375L55189k52181o35329j07411M70517J99480
41370F26018n53797r96602j021110q36144l75461K62281N32247K55093N2662L50505
41360a704308O11688K81394j36389J50568Q05551P31558k57494j077882q36371
$$ y = [946096, 196466, -1013455, -1621492, -1155472, -136264, 650612, 873256, 646713, 272535, 144229, 544220, 1270692, 1662076, 1235790, 235071, -606294, -782247, -370719, 253600, 823967, 1181986, 1082918, 377462, -531931, -815897, -149958, 732251, 871358, 294722, -166785, -168829, -211319, -604149, -928094, -912359, -1035259, -1622598, -2036711, -1561797, -577816, 6009, 60797, 52583, -58946, -599836, -1053811, -448995, 984302, 1788838, 1303246, 560378, 595753, 950942, 698761, 63432, -43979, 426538, 626018, 72221, -924381, -1945491, -2781635, -3157096, -2894815, -2362568, -2107475, -2054813, -1704308, -1092620, -811226, -947615, -797047, 8504, 740062, 482568, -595314, -1431685]
41351a431685J01726P76611P79524L69948j32745o09113r21637q26571k35984
41342b129926N40953R59604P49172K42738J5482J20873l5908p97672j500993j159226
41332b994903J21887J043372P09643k24325n06577M2233N34736M65937K52945
41323e55052K37161J01913k85038l22582L08524P86990K53042p12305q00674O8733
41313i19288O71457L56489j82351k55235j52759k98910m26924k12241Q5211K02512
41303a132039L52936N82825M53320m7219j53164L92706O12170k41477j334169
41294e14111j419761o07114J66420O82969J162575J126465J20930q58078l93124
41285e32829J017456J384543J43467j052940q73172l4184J97133j74783m48573
$$ y = [-1431685, -1329959, -553348, 226176, 596124, 463379, -145734, -1067371, -1893942, -2129926, -1588973, -629369, 119803, 362541, 378023, 498896, 462988, -334684, -1835677, -2994903, -2873016, -1829644, -1120001, -1344326, -1850903, -1808670, -1273934, -807997, -555052, -317891, -215978, -501016, -823598, -515074, 271916, 524958, -187347, -988021, -919288, -247831, 108658, -73693, -328928, -481687, -780597, -1207521, -1419762, -1334551, -1132039, -779103, -196278, 257042, 209823, 56659, 449365, 1061535, 820058, -514111, -1933872, -2540986, -2374566, -1691597, -529022, 597443, 718373, -139705, -532829, 484627, 1869170, 2012637, 959697, 86525, 52341, 249474, 74691, -373882]
41276c73882n23406o58612o96433l64812J65139N99972Q91721R14505M25262k97800
41266H1654m97650J0583N56885O87468O72448O27684J51365o57714q72901j38767
41256F21055N54736L04262l58082m24330M2802K68728O6799j50384k09291k17940
41246D98355j54444n1426j48330l59689k10077K31328K04691l62735l88484O00451
41236a40360J361490P70813k80585k81757M68615N04368l34070q67048p17064
41227D84402o69820r23098p30708j1394L07129p2368k89503J31631N68001N75704
41217f30024N50694O02408J24187q35379j084580o3687J018821Q35036j91136
41208C26340p03960l66767Q0921J87243J66901K11527K81969L91011M52140J46454
$$ y = [-373882, -897288, -1555900, -2252333, -2617145, -2452006, -1852034, -960313, -45808, 379454, 81654, -415996, -405413, 151472, 838940, 1511388, 2139072, 2290437, 1632723, 759822, 621055, 1175791, 1480053, 1121971, 697641, 740443, 1009171, 1075970, 925586, 716295, 498355, 343911, 292485, 144155, -215534, -425611, -194283, 10408, -352327, -740811, -140360, 1221130, 1991943, 1711358, 1429601, 1898216, 2402584, 2068514, 1201466, 484402, -185418, -1108516, -1839224, -1850618, -1543489, -1615857, -1905360, -1773729, -1205728, -630024, -79330, 523078, 647265, -188114, -1272694, -1336381, -317560, 517476, 326340, -377620, -744387, -663466, -476223, -309322, -97795, 184174, 575185, 1027325, 1173779]
41198A173779m70265o50970M7107Q56659P15455k03231p58623m83744m1183k8793
41188A56191k44212l54350m64833o17210m07260L27544R18610O30985k07700n15279
41178g77514R7937Q11146P45353J04975k63377q8810J40794Q1522m0091k0470
41168G91465q5623l90251n99731l81073N5106L11145L68987L80857K46072r1607
41158F05347k40234J39808O51599O16140O9794l38492l53389l29589m45996m11468
41148c6480r3750J82212J83941J18813K11099L29408K27795j28468n63225p81583
41138c50238n25030Q9220N41947N39270L92535L87382K10973l90319q64735o10463
41128e79458o8834n8224l66784j99563K38297L7913n96086m57520M81285P39555
$$ y = [1173779, 703514, 52544, 99651, 956310, 1671765, 1468534, 709911, 226167, 184984, 156191, -88021, -442371, -907204, -1524414, -1931674, -1604130, -685520, -54535, -262235, -777514, -679577, 131569, 876922, 981897, 718520, 629710, 770504, 852026, 811935, 791465, 705842, 315591, -284140, -665213, -610107, -298962, 70025, 450882, 696954, 605347, 365113, 504921, 1156520, 1772660, 1842454, 1503962, 1150573, 820984, 374988, -36480, -130230, 51982, 235923, 354736, 565835, 895243, 1123038, 994570, 431345, -350238, -875268, -786048, -244101, 295169, 687704, 1075086, 1286059, 895740, 31005, -579458, -648292, -706516, -1073300, -1272863, -1034566, -996653, -1592739, -2050259, -1568974, -829419]
41118h29419j89422p44172K57606J574179J345111j50634j051710n42214M81814
41109A51139R53267O28168j63699p59661m78129M62396Q29665M2530p44802l25531
41099E95343N33767K26026j028597j373048j30908J239657J340727N36044p7737
41090A861274j98605j68974k15142m36571q41500r64051j84189J160666J755659
41081A768567R06459n07300j172079q19937q7615M67008O12868K39682m31974
41072I75679p75348m69453j3352k3657l10513k22727K88428N74980K59680k41057
41062D2660l28805j25K35693P5051j77911j5538N44359Q43261L51563n85081j048106
41051f2979n92919K67522O88153L75712k55159o31494n69997l07161q3251J65441
$$ y = [-829419, -1018841, -1763013, -1505407, 68772, 1413883, 1263249, 211539, -330675, 151139, 1104406, 1732574, 1568875, 809214, 331085, 793481, 1623146, 1665676, 920874, 595343, 1129110, 1355136, 326539, -1046509, -1177417, 62240, 1402967, 1939011, 1861274, 1662669, 1493695, 1278553, 841982, 482, -963569, -1147758, 12908, 1768567, 2675026, 2167726, 995647, 175710, 88095, 555103, 1167971, 1407653, 975679, 200331, -269122, -282474, -306131, -616644, -839371, -550943, 24037, 283717, 42660, -286145, -286270, -50577, 24474, -153437, -168975, 375384, 1218645, 1570208, 985127, -62979, -655898, -388376, 299777, 675489, 420330, -211164, -781161, -1088322, -1171573, -1006132]
41041a006132N56858Q30726N56203j61390o57513o18876m89685n96322m87107
41032b073238K00371P90869M57219k99343k21743P04496J084352K32093p66651
41023A08425p36832j02053J0996m25740n13737J8101N04544M94124K89543K50794
41013a01835L08191L41135M17680M44751J31038m34250o60063k63117K08104R3106
41003D84740m31941o28141k52451K11965L65383L37157K71879n478m35218m25010
40993e07115K59530P62523J67289r66102j129209o518J004575P93963r46j95504
40983A82486K35215N54019N84946N61405K43240o13000j293258r09312O0323L18897
40973g5039k26012l89720K01621M59500k28093q32793l18348P07190R98299M85092
$$ y = [-1006132, -449274, 381452, 937655, 776265, 118752, -500124, -989809, -1586131, -2073238, -1872867, -1081998, -624779, -924122, -1145865, -441369, 642983, 875076, 108425, -628407, -730460, -719464, -1145204, -1658941, -1640840, -1136296, -642172, -352629, -101835, 206356, 547491, 965171, 1409922, 1540960, 1106710, 446647, 183530, 391634, 484740, 52799, -575342, -827793, -615828, -250445, 86712, 358591, 353113, -82105, -507115, -247585, 514938, 682227, -283875, -1413084, -1419602, -415027, 378936, 377990, 182486, 417701, 971720, 1556666, 2118071, 2361311, 1748311, 455053, -454259, -393936, -75039, -301051, -690771, -489150, -29650, -257743, -1090536, -1408884, -701694, 296605, 781697]
40963G81697K6811k7414J1789M7523K34400L80430J69712j66931j39271J85217
40953A503963L22057J76395M2208p3208m21016q34616p67347j35447M11438K63040
40943D87467m27281r16332o05951L62456J139995R94467K14791j88502J21539
40934A182649L08983k76814r11815n15951N85793J003849K90893m89073m16494
40925G62020M9423k5451o73390j175258j105590o26078k9276M62039N94532K79401
40915a487628j21522q7905M00012P48622M16771m32778j055032q70962m2935P05072
40905a828285Q09137L62848q7843j49985O8516J63100o2350l09031j03160N11610
40895f25443Q08114K27093p19865r01225k0746R00239P90873j59222q75226p59568
$$ y = [781697, 808508, 781094, 792883, 840406, 1074806, 1455236, 1624948, 1458017, 1318746, 1503963, 1826020, 2002415, 2044623, 1971415, 1550399, 715783, -51564, -187011, 224427, 487467, 60186, -856146, -1462097, -1099641, 40354, 1034821, 1249612, 1061110, 1182649, 1491632, 1214818, 303003, -212948, 372845, 1376694, 1667587, 1178514, 762020, 811443, 785992, 112602, -1062656, -2168246, -2794324, -2823600, -2361561, -1767029, -1487628, -1609150, -1697055, -1297043, -548421, -131650, -564428, -1619460, -2490422, -2533357, -1828285, -1019148, -656300, -744143, -894128, -825612, -662512, -724862, -1033893, -1137053, -625443, 182671, 409764, -310101, -1211326, -1232072, -331833, 459040, 299818, -575408, -1334976]
40885a334976j90539J81758J71413O7850J87385M66125M79026J5041m48772k90794
40875f96483K31037J95949n04768p75729K3787R06681O88201j36392k08006M49130
40865A73407N06539l65155q52429j29262P60309N01052n42016r95590m67230J46211
40855a264164N6252n35351q88660n26747L54288R83577P40202k2712k94699K19344
40845a178670O60874L64255j03921K2467L27918p5086q79952q89551N2738O93563
40835a005365K49767m53977l20779M27093P67746L99020q7968k36128j51323j5409
40825d27323J63657K81445J43519j57972k66549n3800K14535K55492L7291l31188
40815a40893o67007o67444j77478M14260M45411j58637o39194l03658N75039J079246
$$ y = [-1334976, -1525515, -1343757, -1172344, -1104494, -917109, -450984, 28042, 43083, -405689, -696483, -465446, -269497, -774265, -1549994, -1526207, -619526, 68675, -67717, -275723, 173407, 679946, 314791, -537638, -666900, 93409, 594461, 52445, -943145, -1410375, -1264164, -1207912, -1743263, -2631923, -3158670, -2804382, -1820805, -1080603, -1103315, -1398014, -1178670, -517796, -153541, -257462, -234995, 92923, 17837, -862115, -1751666, -1698928, -1005365, -755598, -1209575, -1530354, -1103261, -335515, 63505, -24463, -260591, -411914, -427323, -263666, 17779, 161298, 3326, -263223, -317023, -102488, 153004, 190295, -140893, -807900, -1475344, -1652822, -1238562, -793151, -951788, -1590982, -1894640, -1319601, -240355]
40805b40355P42541L0699k61760J01796N74679M60674k39264p65804n67309r2252
40795b56355j37523n45800l38929O68826J308777O97092l83473o43746j88132
40786A80737q8696m53180l20285N05225R57663M61331j38019q4976P127o46502
40776C80425j449134j242338j22686P33769P83838N57939M82326L11601j13830
40767C21910m27266l68455k16243k50869k54465Q5320N45631N12011k23867r91372
40757a267665q18933L48897J296615R13805k45350n95570K40467R09839M59335
40748A241440k24715J0359O74873N87535r1111l07393q9976m09884j223341j329072
40738a161285l62054N84960O81195L39117Q8086k07140n25220l69374J68507K46891
$$ y = [-240355, 502186, 532885, 271125, 372921, 947600, 1408274, 1169010, 403206, -164103, -256355, -393878, -939678, -1278607, -609781, 698996, 1396088, 1012615, 368869, 180737, 92041, -361139, -681424, -176199, 781464, 1242795, 1104776, 1019800, 1026927, 380425, -1068709, -2311047, -2433733, -1699964, -916126, -358187, 124139, 435740, 321910, -105356, -473811, -690054, -940923, -1195388, -1110068, -564437, -52426, -276293, -1267665, -2086598, -1737701, -441086, 472719, 227369, -368201, -127734, 782105, 1241440, 1016725, 1027084, 1701957, 2289492, 2198381, 1890988, 1801012, 1391128, 167787, -1161285, -1523339, -938379, -257184, 81933, 170019, -37121, -562341, -931715, -763208, -516317]
40728e16317k51203l56523K33147M42416k52989o30633L03142J430023J163028
40719A564091k1805m36476J01963K66016l43214o28594n8947L80890j22133q73769
40709a71978p90526K3799N78084L65206j81264l85217j17477Q4083l15022r97501
40699a907813r72413O4139J042329Q60842j2049k10942N00222R98266O37276J17952
40689A117809J25190J93798l25811r78729q36652k0541L67239j66321p81526m95954
40679a801498M30792Q62021L83361j23635J94669Q40292O98341j85652o06964
40670F91727j26440J76755m94591j188022o01475Q31816J549353J087433L58658
40661B285214l6895l53008n86940l05557J91493l7277r08381j127292k46773M82085
$$ y = [-516317, -767520, -1124043, -890896, -448480, -701469, -1332102, -1028960, 401063, 1564091, 1542286, 1105810, 1207773, 1473789, 1130575, 501981, 443034, 823924, 701791, -171978, -962504, -938705, -360621, 4585, -176679, -561896, -679373, -595290, -910312, -1907813, -2880226, -2816087, -1773758, -912916, -924965, -1135907, -635685, 362581, 999857, 1117809, 1242999, 1436797, 1110986, 132257, -704395, -724936, -357697, -524018, -1305544, -1801498, -1370706, -508685, -125324, -248959, -54290, 786002, 1484343, 1298691, 691727, 565287, 742042, 247451, -940571, -1542046, -710230, 839123, 1926556, 2285214, 2248319, 1895311, 1308371, 1002814, 1194307, 1157030, 248649, -878643, -1125416, -643331]
40651f43331J27427m18871p3341N29406K21106n18420k83299P99623J109514P8785
40641I28599r11502o18527M04012Q93451N95506J10207k30279m71846m70664m6765
40631A82192M53084M33492r8923m95964l61802l7096q934j95831j33572K94072
40621C0718O55014N35726N8012l04525k78040q329J70540M1542l28504n77170
40611e016l31141K87273O00023J55597n50755o10561M6549N08338J76820l83671
40601a06544l21680K56999N29967J84230k60532l15243j01507M9063P0420L4881
40591B0054m0941l1597K81228P32767O73188k06721j166441j104388J5588R68659
40581A41396P31331l06320r65298p64788k42300N3867K34720N79227R14793Q47891
$$ y = [-643331, -515904, -934775, -1008116, -478710, -257604, -776024, -1059323, -259700, 849814, 928599, 17097, -601430, -197418, 696033, 1291539, 1401746, 1171467, 699621, 228957, 182192, 635276, 1068768, 969845, 473881, 112079, 74983, 66049, -129782, -263354, 30718, 685732, 1221458, 1279470, 974945, 696905, 688576, 859116, 900658, 572154, -5016, -336157, -48884, 551139, 706736, 155981, -454580, -408031, 100307, 277127, -106544, -428224, -171225, 358742, 542972, 282440, -32803, -134310, -85247, -14827, 20054, -20887, -52484, 228744, 961511, 1634699, 1427978, 261537, -842851, -827263, 141396, 872727, 566407, -398891, -1163679, -1405979, -1352112, -1117392, -538165, 376628, 1224519]
40571A224519L35350k62559n29511k58550L61312P11256K90268n18102p20415
40562F33568o0215M94432J23364n85142n30893K03098N54319J65395k31074j63349
40552F03503o7635k89264m33217k00862k9313k90062n35651k15052L80867N63738
40542e12948K68716J0566Q0645L28588N45563O07547M07921J7032k70489l27254
40532A155887l81432n70896o49636m18018p7333J33111K53858K91570Q2020k22712
40522d03581j22539L69723N04609k8676m27894q310O01899M38425k33569m52205
40512B37882k07064k80090o66470n22602K48615O89374L61602J0657J92192L58670
40502D22766m0148n12067l71337J02830J91802r8989k10771j8222J09983M6977
$$ y = [1224519, 1559869, 1297310, 767799, 509249, 870561, 1581817, 1872085, 1353983, 633568, 573353, 1067785, 1191149, 606007, 75114, 278212, 832531, 997926, 766852, 603503, 535868, 246604, -186613, -387475, -416788, -706850, -1242501, -1457553, -1076686, -512948, -244232, -233666, -153021, 175567, 721130, 1328677, 1736598, 1753630, 1483141, 1155887, 774455, 203559, -446077, -864095, -941428, -808317, -554459, -262889, -180869, -403581, -526120, -156397, 348212, 319536, -108358, -116668, 485231, 923656, 690087, 237882, 30818, -249272, -915742, -1438344, -1189729, -500355, -138753, -128096, 64096, 422766, 382618, -129449, -500786, -397956, -206154, -305143, -515914, -534136, -424153, -377176]
40492c77176M2264J84785K56587J24292r4974k40448k12610M9215M47295O74064
40482H53294N08668R9907k09150k59008j66318j39005k63516l77113k00834K14874
40472F1799L33017j89555p90520n72580L73418R28988M85871k15577k73903L3134
40462A74092j40417p13462p43183P9356Q70190P42975m9546n30973k04018N05731
40452i255Q28928M01723m85400j171649j157135n05945K08891M28706J49897r7455
40442a408694J02984M98893M73694r6769o25636o11935k87938j42014j38965P9007
40432b157373M39260M95180J73228j17669j28794K3499K79797O55081Q27617M07569
40422H97395k93997n00322j18396J39623k1273n3835K87929L89130o2735l49796
$$ y = [-377176, -334912, -150127, 106460, 230752, 135778, -104670, -317280, -268065, 179230, 853294, 1361962, 1461869, 1252719, 993711, 827393, 688388, 424872, 47759, -153075, 61799, 394816, 205261, -585259, -1157839, -784421, 144567, 630438, 414861, 140958, 174092, 33675, -679787, -1422970, -1343614, -473424, 269551, 220005, -310968, -514986, -9255, 819673, 1221396, 735996, -435653, -1592788, -2098733, -1889842, -1461136, -1311239, -1408694, -1305710, -806817, -333123, -429892, -1055528, -1667463, -1955401, -2097415, -2236380, -2157373, -1718113, -1222933, -1049705, -1167374, -1296168, -1272669, -992872, -337791, 489826, 897395, 603398, 103076, -15320, 124303, 103030, 49195, 337124, 726254, 663519, 313723]
40412C13723M2700L93253n0327o58634m44059J48990p3120r18440r32874K64057
40402a914731J260606R22020n6072l36562K33300P39213N63902l9190m37817k52507
40392F82162L08304N81080J95133l30060k18158L75136N04218j40535p57909o83929
40382E15442l20771l36961o24680o59584l84546j09606J00550L60377N57060N17860
40372c84859L68439L06805K44133L4552j93131k73707k79189k20358J54573Q43264
40362F00522J239646Q17683r9689p39654p97788m96059l2991M55068O33370L04660
40352A884768j28431j28117J67512J91824j05962k29028k1214J01921r5214l16948
40342A321111k88052r2486J72220M99436N99286R2412o73408p23588J81038R46322
$$ y = [313723, 356423, 749676, 699349, 40715, -403344, -254354, -327474, -1245914, -2178788, -1914731, -654125, 267895, 211823, -124739, 108561, 847774, 1411676, 1372486, 934669, 682162, 990466, 1571546, 1766679, 1436619, 1218461, 1593597, 2097815, 1957280, 1199371, 515442, 194671, -142290, -766970, -1426554, -1811100, -1920706, -1820156, -1459779, -902719, -384859, -16420, 290385, 534518, 569070, 375939, 102232, -176957, -397315, -242742, 600522, 1840168, 2657851, 2558162, 1818508, 1020720, 524661, 491670, 946738, 1580108, 1884768, 1756337, 1628220, 1795732, 1987556, 1881594, 1652566, 1631352, 1733273, 1638059, 1321111, 1033059, 940573, 1112793, 1612229, 2211515, 2303927, 1630519, 906931, 1087969, 2034291]
40332B034291N39068n48684j009550n56142j36030l57703o44996l07104K93304
40323f93546K90162l30107o44885r6142P19155Q61504K70102k91185l58173k71567
40313e44682m16513n04657p6334O08662P99694L10630k54676m13895l30662k01079
40303a023512K25179J002702J398786P00410o03508j223350o84532J52822L56463
40294C01460L8873j38916j5203N6735q6520k47948k73093j76555N1960L70531
40284a18676M90212J72108l12834m39324j47480J19178J15372M4504J8930j66950
40274b24960m85612m65193O2221M87651K35291l26338m00920N4778L39066R5920
40264f28096k73857l34226j41665O7341J86684J10345k02684m07754n6687O30638
$$ y = [2034291, 2573359, 2024675, 1015125, 458983, 322953, -34750, -679746, -986850, -693546, -403384, -733491, -1378376, -1474518, -755363, 106141, 376243, 85058, -273115, -544682, -961195, -1465852, -1542186, -933524, -133830, 176800, -77876, -491771, -822433, -1023512, -798333, 204369, 1603155, 2303565, 1700057, 476707, -207825, -55003, 301460, 340333, 201417, 186214, 242949, 156429, -91519, -364612, -541167, -489207, -118676, 371536, 543644, 230810, -208514, -355994, -236816, -121444, -76940, -58010, -224960, -710572, -1175765, -1113544, -625893, -390602, -716940, -1117860, -1063082, -724016, -628096, -901953, -1236179, -1377844, -1310503, -1123819, -1013474, -1216158, -1623912, -1680599, -1049961]
40254a049961Q50288L21667k73869l12637j02762k39768n89089n53283n2586M05132
40244a596868N03963M16340L60888L16682J93140k1414k48231k72577R2175N88170
40234C32268N95966l3916n99627m42850J33402L81955K05039P0858J01844N868
40224G50807k06357k03927k4029n7135l13911l94369k17644q6796j9463K08940
40214e63884L33235j63871r20635q31021K89138J163864P95775j34096l68488
40205c99983J56105N30103L35374m7112l04175m95637n85077l68292J19900N95931
40195d62863Q51417P63596K52490l90826n06368R6186O52685L73683m51277q78850
40185B99873n52292J01837O17999P51002K80010o58150j224759o98503M15887
$$ y = [-1049961, -199673, 121994, -151875, -464512, -567274, -807042, -1396131, -1949414, -2002000, -1596868, -1092905, -676565, -315677, 1005, 194145, 172731, -75500, -348077, -255902, 332268, 928234, 894318, 294691, -148159, -14757, 367198, 572237, 643095, 744939, 750807, 544450, 340523, 316494, 259359, -54552, -448921, -666565, -753361, -772824, -563884, -230649, -394520, -1315155, -2146176, -1857038, -693174, 102601, -31495, -399983, -243878, 286225, 621599, 574487, 270312, -225325, -810402, -1178694, -1058794, -462863, 388554, 1152150, 1404640, 1013814, 507446, 603632, 1256317, 1630000, 1178723, 299873, -252419, -150582, 467417, 1218419, 1498429, 840279, -384480, -1082983, -667096]
40176f67096Q76238K95401m94430o77416l01580J79003M79539M59044J45148j01449
40166A92402J2416J70327r4056n15261m32837Q6734L51833K37165K74318M95279
40156G78320L09616k40659k93854L43868P01546K19174l27910k20882M727l16562
40146I57384o93925m44803o0710l18850p16884k23102Q21123J016128K1764r84600
40136f26475j069036n71313j63359N6383K01047K08482J69502L59891O96932P66799
40126B8853N17614L00850J83595p2984l39629k43541p053k23837o77333m61672
40116i95137M14902P25507q4008q38115l66368O56549P48312j55359p67771m28353
40106a089841K10634M42009L39126J54065j60253m91643m11653J11813M62485
$$ y = [-667096, 209142, 504543, 10113, -667303, -968883, -789880, -310341, 148703, 293851, 192402, 204818, 375145, 281089, -234172, -667009, -580275, -228442, 8723, 283041, 778320, 1087936, 847277, 553423, 897291, 1598837, 1818011, 1490101, 1269219, 1273946, 957384, 263459, -181344, -242054, -560904, -1277788, -1500890, -679767, 336361, 358125, -626475, -1695511, -2266824, -2430183, -2373800, -2172753, -1964271, -1794769, -1434878, -737946, 28853, 546467, 847317, 1030912, 957928, 618299, 374758, 367705, 143868, -533465, -995137, -580235, 145272, 61264, -776851, -1143219, -486670, 261642, 106283, -661488, -1089841, -879207, -437198, -98072, 55993, -104260, -595903, -1007556, -895743, -433258]
40097d33258K61712k3815J62790N54292M84558m4815l60453j41919J19468j52813
40087D25747q32886j259093r51508Q373J089949J615762J192809J54404n52351
40078H91206k60869O40956J109897O09588m18863j217633j430461j080299l19331
40069a475809M99597Q72923O53224K85213K18281L11895J51864k83485o53254
40060E80449p47899n72975j43502M04314P09062O20607M99982O04938M88708l23713
40050B119971j305948j412103n35625L64729O62047P03510Q58059Q30905L47355
40041B632900k39595n14655n54312m87940j50077L58349M29240j51747o74708
40032F47455n17077j05339j36936l85167j60160M33167O68027M26948K83077L68987
$$ y = [-433258, -171546, -195361, -32571, 521721, 1006279, 961464, 601011, 459092, 578560, 425747, -407139, -1666232, -2617740, -2609367, -1519418, 96344, 1289153, 1443557, 891206, 630337, 1271293, 2381190, 2990778, 2571915, 1354282, -76179, -1156478, -1475809, -976212, -103289, 549935, 835148, 1053429, 1365324, 1517188, 1233703, 580449, -167450, -740425, -883927, -479613, 229449, 850056, 1350038, 1954976, 2443684, 2119971, 814023, -598080, -1133705, -768976, -106929, 596581, 1454640, 2285545, 2632900, 2393305, 1878650, 1324338, 836398, 686321, 1044670, 1473910, 1322163, 647455, 130378, 25039, -111897, -497064, -657224, -224057, 443970, 870918, 1153995, 1522982]
40022A522982J26818n97438j047120n72066L96933Q46785L79256m18817o76760
40013c9427j35432O09886P47732J65355m35549m54677j37603j15573m72396o97948
40003i65632m35239J34639N91549O39063K58380k27793l85727j91619p1734j92137
39993h46250j32225L51053P42541N44995J58843K18793M50026J23376n92795p87760
39983B30597k83870R5000j28626m70406m71614l42828k64262K8848M81189M12378
39973g13594l85983r75661m37047P95741J476598J084470J93537m46849o30488
39964c9276n91522n91761o13842l67878K45856P75360P40431M12015M11756N87856
39954I68995K07607n99330p21347J52836P91036K28626p37709q64249l15553P274
$$ y = [1522982, 1649800, 1052362, 5242, -566824, -169891, 676894, 1056150, 637333, -39427, -174859, 435027, 1182759, 1348114, 912565, 457888, 320285, 204712, -267684, -965632, -1400871, -1266232, -674683, -35620, 222760, -5033, -390760, -582379, -654113, -846250, -978475, -627422, 115119, 660114, 818957, 1037750, 1487776, 1611152, 1018357, 230597, -53273, 41727, -86899, -557305, -1028919, -1371747, -1636009, -1607161, -1125972, -713594, -1099577, -2075238, -2512285, -1716544, -239946, 844524, 1038061, 591212, -39276, -630798, -1222559, -1836401, -2204279, -1958423, -1183063, -442632, -30617, 381139, 968995, 1176602, 577272, -144075, 8761, 799797, 1028423, 290714, -573535, -889088, -881814]
39944h81814J72593P76373J332371P57596o57860j354427p48792N9981J51380
39935c92599k9409J19339K27552j78519o62342n89795j47035J27748K35899M09234
39925h79927M32482K4301m91154n79588k58991J16520M85191Q75845R27968L27765
39915I80412m92723p92772n30667k66987j65006J64129P48781R27994K54588p73139
39905E4610j252856q79114j29172L66074M11504K91692L57756N72685N35740N9211
39895C88130m37298l81915J74564N75897L85223j28818m36419l84691j98702m5671
39885d89700J47755M59900P18242N95056J6187n87375o48661j65693K28740R7547
39875C71998k08018j52515R4387k5666m18191l98204J22868L80408M2354j27461
$$ y = [-881814, -709221, 67152, 1399523, 2157119, 1499259, 144832, -603960, -543979, -392599, -422008, -302669, -75117, -253636, -915978, -1505773, -1652808, -1525060, -1289161, -879927, -447445, -423144, -914298, -1493886, -1752877, -1636357, -1151166, -275321, 652647, 980412, 487689, -305083, -835750, -1102737, -1267743, -1103614, -354833, 573161, 827749, 54610, -1198246, -2077360, -2206532, -1840458, -1428954, -1137262, -779506, -206821, 328919, 388130, -49168, -431083, -256519, 319378, 704601, 575783, 139364, -245327, -444029, -489700, -341945, 117955, 836197, 1431253, 1447440, 860065, 211404, 45711, 274451, 371998, 163980, 11465, 105852, 80186, -338005, -736209, -613341, -232933, -190579, -318040]
39865c18040M37573R38387L52195p77290r62147m6353N17810m8401o54623j65328
39855g26217P46826P15020j32197m59128J24973N91501K57155k52623k23230L5806
39845F77886n3348k84225j44853K08110K56620O1484J12157L92017L31158k67973
39835A289033q54177q27940k12802M96870Q50800P16110K88782q0337k10849k29154
39825A226336k89933l36996l17029l75487n49360n38486j72692J71899J19744
39816a062004k0392K29963N47506K06899n81739p20927J42773J005342R95592
39807G43013N54123M22821L18067l66302j130320q90557K46035R39753M87572
39798A324205l24557n36738k09157J50908M51769O61913L65944n04214j081013
$$ y = [-318040, 119533, 1057920, 1410115, 632825, -329322, -375675, 142135, 93734, -560889, -726217, 20609, 735629, 603432, 144304, 269277, 860778, 1117933, 865310, 642080, 677886, 624538, 340313, 195460, 403570, 660190, 721674, 833831, 1225848, 1557006, 1289033, 434856, -393084, -605886, -109016, 741784, 1457894, 1746676, 1666339, 1455490, 1226336, 936403, 599407, 282378, -93109, -642469, -1180955, -1353647, -1181748, -1062004, -1082396, -852433, -304927, -98028, -679767, -1400694, -1257921, -252579, 743013, 1297136, 1719957, 2038024, 1671722, 541402, -349155, -103120, 836633, 1324205, 999648, 462910, 253753, 404661, 856430, 1518343, 1884287, 1380073, 299060]
39789B99060o32106J95814K27945m03375m62917L29079P58059Q4378o87316l77656
39779f69035N03854O26688o1420m27953q1941J67197j28957l45101k8137K98317
39769a46488J67787Q388K36257M12914J35965n7497L43539O96540K02095n75716
39759A423784n29980N5056q5623r70511j190124k14606O96198M86539j86482k36768
39749g52517K59402O54657Q51081Q70762L03158p60306j185901l87129M35214
39740B88421J1879q67033n94399N21788P26703k26709p12241n1209M13161k28177
39730g17816q66818l81251M19047K81146l38870k04851N29196P31675L03541J42736
39720a02265L88284K82613k42078l36813J99136M81809M5498m30547l85335k42434
$$ y = [299060, -333046, -137232, 90713, -312662, -775579, -446500, 311559, 395937, -291379, -669035, -165181, 461507, 400087, -27866, -109807, 57390, -71567, -416668, -444805, -146488, 21299, 29687, 265944, 678858, 814823, 757326, 1100865, 1797405, 1999500, 1423784, 893804, 948860, 863237, -107274, -1297398, -1512004, -815806, -329267, -515749, -752517, -493115, 161542, 1012623, 1883385, 2186543, 1426237, 240336, -146793, 288421, 300300, -566733, -1161132, -639344, 87359, -139350, -851591, -902800, -489639, -717816, -1584634, -1965885, -1546838, -1265692, -1604562, -1809413, -1280217, -548542, -245001, -102265, 286019, 568632, 326554, -10259, 188877, 670686, 716184, 285637, -99698, -342132]
39710c42132l80147k69785N01089J157151P12467m57471j037604n67616J19713
39701e64335K56121O1743N9458J82596O4023j92188j11098L53851O26485K93713
39691A030369k66078l89061p7648K8437l43484o64192m35054N0077K35551J68514
39681f62569K09301K13304j93581o79904m74478L56898Q34702N25260J51985L14849
39671E95767N15780J30627m40208m46735k5086J56000N4041J17306K93607J42337
39661A093436k26177k73188k4271M76j58767Q2951O47011O29620k80832j128417
39651C61842r47687P879P97401R36460N17545k29407r39976j134898p57389l30246
39641a718476j90072j1417N21535J107834J370498J447494J486316J133281K20654
$$ y = [-342132, -722279, -992064, -490975, 666176, 1378643, 921172, -116432, -684048, -564335, -308214, -246471, -187013, -4417, 59606, -132582, -243680, 110171, 736656, 1030369, 764291, 375230, 297582, 326019, -17465, -681657, -1116711, -1066634, -831083, -662569, -453268, -239964, -433545, -1113449, -1587927, -1231029, -396327, 128933, 280918, 595767, 1111547, 1242174, 801966, 355231, 330145, 486145, 540186, 657492, 951099, 1093436, 867259, 594071, 569800, 570276, 411509, 494460, 1141471, 1771091, 1490259, 361842, -585845, -577966, 219435, 1155895, 1673440, 1444033, 504057, -630841, -1388230, -1718476, -1908548, -1919965, -1398430, -290596, 1079902, 2527396, 4013712, 5146993, 5367647]
39632E367647n91468o92774n53324r12020j364160r57361J1445J90450o55248
39623a56813j070196j06258J132412J095160L3466n33514j02078L27352r230n72265
39613C8036n46791o5521J80455J7189j69936j96139k26879k19815J24592O55636
39603d09173O27977k44624j028233n97394P17046J367508O72929k06434N2370
39594I51972R99420J076589j27263j338019j390157o10513k0016J03410K35607
39585a18970N80545P13306K50552n44041r82819o72819N1638M46978J58560l93816
39575e10886n66503k78429K7407P8210K1475R470q253k415J71282L90389L10199
39564c58054k0358p7621L17382N99489L01640j59371j17888K47742J74632m22049
$$ y = [5367647, 4776179, 4083405, 3530081, 2618061, 1253901, 296540, 307985, 498435, -156813, -1227009, -1333267, -200855, 894305, 927771, 394257, 292179, 619531, 610301, 38036, -508755, -574276, -393821, -376632, -546568, -742707, -969586, -1189401, -1064809, -409173, 218804, -25820, -1054053, -1651447, -934401, 433107, 1106036, 899602, 951972, 1951392, 3027981, 2900718, 1562699, 172542, -437971, -457987, -354577, -118970, 461575, 1174881, 1425433, 881392, -101427, -774246, -722608, -275630, -117070, -510886, -1077389, -1355818, -1328411, -1250201, -1228726, -1219256, -1227509, -1229924, -1058642, -668253, -358054, -378412, -456033, -138651, 460838, 762478, 603107, 485219, 732961, 907593, 485544]
39554D85544o90435n1174R12757J156706M31958n51195j056432j033605q87606
39545a283482q50405p64629l88844K33306P35276P50797L18489o0333P5129N36821
39535f97875O27847P3812m90768l65653J65935K90688K4063J74788P80447P07408
39525A290692n33962j628552j186943J65889P66962M12329K86437O52037M46043
39516F70932n68380j076420l59679M56267L18738l0048M57853J136961P28179
39507A734403m48262r48421m42968J05254K44091M39727P09964L94007m58672
39498A329123q47809l90971P1184o5491k21236K09078P06836M28863n04990j245052
39488e30465j260843n96086M37534J262926J205947K93443m57674j66206P34440
$$ y = [485544, -204891, -256065, 656692, 1813398, 2245356, 1694161, 637729, -395876, -1283482, -2133887, -2898516, -3287360, -3054054, -2318778, -1567981, -1249492, -1309825, -1234696, -697875, -70028, 3784, -486984, -852637, -686702, -396014, -371951, -197163, 583284, 1290692, 756730, -871822, -2058765, -1892876, -1125914, -713585, -427148, 224889, 670932, 102552, -973868, -1333547, -877280, -558542, -588590, -130737, 1006224, 1734403, 1286141, 337720, -105248, 6, 244097, 683824, 1393788, 1787795, 1329123, 481314, 90343, 161527, 96036, -125200, 83878, 790714, 1219577, 714587, -530465, -1791308, -2387394, -1949860, -686934, 519013, 812456, 354782, 188576, 923016]
39479I23016J030429K91440o80549r59540n31001n5391M2712m7479K6033K14591
39469B54261J47414k79512o74742o59608l56042j25385n9339m9365j20407k83051
39459b205776k69804R8592M79954M85856L77280O15411R03217N34143l19783o29020
39449G0070k4563O37956O05094K32389J42810J93062k8522l19411k59619n0080
39439A199186j90890n94477p08728l75390J0958J20330J8493n6489M8306K52021
39429b76680K05809k94564p53827l74018P23314J323378O66819m33997o93195
39420I3039o7645M03251J34230m37843o62449l44501L08495Q33569P43742J22982
39410A126870k57441L6361L26101k05474j121119j243782l97544L75633L84179
$$ y = [923016, 1953445, 2244885, 1564336, 604796, 73795, 18404, 61116, 13637, 39670, 254261, 401675, 122163, -552579, -1212187, -1568229, -1693614, -1752953, -1802318, -1922725, -2205776, -2475580, -2376988, -1897034, -1411178, -1033898, -418487, 484730, 1018873, 699090, 70070, 45507, 683463, 1288557, 1520946, 1663756, 1856818, 1828296, 1508885, 1249266, 1199186, 1008296, 413819, -294909, -670299, -659341, -539011, -520518, -577007, -528701, -276680, -70871, -365435, -1119262, -1493280, -769966, 553412, 1220231, 786234, 93039, 25394, 428645, 562875, 125032, -537417, -881918, -573423, 260146, 1003888, 1126870, 869429, 905790, 1231891, 1026417, -94702, -1338484, -1736028, -1360395, -976216]
39401i76216R4963J47548M29752N00974K65538j30265n46454p37021m78410K294
39391a427297K09308R9580R2363K95969L59111J91787J24198J82914k4702m53329
39381c50098m61967J01743M61598Q4364m32842k82591L44439O55230L97488m8896
39371D68468l51706l97005j12592L26313M34751O3969k44013k9821L77563M57618
39361I93545L32539L88365N22668M51403L15315K54820j12427r22446j304158
39352I19624m97726O59297O64681l96415r33833k64475N14350M34451K5783R4810
39342A220547L56775J85833k00617k30064N4824L19914N66505O80958J01750j177814
39332A878611j980480j351827l3558N38201K08913p7098j0382j36993n21848n47192
$$ y = [-976216, -881253, -733705, -303953, 197021, 462559, 332294, -214160, -951181, -1429591, -1427297, -1217989, -1118409, -1026046, -730077, -370966, -179179, -54981, 127933, 103231, -350098, -812065, -710322, -248724, -164360, -597202, -879793, -535354, 119876, 517364, 468468, 116762, -280243, -392835, -66522, 368229, 432198, 188185, 158364, 535927, 993545, 1326084, 1714449, 2237117, 2688520, 3003835, 3258655, 3146228, 2223782, 919624, 421898, 1081195, 1745876, 1349461, 415628, 151153, 665503, 1099954, 1125737, 1220547, 1577322, 1763155, 1562538, 1332474, 1387298, 1707212, 2273717, 2954675, 3056425, 1878611, -101869, -1453696, -1487254, -949053, -740140, -817238, -827620, -964613, -1486461, -2033653]
39322b033653j25900J10723K954Q1749M07400L92532P9595L27142J218483J532055
39312A993080N45256p30256j008679m94163k06371l30418l18143o3623R7007J80972
39302c35338L91388M75715J41626k12854p0858K42631J07907k28321j00610K40138
39292F51424m6462q06867r27618j36375M74879J55582l80758j73132N20606P25760
39282E7039J69100m81467n16408J02870P29733N76813m08314j215129q33759L74234
39272a445288J063595O97144P9594p6276j01161m33897p15459n18227j85544j62437
39262a797956j42137L12270Q52214Q78512N19949K54687N805m91376q14930l66674
39252g89636M57901O45461P3546l46619j30727J38367q7991m37306k98764K18843
$$ y = [-2033653, -2159553, -2048830, -2045876, -1964127, -1556727, -1164195, -1084600, -757458, 461025, 1993080, 2538336, 1808080, 799401, 305238, 98867, -231551, -549694, -613317, -516310, -335338, 56050, 531765, 673391, 460537, 389679, 632310, 740217, 511896, 411286, 651424, 604962, -201905, -1129523, -1265898, -791019, -635437, -1016195, -1189327, -668721, 57039, 226139, -255328, -771736, -668866, 60867, 637680, 229366, -985763, -1819522, -1445288, -381693, 315451, 395045, 318769, 217608, -216289, -931748, -1449975, -1635519, -1797956, -1940093, -1627823, -775609, 102903, 622852, 877539, 883344, 391968, -422962, -789636, -331735, 313726, 387272, 40653, -90074, 48293, -39698, -477004, -775768, -556925]
39242e56925N24652L73385K3410k25288l27994m16150n80487o85985m39324J94269
39232b116437P44301P13215K62855N4039L44408O23289L29362l61910p54494n16705
39222f78077n6965O0622j36216j27426K84353O41480N31730K29520J84846K13373
39212A147240j18626n31426l69139J31722J2529p23765q23860K11108J043212
39203b1005M28199p76269q34117L13418J130866P70753j15395p13293q62270n12547
39193a191660L42226J004389N65291o14915j044456j42706R00057Q41785J5917
39184F75928m28182j27421M07398P48551Q46166O84054K71774j45253k69357p0716
39174B592942K33676L45881J2567o85078j159873q64653m2394N24246N07050K39538
$$ y = [-556925, -32273, 341112, 364522, 139234, -188760, -604910, -1185397, -1871382, -2310706, -2116437, -1372136, -658921, -396066, -342027, 2381, 625670, 955032, 593122, -161372, -678077, -735042, -674420, -810636, -938062, -653709, -12229, 519501, 749021, 933867, 1147240, 1028614, 497188, 128049, 259771, 272300, -451465, -1275325, -1064217, -21005, 407194, -369075, -1203192, -889774, 241092, 1011845, 896450, 183157, -679113, -1191660, -849434, 154955, 720246, 105331, -939125, -1081831, -181774, 660011, 675928, 247746, 120325, 527723, 1276274, 2122440, 2806494, 3078268, 2933015, 2663658, 2592942, 2826618, 3172499, 3185066, 2499988, 1340115, 475462, 433068, 957314, 1464364, 1703902]
39164A703902k9726l75666o03499k32440O23857J090170O53747j50856n83786
39155B095703o46551p37138q88501q76336p06998n14482k44163J67160N28705
39146a822601O37277N88391O10778P60954R05259Q18290L05938m90300r98447
39137A315539q20008l14123r5390j22646N9658L34335J34447m34768n51142L1886
39127d62212N54610M43909R3032M4217J68436J24299l4226j52215k83185l37615
39117A59050k0739N44598P38363L07697k59397m67065l39489p4420J92752K28408
39107A009758P701O7262O56399Q20110l63214j849992j677978j9445Q40313K0035
39097d89051o99505m2178O73804J12672n69289J85367J464521J393598K40109
$$ y = [1703902, 1674176, 1298510, 695011, 462571, 1086428, 2176598, 2830345, 2679489, 2095703, 1449152, 712014, -176487, -1052823, -1759821, -2274303, -2518466, -2351306, -1822601, -1185324, -596933, 13845, 774799, 1680058, 2498348, 2804286, 2313986, 1315539, 495531, 181408, 86018, -36628, 23030, 357365, 491812, 57044, -494098, -462212, 92398, 536307, 629339, 673556, 841992, 966291, 932065, 779850, 496665, 159050, 138311, 682909, 1421272, 1728969, 1469572, 1002507, 663018, 588598, 781350, 1009758, 1017459, 1084721, 1741120, 2561230, 2198016, 348024, -1329954, -1349399, -509086, -489051, -1188556, -1230734, -556930, -444258, -1013547, -828180, 636341, 2029939, 2270048]
39088B270048l08458k2738K790l52857l24178j14541m82371r07782l44853N71307
39078a3633L23424p41790q26210K32482P30935J29052j87238L54350M85397l65810
39068A20959q32477m6063P36198K86278n59867m87930J10318O4151n45937p52727
39058a907097l62024R585N7930j1718k292K16774O96982J039366O82302j23526
39048B96282m39068j6884L96837L94862L86243M10324j64565j197818j441338
39039a375125m27572O30939O83447K65163J57860K9864m43555m87367L45611Q97531
39029B76796J44283q60469n30541O35550Q94442J16861k26374K98608N20723p0596
39019A199283l95220K74972R97754O44168m04159r22543m88139K94051P21598
$$ y = [2270048, 1961590, 1938852, 1941642, 1588785, 1264607, 1150066, 667695, -240087, -584940, -13633, 309791, -431999, -1258209, -1025727, -294792, -165740, -352978, 1372, 486769, 120959, -711518, -757581, -21383, 264895, -294972, -782902, -672584, -608433, -1154370, -1907097, -2269121, -2259536, -2201606, -2213324, -2215616, -1998842, -1301860, -262494, 419808, 296282, -142786, -159670, 237167, 632029, 1018272, 1428596, 1264031, 66213, -1375125, -1802697, -1171758, -488311, -223148, -65288, -35424, -478979, -966346, -620735, 276796, 421079, -439390, -969931, -334381, 560061, 676922, 450548, 749156, 1269879, 1199283, 804063, 1079035, 2076789, 2720957, 2316798, 1394255, 906116, 1200167, 1921765]
39010A921765N30157j61118r01585j084017m95437L32754N94987Q6693n31544
39001B92655m70549K20036O59599K55804n02646p47083l96837j6030K13205N02237
38991A0391N86701l7389q90490p57365M37540J230231P05770k29527m67225l52484
38981B36153o27909q59467l19994M11215K79941l73775l44888L74255O34067J21205
38971d69197k32465L8029K57744j3091k28559K1867K55854O2972j01001K39229
38961a68618O63748N10552m3630k43996J49502N91424M99283j04445o97157p85818
38951C70845l25154K69297M87615J41229m97177q74538n76030K17958P64739N53033
38941E31817j2910j38998K32014M14553J10495j93303j27960L9819Q2081J92732
$$ y = [1921765, 2451922, 2290804, 1389219, 305202, -190235, 142519, 737506, 824199, 292655, -177894, 42142, 701741, 957545, 454899, -292184, -689021, -705051, -491846, 10391, 597092, 559703, -330787, -1088152, -650612, 579619, 1285389, 1055862, 588637, 236153, -391756, -1251223, -1571217, -1160002, -880061, -1253836, -1598724, -1224469, -590402, -469197, -701662, -663633, -405889, -418980, -647539, -625672, -369818, -306846, -407847, -168618, 495130, 1005682, 962052, 718056, 867558, 1458982, 1958265, 1853820, 1156663, 370845, 45691, 314988, 802603, 943832, 446655, -427883, -1003913, -785955, -21216, 531817, 518907, 379909, 611923, 1026476, 1136971, 943668, 815708, 855527, 937608, 1130340]
38931A130340L20304j4516p26973q91887j19895O63285N87034J10331J2762R239
38921A080024m43094p21431J07736J417437J549019K08831j047317r73145r5886
38912A082174L88292K03257j04750j94469k17063l28670l87774j83536K16257
38903D73718N08983O01697P55665R98101P60921k28623j023479m88366Q15669
38894C174286J088933j26016j239123j005079j53023J61195O3191N2123k41610
38885A774877j076138j533634q28051K90422P41652P32037Q62442P38933l0583
38876A671957n54569m1160N65934J15068o06323k35186N94526K90828p71442p80359
38866B49274L91651J000433L54220l35118k45572l4124k53048m56145l04169r7632
$$ y = [1130340, 1450644, 1436128, 709155, -182732, -302627, 360658, 947692, 1058023, 1070785, 1080024, 636930, -84501, 23235, 1440672, 2989691, 3198522, 2151205, 1178060, 1082174, 1470466, 1673723, 1568973, 1374504, 1157441, 828771, 440997, 257461, 473718, 982701, 1584398, 2340063, 3338164, 4099085, 3870462, 2846983, 2358617, 3174286, 4263219, 4137203, 2898080, 1893001, 1739978, 1901173, 1964364, 2016487, 1774877, 698739, -834895, -1662946, -1372524, -630872, 101165, 963607, 1702540, 1671957, 1117388, 1076228, 1642162, 1757230, 1150907, 915721, 1510247, 1801075, 1029633, 249274, 640925, 1641358, 1995578, 1660460, 1414888, 1380764, 1127716, 671571, 367402, 269770]
38856B69770N7561L50696N11929J66863k55452j81823k9776l83926o76565j57444
38846c28167N68604N64730K51407L83551M25957j52291k81503P58270J262398
38837C452956l11175k148466j643359J96140M89240n57822m46504P67267Q11956
38828F10233j24562L22176J849371J653057l33616j110719L3819O01937j36507
38819C365189j25867Q78359P38121l57152J24950J724530J327333n34190m1605
38810G099668K497786K718892P12864J394075M792483N120563J873856J558345
38802B7768532N045804N056745J062302K935814J2534954J7838082J7036906K9742253
38794A19021392O3426794Q4253614N1774442k1373397p5442210p4251202m2303456
$$ y = [269770, 327331, 678027, 1189956, 1356819, 1101367, 919544, 889768, 505842, -170723, -328167, 240437, 805167, 1056574, 1440125, 1866082, 1713791, 1432288, 2190558, 3452956, 3141781, 993315, -650044, -453904, 35336, -522486, -968990, -201723, 610233, 485671, 807847, 2657218, 4310275, 3976659, 2865940, 2899759, 3501696, 3365189, 3239322, 4117681, 4855802, 4498650, 4623600, 6348130, 7675463, 7141273, 7099668, 9597454, 12316346, 13029210, 14423285, 19215768, 24336331, 26210187, 27768532, 32814336, 37871081, 38933383, 41869197, 54404151, 72242233, 89279139, 119021392, 182448186, 266701800, 318476242, 297102845, 221660635, 147409433, 105105977]
38787A05105977k1769585j9824499j7232728p593469k014621m303637n573430
38780B6794008k155058n37258l365501m950843k663620j023943k260771k719268
38772G117746q37936l8456j514357j850572O2350P70858r78426j746695P3471
38763A057983J292388m9660j226511r7230J128840K86193r10895l99272N29092
38754A610928j2424j058224q56152O8310L54051K67814N99394Q28112K38007n53799
38744A486017o45083k09355K05517N30315O49654K76979k43349k96545k23252
38735A530898p09882j167322n34196N77687O42682j29204k30542K90050K7344
38726B97515q21024n66609P28959J116971K66478K3351Q47497R11843k82926o77130
$$ y = [105105977, 83336392, 63511893, 46279165, 38685696, 36671075, 32367438, 26794008, 24638950, 24101692, 20736191, 15785348, 13121728, 12097785, 9837014, 7117746, 6279810, 6241354, 4726997, 2876425, 2938775, 3709633, 2731207, 984512, 1057983, 2350371, 2300711, 1074200, 976970, 2105810, 2392003, 1481108, 1081836, 1610928, 1598504, 540280, -315872, -247562, 106489, 374303, 973697, 1801809, 2039816, 1486017, 840934, 631579, 837096, 1367411, 2017065, 2294044, 2050695, 1754150, 1530898, 821016, -346306, -880502, -302815, 339867, 210663, -19879, 270171, 297515, -523509, -1090118, -361159, 755812, 1022290, 1045641, 1893138, 2804981, 2522055, 1844925]
38716A844925N80489J317393Q3936j237679p13638L84195K9001j054110r27505
38707C07007J78377N48956j27556p74814r05479p17013j10353P56093Q97133j1635
38697D0716o44358O320Q58378N16043l98435m41601K18006M30562K16646L85854
38687A188131P24514M43304j07978J8292N24527L12678n07221p33340q6642M27763
38677B204028J93486l24109o27790p69284p84910n20661j11265R3261M1519j00221
38667g05946k46264j50156N43911J440552J396462J80241p66023k72423P16880
38658B137234N46327o14431j141068m66491L03729K39696k75545m40675q9808
38649A98968L55422L89834j03804n39927j90556O07821O15291l96860r86736k03586
$$ y = [1844925, 2425414, 3742807, 3826743, 2589064, 1875426, 2259621, 2288622, 1234512, 307007, 485384, 1034340, 906784, 131970, -773509, -1490522, -1600875, -844782, 52351, 40716, -603642, -597322, 261056, 777099, 378664, -62937, 155069, 585631, 802277, 1188131, 1912645, 2355949, 2247971, 2266263, 2790790, 3103468, 2596247, 1862907, 1776265, 2204028, 2397514, 2073405, 1445615, 676331, -108579, -629240, -740505, -647244, -605725, -705946, -952210, -1102366, -558455, 882097, 2278559, 2458800, 1692777, 1420354, 2137234, 2683561, 2069130, 928062, 461571, 765300, 1004996, 729451, 288776, 198968, 554390, 944224, 840420, 300493, 109937, 717758, 1333049, 936189, -50547, -254133]
38639b54133P94300N84749k10200j38822N25069M26527l35954m78596J4377o1856
38629H65461p06800o27909K12100L03602o09421p82743N21688J511886P25586
38620A413450n51603m66343M08581L06564o23213o80437L97337R86990K36020
38611A427346p03838o30159J5528K14318K8902J73360N52397L36729n82019j157392
38601c24828n77876N13789Q02293N2400o32796l81970L54518O82926N62079N10779
38591A561314N00153Q4334n36959n97772k6529L06576q9828n95970n15287j07615
38581a7583o383j72850r6171L09996O21916N32423R7712m72674q79695p78845
38571h62154j61801M42762N01771R0079l14809m53944l62206l6125N10813R44102
$$ y = [-254133, 540167, 1124916, 914716, 775894, 1300963, 1727490, 1391536, 912940, 927317, 865461, 158661, -469248, -257148, 46454, -562967, -1345710, -824022, 687864, 1413450, 861847, 395504, 804085, 1110649, 487436, -193001, 204336, 1191326, 1427346, 723508, 93349, 108877, 323195, 352097, 525457, 1077854, 1414583, 832564, -324828, -902704, -388915, 413378, 465778, -167018, -548988, -194470, 488456, 1050535, 1561314, 2061467, 2145801, 1608842, 1011070, 984541, 1291117, 1201289, 605319, 90032, -17583, -23966, -196816, -292987, 17009, 638925, 1171348, 1269060, 796386, -83309, -862154, -1023955, -581193, -79422, 10657, -304152, -758096, -1120302, -1156427, -645614, 298488]
38561B98488Q36705K62301k25268l03553k21931k85318l48948j19545K67910L59070
38551E19911L2294l10519l04377p2892P7602J55826L53357N72751N04910J66310
38541A695173p1403q4464j92500n50525p85799n81254k39218k03454k99885j1770
38531a325099O08616Q91355M90365j12303k44195J41117M99661L56064k41716
38522A063865q19065r17849m91738R8008M65773M93744K45866j72741n27655m76606
38512a038398M1598N86064O68039L37793N3019L5845M7538j87986n70057p20531
38502g47076m29855L8215J80798q5401j79201L70772J049829Q76501j38958q15575
38492A20049m06507L87096N62720K49846J98011M08938K76263k12170m28792j94507
$$ y = [298488, 1135193, 1397494, 1172226, 868673, 646742, 361424, 12476, -107069, 160841, 519911, 552205, 241686, -62691, -135583, -57981, 97845, 451202, 1023953, 1528863, 1695173, 1623770, 1539306, 1346806, 796281, 10482, -570772, -809990, -1013444, -1313329, -1325099, -716483, 174872, 665237, 552934, 308739, 449856, 949517, 1305581, 1063865, 244800, -673049, -1164787, -1066779, -601006, -107262, 138604, -34137, -561792, -1038398, -996800, -410736, 257303, 595096, 648115, 683960, 731498, 543512, -26545, -747076, -1176931, -1138716, -957918, -1043319, -1222520, -851748, 198081, 1074582, 935624, 120049, -286458, 100638, 663358, 913204, 1111215, 1520153, 1796416, 1584246, 1155454, 960947]
38482I60947R14r3472j82971j15878j17961k18393j48829O0578O7754q8467L842
38471A28064K92514K05547l20490n33472J1601O97526P17426J87857j44130L5001
38461A277444L31122K71710j50340n28324n00447j87146q1434l61454n71079l21634
38451h21582J7568j16851n20845n43372j55605J25404K29496N04748P66825M54943
38441e9271j86012k37270L49151N41961n1738n06437j73014L08120L38443M45257
38431G69190J034126J230377K41465j040193j183108l03093L51628L45044J89665
38422A635101R20m83705q09286k65900O23252N96005k86727o10721R3058N83806
38412A075803K382p37952n09599K88806N77079K71326N1476R3713N8697q3625
$$ y = [960947, 961861, 868389, 685418, 569540, 451579, 233186, 84357, 144935, 212689, 124222, 128064, 420578, 626125, 305635, -227837, -216236, 481290, 1198716, 1386573, 1242443, 1277444, 1608566, 1880276, 1729936, 1201612, 701165, 514019, 432585, 71131, -499948, -821582, -804014, -920865, -1441710, -1985082, -2140687, -2015283, -1785787, -1281039, -514214, -59271, -245283, -482553, -133402, 408559, 356821, -149616, -322630, -14510, 323933, 769190, 1803316, 3033693, 3275158, 2234965, 1051857, 748764, 1100392, 1445436, 1635101, 1636021, 1152316, 343030, 77130, 700382, 1296387, 1009660, 398939, 491997, 1075803, 1078185, 340233, -169366, 119440, 696519, 967845, 1019321, 1113034, 1171731, 1088106]
38402A088106j35415k58202o40283q41901l13441N78035Q53824K51403m71942
38393A10184o38700l94152j66385K8263L74534O99219N52760j53363q30999p31130
38383a149769J69502R85198Q97113J78019k30949j12213j82346o80623p10542
38374h36610K68281J143661N53081r02151j298183j74356Q75878P30688K55581
38365F15870M78029P40288K1927j001143r02544R7141M45995k12972n84513L0888
38355b71034P01293N72403J06539q5235k74375o20057m36714M84088R90517K57230
38345A424655o72074m47124L84343L89692k15863K1666J110929J360143O6168
38336C422535j350133j484200p23631j81652j13492j46117p1076K43902Q45802
$$ y = [1088106, 952691, 694489, 54206, -787695, -1101136, -523101, 330723, 582126, 110184, -528516, -922668, -1089053, -1060790, -686256, 12963, 565723, 412360, -418639, -1149769, -980267, 4931, 902044, 1080063, 849114, 736901, 554555, -126068, -836610, -568329, 575332, 1128413, 226262, -1071921, -1246277, -370399, 360289, 615870, 1093899, 1834187, 1856114, 854971, -47573, 49568, 495563, 282591, -301922, -271034, 430259, 1002662, 1109201, 1023966, 749591, 129534, -307180, 176908, 1167425, 1424655, 752581, 305457, 689800, 1079492, 863629, 885295, 1996224, 3356367, 3422535, 2072402, 588202, -135429, -317081, -430573, -576690, -647766, -403864, 441938]
38327D41938J143902L68421j018231j553060q97570l68989o77424o80983N15070
38318b726926J710879J378479J09390m01864L7493K94896P2311N3800K36964n8961
38308G06461o08251m47829K86513L82780l47712o55781J1736N56858J07206n67983
38298e76002m21516K31090M18469J5718l86672m85370l35805N3864N13711N82027
38288c90486J88458k6542L43731P21239L79496m09726p51214l57586K11226L58812
38278B67408J7533m42037n13223K8783P37941Q21835J19249o08253o44184j60261
38268c75209K31766L07393J94193m4820k97468k40741K02884N62371M45415J33675
38258A119459N2180K1944l21506o68243l72351M31105Q16811L18565m35925n93665
$$ y = [441938, 1585840, 1954261, 936030, -617030, -1514600, -1883589, -2561013, -3241996, -2726926, -1016047, 362432, 471822, 69958, 107451, 402347, 474658, 528458, 765422, 706461, 98210, -349619, -63106, 319674, -28038, -683819, -672083, -115225, -8019, -576002, -997518, -766428, -347959, -332241, -718913, -1204283, -1540088, -1486224, -972513, -390486, -202028, -228570, 115161, 836400, 1215896, 806170, 54956, -302630, -91404, 267408, 284941, -157096, -670319, -641536, 96405, 918240, 1037489, 429236, -214948, -375209, -143443, 163950, 358143, 313323, 15855, -224886, -22002, 540369, 985784, 1119459, 1171639, 1193583, 872077, 203834, -168517, 262588, 1079399, 1397964, 962039, 368374]
38248C68374j07905M09884N37240L72298J53985r3333m32779p21740o73997k43349
38238d31322K54128N27508O15372N92592K47544n14560j132606q73161J08946
38229f05559Q03846O02740n5924n03713o70577p35844n61170j6961N43201O76740
38219e23221M37672J38909j44164l95353l52220Q2350M24875J98071k71754k36103
38209f40938M07795R79579R00951K46495n36174r98800q25212o1450P32942R26822
38199A132010M68303j48974n06200n66062m57390l00777k35098l25672m16919
38190a356779k59002K17277Q12632J139912Q24888p0810q29617p41038m8881L56574
38180D5156K97040N06164J136388J138256o1685j245581r84043J44693L44982
$$ y = [368374, 260469, 670353, 1207593, 1579891, 1733876, 1640543, 1207764, 486024, -187973, -431322, -177194, 350314, 965686, 1558278, 1805822, 1291262, 158656, -714505, -605559, 198287, 801027, 745103, 241390, -429187, -1165031, -1726201, -1743162, -1199961, -523221, -85549, 53360, -90804, -486157, -838377, -756027, -331152, -133081, -404835, -640938, -233143, 746436, 1647387, 1893882, 1357708, 358908, -466304, -527754, 205188, 1132010, 1600313, 1451339, 945139, 379077, -78313, -379090, -614188, -939860, -1356779, -1615781, -1398504, -585872, 554040, 1378928, 1308118, 478501, -262537, -311418, 45156, 342196, 848360, 1984748, 3123004, 3061319, 1815738, 831695, 976388, 1321370]
38171A321370p20859j551623j108777n5765N83185P00960N80396K19361k41482
38162b73234l32293k7625R8808r5885l2161M24657N24781l7275l97562O3549N58698
38151D74458J55955o29343o79757q0701J94460q355L8385M62294N55237R6667
38141E79300k83454k88123l80078o62579m18427O12467J393602Q77234m21196
38132A008746j017024m03881L97441L07473m39299p44978j59703N46431M55921
38123d8873k09708l77599L11471Q80905L79468o79339r75535k03891O23554O72252
38113C72705K03975j80455l55075l43089L7725O49540Q01512J81665n09759n31009
38103C27735j94798j97980l18718J78910J053126J177764K79959n27943l89699
$$ y = [1321370, 600511, -951112, -2059889, -2115654, -1532469, -831509, -251113, -31752, -273234, -605527, -633152, -534344, -630229, -662390, -237733, 287048, 249773, -147789, -84240, 474458, 630413, 1070, -678687, -759388, -564928, -573283, -534898, -72604, 482633, 579300, 295846, 7723, -372355, -1034934, -1453361, -840894, 552708, 1429942, 1008746, -8278, -412159, -14718, 292755, -146544, -891522, -1051225, -504794, -48873, -258581, -636180, -324709, 556196, 935664, 256325, -719210, -923101, -299547, 372705, 576680, 396225, 41150, -301939, -264214, 385326, 1186838, 1368503, 858744, 327735, 132937, -65043, -383761, -204851, 848275, 2026039, 2305998, 1778055, 1388356]
38094A388356J05443M5378l23523j78323L37554K58771n99150j213995q16305
38085i95794L1374L24603L9822n261M94903Q34397L50882n37191q37208l43099
38075f42572J03362j27989n08411j83850O22278Q42116J69312m57138k91995J34814
38065c40073j44m50661m12309M5820J09680l48709n28531m1911M62682L75443
38055a128713J6172j9582K41945M14934M05018L23467J78358N9440J98549M77317
38045A166905L81796j46014m10640n6436J87701l78221j130169r34944N9279N49824
38035g10919j5045p08228n65104J17612L80899p5158o41776n96097J40310R02884
38025a770622R16610K00699l41707p1772M56317L08580l65840n53017N637M25649
$$ y = [1388356, 1493799, 1539177, 1215654, 1037331, 1374885, 1633656, 1034506, -179489, -995794, -964420, -639817, -599995, -605256, -110353, 724044, 1074926, 537735, -299473, -642572, -539210, -667199, -1175610, -1359460, -737182, 104934, 274246, -182892, -474887, -340073, -340217, -790878, -1203187, -1157367, -1047687, -1396396, -1924927, -1966838, -1504156, -1128713, -1112541, -1132123, -890178, -475244, -70226, 253241, 431599, 491039, 689588, 1166905, 1548701, 1402687, 992047, 935611, 1123312, 745091, -385078, -1320022, -1260743, -710919, -725964, -1434192, -1999296, -1881684, -1500785, -1575943, -2217719, -2813816, -2673506, -1770622, -854012, -653313, -995020, -1066792, -610475, -301895, -667735, -1220752, -1215115, -789466]
38015g89466J51609j86821P5363M95789L10280k37838k62363L34475O72527J97026
38005G60581n20868n80551N6616N65095L56713j79587k64108J52999L43624m1971
37995F48543l88132j23402K57125o0197q18578r98574l70403K57055L57232K43121
37985i96210J81203J1663j08588K91117Q74007N71466o52670j329966n62027O12471
37975a107534Q86726N48288M63919L35548m52093j114282m57329Q67589J025328
37966I96160j70445r72502m77382J49457j84936p93441n69687K41245O90468O13151
37956d77912M66406L69521K08116J55733K96859K06170l62386q14894m86508L00466
37946a38429O84575M88774K62085K63487J27864m10848j016638j141953o47337
$$ y = [-789466, -637857, -824678, -749315, -253526, 56754, -181084, -443447, -108972, 563555, 760581, 239713, -340838, -284222, 280873, 637586, 457999, 193891, 346890, 690514, 648543, 260411, 137009, 394134, 333937, -484641, -1483215, -1853618, -1596563, -1239331, -996210, -815007, -803344, -911932, -620815, 253192, 824658, 171988, -1157978, -1720005, -1107534, -220808, 327480, 791399, 1126947, 674854, -439428, -896757, -29168, 996160, 825715, -146787, -624169, -474712, -659648, -1453089, -2022776, -1781531, -1091063, -477912, -11506, 358015, 566131, 721864, 1018723, 1224893, 862507, 47613, -438895, -138429, 546146, 1034920, 1297005, 1560492, 1688356, 1277508, 260870, -881083, -1528420]
37937a528420O7207M54082L58689J47350J60893J98997p7717m07058k37532K44107
37927f19402K32330l53237n65678P8569P19931M61530k53906m56194j69869q7459
37917a013385k06637M6459N64085N92761K2269m30309m34469m12507m89445j54674
37907a915852N94843Q04467j9656q46581m01173R62109J634998Q69738l52128
37898A330765o93508j7770P30820P45358Q3680o00799p34983k90160K31527K89155
37888A074085j18519m31915j89842M00344P32913N51605J46737j82305m77987
37879A505116p68835p49153k00343M90610O82675K77108k38955m92513n40675
37870c4965m99625l32180r5293K6354M4525J38730K46191J26175j17371j14540
$$ y = [-1528420, -1461213, -1007131, -648442, -501092, -340199, -141202, -218919, -625977, -863509, -619402, -387072, -740309, -1305987, -1227418, -507487, -45957, -299863, -756057, -925926, -1013385, -1220022, -1173563, -609478, -16717, 5552, -424757, -859226, -1271733, -1761178, -1915852, -1321009, -516542, -536198, -1382779, -1783952, -821843, 813155, 1682893, 1330765, 637257, 619487, 1350307, 2095665, 2179345, 1578546, 843563, 553403, 784930, 1074085, 955566, 523651, 333809, 734153, 1467066, 2018671, 2165408, 1983103, 1505116, 736281, -12872, -213215, 277395, 960070, 1237178, 998223, 505710, -34965, -534590, -866770, -962063, -935709, -891184, -752454, -506263, -380088, -497459, -611999]
37860f11999Q2729K5813k51723j16491N80957J068948P85816K17092Q7q8989m90122
37849A202118q55164o21708j01017J3775j21285J84060Q10702Q83438J55891o39914
37839I10896q92304o74648j85565M52316P68020K84617n52567p36935j82484J48026
37829f60628j42978k48941L64968R08796M67657n48749j019532o46002q0241J30758
37819a474892N1004J0627K32454O24038P02867Q3480p91874r64555k49895M44824
37809a331922M39645J79017L13247O33552O02466L20797K13330K24930L0694l54381
37799A271375p60900j185404j389893q26648L72345J055805N43273k66832k68361
37790a455240J22825j27588o77742k96294R29725J532939R15399J20269K0366
$$ y = [-611999, -529270, -503457, -755180, -871671, -290714, 778234, 1564050, 1781142, 1781229, 1692240, 1202118, 346954, -274754, -375771, -361996, -483281, -299221, 511481, 1394919, 1550810, 910896, 18592, -656056, -841621, -389305, 378715, 663332, 110765, -626170, -808654, -660628, -803606, -1052547, -687579, 221217, 688874, 140125, -879407, -1525409, -1605650, -1474892, -1423888, -1413261, -1180807, -556769, 146098, 229578, -562296, -1526851, -1776746, -1331922, -892277, -713260, -400013, 233539, 836005, 1156802, 1370132, 1595062, 1625756, 1271375, 510475, -674929, -2064822, -2891470, -2519125, -1463320, -920047, -1186879, -1455240, -1332415, -1460003, -2137745, -2434039, -1504314, 28625, 944024, 1064293, 1084659]
37781A084659J52855j04481m48312m37839l55493n44721o72837l28879K60334
37772a394714O45066P22143N10954k775m74877l85584N7996L8850m75865m52911
37762a211717N03099J196185M87186r32325j454062o74155M00527Q46467N77443
37753b61352p0341o13419n21941J71148O27708K88172j95875O5337P44449Q40579
37743A074465L20158J6180P0053j95737p78646p64417Q935L76370l50085j125682
37733a348406o94214M64723Q49895J36986n12459k63072L42542M16049j6035k99767
37723i23758k16077j48466l20755m08681p2411M74046P30030N87751M04600M27422
37713E33701N09065M71234L63644J94317j85531o51224o96752j82277K22759p4227
$$ y = [1084659, 1237514, 1133033, 684721, 246882, -108611, -653332, -1326169, -1655048, -1394714, -749648, -27505, 483449, 480674, 5797, -379787, -321791, -282941, -758806, -1211717, -708618, 487567, 974753, 42428, -1411634, -2085789, -1685262, -838795, -261352, -331693, -945112, -1467053, -1295905, -668197, -380025, -575900, -510563, 233886, 1074465, 1394623, 1410803, 1480856, 1285119, 506473, -257944, -249009, 127361, -222724, -1348406, -2042620, -1577897, -728002, -591016, -1103475, -1366547, -1024005, -607956, -623991, -923758, -1139835, -1288301, -1609056, -2017737, -2090148, -1616102, -886072, -298321, 106279, 533701, 1042766, 1514000, 1877644, 2071961, 1886430, 1235206, 538454, 356177, 578936, 504709]
37703E04709n98475m39446L33640P53091M38450O8419J49220K41575j08229m87649
37693H55305l58605m7984j74369n08319l23710K86263L97965l05059r31209o15607
37683a725329K71563P02463L89508l3734j06344j36848m80146p55414l29813O04466
37673a599628J066799N62998k08564l13087J67156M12149J55235n5495P8721Q7642
37663C53926l64323p45795m41461K00922L42673o7391k65582J08815N47451N89249
37653B58484M55263M05768J55094m73396q54272l48365M95641M78531m82915j103910
37643a014077n76280K83378L90750O3862L09102R85028R91642J84969k95055O6726
37633A390045K72335m51446j229906r39015q3750Q5916k86391J1885J020134J369981
$$ y = [504709, -93766, -533212, -199572, 553519, 991969, 1060388, 1209608, 1451183, 1342954, 855305, 496700, 448716, 274347, -233972, -557682, -271419, 126546, -178513, -1109722, -1725329, -1453766, -751303, -361795, -395529, -501873, -638721, -1118867, -1874281, -2204094, -1599628, -532829, 30169, -178395, -491482, -324326, 87823, 243058, 187563, 266284, 353926, -10397, -756192, -1197653, -996731, -654058, -721449, -987031, -878216, -330765, 258484, 713747, 1119515, 1274609, 801213, -53059, -401424, 94217, 572748, 89833, -1014077, -1590357, -1306979, -916229, -852367, -543265, 441763, 1433405, 1618374, 1323319, 1390045, 1662380, 1210934, -18972, -957987, -1041737, -955821, -1242212, -1230327, -210193, 1159788]
37623A159788N41288k39466N43M79383J13127o73895p91361l19392j72971m11491
37613c14447k56864L44522N06615o6846m93966p1163O97623R38040N63852Q1258
37603A928624j91119j99994N2359L01425P0643n59178p33874k9744O21971J20162
37593A381275j009777j147615M3629R95075M73262o65697q41643k3634N31667
37584b63458L24389N6089J13957k2761n38334o83296n5376N50971L75703r6123
37574b38239q3209J01142k67345q41033p06717l6167J66347j42664N489O91663
37564a350733P34560k39308q70366j57497Q24384N71724m52724n78219M52257
37555a065922J178647O70317l24564p36874n41863l13558k66533k58076j81215
$$ y = [1159788, 1701076, 1461610, 1462153, 1941536, 2054663, 1380768, 589407, 270015, 97044, -314447, -571311, -226789, 279826, 212980, -280986, -352149, 345474, 1283514, 1847366, 1928624, 1737505, 1537511, 1589870, 1891295, 1961938, 1402760, 668886, 639142, 1261113, 1381275, 371498, -776117, -732488, 262587, 735849, 70152, -771491, -795125, -263458, 60931, 117020, 230977, 208216, -330118, -1013414, -1068790, -517819, -142116, -238239, -321448, -220306, -487651, -1328684, -2035401, -2071568, -1905221, -2047885, -2042396, -1350733, -616173, -855481, -1725847, -1883344, -1058960, -487236, -939960, -1518179, -1065922, 112725, 783042, 458478, -278396, -820259, -1133817, -1400350, -1658426, -1839641]
37546a839641N2391M90114Q32653O18339l6510m05001j93517p5294o62484j386819
37536b605769j137125J21531J124533Q98716l2052m51711m1406M41996M15749
37527a265538J79573J97460L38323K87236J97014L14911L52941k3758l75041o0572
37517A42549N21090L57380m54923o61951Q8927M62641m95687j697473j569328
37508c306775l69201M05196L11991K13004N28819P13865M91075K96221L10642
37499d05163J96342j6676J11115L87895Q8336o06639n42210M96705J084104K31546
37489A025355r53894q58331K08370N57950k73620r13943l11813P21436P63289
37480c5201j83286p62541j87493P13835P00813j49196o00970o5256N89420M04030
$$ y = [-1839641, -1787250, -1297136, -464483, 153856, 117346, -287655, -481172, -556466, -1218950, -2605769, -3742894, -3621363, -2496830, -1598114, -1630166, -2081877, -2123283, -1681287, -1265538, -1085965, -888505, -550182, -262946, -65932, 248979, 601920, 578162, 203121, 142549, 663639, 1021019, 566096, -95855, -6928, 455713, -39974, -1737447, -3306775, -3675976, -3270780, -2958789, -2745785, -2216966, -1503101, -1012026, -715805, -405163, -208821, -225497, -114382, 273513, 361849, -244790, -787000, -290295, 793809, 1025355, 71461, -786870, -578500, -20550, -294170, -1208113, -1519926, -798490, -35201, -218487, -981028, -1168521, -454686, 246127, 96931, -504039, -569295, 20125, 424155]
37470D24155k50445l75007P0497K74155Q024j29773Q7478J53661j27760k52093
37460a17108j152J21035j34937k39927J56838N61644M65351Q2982k54924o59882
37450b0080j064283q74377N3328Q50961Q03061L50208J77938R7547k68429m82136
37440c76262o9075L71667N4842n27368l38341L97046N15951j51349o00124l97761
37430a120774k01331l48613l01956J27187K74385j14685k47814M27988J263704
37421b41909J428040J055229O61353J94132n12018r74072o79155o5185N978m62919
37411D09474o67836k83030J02492l0549l30840q9718P51636J426098J160840O6521
37401B515088q76594q12470N3965O98884M50135l48655q98529q41494m17448k2227
$$ y = [424155, 173710, -201297, -130800, 143355, 151379, 21606, 109084, 262745, 134985, -117108, -118260, 2775, -132162, -372089, -215251, 346393, 811744, 894726, 639802, -20080, -1084363, -1958740, -1905412, -1054451, -251390, 98818, 276756, 374303, 105874, -376262, -445337, -73670, -18828, -546196, -884537, -487491, 28460, -122889, -723013, -1120774, -1322105, -1670718, -1972674, -1845487, -1571102, -1685787, -1933601, -1505613, -241909, 1186131, 2241360, 2902713, 3096845, 2584827, 1610755, 931600, 866415, 872393, 409474, -258362, -541392, -438900, -469449, -800289, -890007, -138371, 1287727, 2448567, 2515088, 1638494, 826024, 879989, 1578873, 2029008, 1680353, 781824, -59670, -477118, -499345]
37391d99345J01209r7255m44968o12744m36382j41253n1127r6447J40955P83721
37381a353636J274587R34532j04842q81145p16968k9744L50065L48112M76196
37372B97157O69238K54269p03525j063870k60957O08081K97283o54520o87521
37363a244365M38643J359429J155488M39144Q4276l0833m36188j025978j268471
37354e28855r97602m67102Q1625N23360P53158P47986N61682K00271k58019m95638
37344A20866l01204P261p867j74474N187M19460M29834p4328m74067m09816k17534
37333f76682j94616j75397m1464Q8412L51977J004586J604457J291760J69000
37324C422033o37097o82118p99092j394170j451823k57324J034274R10336k05646
$$ y = [-499345, -398136, -495391, -940359, -1553103, -1989485, -2130738, -2181865, -2278312, -2137357, -1353636, -79049, 855483, 750641, -130504, -847472, -877216, -527151, -179039, 297157, 966395, 1220664, 517139, -546731, -807688, -199607, 97676, -556844, -1244365, -805722, 553707, 1709195, 2148339, 2232615, 2201782, 1765594, 739616, -528855, -1526457, -1993559, -1911934, -1388574, -635416, 112570, 674252, 874523, 616504, 120866, -180338, -173077, -180944, -355418, -350231, 69229, 499063, 424735, -49332, -459148, -676682, -871298, -1046695, -1088159, -999747, -647770, 356816, 1961273, 3253033, 3422033, 2784936, 2102818, 1303726, -90444, -1542267, -1799591, -765317, 145019, -60627]
37315f0627o40168J5673N68780K63246k60949k51105P4594J29403j49587l86977
37305f97717k60090K58314P75938O75821j18734p67502m67889M16802Q36011M80220
37295A131174l136j23751j00133k45324m80459n88375m68157j35493J33033j16706
37285i97327p75458q92507J06985J294674J311444L17839k86149j3220J66673
37276B32954l39044p31183k50393N28664O68493K70890L0957L9310q7814l36133
37266B6701l87907l01286l57444m20594j10150M86208Q25982O11327Q0019l41147
37256A11709l81155n7019K87031K60663m7526j22230J82315L40562K3130k37978
37246C59502J21171N81999J08507j228032k039952j320450K72048J246267R86340
$$ y = [-60627, -700795, -685122, -116342, 146904, -114045, -365150, -290556, -161153, -310740, -697717, -957807, -699493, 76445, 752266, 633532, -133970, -601859, -185057, 650954, 1131174, 1128038, 1004287, 904154, 658830, 178371, -410004, -878161, -1013654, -880621, -997327, -1772785, -2665292, -2558307, -1263633, 47811, 365650, 79501, 66281, 232954, -106090, -837273, -1087666, -559002, 109491, 380381, 411338, 450648, 362834, 26701, -361206, -662492, -1019936, -1440530, -1550680, -1064472, -238490, 372837, 452856, 111709, -269446, -326465, -39434, 221229, 173703, 51473, 233788, 574350, 597480, 359502, 480673, 1062672, 1171179, -56853, -2096805, -3417255, -3145207, -1898940, -912600]
37237i12600J45134m42279o46317p23442o14925n8592P27179J051118O73117K47877
37227e53730L96719P15266L91479l85057n44691J82374O79790R2408p63980n35656
37217c25078O26999J232306N51956m78457p04205k08385J71704J25960M815K7532
37207A025147L1055p8176j65769j89381k42567k32163O1760M92530N47954P5219
37197A325609l77719k71391J87737M14290K88754J46283Q8918j15674m65569o27022
37187E94216m94129l12761j39575K36024O61199N85707j6321l72998l5517L86340
37177A092185K09409k53568l84987m11394q47592j241499p07888M29111Q31665
37168a284558J56511l88497O3860P51506O01201j19701m03028j05184O5588j47635
$$ y = [-912600, -767466, -1209745, -1856062, -2579504, -3194429, -3253021, -2525842, -1474724, -801607, -553730, -157011, 558255, 949734, 564677, 19986, 202360, 882150, 974558, 210578, -325078, 301921, 1534227, 2086183, 1607726, 903521, 695136, 866840, 992800, 997615, 1025147, 1056202, 978026, 812257, 622876, 380309, 148146, 209906, 702436, 1250390, 1325609, 947890, 676499, 864236, 1278526, 1567280, 1713563, 1802481, 1686807, 1221238, 594216, 100087, -212674, -352249, -116225, 544974, 1130681, 1114360, 741362, 705845, 1092185, 1301594, 1048026, 663039, 251645, -595947, -1837446, -2545334, -2116223, -1284558, -1128047, -1516544, -1452684, -701178, -99977, -219678, -622706, -727890, -662302, -809937]
37158h09937k37757P7138L57849J65109k65748l89937j13329J19311n4684m29762
37148a581747n03602j58391J84798J91265Q7077K34358N25323O24553N69370N75152
37138G48156M27293k31015j038435j118418l09445N07858N68187Q3742l15178
37129f77255l88204k22626O3801K29545L8667k48202p3736M91381O98190K87746
37119A99307o2596J16347L11306j4859m67477m49506j61906q2904p8772J02380
37109e88680N6498n45991r57185k44479J087023J567169Q17755r574n004L58408
37099A535940K27229l62489p48337o20266k50965l8661j23351k98504k19645J37215
37089g61834L24594O223m72040m86097J0255M46397L77243r1399n12088m32046
$$ y = [-809937, -1047694, -970556, -612707, -447598, -713346, -1103283, -1216612, -1097301, -1151985, -1581747, -2085349, -2243740, -2058942, -1867677, -1780600, -1546242, -1020919, -396366, 173004, 748156, 1175449, 944434, -94001, -1212419, -1521864, -1014006, -445819, -362077, -677255, -1065459, -1288085, -1224284, -994739, -956072, -1204274, -1278010, -786629, -88439, 199307, 136711, 253058, 564364, 549505, 82028, -367478, -529384, -612288, -691060, -588680, -532182, -1078173, -2035358, -2279837, -1192814, 374355, 1192110, 1182536, 1177532, 1535940, 1763169, 1400680, 652343, 32077, -218888, -257549, -380900, -679404, -899049, -761834, -437240, -431017, -903057, -1389154, -1378899, -932502, -555259, -646658, -1158746, -1590792]
37079a590792K65062J044956J078105K78165m39831l83968j1456j7324j58935
37070F3982R9700L67824n5043p19526n23541M55756R83979N78254L8619j15342
37060A174662l36119p90369q07337k01294J45575k10932l86858K99671J003875
37051a09126O50724l40226p98668n61630k80281l9583N29761J088855Q48293m8915
37041I39204n42426j66685M10568N12224K49228j4991k21486l49966k27743R2077
37031F80004K44607Q2544j20812j61737j83537l08448l95027l23879j59069R3019
37021e52335M78833P27305L81372m32768q52501l40120M58340M90326k32203o08004
37011d81755j3026P57873N80825l88926q98947l13152O05208Q65739N12032J89225
$$ y = [-1590792, -1325730, -280774, 797331, 1075496, 635665, 251697, 240241, 222917, 63982, 163682, 531506, 476463, -243063, -766604, -310848, 673131, 1251385, 1290004, 1174662, 838543, 48174, -759163, -960457, -814882, -1025814, -1412672, -1113001, -109126, 541598, 201372, -597296, -1158926, -1439207, -1478790, -949029, 139826, 988119, 939204, 396778, 230093, 640661, 1152885, 1402113, 1387122, 1165636, 815670, 587927, 680004, 924611, 1007155, 886343, 724606, 541069, 232621, -162406, -486285, -645354, -552335, -73502, 653803, 1035175, 602407, -250094, -590214, -131874, 358452, 126249, -481755, -494781, 263092, 843917, 454991, -443956, -757108, -151900, 713839, 1225871, 1415096]
37001A415096K1594k92625n92564l99820Q3723P7145m79060o48424N3738P85351
36991B4154N82224k52015p22518n80421l22685j13469L30152Q57868Q28412J32996
36981G64698m63082l38814J50141K27059k72594p88458p73894k57353K80898M27704
36971a043695K27887Q1094K31749M59714M09096J04214j21321j71122l18263o58801
36961g99448p58530k03339O23073P96895P1029o16354l27716M94810O11499j04051
36951b12132l84369L84406R70757J52800j164338j178502k4344M29990l83975
36942a409707q67130K73R43992N85304k57525m9105Q38099Q14438k51761r02861
36932e55983m62424J43749Q2951k96757l91297j95171J00562M03737L70284l21772
$$ y = [1415096, 1436690, 1144065, 551501, 151681, 235404, 312549, -166511, -814935, -761197, 24154, 606378, 354363, -368155, -948576, -1271261, -1384730, -1054578, -196710, 631702, 764698, 301616, -37198, 112943, 340002, 67408, -721050, -1494944, -1752297, -1471399, -1043695, -815808, -734714, -502965, -43251, 365845, 470059, 348738, 177616, -140647, -799448, -1557978, -1761317, -1138244, -341349, -270320, -886674, -1214390, -719580, -108081, -212132, -596501, -212095, 758662, 911462, -252876, -1431378, -1455722, -1025732, -1409707, -2276837, -2276564, -1332572, -747268, -1004793, -1053898, -215799, 598639, 346878, -555983, -1018407, -874658, -791707, -1088464, -1479761, -1674932, -1574370, -1170633, -800349, -1122121]
36922a122121j127601r88378J89785J254328J291856O30627J16360J22270M89709
36913H56835P64292L88047o26017j263005o58077M22185M34786n85483r58876
36904a225313O5907J215430J254858O06425P0747n34177j320041j350971j57728
36895a374863R63795P38261m0672N7059N81547J16876r87906j063849l7884M16294
36885f31342k17588n35632J40915N81981m428m94174P2963P49265M65331k3765
36875A03526L53795Q75143L08656p16436o73056K18476M50330k7658K12463J257749
36865B362988J296151m44928k181073k068639o79015K36955K40500J40521L15713
36856g80827M54668M80592N65523N16283J03043k82098j66520R4749j72561p89996
$$ y = [-1122121, -2249722, -3238100, -3048315, -1793987, -502131, 128496, 244856, 367126, 856835, 1621127, 2009174, 1383157, 120152, -537925, -115740, 319046, -266437, -1225313, -1159406, 56024, 1310882, 1917307, 1988054, 1453877, 133836, -1217135, -1374863, -411068, 327193, 286521, 343580, 925127, 1042003, 54097, -1009752, -1047636, -631342, -848930, -1384562, -1243647, -661666, -666094, -1160268, -1087305, -338040, 127291, 103526, 457321, 1332464, 1641120, 924684, 251628, 470104, 920434, 892776, 1105239, 2362988, 3659139, 3214211, 1033138, -1035501, -1714516, -1477561, -1237061, -1096540, -780827, -326159, 154433, 719956, 1236239, 1339282, 1057184, 890664, 985413, 812852, 22856]
36846B2856r43290m10952K53870O41567P90709O99717L35174L3528J18204K38147
36836A779530j08715n68171l85200K61085M49099L3460j88723L5431O23n44577
36826G63842q11898l53489J18596j5536k62326l3945K85131J73818k0932J11068
36816d5671O7279o28804j214572o46663O96955J470828J189853M81986j68086
36807A203105p33500r05578k92519O16390Q08901J88628l26347k11909J44051
36798D91222M05736P10281R22324N24377l80134q90917n85644j58931l09259p10782
36788A8273o47507j22113K30385J9020n26331q80781p24352k40558R9784J77871
36778b596309L56616P05531O53796O215l48431K94734J056396O24061n77631q95956
$$ y = [22856, -920434, -1331386, -1077516, -435949, 354760, 1054477, 1389651, 1423179, 1541383, 1779530, 1670815, 1102644, 717444, 978529, 1427628, 1461088, 1272365, 1307796, 1308419, 763842, -48056, -401545, -282949, -298485, -560811, -594756, -309625, -135807, -156739, -45671, 21608, -607196, -1821768, -2468431, -1771476, -300648, 889205, 1371191, 1203105, 469605, -435973, -728492, -112102, 696799, 885427, 559080, 347171, 491222, 896958, 1607239, 2529563, 3053940, 2673806, 1782889, 1197245, 1038314, 729055, 18273, -629234, -751347, -520962, -501942, -1028273, -1909054, -2633406, -2873964, -2774180, -2596309, -2239693, -1534162, -880366, -874151, -1222582, -927848, 128548, 752609, 174978, -720978]
36768g20978k5965N91297J53992m17280k94887j4854j64898k75190O3252K89575
36758h15936N5574P6830P62488J195910O40946o5073R4301N64235K81850l96063
36748B395062l75546K03156K35688m77950j045301r33110m12585J87247O16747
36739C93408M73396j59562l76847J97409M71919m08761j289546o24781Q51051
36730d72314J103090K3622n59892l1648K34359l88083o22818K83802J105430P55521
36720A431069L7804k4809K0001n74555j007158k79273P48294M96095p27939j056219
36710i36690J64613J500928J500033L87597o32843q63050m98025j08612q1607
36701D32344l34317m80151l52824j73852r0359N1192K38179J14725l34219m53057
$$ y = [-720978, -746943, -155646, -1654, -418934, -713821, -728675, -893573, -1168763, -1105511, -815936, -760362, -683532, 78956, 1274866, 1915812, 1850739, 1945040, 2509275, 2791125, 2395062, 2019516, 2222672, 2458360, 1980410, 935109, 1999, -410586, -223339, 393408, 866804, 707242, 330395, 527804, 999723, 590962, -698584, -1323365, -472314, 630776, 654398, 94506, 62858, 297217, -90866, -713684, -429882, 675548, 1431069, 1468873, 1444064, 1464065, 889510, -117648, -396921, 351373, 847468, 119529, -936690, -772077, 728851, 2228884, 2616481, 1983638, 1120588, 622563, 513951, 432344, 98027, -382124, -734948, -908800, -999159, -947967, -709788, -595063, -929282, -1382339]
36691a382339J70285Q99943Q18227M464o03649m59061P2338L52866J40183l47779
36681c34522o60829m69933M3903L03317M9757l19113l63527j92097j07225m3194
36671b093463J97323M47769L93101P8398k01940l30885l32328j32237K84072O73858
36661a016332Q07151P36553N75131L01112k366r7788k2782j16406l60827k59535
36651E43911K88119O38412L87936J3776m6509j92767p56086j046569l54278O70922
36641A46867Q28255J79548j84004N2483J83261j5273M9878M07567K03524p32310
36631A119796j256428n95343L66938L67367m36318q62356l76751M98230J100492
36622g4373J168796O90745q7623o10824n33770j90458r4399j80205o4853J53685
$$ y = [-1382339, -1212054, -312111, 506116, 510580, -93069, -552130, -479792, -126926, 13257, -334522, -995351, -1465284, -1421381, -1118064, -1068307, -1387420, -1750947, -1943044, -2050269, -2093463, -1896140, -1448371, -1055270, -976872, -1178812, -1509697, -1842025, -1974262, -1690190, -1016332, -209181, 527372, 1102503, 1403615, 1401249, 1303461, 1280679, 1164273, 803446, 543911, 832030, 1470442, 1858378, 1872154, 1825645, 1632878, 876792, -169777, -524055, 146867, 975122, 1154670, 970666, 1023149, 1206410, 1191137, 1241015, 1648582, 1852106, 1119796, -136632, -731975, -365037, 2330, -433988, -1296344, -1673095, -1174865, -74373, 1094423, 1785168, 1697545, 1086721, 552951, 362493, 268094, 87889, 23036, 176721]
36612A76721K5754l86016m87626j33933N4336l04202o14107j41075P68776J027229
36602a4143L17765m65489n41594k95403m08090n05068L07333J679881K012852
36593B088044O67248q88470j023505k16058j60140j073909j409281l55960Q43200
36584a528831P37505l11745q92674n43351N4688M07116O27264O78241K52086m39911
36574i59612o35834j10200L97027K29331k93179m96615l54603k54611j41087L35303
36564b284080R34773R24208K23557k97343m2633M58813M83312K89236N43273R76738
36554B209854O73373l52395r75617o44175k03050m87242j025757r49923m35157
36545b190089k29525k56379J82599J023486J370642Q51185P3828l86094n62990
$$ y = [176721, 202475, -183541, -671167, -805100, -750764, -1054966, -1669073, -1810148, -1041372, -14143, 303622, -161867, -703461, -998864, -1406954, -1912022, -1604689, 75192, 2088044, 2755292, 1866822, 843317, 627259, 467119, -606790, -2016071, -2372031, -1528831, -791326, -1103071, -1995745, -2539096, -2484408, -2077292, -1450028, -771787, -519701, -959612, -1595446, -1705646, -1308619, -1079288, -1372467, -1869082, -2223685, -2478296, -2619383, -2284080, -1349307, -425099, -201542, -498885, -541518, -82705, 400607, 689843, 1233116, 2209854, 2883227, 2530832, 1555215, 911040, 707990, 220748, -805009, -1754932, -2190089, -2419614, -2675993, -2493394, -1469908, -99266, 751919, 825747, 439653, -123337]
36536a23337n07338m7451N56918O08508L1377l76044k01886r9952o08711j111145
36526a879061p99408k2917K97167J52598L01537Q63308J121208P40050K05604
36517I80086r9077l40591n09859j82276N36768O96947j59522j034664p41920L19666
36507e34442O86781m5396p25271m37982K67702M62278K49237K84753M95662K65025
36497I68347l64965o64243l97178j30462j90839j70644J94860M47547K02490j32639
36487b37726k5844L11846L47220Q5700j18826k34774l66158k38819L68544R10139
36477H01302O00562m03587j089563q84732k22487K20474K46531M3039r2829R7932
36467f83358N03842N60336Mn53353m08338N8436k2640n17691m78915J84115M76733
$$ y = [-123337, -630675, -678126, -121208, 487300, 518677, 142633, -59253, -159205, -767916, -1879061, -2678469, -2701386, -2404219, -2251621, -1950084, -1086776, 34432, 774482, 980086, 881009, 540418, 30559, -151717, 385051, 1081998, 922476, -112188, -854108, -534442, 152339, 106943, -618328, -1056310, -788608, -326330, -77093, 207660, 703322, 968347, 603382, -60861, -458039, -588501, -779340, -949984, -755124, -307577, -105087, -237726, -263570, 48276, 395496, 481196, 362370, 127596, -238562, -477381, -108837, 801302, 1401864, 998277, -91286, -976018, -1198505, -978031, -731500, -688461, -781290, -683358, -179516, 380820, 380824, -172529, -580867, -522431, -545071, -1062762, -1541677, -1357562, -880829]
36456h80829L5563j87696M70814J218993J034018J88817l00654j39771J12284
36447A551539n2603o39051j217153j103523l8323J078095R74385j19356m79963
36438d5953O13161J605496Q89217q13187j602484j075887l55188l9908K64157
36429e60576O27872N52734P8751j57906n3962q7386k41020m8195K84202M9332
36419D43846n59023n12862L31549Q61338M55751j17017r8701R9975j55986n81148
36409A67722n65275j96198N4084J18096J77998J81041L6401r3187p9066j6353
36399b14737R8134L77700N85403L03482k72436m50351j40454N994k25905k85069
36389b18239k5223q4180n83314o37911J05651O39218K44512j96174K59382Q44557
$$ y = [-880829, -845266, -1032962, -562148, 656845, 1690863, 1879680, 1579026, 1439255, 1551539, 1498936, 859885, -357268, -1460791, -1499114, -421019, 553366, 434010, -45953, 567208, 2172704, 3061921, 2248734, 646250, -429637, -784825, -824733, -560576, 67296, 620030, 698781, 540875, 486913, 399527, 158507, 110312, 394514, 443846, -115177, -628039, -296490, 564848, 1020599, 903582, 804881, 904856, 748870, 167722, -397553, -593751, -539667, -421571, -243573, -62532, -26131, -119318, -198384, -214737, -116603, 261097, 846500, 1149982, 877546, 427195, 286741, 292735, 66830, -218239, -243462, -327642, -910956, -1548867, -1443216, -803998, -559486, -755660, -496278, 348279]
36379C48279L50890o85014p83579J024K29089m49786p84196j04403O43005N58207
36369f76484P9641m9309O1015M6164Q9836L91605N94743M03186J05019p1562m04747
36358E69107r02877q77907o1004N87885J59761o53788m20583Q64914J652480R89993
36348A907981k54080p41458l94425j11347k77746l83269m9265K95903R2705m17669
36338c32670m36533K80795J017939R89106L05076k74412l46094k01854k11374
36329G89979l16959k88365j38455n2771j03980k32865l73423m38804l06470L0409
36319a431704L81079N45839N24840M59161M22010L26469K5050m59514p69022m59920
36309d35712L74757R37810N91816k02790l68068K88700P12201J10934p93457p41390
$$ y = [348279, 699169, 14155, -769424, -768400, -539311, -989097, -1773293, -1877696, -1234691, -676484, -596843, -646152, -585137, -538973, -449137, -57532, 537211, 940397, 1045416, 973854, 569107, -333770, -1211677, -1272681, -684796, -525035, -1178823, -1599406, -734492, 917988, 1907981, 1653901, 912443, 518018, 406671, 128925, -254344, -303609, -7706, 84999, -332670, -769203, -488408, 529531, 1518637, 1823713, 1549301, 1203207, 1001353, 789979, 473020, 184655, 46200, -6571, -110551, -343416, -716839, -1155643, -1462113, -1431704, -1050625, -504786, 20054, 479215, 901225, 1227694, 1252744, 793230, 24208, -435712, -60955, 876855, 1468671, 1265881, 897813, 1186513, 1898714, 2009648, 1216191, 474801]
36299D74801J99223O64783n7865j019887r86152j33307L43660m1057n66155n25652
36289a647608j44906L8895O2733K54154M72131K96649j72863l49584j8659L92706
36279h16352M99060L80215J80794j51892m81972l93802J44258N19678L11746p3150
36269A18583r2476P3543k3262j94017O4619N84466O79408K13595k38364k91866
36259H94229j05255J53467M50909M96456J7778n19534l64844K21738J59025o81354
36249G22615j060369l32007L63616j29485r99381o18386Q63289J582003O10568
36240A002463p92273r72743O1007R48344P57908j04922n72808j64468M85823M04961
36230A053292m24305r62119n63442O1226l0977m84244k38830O29333Q84917O1855
$$ y = [474801, 674024, 1338807, 1280942, 261055, -725097, -858404, -514744, -555801, -1121956, -1647608, -1792514, -1753619, -1690886, -1436732, -964601, -667952, -840815, -1190399, -1209058, -816352, -317292, 62923, 243717, 91825, -390147, -783949, -639691, -120013, 191733, 118583, 26107, 99650, 76388, -117629, -53010, 531456, 1210864, 1424459, 1186095, 894229, 788974, 942441, 1393350, 1889806, 1907584, 1388050, 1023206, 1244944, 1403969, 722615, -337754, -669761, -306145, -435630, -1435011, -2053397, -1190108, 391895, 1002463, 210190, -762553, -701546, 246798, 1004706, 899784, 326976, 162508, 648331, 1053292, 628987, -333132, -896574, -835348, -866325, -1350569, -1589399, -960066, -75149, -13294]
36220a3294p68666n86274K31889P35846P09749M57861K2676n51599p07738k0086
36210d89636R30265J123840M13927l88939o23503l56905L8018K69637J19982l86699
36200F49987p82008n90114L7317N41382P11879P22727N35075p2372q41215j090640
36190a77982o41445q8408R8339J64078M27830O15274L33796j93311m29600l18110
36180b09539k20657k03747L0075M48880M78079k23233j092625j178560l02373
36171b473700O31417O81558K0432l27385J30002P43803P65790M44781M51606O04804
36161A673108J29635q48854j166998l53669N17468M01223j68349p0733N28346
36152F41177N38078j30966l61912L15176R18771N43177l19834o58231l91567j88329
$$ y = [-13294, -781960, -1368234, -1136345, -400499, 309250, 767111, 789787, 238188, -469550, -489636, 440629, 1564469, 1978396, 1589457, 965954, 609049, 647067, 916704, 1036686, 649987, -132021, -722135, -684818, -143436, 568443, 1291170, 1826245, 1753873, 912658, -177982, -819427, -907835, -809496, -645418, -217588, 397686, 731482, 538171, 108571, -209539, -430196, -633943, -603868, -154988, 323091, 99858, -992767, -2171327, -2473700, -1842283, -1160725, -1140293, -1467678, -1337676, -593873, 171917, 616698, 1068304, 1673108, 1802743, 953889, -213109, -566778, -49310, 351913, 183564, 112831, 641177, 1179255, 1048289, 686377, 1001553, 1920324, 2463501, 2143667, 1485436, 1093869, 905540]
36142I05540l18025m38624l00638m8106J07972J10585K0751j6175N9597j0243
36132G2634m77371r17724n25843N95761J206007O03907k12617J8241Q67743R19502
36122B150240M2779n10746k97080l70670j254355j706387n80301J142345J516323
36113A32148L00424q50318p31704N9118L37090n8965l62899n9995N23769O73776
36103c7556J10672o29529p24105p3468M85926K63047l27838l90852J47423N51329
36093f24951M64667K67621J76828j26468o51747p31444n6163O25150N38872M7178
36083g0457m3008J31382k02623r78191j232803o26770L7076J35880Q4403L53182
36073b411929N59005K97676Q8999M99384R23389M38571m70530m24801O05532J046286
$$ y = [905540, 587515, 148891, -151747, -199853, -91881, 18704, 39455, 23280, 82877, 72634, -404737, -1322461, -1848304, -1252543, -46536, 557371, 344754, 362995, 1230738, 2150240, 2193019, 1682273, 1385193, 1014523, -239832, -1946219, -2526520, -1384175, 132148, 432572, -417746, -1149450, -1090332, -753242, -812207, -1175106, -1235101, -711332, -37556, 73116, -556413, -1280518, -1353986, -868060, -605013, -932851, -1323703, -1176280, -624951, -160284, 107337, 284165, 157697, -494050, -1225494, -1281657, -656507, -117635, -70457, -113465, 17917, -184706, -1162897, -2395700, -3022470, -2985394, -2849514, -2765111, -2411929, -1852924, -1555248, -1466249, -966865, -43476, 395095, -75435, -500236, 105296, 1151582]
36063A151582J55033p15720k07878Q74426Q15287l35095q81612r0842Q23035O11664
36053B199880l38926q44774n54602n3092J33565J1073j36070n4925K46909M06947
36043A015985J07367l83430m91671j84989M2792Q4885L34424O79205L48123p14769
36033H37922j276502m53100Q48523J133037L73584k49867k39557j54025k69413
36024E50602j72543J75492J58739l76291p38443n29172k44637k85888k45620K32340
36014a475421O54750M52034k9843n3319L81391O29430L92992M230j81006j80410
36004E94828j82410k54261k60217J4904N26170P87175L75310l83722p19453m57961
35994D0363j67193j47578j9086L90962N40640O0637n48183o95698n48577m66253
$$ y = [1151582, 1306615, 590895, 383017, 1257443, 2072730, 1737635, 856023, 765181, 1588216, 2199880, 1860954, 1016180, 461578, 408486, 542051, 553124, 417054, 362129, 609038, 1015985, 1123352, 739922, 248251, 63262, 106054, 190939, 525363, 1204568, 1552691, 837922, -438580, -891680, -43157, 1089880, 1463464, 1213597, 974040, 820015, 550602, 378059, 553551, 712290, 335999, -402444, -931616, -1176253, -1462141, -1707761, -1475421, -820671, -368637, -398480, -451799, -70408, 559022, 952014, 956244, 775238, 594828, 412418, 158157, -102060, -87156, 439014, 1226189, 1601499, 1217777, 498324, 40363, -126830, -274408, -293494, 97468, 638108, 698745, 150562, -545136, -1093713, -1559966]
35984a559966k35402L77981Q90131P57599K90105M9664j64799p54098j204727
35975a553512p18540L02530O59233J97581j4450M99485Q92687M85232j36507j40504
35965D73235K74504L15000k37045q64573r92185m77069K88086O33476L18630p8028
35955c45969L9259L19665P3231m05635k33168M15082M16049l29609n66123J17199
35945e00019L60987o69958j549002o24754J286839J950514Q32166n02516q16475
35936b32218m33323n4878J91565K75517J3896l74912l65427K1434K42153J58261
35926e57932J15139J14494j62191m91622k75979L36599N26032J34500j45784j07216
$$ y = [-1559966, -1795368, -1417387, -527256, 230343, 520448, 570112, 405313, -348785, -1553512, -2272052, -1969522, -1310289, -1112708, -1127158, -627673, 265014, 750246, 613739, 473235, 747739, 1062739, 825694, -38879, -1031064, -1508133, -1220047, -586571, -267941, -345969, -306710, 12955, 86186, -319449, -552617, -137535, 278514, -51095, -617218, -500019, -139032, -808990, -2357992, -2982746, -1695907, 254607, 1086773, 584257, -232218, -665541, -720419, -528854, -253337, -239441, -614353, -979780, -958346, -716193, -557932, -442793, -328299, -490490, -982112, -1258091, -921492, -395460, -260960, -406744, -513960]
$$ [...]
##END NTUPLES=NMR SPECTRUM
##END=
