##TITLE=31Pdec_AN-AD-63
 CDCl3, 24 sc
 13.05.2021
##JCAMPDX= 6.0         $$ Bruker NMR JCAMP-DX V2.0
##DATA TYPE= NMR SPECTRUM
##DATA CLASS= NTUPLES
##ORIGIN= UXNMR, Bruker Analytische Messtechnik GmbH
##OWNER= root
$$ XWIN-NMR		Version 3.5
$$ Thu May 13 13:26:44 2021 Russian Standard Time (UT+4h)  she@DPX200
##.OBSERVE FREQUENCY= 81.013821
##.OBSERVE NUCLEUS= ^31P
##.ACQUISITION MODE= SIMULTANEOUS
##.ACQUISITION SCHEME= undefined
##.AVERAGES= 24
##.DIGITISER RES= 16
##SPECTROMETER/DATA SYSTEM= spect
##.PULSE SEQUENCE= zgpg30
##.SOLVENT NAME= CDCl3
##.SHIFT REFERENCE= (INTERNAL, CDCl3, 0, 248.564)
##AUDIT TRAIL= $$ (NUMBER, WHEN, WHO, WHERE, WHAT)
$$ ##TITLE= Audit trail, XWIN-NMR		Version 3.5
$$ ##JCAMPDX= 5.01
$$ ##ORIGIN= Bruker BioSpin GmbH
$$ ##OWNER= she
$$ F:/spectra/data/she/nmr/P31/1/pdata/1/auditp.txt
$$ ##AUDIT TRAIL=  $$ (NUMBER, WHEN, WHO, WHERE, WHAT)
(   1,<2021-05-13 13:24:59.09 +0400>,<she>,<DPX200>,
      <created by zg, POWCHK disabled, PULCHK disabled
       configuration hash MD5:
       00 E9 B6 7A A2 85 ED C7 34 08 36 98 17 FE 4E 26
       data hash MD5: 32K
       87 D7 3A 8F C4 56 64 FC 96 F6 DE 8A 0A 7F 56 1F>)
(   2,<2021-05-13 13:25:01.40 +0400>,<she>,<DPX200>,
      <Start of raw data processing
       efp BC_mod = 2 LB = 1 FT_mod = 6 PKNL = 1 PHC0 = -5952.501 PHC1 = -508.7993 SI = 64K 
       data hash MD5: 64K
       A7 85 51 CE F3 13 53 10 73 D8 55 46 4A 4A 92 FF>)
(   3,<2021-05-13 13:25:31.50 +0400>,<she>,<DPX200>,
      <pk PHC0 = -311.5794 PHC1 = 703.3997 
       data hash MD5: 64K
       37 7E CC 72 FD 3A DA 9B 35 DA F9 A2 37 1D 57 6A>)
(   4,<2021-05-13 13:25:35.21 +0400>,<she>,<DPX200>,
      <abs ABSG = 5 
       data hash MD5: 64K
       E8 CF 12 25 2F D8 DA 76 E6 5F A1 85 E5 29 A6 A4>)
$$ ##END=
$$ 
$$ hash MD5
$$ A1 65 BB 17 B1 AE DB 0E 89 37 6C 23 8B 04 6F 87
##$RELAX= 
##$RELAX= 
##$RELAX= 
##$RELAX= 
##$RELAX= 
##$RELAX= 
##$RELAX= 
##$RELAX= 
$$ Bruker specific parameters
$$ --------------------------
##$DU= <F:/spectra>
##$EXPNO= 1
##$NAME= <P31>
##$PROCNO= 1
##$TYPE= <nmr>
##$USER= <she>
##$AMP= (0..31)
100 100 100 100 100 100 100 100 100 100 100 100 100 100 100 100 100 100 
100 100 100 100 100 100 100 100 100 100 100 100 100 100 
##$AQSEQ= 0
##$AQ_mod= 1
##$AUNM= <au_zg>
##$AUTOPOS= <>
##$BF1= 81.014009
##$BF2= 200.13
##$BF3= 200.13
##$BF4= 200.13
##$BF5= 200.13
##$BF6= 200.13
##$BF7= 200.13
##$BF8= 200.13
##$BYTORDA= 1
##$CFDGTYP= 0
##$CFRGTYP= 5
##$CHEMSTR= <none>
##$CNST= (0..31)
1 1 145 1 1 1 1 1 1 1 1 1 1 1 1 1 1 1 1 1 1 1 1 1 1 1 1 1 1 1 1 1 
##$CPDPRG= <waltz16>
##$CPDPRG1= <>
##$CPDPRG2= <waltz16>
##$CPDPRG3= <>
##$CPDPRG4= <mlev>
##$CPDPRG5= <mlev>
##$CPDPRG6= <mlev>
##$CPDPRG7= <mlev>
##$CPDPRG8= <mlev>
##$CPDPRGB= <>
##$CPDPRGT= <>
##$D= (0..31)
0 1 0 0 0 0 0 0 0 0 0 0.03 2e-05 3e-06 0 0 0 0 0 0 0 0 0 0 0 0 0 0 0 0 
0 0 
##$DATE= 1620897898
##$DBL= (0..7)
120 120 120 11 120 120 24 19 
##$DBP= (0..7)
150 150 150 150 150 150 150 150 
##$DBP07= 0
##$DBPNAM0= <>
##$DBPNAM1= <>
$$ [...]
##$SUBNAM3= <"">
##$SUBNAM4= <"">
##$SUBNAM5= <"">
##$SUBNAM6= <"">
##$SUBNAM7= <"">
##$SUBNAM8= <"">
##$SUBNAM9= <"">
##$SW= 501.771253377433
##$SWIBOX= (0..15)
0 1 3 0 0 0 0 0 0 0 0 0 0 0 0 0 
##$SW_h= 40650.406504065
##$TD= 32768
##$TD0= 1
##$TE= 0
##$TE2= 300
##$TE3= 300
##$TEG= 300
##$TL= (0..7)
0 120 53 12 22 120 120 120 
##$TP= (0..7)
150 150 150 150 150 150 150 150 
##$TP07= 0
##$TPNAME0= <>
##$TPNAME1= <>
##$TPNAME2= <>
##$TPNAME3= <>
##$TPNAME4= <>
##$TPNAME5= <>
##$TPNAME6= <>
##$TPNAME7= <>
##$TPOAL= (0..7)
0.5 0.5 0.5 0.5 0.5 0.5 0.5 0.5 
##$TPOFFS= (0..7)
0 0 0 0 0 0 0 0 
##$TUNHIN= 0
##$TUNHOUT= 0
##$TUNXOUT= 0
##$USERA1= <user>
##$USERA2= <user>
##$USERA3= <user>
##$USERA4= <user>
##$USERA5= <user>
##$V9= 5
##$VALIST= <valist>
##$VCLIST= <CCCCCCCCCCCCCCC>
##$VD= 0
##$VDLIST= <DDDDDDDDDDDDDDD>
##$VPLIST= <PPPPPPPPPPPPPPP>
##$VTLIST= <TTTTTTTTTTTTTTT>
##$WBST= 1024
##$WBSW= 4
##$XGAIN= (0..3)
0 0 0 0 
##$XL= 0
##$YL= 0
##$YMAX_a= 17943
##$YMIN_a= -18123
##$ZGOPTNS= <>
##$ZL1= 120
##$ZL2= 120
##$ZL3= 120
##$ZL4= 120
##$ABSF1= 248.5645
##$ABSF2= -253.2056
##$ABSG= 5
##$ABSL= 3
##$ALPHA= 0
##$AQORDER= 0
##$ASSFAC= 0
##$ASSFACI= 0
##$ASSFACX= 0
##$ASSWID= 0
##$AUNMP= <proc_1d>
##$AZFE= 0.1
##$AZFW= 0.5
##$BCFW= 0
##$BC_mod= 2
##$BYTORDP= 0
##$COROFFS= 0
##$CY= -3
##$DATMOD= 1
##$DC= 0
##$DFILT= <>
##$DTYPP= 0
##$F1P= 0
##$F2P= 0
##$FCOR= 1
##$FTSIZE= 65536
##$FT_mod= 6
##$GAMMA= 0
##$GB= 0
##$INTBC= 1
##$INTSCL= 5.30512e-09
##$ISEN= 30
##$LB= 1
##$LEV0= 0
##$LPBIN= 0
##$MAXI= 10000
##$MC2= 0
##$MEAN= 0
##$ME_mod= 0
##$MI= 50
##$NCOEF= 0
##$NC_proc= -5
##$NLEV= 6
##$NOISF1= 182.463
##$NOISF2= 159.3651
##$NSP= 0
##$NTH_PI= 0
##$NZP= 0
##$OFFSET= 248.5645
##$PC= 4
##$PHC0= -6264.081
##$PHC1= 194.6004
##$PH_mod= 1
##$PKNL= yes
##$PPARMOD= 0
##$PSCAL= 0
##$PSIGN= 0
##$REVERSE= no
##$SF= 81.014009
##$SI= 65536
##$SIGF1= 159.3651
##$SIGF2= -187.1042
##$SINO= 113.3802
##$SIOLD= 16384
##$SREGLST= <1H.CDCl3>
##$SSB= 0
##$STSI= 65536
##$STSR= 0
##$SW_p= 40650.406504065
##$SYMM= 0
##$S_DEV= 0
##$TDeff= 32768
##$TDoff= 0
##$TI= <>
##$TILT= no
##$TM1= 0
##$TM2= 0
##$TOPLEV= 0
##$USERP1= <user>
##$USERP2= <user>
##$USERP3= <user>
##$USERP4= <user>
##$USERP5= <user>
##$WDW= 1
##$XDIM= 65536
##$YMAX_p= 454984495
##$YMIN_p= -25257084
$$ End of Bruker specific parameters
$$ ---------------------------------
##NTUPLES= NMR SPECTRUM
##VAR_NAME=  FREQUENCY,     SPECTRUM/REAL,   SPECTRUM/IMAG
##SYMBOL=    X,             R,               I
##VAR_TYPE=  INDEPENDENT,   DEPENDENT,       DEPENDENT
##VAR_FORM=  AFFN,          ASDF,            ASDF
##VAR_DIM=   65536,         65536,           65536
##UNITS=     HZ,            ARBITRARY UNITS, ARBITRARY UNITS
##FACTOR=    0.620285442955139, 1,           1
##FIRST=     20137.2065510759, 0,            0
##LAST=      -20513.1999529892, 0,           0
##MIN=       -20513.1999529892, -25257084,   0
##MAX=       20137.2065510759, 454984495,    0
$$ Real data points
##PAGE= N=1
##DATA TABLE= (X++(R..R)), XYDATA
$$ [...]
39885b128544J430497J993770R64755o36787j163900l63351O36725Q51644K23227
$$ -2128544 -698047 1295723 2260478 1623691 459791 96440 733165 1584809 1808036
39876A808036o96212j207527r29786k28164J50233M3712o1735r779j68946m47833
$$ 1808036 1111824 -95703 -1025489 -1253653 -1103420 -1059708 -1121443 -1131222 -1300168 -1748001
39866a748001j51152P24458J089655L35709n94834n05063L92599Q85262L28789
$$ -1748001 -1899153 -1174695 -85040 250669 -344165 -849228 -456629 428633 757422
39857G57422p84969j411130q03087O63238J465485O13393p10010n25391Q80057
$$ 757422 -27547 -1438677 -2241764 -1578526 -113041 500352 -209658 -735049 145008
39848A45008J141115m34433j534996m72581J085887R09908k31438k78971L59201
$$ 145008 1286123 851690 -683306 -1155887 -70000 839908 608470 329499 688700
39839F88700k56604j730522j633515L25038J531420N63532p16337l62087P34373
$$ 688700 432096 -1298426 -2931941 -2606903 -1075483 -511951 -1228288 -1590375 -856002
39830h56002P49360q3629k88162K62433M86348J85159K16129P40149Q16905n1545
$$ -856002 -106642 -190271 -478433 -216000 270348 455507 671636 1411785 2228690 2177145
39820B177145j129198j547320j317173q21716n3095R70953J501672O93740r86421
$$ 2177145 1047947 -499373 -1816546 -2638262 -2691357 -1720404 -218732 475008 -511413
39811e11413j836501r19328O14776R82306J35834l86037J24660O02445R9803o60277
$$ -511413 -2347914 -3267242 -2652466 -1670160 -1534326 -1920363 -1795703 -1193258 -1093455 -1753732
39801a753732n15480L23099P88168O30466M51128M83490M11164J49231j12665
$$ -1753732 -2269212 -1946113 -1157945 -527479 -76351 407139 818303 967534 854869
39792H54869m10268p52419p25067j61040K52786n0903m53081r2022O65051Q75974
$$ 854869 444601 -307818 -1032885 -1193925 -941139 -992042 -1445123 -1537145 -872094 3880
39782C880O02171M74904K33799o65002j413463p67358N59916N91316o17971p31718
$$ 3880 606051 1080955 1314754 649752 -763711 -1531069 -971153 -379837 -997808 -1729526
39772a729526J078478K429789J189643j300528k227740j112646K66457P60234
$$ -1729526 -651048 1778741 2968384 1667856 -559884 -1672530 -1406073 -645839
39764f45839P24002N28436K5685n40209n33873J2706L71668K09183j17857k99441
$$ -645839 78163 606599 632284 92075 -441798 -429092 -57424 151759 33902 -265539
39754b65539l62548l21319j72722n7451R3778O53785J444139J430051J55451j156361
$$ -265539 -628087 -949406 -1122128 -1179579 -1085801 -432016 1012123 2442174 2597625 1441264
39744A441264j093396j36932J18127n01759o09102K89918Q98048K56603o84856
$$ 1441264 347868 210936 329063 -172696 -781798 -491880 406168 662771 -22085
39735b2085n61572L83116Q11283K11036o22182p11013J38792J232589J453520
$$ -22085 -583657 -200541 610742 821778 199596 -511417 -372625 859964 2313484
39726B313484K72653j351537j706155m38326P97831N04548o33753r16936j48443
$$ 2313484 2586137 1234600 -471555 -909881 -112050 392498 -241255 -1158191 -1306634
39717a306634M26598L82237O02894J255389J019578p02783k210234j584175M67138
$$ -1306634 -880036 -497799 105095 1360484 2380062 1677279 -532955 -2117130 -1649992
39708a649992J459139N27690o49951n02490M19254P41999L18426n7443j38359
$$ -1649992 -190853 336837 -313114 -815604 -396350 345649 664075 606632 468273
39699D68273k53432k97465J45015P86651P99849R3318m64204k90828K11144M17779
$$ 468273 214841 -82624 62391 849042 1648891 1742209 1278005 987177 1198321 1616100
39689A616100J99986l51430j110530j491364p25687Q60449J684267Q28838n57688
$$ 1616100 1816086 1464656 354126 -1137238 -1862925 -1002476 681791 1510629 952941
39680I52941p51107K02442P74318K67185m55405n65277k95964m0814L85345R86764
$$ 952941 201834 404276 1178594 1445779 990374 425097 129133 88319 473664 1460428
39670A460428J081787L16786n69993p69627n57427o45633r57389r16050n08266
$$ 1460428 2542215 2859001 2289008 1519381 961954 316321 -641068 -1557118 -2065384
39661b065384j63963P1020L53682L78148j31633n43150j8237J049636J435420
$$ -2065384 -2229347 -2158327 -1804645 -1426497 -1558130 -2101280 -2119517 -1069881 365539
39652C65539Q79786L02075J75252q639m34024n06792j46467j64112p36563q73147
$$ 365539 1245325 1547400 1722652 1714013 1279989 773197 626730 462618 -273945 -1147092
39642a147092j82492K41277k85719o79086M7402Q97288N43814k65469O8022J172038
$$ -1147092 -1329584 -1088307 -1374026 -2053112 -2005710 -1108422 -564608 -830077 -762055 409983
39632D09983J275262J78863n56933k96615p023j11793J26218O79196M16084o33204
$$ 409983 1685245 1864108 1307175 1010560 1003537 891744 1017962 1697158 2113242 1480038
39622A480038q40453K46712Q17248k53981j403494r52384J56710J83460l82950
$$ 1480038 639585 886297 1703545 1449564 46070 -906314 -749604 -566144 -949094
39613i49094M8996J083062R29255l49822p08669N75288J679512R81636o95255
$$ -949094 -900098 182964 1112219 762397 53728 629016 2308528 3290164 2594909
39604B594909j471127q60115L9841J13668o53889j277014p57170P29811J778960
$$ 2594909 1123782 263667 303508 417176 -236713 -1513727 -2270897 -1541086 237874
39595B37874J354870J07116n91202m82575l39031l97190j06024O07962J011678
$$ 237874 1592744 1699860 1108658 626083 287052 -110138 -216162 391800 1403478
39586A403478O71762o9757p95078j243507r11163M18368J683518J374191l52055
$$ 1403478 2075240 2005483 1210405 -33102 -944265 -525897 1157621 2531812 2179757
39577B179757j603618j209457o3877M66934K87329L9887r2998k15121j68406N3734
$$ 2179757 576139 -633318 -697195 -230261 57068 96955 3957 -211164 -379570 -325836
39567c25836K3585l34070l71064K43514Q43580P72198L17130l0503m40521j068680
$$ -325836 -302251 -636321 -1007385 -763871 79709 851907 1169037 1138534 698013 -370667
39557c70667j317564p28803N9366K59368K44587Q14230J626695J569001M65339
$$ -370667 -1688231 -2417034 -2357668 -2098300 -1853713 -1039483 587212 2156213 2621552
39548B621552o84485j077957p76126j38399M65994N14038j46880p32949m27499
$$ 2621552 1937067 859110 82984 -55415 410579 924617 777737 44788 -382711
39539c82711K98887L28908k75029l46763M16288R34956N41606o1546k29134m64907
$$ -382711 -83824 245084 -29945 -376708 39580 974536 1516142 1454596 1225462 760555
39529G60555j218181j709608j074607J29618P29132O73524P91580J179632J046283
$$ 760555 -457626 -2167234 -3241841 -3112223 -2383091 -1709567 -917987 261645 1307928
39520A307928J05739q96784j145535n07002O12012J452848J177222j58806j116737
$$ 1307928 1413667 516883 -628652 -1135654 -523642 929206 2106428 1947622 830885
39511H30885m53204R29448R55998n49792j360157j01739J537403J175659q13543
$$ 830885 377681 1307129 2263127 1713335 353178 251439 1788842 2964501 2150958
39502B150958j919507j030015M37939R76492Q40080Q43970P10934k49326j550602
$$ 2150958 231451 -798564 -360625 615867 1455947 2299917 3010851 2761525 1210923
39493A210923j849910p67361N47599Q90798L78760n7976q2766j59078m20744k01484
$$ 1210923 -638987 -1406348 -858749 32049 410809 352833 270067 110989 -309755 -511239
39483e11239P64111J338352K58835j730947k332867p07316J214181J343322K75051
$$ -511239 252872 1591224 1850059 119112 -2213755 -2921071 -1706890 -363568 -88517
39474h8517J09043J137833J526239K95251j160751j187919j30853M79755R3270
$$ -88517 20526 1158359 2684598 2979849 1819098 631179 500326 980081 1073351
39465A073351n08710n24874N1986O75770O92768k14165j529644k096414j270078
$$ 1073351 564641 39767 91753 767523 1460291 1246126 -283518 -2379932 -3650010
39456c650010K82201J289685J206739N46101Q7031O0038O4592l21667q41098o80443
$$ -3650010 -3367809 -2078124 -871385 -325284 -238253 -178215 -113623 -435290 -1276388 -1956831
39446a956831M12260J463264J348887L16252l85841k91758j45638m67196q02647
$$ -1956831 -1544571 -81307 1267580 1583832 1197991 906233 760595 293399 -509248
39437e09248p43439o08939n85988j98728O86524J229750P80461n5105k92187Q5684
$$ -509248 -1252687 -1861626 -2447614 -2646342 -1959818 -730068 50393 -4712 -296899 -211215
39427b11215L76291K37803j05775k87495j2785O03852P36752k29378j319487q37169
$$ -211215 165076 402879 297104 9609 -3176 600676 1337428 1108050 -211437 -1048606
39417a048606R62286J716981L49575j168421q43332K73580K5268j221666j322222
$$ -1048606 -86320 1630661 1980236 811815 -31517 242063 267331 -954335 -2276557
39408b276557L3079R79857N83333n6882j5918K01186N2540j21443n1330K9571
$$ -2276557 -2243478 -1263621 -680288 -737170 -753088 -551902 -499362 -620805 -672135 -642564
39398f42564K29165Q91292J445146Q33268o56386j470468r99142k25547J18433
$$ -642564 -413399 477893 1923039 2756307 2099921 629453 -369689 -595236 -476803
39389d76803M34705Q50583O04219m09322r53463k15905R21541J206525N96822
$$ -476803 -42098 808485 1412704 1003382 49919 -165986 755555 1962080 2558902
39380B558902j75132o57399o95812l00674M2151j80781n26110j45528N90813M54661
$$ 2558902 2383770 1726371 1030559 729885 772036 591255 65145 -80383 510430 965091
39370I65091m73803p13641J37901P29810M16313L31819R94981R77982n32998j824563
$$ 965091 491288 -222353 -84452 645358 1061671 1393490 2388471 3366453 2833455 1008892
39360A008892j203800K00628L27860m68518l11805Q96115J491828Q96878J72196
$$ 1008892 -194908 5720 333580 -134938 -446743 449372 1941200 2838078 3010274
39351C010274j07554m66655r98698j078284p01374m75305k70293M87414J253805
$$ 3010274 2902720 2436065 1437367 359083 -342291 -817596 -1087889 -600475 653330
39342F53330R07560j09962j68582P53397P41920r04011k259367j655180j79540
$$ 653330 1560890 1450928 1282346 2035743 2777663 1873652 -385715 -2040895 -2220435
39333b220435K02585l94696m70443J67113L22822l05308n64866K27598J218449
$$ -2220435 -2017850 -2412546 -2882989 -2715876 -2393054 -2698362 -3263228 -3035630 -1817181
39324a817181J351688P38742J34562j70117k88986j41357L21568N56371r4927
$$ -1817181 -465493 273249 407811 237694 -51292 -192649 128919 685290 590363
39315E90363j266630j609325l89505J383482J990752R88601m14039r41591n78971
$$ 590363 -676267 -2285592 -2675097 -1291615 699137 1687738 1273699 332108 -246863
39306b46863j01368J04336K29043L90963L89650R0239l37978o14452n67410k07791
$$ -246863 -348231 -243895 -14852 376111 765761 856000 518022 -96430 -663840 -871631
39296h71631K24794L84173J95192J41R5594K56389N7345l80408l98314K63316
$$ -871631 -646837 -262664 -67472 -67331 28263 284652 341997 -38411 -436725 -173409
39286a73409R04971O66729k45090o88312j26975N32295J97411p52156r65505j49759
$$ -173409 731562 1398291 1153201 464889 337914 870209 1067620 315464 -650041 -799800
39276g99800N18680K68480j75626j9661K44638p0176m24171n3143M14857n5026
$$ -799800 -281120 -12640 -188266 -207927 36711 -33465 -457636 -510779 -95922 -150948
39266a50948q38712l81449J160701J846626P40450q76959j464538r16038O2279
$$ -150948 -989660 -1371109 -210408 1636218 2376668 1499709 35171 -880867 -818588
39257h18588Q37938P83906k27061r98496k61257J076838Q73877p45083j216490
$$ -818588 19350 803256 576195 -422301 -683558 393280 1267157 522074 -694416
39248f94416L49886J521805M49501j139528q98559M47756Q67092N78550R86072
$$ -694416 -344530 1177275 1626776 487248 -411311 36445 903537 1482087 2468159
39239B468159J489311M86284j293849j592351l67890K67730k46740k94690N89670
$$ 2468159 3957470 4443754 3149905 1557554 1189664 1457394 1210654 915964 1505634
39230A505634P49562n10334j578053j289975o23203m93877j40165R12413J349862
$$ 1505634 2255196 1744862 166809 -1123166 -1746369 -2240246 -2380411 -1467998 -118136
39221a18136K22607j076522p92656N02136R74665L18754k69927k49227j77353
$$ -118136 104471 -972051 -1764707 -1262571 -287906 30848 -239079 -488306 -665659
39212f65659l13373k43530J41063M48674N75456P49623P92363K03082q94059j584967
$$ -665659 -979032 -1222562 -1081499 -632825 -57369 692254 1484617 1687699 793640 -791327
39202g91327j189327n8715Q11529P69945N7631n26022m73017M239M55402P82327
$$ -791327 -1980654 -2039369 -1227840 -457895 -400264 -926286 -1399303 -1395064 -939662 -157335
39192a57335J003996Q28187J25966m46049j71091N00647M45688l82303q09368
$$ -157335 846661 1674848 1800814 1354765 1183674 1684321 2130009 1747706 938338
39183I38338k99250K02438j87352r35842j015901l73409K85324N43186M13722
$$ 938338 639088 841526 654174 -281668 -1297569 -1670978 -1385654 -842468 -428746
39174d28746r886m05658k62361L21298M61777k14911p31285q3075J083882J174640
$$ -428746 -438632 -844290 -1106651 -785353 -323576 -538487 -1269772 -1352847 -268965 905675
39164I05675j29061j351900j116281J99157J050794N70820n37324q67432Q8362
$$ 905675 776614 -575286 -1691567 -1492410 -441616 129204 -408120 -1275552 -1187190
39155a187190J333259J493910M26529o89768q70304l89281q5772j53360j35566
$$ -1187190 146069 1639979 2066508 1376740 506436 117155 31383 -121977 -257543
39146b57543J68044L65404O3311n59858r24203p21837l17260l05054o26193m99288
$$ -257543 -89499 275905 339216 -220642 -1144845 -1866682 -2183942 -2488996 -3115189 -3614477
39136c614477M47248J407358J386896O23306J65261K44457J46192k83824k74684
$$ -3614477 -3167229 -1759871 -372975 250331 415592 660049 806241 522417 247733
39127B47733L59307O26584j3788o06924k62389K88054l9009o83204k90911Q67005
$$ 247733 607040 1233624 1219836 612912 350523 638577 599568 -83636 -374547 492458
39117D92458J070016j61169j209802p64764L44281O37037J92531J22340M93837
$$ 492458 1562474 1401305 191503 -573261 -228980 408057 600588 722928 1216765
39108A216765K32301r12938j607706p04864J026586J717282O59902r05739j315473
$$ 1216765 1449066 536128 -1071578 -1776442 -749856 967426 1627328 721589 -593884
39099e93884l36039P48587P41893q3779m43527J79441P17631j0023j356474j396947
$$ -593884 -929923 -181336 560557 476778 33251 212692 930323 920300 -436174 -1833121
39089a833121L43388J850101J188191p65194j485345k52970J126952J112740L23276
$$ -1833121 -1489733 360368 1548559 783365 -701980 -954950 172002 1284742 1608018
39080A608018P8291M25143N45838J57421m28889r45311j109498o33070N6928m0526
$$ 1608018 1686309 2111452 2657290 2814711 2385822 1440511 331013 -302057 -245129 -285655
39070b85655r14141j113107J30218J413435J087509k53047p46541o2891M66430
$$ -285655 -1199796 -2312903 -2182685 -769250 318259 65212 -681329 -744220 -277790
39061b77790J66671k28784j15433J95416L40497L05519o4713q01031j162030m57480
$$ -277790 -111119 -339903 -455336 -259920 80577 386096 321383 -479648 -1641678 -2099158
39051b099158O50776R39281M58910J70679Q6109m97086j102213m53485J078237
$$ -2099158 -1448382 -509101 -50191 120488 206597 -290489 -1392702 -1846187 -767950
39042g67950J504883K29430r57028o52508K38058L38794j07060j26456L35986
$$ -767950 736933 966363 9335 -643173 -405115 -66321 -173381 -299837 36149
39033C6149P25845P65989K89717o80169j198027k08013J393734J318176p04998
$$ 36149 761994 1527983 1817700 1137531 -60496 -268509 1125225 2443401 1738403
39024A738403k070210j014659Q20772J091078J00085m50795m09331o78678j030263
$$ 1738403 -331807 -1346466 -525694 565384 665469 214674 -194657 -873335 -1903598
39015a903598o43296O5749K09611K04118Q00184J232748M62942n66299k38749
$$ -1903598 -2546894 -2481145 -2271534 -2067416 -1267232 -34484 428458 -137841 -376590
39006c76590Q54103Q34769j60617l23702L95560J64756j125911j186254P78193
$$ -376590 477513 1312282 1151665 827963 1223523 1388279 262368 -923886 -145693
38997a45693K294117J265741r29157j788291j227841p55976n82696J76641J236429
$$ -145693 2148424 3414165 2485008 696717 -531124 -1287100 -1869796 -1693155 -456726
38988d56726J307218L40171k73020R5625M68733K5113n94759m16710L31841O20937
$$ -456726 850492 1190663 917643 1013268 1482001 1507114 912355 495645 827486 1448423
38978A448423J05694n23848n79348j75128J47998J92722J79289K27314J48152
$$ 1448423 1554117 1030269 450921 275793 423791 616513 795802 1023116 1171268
38969A171268j93406o09780q19996p35695m08166Q1096N50967P70335P08833N40272
$$ 1171268 977862 368082 -451914 -1187609 -1595775 -1514679 -963712 -193377 515456 1055728
38959A055728L46320P8561j82452k79279k69396k60112p5142L40880M06388l09595
$$ 1055728 1402048 1480609 1298157 1018878 749482 489370 414228 755108 1161496 851901
38949H51901r49749l02462J031540J020907o94099j846182q01853R03081R43427
$$ 851901 -97848 -400310 631230 1652137 958038 -888144 -1689997 -786916 156511
38940A56511k62669m99145O51179J463516J014213K32699j05548l88814p66770
$$ 156511 -106158 -605303 45876 1509392 2523605 2756304 2650756 2261942 1495172
38931A495172n80231J88412M85994q9464n35440j29465M31276L39864q5748l00727
$$ 1495172 914941 1103353 1589347 1499883 964443 834978 1266254 1606118 1520370 1219643
38921A219643n01561p68710l77711Q63493J558075M57368j325359j446094L81781
$$ 1219643 718082 -50628 -428339 435154 1993229 2450597 1125238 -320856 60925
38912F0925J787454R36753r61686j395878m8676Q85020n8282j502813j289188
$$ 60925 1848379 2785132 1823446 427568 378892 1263912 1205630 -297183 -1586371
38903a586371L77324J333505O41395l69418m77618k18194l67290m21945J62209
$$ -1586371 -1209047 124458 765853 396435 -81183 -299377 -666667 -1088612 -926403
38894i26403O01538J76073j83607N41340J302205M49979j307451j689384l45661
$$ -926403 -324865 -148792 -332399 208941 1511146 1961125 653674 -1035710 -1381371
38885a381371P25240L93673k21139p3592K28190q975k30380J47234O48621P71346
$$ -1381371 -656131 -262458 -483597 -557189 -328999 -337974 -568354 -421120 227501 998847
38875I98847Q07947Q64200L58473p14397j290012q13269j13517M5299M9132L01714
$$ 998847 1806794 2670994 3029467 2315070 1025058 211789 98272 143571 192703 494417
38865D94417L03873k51358o89549n63880m59824p13594n98174K47942Q98684P33392
$$ 494417 798290 546932 -142617 -706497 -1166321 -1879915 -2478089 -2230147 -1331463 -598071
38855e98071O02163J134915J239169j37236j855288j959175m78803Q00891Q75414
$$ -598071 4092 1139007 2378176 2240940 385652 -1573523 -2052326 -1251435 -376021
38846c76021L14531j05985j78809R5181M98127M71873j05197m65812p7058M73897
$$ -376021 -61490 -167475 -346284 -251103 247024 718897 613700 147888 70830 544727
38836E44727N56821N38830P41180M54830o93786j481670p57083N97321J035954
$$ 544727 1101548 1640378 2381558 2836388 2142602 660932 -96151 501170 1537124
38827A537124P17139O42593M27087q09544k054649j467909M52294J335462N71086
$$ 1537124 2254263 2896856 3323943 2514399 459750 -1008159 -555865 779597 1350683
38818A350683j02033J43342Q3539p87976j032122N4496R06802K71882p16587o05282
$$ 1350683 1248650 1391992 1475531 687555 -344567 -290071 616731 888613 172026 -433256
38808d33256K8980j4780l48559j687N89882M39452q1608K7643M83029K64371m38434
$$ -433256 -404276 -419056 -767615 -769302 -179420 260032 178424 206067 689096 953467 515033
38797E15033n06558J79551O38028M54066J42421o2293m17818o69478j74134P60345
$$ 515033 8475 188026 826054 1280120 1422541 1360248 942430 272952 98818 859163
38787H59163Q79398k52260j450299j385564j87866Q79470Q84393K416q52088q81177
$$ 859163 1738561 1486301 36002 -1349562 -1537428 -657958 226435 228851 -623237 -1504414
38777a504414m8774R53637J372559R76934P1414p55744r22755l78471J36768j6015
$$ -1504414 -1553188 -599551 773008 1749942 1821356 1065612 142857 -235614 -98846 -114861
38767a14861k45302M90647J621390J185178j108137k666281j400791J018186J408940
$$ -114861 -360163 130484 1751874 2937052 1828915 -837366 -2238157 -1219971 188969
38758A88969k78750j123130J51117J488639J076283l3689k45775j24696q28731
$$ 188969 -89781 -1212911 -1061794 426845 1503128 1469439 1223664 1098968 270237
38749B70237j516533o52325J065734J477408K99090n86462k39954J52469k56520
$$ 270237 -1246296 -1898621 -832887 644521 943611 357149 117195 269664 13144
38740A3144m21007N71664J588063J076174m73188j283108q92984m39156n78111
$$ 13144 -407863 163801 1751864 2828038 2354850 1071742 178758 -260398 -838509
38731h38509o66182j95377K97496K78257J44196M31655Q32197P21749J81214j97787
$$ -838509 -1504691 -1700068 -1402572 -1124315 -980119 -548464 283733 1005482 1186696 988909
38721I88909k00020o0700Q3370J98742K1862n98751j111280p25019M47059J365753
$$ 988909 788889 728189 811559 1010301 1032163 433412 -677868 -1402887 -955828 409925
38711D09925J370540Q76357M84570P4015o61221j287565j061366j49880L68389
$$ 409925 1780465 2656822 3141392 3215407 2554186 1266621 205255 55375 423764
38702D23764p9452p46580n56345M65658J229936R46054J677o35994n69653k31482
$$ 423764 344312 -402268 -958613 -492955 736981 1683035 1684712 1048718 479065 247583
38692B47583j15785j31219J00379N32199O43301J55318m90176n97690m8287N84366
$$ 247583 131798 579 100958 633157 1276458 1431776 941600 343910 295623 879989
38682H79989P70595O38343O56056Q27358N69071m17025j447224j500204n34626
$$ 879989 1650584 2288927 2944983 3772341 4341412 3924387 2477163 976959 442333
38673D42333L72159M03046l2206j32689M2190r0437l98927j43985O63876J052005
$$ 442333 814492 1217538 1185332 1052643 1094833 1004396 605469 461484 1125360 2177365
38663B177365N51307q0545j24421K821l47769q36821p65727l44450k75168m64900
$$ 2177365 2728672 2648127 2523706 2526527 2178758 1341937 576210 231760 -43408 -508308
38653e08308k70137K09771K51299j56562k71704O4273K48851J83526L84779N88797
$$ -508308 -778445 -568674 -317375 -473937 -745641 -681368 -432517 -248991 135788 724585
38643G24585k02249j680860j897877p2164J758730J434782j77001o06298M60568
$$ 724585 522336 -1158524 -3056401 -3128565 -1369835 64947 -112054 -718352 -257784
38634b57784J012283O2879j042699j026747m04588n8593K42758Q79770J257093
$$ -257784 754499 817378 -225321 -1252068 -1656656 -1715249 -1472491 -592721 664372
38625F64372P91602N9280j32177l2926k68119n65014k84718K80089K72170l44104
$$ 664372 1455974 1515254 1383077 1350151 1082032 517018 232300 512389 784559 440455
38615D40455p77256o29172k35364Q7398L20515L67593J38766p8043K2682K02599
$$ 440455 -336801 -965973 -1201337 -1113939 -793424 -425831 -287065 -365108 -342426 -139827
38605a39827J06667m4490P5703J08408l81657q45035m52578L18566J55308r26357
$$ -139827 -33160 -77650 -1947 106461 -275196 -1120231 -1572809 -1254243 -1098935 -2025292
38595b025292j310714j45007J330119J556053O88223k5847m3530K49369M83852
$$ -2025292 -3336006 -3481013 -2150894 -594841 93382 67535 24005 273374 757226
38586G57226N44629K91180j56133k33752K47043N34154n1180r61988j140971n44831
$$ 757226 1301855 1593035 1436902 1203150 1450193 1984347 1933167 971179 -169792 -714623
38576g14623l9401k104J7083L08208N80691N95741M60506K39010n4903j29014
$$ -714623 -754024 -756128 -739045 -430837 149854 745595 1206101 1445111 1390208 1261194
38566A261194J78921K77245m64438j403448j162538K77482J222689N80499n68609
$$ 1261194 1440115 1717360 1252922 -150526 -1313064 -1035582 187107 767606 198997
38557A98997n89836L88987Q90290K99751n13126o64390l04331l1716m2671j60405
$$ 198997 -390839 -1852 888438 1188189 675063 10673 -293658 -325374 -368045 -528450
38547e28450k20047j63979k2577J02761K17492M84697Q36324P73255J5784q29012
$$ -528450 -748497 -912476 -935053 -832292 -614800 -130103 706221 1479476 1495260 666248
38537F66248q45223j3205P62238Q51336M85222M8352m64664r61040r39338k44046
$$ 666248 -178975 -192180 570058 1421394 1906616 1954968 1490304 529264 -410074 -654120
38527f54120L86780K10505m00497m40436K77059Q82542P28857K22219R2599L41343
$$ -654120 -267340 -56835 -457332 -897768 -620709 261833 990690 1212909 1305508 1646851
38517A646851L37180k74308j111152j446859q98568J84841R45320Q06489J26688
$$ 1646851 1984031 1709723 598571 -848288 -1746856 -1562015 -616695 189794 316482
38508C16482j93373J20864L27377k21294r70266q12258K83222J077038P26081
$$ 316482 123109 243973 571350 350056 -620210 -1432468 -1149246 -72208 653873
38499F53873p4300j39498N34250Q82278L24711n69041j000411q14531k53627M97979
$$ 653873 579573 440075 974325 1856603 2181314 1612273 611862 -202669 -456296 41683
38489D1683J127048J082042K06792p98886j066384n55552O4242L65756M87576
$$ 41683 1168731 2250773 2457565 1658679 592295 36743 100985 466741 954317
38480I54317N52904L25178l37471j028865j102161l86483N33039Q24025K82280
$$ 954317 1507221 1832399 1494928 466063 -636098 -1022581 -489542 334483 616763
38471F16763l51563k09458N38451P67996j00115j159482j092847J20635J197549
$$ 616763 265200 55742 594193 1362189 1262074 102592 -990255 -869620 327929
38462C27929J135694K15570n87025o65161j62558L32214L81743J44341O8649O3081
$$ 327929 1463623 1679193 1092168 427007 264449 596663 978406 1122747 1191396 1254477
38452A254477m58649j340163j331958J46671J666013J508967K01939k82552M02693
$$ 1254477 795828 -544335 -1876293 -1729622 -63609 1445358 1647297 1364745 1767438
38443A767438O06027m28180j307037q62772O4703K95581J45393L09232L35940
$$ 1767438 2373465 1945285 638248 -224524 -159821 135760 281153 590385 926325
38434I26325l16279q85954n07871J81823J52859k36168j02850K45294J16010P663
$$ 926325 610046 -275908 -783779 -601956 -449097 -685265 -788115 -542821 -426811 -419148
38424d19148N32394P07550m91736j666233o77077J584401J986547q0852j660118
$$ -419148 113246 820796 329060 -1337173 -2014250 -429849 1556698 1475846 -184272
38415a84272p66854P81807N30474r23647j308072j67418R61749R73075J85949
$$ -184272 -951126 -169319 361155 -562492 -1870564 -2037982 -1076233 -103158 82791
38406H2791n58735o44079K9755P19405L99064p72013j352987n67256O13123R85137
$$ 82791 -475944 -1120023 -1090268 -370863 28201 -743812 -2096799 -2664055 -2050932 -1065795
38396a065795O88799M80421M26717K21525k4904j48794l48240n58026k17683P01769
$$ -1065795 -376996 103425 530142 751667 726763 577969 229729 -328297 -545980 155789
38386A55789J287451Q95196o5896r53564j453616j055452N75425K234034J908649
$$ 155789 1443240 2338436 2272540 1318976 -134640 -1190092 -614667 1619367 3528016
38377C528016l26752j914055j289993R3766M29536K00468N05557O85389k44250
$$ 3528016 3201264 1287209 -2784 90982 520518 720986 1226543 1911932 1667682
38368A667682j326179j074256N7742P21825R54554J265687Q21022r66177k274172
$$ 1667682 341503 -732753 -675011 46814 1001368 2267055 3088077 2121900 -152272
38359a52272j130827J111578J535968J70166m40457K86748L73212p68232j272922
$$ -152272 -1283099 -171521 1364447 1534613 1094156 1380904 1754116 985884 -287038
38350b87038l49009L87077N6941l7371O88580O85477o99324j466073j66364J391131
$$ -287038 -636047 -248970 -192029 -229400 459180 1144657 445333 -1020740 -1187104 204027
38340B04027Q08032j205029j949116m58347J733541K785713K082463K45469j275806
$$ 204027 1012059 -192970 -2142086 -2600433 -866892 1918821 4001284 4246753 2970947
38331B970947j261009j11793N72259J82914l26688l72322n54942r41011m58184
$$ 2970947 1709938 1598145 2170404 2353318 2026630 1654308 1099366 158355 -299829
38322b99829R79282J654108O54605n08597l50103L17120K17482o9417L81200O63689
$$ -299829 679453 2333561 2988166 2479569 2129466 2446586 2664068 2594651 2975851 3639540
38312C639540k83955j187972k29222J630775J867154M07791l83648L13293O05983
$$ 3639540 3355585 2167613 1938391 3569166 5436320 5844111 5460463 5773756 6379739
38303F379739p61230k346976k296723q09762P11771J500171J450513N81133n59317
$$ 6379739 5618509 3271533 974810 165048 876819 2376990 3827503 4408636 3849319
38294C849319r25978k63386M52459M90024L62930O55444Q14263R2659r97492j269940
$$ 3849319 2923341 2659955 3112414 3602438 3965368 4620812 5435075 5527734 4530242 3260302
38284C260302n69135Q6987p634m27808m04164J43293O03725M65661o3877k77420
$$ 3260302 2691167 2778154 2770520 2342712 1938548 2081841 2685566 3151227 3087350 2809930
38274B809930J13032M58160J9428p66899o80727M13267J115224N67039j08820
$$ 2809930 2922962 3381122 3400550 2633651 1952924 2366191 3481415 4048454 3939634
38265C939634L70472J169610O43025p02881q16991M26588R82479L20739L88353
$$ 3939634 4310106 5479716 6122741 5419860 4602869 5029457 6011936 6332675 6721028
38256F721028J698266J741899m89456j696303P00938L696013L195548R36903J631944
$$ 6721028 8419294 10161193 9671737 7975434 8676372 12372385 15567933 16504836 18136780
38247A8136780M968577O606274O166238P261332R712597R646083Q242288J1496362
$$ 18136780 23105357 29711631 35877869 43139201 52851798 62497881 70740169 82236531
38239H2236531J9277831K5099558L0394219M5382356O6444764O6578893K5944908
$$ 82236531 101514362 126613920 157008139 202390495 268835259 335414152 361359060
38232C61359060l4956503p2032863o6962097m2356713k6353864k1525646j6370146
$$ 361359060 326402557 254369694 187407597 145050884 118697020 97171374 80801228
38225H0801228r472269p514430r723458r355208o083644m969712n972748m689778
$$ 80801228 71328959 63814529 54091071 44735863 38652219 33682507 27709759 23019981
38217B3019981j515215q81679k667620k639326n72081k58880j947711j983373
$$ 23019981 21504766 20623087 17955467 15316141 14744060 14485180 12537469 10554096
38209A0554096J38828J059945j0896m00700L07169l35287k165847k123614l5669
$$ 10554096 10692924 11752869 11741973 11341273 11648442 11313155 9147308 7023694 6988025
38200F988025Q05022m30998q95926L66774Q06363n55379j315248l10761M44684
$$ 6988025 7793047 7362049 6466123 6832897 7639260 7083881 5768633 5457872 5902556
38191E902556j43678l87990N32798R15624o1911p58676j51141O32981P87058Q66652
$$ 5902556 5758878 5370888 5903686 6819310 6757399 5998723 5847582 6480563 7267621 8134273
38181H134273Q03760j35977j111772m34752J370993K176965J646237J084950P20005
$$ 8134273 8938033 8802056 7690284 7255532 8626525 10803490 12449727 13534677 14254682
38172A4254682K87871R38937K946787L505341J102725m54971K337996O048956
$$ 14254682 14542553 15481490 18428277 21933618 23036343 22581372 24919368 30968324
38164C0968324N892553M737127Q171712J3459065J3681889J0987417J3789825
$$ 30968324 36860877 41598004 49769716 63228781 76910670 87898087 101687912
38157A01687912K1841163K8286026L6619355N6725322P8201982O8760828J4860887
$$ 101687912 123529075 151815101 188434456 245159778 323361760 392122588 406983475
38150D06983475n0909179q2180810p0117823m4365182k9827867k4159471j7361082
$$ 406983475 356074296 273893486 203775663 159410481 129582614 105423143 88062061
38143H8062061j1135941j0529109j1931044r840638o348267n645553o061598m433135
$$ 88062061 76926120 66397011 54465967 44625329 38277062 32631509 26569911 22136776
38135B2136776k538742k990387l661542j850010K73845l75949k106097j667204
$$ 22136776 19598034 16607647 12946105 11096095 11369940 10993991 8887894 7220690
38127G220690J5675R5156q63490l80561J122622J255811k7419p81722o36155p44071
$$ 7220690 7236365 7331521 6468031 6087470 7210092 8465903 8438484 7656762 7020607 6276536
38117F276536j064313n92923L58339N79022Q5794j92615k04629m84809p88979
$$ 6276536 5212223 4619300 4977639 5556661 5642455 5449840 5245211 4760402 3971423
38108C971423o09700l29872m67355n55759l9377N63842N69382L19404L78669M47977
$$ 3971423 3361723 3031851 2564496 2008737 1969360 2533202 3102584 3421988 3800657 4248634
38098D248634J22479j72218R162K50288O8471k82321n16714q39396j120753o87200
$$ 4248634 4371113 4198895 4208057 4458345 4526816 4244495 3727781 2888385 1767632 1080432
38088A080432L80666R49304N63382K09189N46899P22408m4569r22048p05239L36554
$$ 1080432 1461098 2410402 2973784 3182973 3729872 4452280 4407711 3485663 2780424 3116978
38078C116978R63944O17093l19405j225244j491158p66519L82205P59940N8617
$$ 3116978 4080922 4698015 4378610 3153366 1662208 895689 1277894 2037834 2096451
38069B096451o31950l35702N25455Q68791L23048n71568j027704o68261L3051
$$ 2096451 1464501 1128799 1654254 2523045 2846093 2274525 1246821 578560 611611
38060F11611R5991o38573j015392k38672P09245N94614M2867L75617J078407O16384
$$ 611611 707602 69029 -946363 -1185035 -475790 118824 161691 537308 1615715 2232099
38050B232099o93078j078816l68741J141k0053R20896K300887J716900r14999
$$ 2232099 1539021 460205 91464 92605 72552 993448 3294335 5011235 4096236
38041D096236k434540j157655N82427M25129m87548k46162L13835m06768j503689
$$ 4096236 1661696 504041 1086468 1511597 1024049 777887 1091722 684954 -818735
38032h18735j225626j70501P3663R091R72488K019250J231661o19358r41835L91084
$$ -818735 -2044361 -2214862 -2141199 -2132108 -1159620 859630 2091291 1471933 530098 921182
38022I21182P67413q30703k127040j121460R69284J663691N50010o82299p09850
$$ 921182 1688595 857892 -1269148 -2390608 -1421324 242367 792377 110078 -599772
38013e99772O5880M44394L0295l98837j44058K67265o7599p35933n05483M52190
$$ -599772 -533892 -89498 -59203 -458040 -602098 -334833 -402432 -1138365 -1643848 -1191658
38003a191658O00778k31657k67824J037997J517689k59539k183776j630331M40190
$$ -1191658 -590880 -822537 -1090361 -52364 1465325 1205786 -977990 -2608321 -2168131
37994b168131J176647L22702o3470M51486L06170o92696q79988O3338M37635k69679
$$ -2168131 -991484 -668782 -732252 -280766 25404 -667292 -1547280 -1483942 -1046307 -1315986
37984a315986l67676Q33251J495807L61246r88909p28646L13145L28513m01024
$$ -1315986 -1683662 -850411 645396 1006642 17733 -710913 -397768 -69255 -470279
37975d70279k63764P88633J237492N32224k58134l88728m16433q10443q96991
$$ -470279 -734043 54590 1292082 1824306 1566172 1177444 761011 -49432 -946423
37966i46423p398J119329J113064m3831q22984k81748N13296Q6400j060949j112413
$$ -946423 -953821 165508 1278572 1234741 411757 130009 643305 729705 -331244 -1443657
37956a443657J13737O87192l47768j273934m24714J025499R28672l49595o14935
$$ -1443657 -1329920 -642728 -990496 -2264430 -2689144 -1663645 -734973 -1084568 -1699503
37947a699503N88395J496096J105269L29238o1509m63922r23728o59592K04864
$$ -1699503 -1111108 384988 1490257 1819495 1757986 1294064 370336 -289256 -84392
37938h4392L56571m57418p60090J35786P98238P6614r00558o21478L60239N20081
$$ -84392 272179 -185239 -945329 -809543 -11305 65309 -835249 -1456727 -1096488 -576407
37928e76407k00044o97967o38576n18398m00961Q989M81324O16701N82875N13317
$$ -576407 -776451 -1474418 -2112994 -2631392 -3032353 -3023364 -2542040 -1925339 -1342464 -829147
37918h29147n9801j077160j229454J98830J669583J308997k32481p96914r2973
$$ -829147 -888948 -1966108 -3195562 -2996732 -1327149 -18152 -250633 -1047547 -1140520
37909a140520J79087n34531q01367L4907O06507N6115k72944Q13109J980100J219528
$$ -1140520 -961433 -1495964 -2297331 -2262424 -1655917 -1599802 -1872746 -1059637 920463 2139991
37899B139991r46987k058139j066358O48965J521329J431180Q70242m1192j035672
$$ 2139991 1193004 -865135 -1931493 -1282528 238801 1669981 2540223 2499031 1463359
37890A463359j289257m44755N33669L90774p45896j434541p03094P61759J434518
$$ 1463359 174102 -270653 263016 653790 -92106 -1526647 -2229741 -1467982 -33464
37881c3464O79937o23370j149475n70610K42608L81203n2966k47483J91595P87965
$$ -33464 646473 23103 -1126372 -1696982 -1454374 -1073171 -1126137 -1373620 -1182025 -394060
37871c94060Q80475L94308k41249o49950p07383l97513J42135M94210L04560j55067
$$ -394060 486415 880723 639474 -10476 -717859 -1115372 -973237 -479027 -174467 -329534
37861c29534j80260L75209P04483R1243r33471j137341k80832M76729J89081n32052
$$ -329534 -509794 -134585 569898 661141 -272330 -1409671 -1690503 -1213774 -1024693 -1556745
37851a556745m34267N49711J257744R74547K40387k01797l66264m58026j95842
$$ -1556745 -1991012 -1441301 -183557 790990 1031377 829580 463316 5290 -190552
37842a90552M77040O52246m35130j837095j738504k0261J344335J006826P7530
$$ -190552 286488 938734 503604 -1333491 -3071995 -3092256 -1747921 -741095 -663565
37833f63565K19986J004003P43391n56509r80835L18022J664809J246757l76437
$$ -663565 -443579 560424 1303815 747306 -233529 84493 1749302 2996059 2619622
37824B619622j347550j169193q54705q86489n73122M18179J194022Q45948k98453
$$ 2619622 1272072 102879 -751826 -1638315 -2211437 -1793258 -599236 246712 -51741
37815e1741j158124j070609j33326J026023J458043N32329j112802j850436r10415
$$ -51741 -1209865 -2280474 -2413800 -1387777 70266 602595 -510207 -2360643 -3271058
37806c271058N71661J030359M64242N5652K29172K94731k5503j6946O75053J221816
$$ -3271058 -2699397 -1669038 -1204796 -1149144 -919972 -625241 -650744 -667690 7363 1229179
37796A229179Q21078j08042o86627q23263q61828o09910K36919J073980R19053
$$ 1229179 2050257 1942215 1255588 432325 -429503 -1039413 -802494 271486 1190539
37787A190539j05562q42993p13088k94264j59827j23725L6251L8463k33816l20119
$$ 1190539 1084977 241984 -471104 -765368 -925195 -1048920 -1012669 -974206 -1208022 -1528141
37777a528141Q476K24793p3407l85811q6677N22164O29748L9220p11469j031628
$$ -1528141 -1519665 -1294872 -1368279 -1754090 -1840767 -1318603 -688855 -649635 -1361104 -2392732
37767b392732o24282L95009J248641R66070k63961q71079J14684J484855J365594
$$ -2392732 -3017014 -2622005 -1373364 -407294 -671255 -1542334 -1427650 57205 1422799
37758A422799j32846j089614m82776O12702P86181Q9241m57110l57725o0619k33791
$$ 1422799 1289953 200339 -282437 330265 1116446 1205687 748577 390852 330233 96442
37748I6442r25781j340539o48715P32086J263624L24086o44568j21824J086743
$$ 96442 -829339 -2169878 -2818593 -2086507 -822883 -498797 -1143365 -1265189 -178446
37739a78446J011434l63908j087696l41262N05315L45042j83565l58201n34826
$$ -178446 832988 469080 -618616 -959878 -454563 -109521 -293086 -651287 -1186113
37730a186113p55292k10194Q02022N32045j151766j666995K86245J986996P71029
$$ -1186113 -1941405 -2151599 -1349577 -817532 -1969298 -3636293 -3350048 -1363052 -592023
37721e92023j259834l61330K401933K399626j001543k993361p79829K069285J377471
$$ -592023 -1851857 -2213187 188746 2588372 1586829 -1406532 -2186361 -117076 1260395
37712A260395j247128j459662Q83777K044274N56494j052636q23728m6869l78831
$$ 1260395 13267 -1446395 -562618 1481656 2038150 985514 161786 114917 -263914
37703b63914j125584r34845j99360j05496n44236m77603L38210J169888J387195
$$ -263914 -1389498 -2324343 -2523703 -2629199 -3173435 -3651038 -3312828 -2142940 -755745
37694g55745R26168J33946k99410J29520Q15222M99491p89297j339016j96943
$$ -755745 170423 304369 4959 134479 949701 1449192 659895 -679121 -876064
37685h76064J136008Q15621m95072o66976N58517J339129Q11339K28647M54882
$$ -876064 259944 1075565 580493 -86483 472034 1811163 2622502 2851149 3306031
37676C306031M05194q23685j982960j458719J41179R35501N52754J75833K21088
$$ 3306031 3711225 2887540 904580 -554139 -412960 522541 1075295 1251128 1472216
37667A472216j40733j062760j372270l89925R24193J303139O78559k03417q07270
$$ 1472216 1331483 268723 -1103547 -1493472 -569279 733860 1412419 1209002 401732
37658D01732r11627m60761J59892L48209J61929K53357O48453N59569j41086m09195
$$ 401732 -509895 -970656 -810764 -462555 -300626 -47269 601184 1160753 1019667 610472
37648F10472K41683O58236j55918j166642p60182N77105Q15517n05002j523636
$$ 610472 852155 1510391 1354473 187831 -572351 4754 820271 315269 -1208367
37639a208367q33785N70091R34566J18578p01551q39847m99608R4570Q05927J043734
$$ -1208367 -2042152 -1472061 -537495 -418917 -1120468 -1960315 -2459923 -2365353 -1559426 -515692
37629e15692K48352r64585j145988J18951J487768J541529N25636k98560n03252
$$ -515692 -267340 -1231925 -2377913 -2258962 -771194 770335 1295971 997411 494159
37620D94159o85438r99107p16342L54600J067719M00853r21947j255053k04491
$$ 494159 -191279 -1190386 -1906728 -1552128 -484409 -83556 -1005503 -2260556 -2465047
37611b465047R70118J096322L67541k75672l18959M9755L39304K07002j81844
$$ -2465047 -1494929 -398607 -31066 -306738 -625697 -575942 -236638 -29636 -211480
37602b11480k71025Q7337K65157j24212l10943N12663J517305J095190o18273
$$ -211480 -482505 -395168 -130011 -254223 -565166 -52503 1464802 2559992 1941719
37593A941719j671170j065798N9174N93180R64895J479747J063537p00106j940811
$$ 1941719 270549 -795249 -736075 -142895 822000 2301747 3365284 2665178 724367
37584G24367j032230N06923J00443j719984k002192j1114J699498J325488J99161
$$ 724367 -307863 199060 299503 -1420481 -3422673 -3433787 -1734289 -408801 -209640
37575b09640O4685L64223j60528j001162q72623K8911N00762K88534O5244O3665
$$ -209640 -144955 219268 58740 -942422 -1815045 -1786134 -1285372 -996838 -931594 -867929
37565h67929O1534J95323N63302N63206j50635o27586R6069J169103R37809m63173
$$ -867929 -806395 -611072 -47770 515436 364801 -262785 -166716 1002387 1940196 1477023
37555A477023j203552n37858J66577l10095j193063r84374M06796J714728J921129
$$ 1477023 273471 -264387 -97810 -407905 -1600968 -2585342 -2178546 -463818 1457311
37546A457311J076961r7591q48447q42601l77702l1841l8009k42262n25368p47084
$$ 1457311 2534272 2436681 1588234 745633 367931 336090 298081 55819 -469549 -1216633
37536a216633m54822N57765J467877J189448L0061n42761p6959K21763l82542
$$ -1216633 -1671455 -1113690 354187 1543635 1573696 1030935 953976 1175739 793197
37527G93197q04802k168J071436Q88129j78547n47648o3680l8561p93505j107695
$$ 793197 -11605 -13773 1057663 1945792 1767245 1219597 1155917 1117356 323851 -783844
37517g83844m31207J93849Q1907P2020P54998J045346r0083j569562j471445J66863
$$ -783844 -1215051 -1021202 -939295 -867275 -112277 933069 842986 -726576 -2198021 -2031158
37507b031158J356906Q68130l83053q70350l51336K55303K79121P181N1836L81397
$$ -2031158 -674252 193878 -189175 -1059525 -1410861 -1155558 -876437 -869256 -817420 -436023
37497d36023L74986n3978j5403R49519J575263L76783j664430j775517O24042
$$ -436023 -61037 -115015 -130418 819101 2394364 2771147 1106717 -668800 -44758
37488d4758K524288J255936j775094l085903j664237N16086J681543J724368R30635
$$ -44758 2479530 3735466 1960372 -1125531 -2789768 -2273682 -592139 1132229 2062864
37479B062864m20268j184184k88552J216913J143553m70585j188572L0272J173122
$$ 2062864 1642596 458412 169860 1386773 2530326 2059741 871169 901441 2074563
37470B074563L96005j219929j611147o80272L15983Q68789J031803L93433r91987
$$ 2074563 2470568 1250639 -360508 -1040780 -724797 143992 1175795 1569228 577241
37461E77241j666916n86195R19940Q19127o00815j247071l68917P01283Q58479
$$ 577241 -1089675 -1675870 -755930 63197 -537618 -1784689 -2153606 -1452323 -593844
37452e93844M69045J24161k25940n07146k67434L43989M83333n9347m40036q5848
$$ -593844 -124799 -638 -226578 -733724 -1001158 -657169 -173836 -233183 -673219 -759067
37442g59067M84417O06379M10090L38597M11908M31083L76585K26027j67303p19489
$$ -759067 -274650 331729 741819 1080416 1492324 1923407 2299992 2526019 2358716 1639227
37432A639227j045352r50882o20885k17914K72288P26176Q86403P52988N15137
$$ 1639227 593875 -357007 -977892 -1195806 -923518 -197342 689061 1442049 1957186
37423A957186J13618n49694r93345n40109M85350P90340j69385j229558r83100
$$ 1957186 2070804 1521110 527765 -12344 473006 1263346 1093961 -135597 -1118697
37414a118697L03791J111075P60515J00138l6189l2753n31037j063519p12195
$$ -1118697 -814906 296169 1056684 1156822 1120633 1087880 556843 -506676 -1218871
37405a218871K13957M34732k49649n17506K92531R42299L44410m07539K42977
$$ -1218871 -1004914 -570182 -819831 -1337337 -1044806 -102507 241903 -165636 77341
37396G7341J443318R67848j106103k138284q08472R85978J121058J61716j32467
$$ 77341 1520659 2488507 1382404 -755880 -1564352 -578374 542684 704400 571933
37387E71933L63802M87230r4441p10919r55186q10266j52064P33971Q58167j40833
$$ 571933 935735 1422965 1328524 617605 -337581 -1147847 -1299911 -565940 292227 151394
37377A51394j129298j009996k36540K85765P02818J298501J303238K72175n05663
$$ 151394 -977904 -1987900 -2224440 -1938675 -1235857 62644 1365882 1638057 1132394
37368A132394R9706Q52497Q1287j164311n87148J312793J709442k0402j363981
$$ 1132394 1232100 2084597 2165884 1001573 414425 1727218 3436660 3416258 2052277
37359B052277q75053k50149r77923j709143q09210O76778P58617l36960q45192
$$ 2052277 1177224 927075 -50848 -1759991 -2569201 -1892423 -1133806 -1470766 -2315958
37350b315958k66199M40336P31252P78824M15212n53411j292544p64760N04831
$$ -2315958 -2582157 -2141821 -1410569 -631745 -216533 -769944 -2062488 -2827248 -2322417
37341b322417R29125J69747m13724J21520J003561J105628N67341K57482L09367
$$ -2322417 -1393292 -1223545 -1637269 -1515749 -512188 593440 1160781 1418263 1727630
37332A727630J50500k85968l63829J04809L77192q2670o87270o79121m44661q30874
$$ 1727630 1878130 1592162 1228333 1333142 1710334 1627664 940394 261273 -183388 -1014262
37322a014262j460069j081297K84549J037061M00395l05005K46631J315340J401810
$$ -1014262 -2474331 -3555628 -3271079 -2234018 -1833623 -2138628 -1891997 -576657 825153
37313H25153N83774N4634Q1885m297k80753k39368k3306k03895n49111l93249
$$ 825153 1408927 1463561 1545446 1541149 1260396 1021028 997722 793827 244716 -148533
37303a48533J637j43870n81071l73175L58764N38895m1077m73333l36901j13531
$$ -148533 -146896 -290766 -871837 -1245012 -886248 -347353 -388430 -861763 -1198664 -1312195
37293a312195M9804N54868J208338J234284N71362p7554m68731q27776q43595
$$ -1312195 -1262391 -707523 500815 1735099 2306461 2228907 1760176 932400 88805
37284H8805j22941N73551K01826o49356n26523L60679M30392m51380p02157J36231
$$ 88805 -34136 539415 741241 91885 -434638 -73959 356433 -94947 -797104 -660873
37274f60873O16238L2902m09492J05622O63599M83006J15761j05808p51042j475852
$$ -660873 -44635 -11733 -421225 -315603 347996 831002 946763 840955 89913 -1385939
37264a385939p77566J200403J923093J57039j750469j277934M88256Q24073l54150
$$ -1385939 -2163505 -963102 959991 1117030 -633439 -1911373 -1423117 -599044 -953194
37255i53194q13859J70846R13254K25997q64269q26370K99985J153907P62159
$$ -953194 -1767053 -1596207 -682953 -456956 -1321225 -2147595 -1847610 -693703 68456
37246F8456l94499r66230l82733M16351L93269j0210K02313O38286J83250o84854
$$ 68456 -326043 -1292273 -1675006 -1258655 -865386 -875596 -673283 -34997 148253 -536601
37236e36601l72362R36510J230607K7942p09707O0396P05864j08293j072621o14440
$$ -536601 -908963 27547 1258154 1286096 576389 636785 1342649 1234356 161735 -452705
37226d52705M31529M70604k41343n39308m13527l40127L8002Q48000J018773N1859
$$ -452705 -21176 449428 208085 -331223 -744750 -1084877 -1046875 -198875 819898 871757
37216H71757o93279j55267N42897J28475n46655k28629L84165J80251n6580P21418
$$ 871757 178478 23211 566108 694583 147928 -80701 303464 483715 427135 1148553
37206A148553J341298K13846j539745j549680K7769R36969M58573o3025J4328
$$ 1148553 2489851 2703697 1163952 -385728 -357959 579010 1037583 974558 988886
37197I88886l7359k68230K41376J438869K120140J845025J246469M91565p30200
$$ 988886 951527 683297 924673 2363542 4483682 6328707 7575176 8066741 7336541
37188G336541j767114j487359l11879O0874p93837j434465q67523Q3008K70805
$$ 7336541 5569427 4082068 3770189 3831063 3037226 1602761 735238 818246 1089051
37179A089051j33976j92491L51951Q01544M99032k17668l32621L80033P72635
$$ 1089051 955075 762584 1114535 1916079 2415111 2197443 1864822 2244855 3017490
37170C017490J4498q16148l06670P02160K19193j451840j939241o32817N41017
$$ 3017490 3031988 2215840 1909170 2611330 2830523 1378683 -560558 -1193375 -652358
37161f52358O28235Q39456J483855J083904l25552n66719O09413O30821j001748
$$ -652358 -24123 815333 2299188 3383092 3057540 2490821 3100234 3731055 2729307
37152B729307j132991J425814L108310J436598p11812k67293Q62717q3695j492495
$$ 2729307 1596316 3022130 6130440 7567038 6855226 6587933 7450650 7366955 5874460
37143E874460q48272L39547r9345l84919J402189K635423P60076j128577O68607
$$ 5874460 5026188 5365735 5266390 4881471 6283660 8919083 9679159 8550582 9219189
37134I219189L437981K600619j27462q2243K023971K428068J920539L552816N855038
$$ 9219189 12657170 15257789 15130327 15048084 17072055 19500123 21420662 24973478 30828516
37125C0828516O189135P265002J1753016J4772898J1830980R410243J5674675
$$ 30828516 37017651 44282653 56035669 70808567 82639547 92049790 107724465
37118A07724465K6130863L3676475M6600069P4149354R5423917P1279352j779915
$$ 107724465 133855328 167531803 214131872 288281226 383705143 454984495 453204580
37111D53204580p3868807r5441658p1162393m1979435l0008905k5309545j7308187
$$ 453204580 379335773 283894115 212731722 170752287 140743382 115433837 98125650
37104I8125650j1294823j2124833j3572093j0466227o798619o209855n704636
$$ 98125650 86830827 74705994 61133901 50667674 43869055 37659200 31954564
37097C1954564l204284j757094k630302k608637r26802j019106l172640l163883
$$ 31954564 28750280 26993186 24362884 21754247 20827445 19808339 16635699 13471816
37089A3471816k40257J117099o08852j458792K45696R52289r90170k247399j034002
$$ 13471816 13231559 14348658 13739806 12281014 12526710 13478999 12488829 10241430 9207428
37080I207428j38123r66302r24260Q20708J171028q20115j719456o0507R71150
$$ 9207428 9069305 8103003 7178743 7999451 9170479 8350364 6630908 6570401 7541551
37071G541551k84437r32484O58620J660785K05436j317602j054364o69717j122958
$$ 7541551 7257114 6324630 6983250 8644035 8849471 7531869 6477505 5807788 4684830
37062D684830o06975J056121J233162k37252j25706J855983J839968q98100j882378
$$ 4684830 4077855 5133976 6367138 6129886 6004180 7860163 9700131 8802031 6919653
37053F919653P06764K752825J731924P42807J805561K170010Q36571J430721M746500
$$ 6919653 7626417 10379242 12111166 12853973 14659534 16829544 17666115 19096836 23843336
37044B3843336O182920M719063N847074J0819557J2736226R440166R520111J7584540
$$ 23843336 30026256 34745319 40592393 51411950 64148176 73588342 83108453 100692993
37036A00692993K5647695K9910819M2189659O7130577P9338695M7989922j7395858
$$ 100692993 126340688 156251507 198441166 265571743 344910438 392900360 375504502
37029C75504502o9572033p6908713n4262167l3870256k5759052k0157506j2897425
$$ 375504502 305932469 229023756 174761589 140891333 115132281 94974775 82077350
37022H2077350r515895j0829243j0866246p968881o305853o769077n683590k474248
$$ 82077350 72561455 61732212 50865966 42897085 36591232 29822155 24138565 21664317
37014B1664317p14614j340245j552159o86022j083462k745618k724918n48777
$$ 21664317 20949703 19609458 18057299 17371277 16287815 13542197 10817279 10268502
37006A0268502P39622j82085j115824p33446o19553j682085k196529r69463N26191
$$ 10268502 11008124 10826039 9710215 8976769 8357216 6675131 4478602 3509139 4035330
36997D035330O88531O2413k28265k79530m57289l65701J64632M05267j11243q04975
$$ 4035330 4723861 4786274 4558009 4278479 3821190 3455489 3620121 4025388 3914145 3109170
36987C109170r36583m18532L94999Q80456L33369j015530j638795n82037R13392
$$ 3109170 2172587 1754055 2149054 3029510 3362879 2347349 708554 126517 1039909
36978A039909J108666L67229K49695O94149L47728o35221o39398M39069P87156
$$ 1039909 2148575 2515804 2765499 3459648 3807376 3172155 2532757 2971826 3758982
36969C758982k08668q44112j7279R10950M13292q52505j335221p88679Q5761R31361
$$ 3758982 3550314 2706202 2688923 3599873 4013165 3160660 1825439 1036760 1122521 2053882
36959B053882J469795J104678k3994o37803q1333N76146L10826j56344K15025
$$ 2053882 3523677 4628355 4604361 3966558 3885225 4461371 4772197 4615853 4830878
36950D830878P65669K19082r80261j214724k36240N41030K58588l88972n45093
$$ 4830878 5596547 5815629 4835368 3620644 3384404 3925434 4184022 3795050 3249957
36941C249957k74543M8243L51174M94445J39617o42488j227471j123643l97122
$$ 3249957 2975414 3023657 3374831 3869276 4008893 3366405 2138934 1015291 618169
36932F18169N05753R01351J84809j264537j890773o83385J194180J690342O18317
$$ 618169 1123922 2025273 2210082 945545 -945228 -1628613 -434433 1255909 1874226
36923A874226k70674p391M26157J01856l50842k03693j36883r23784j672106r79823
$$ 1874226 1603552 1596161 2022318 2124174 1773332 1569639 1432756 508972 -1163134 -2142957
36913b142957P28331J620708J041862J92479J03418L07138K124n79702p17671
$$ -2142957 -1414626 206082 1247944 1440423 1543841 1850979 1853103 1273401 555730
36904E55730m04577k09947k79473j75067L23206P73245O07617j15345o99473n38713
$$ 555730 151153 -58794 -338267 -513334 -190128 583117 1190734 1075389 375916 -162797
36894a62797K63110J051294J262683P74426j79866j085438j278774n57013L17635
$$ -162797 100313 1151607 2414290 3188716 3008850 1923412 644638 87625 405260
36885D05260L54543k90474m39610L16690R01166M59893k04890q208M35933k32784
$$ 405260 759803 469329 29719 346409 1247575 1707468 1502578 1494370 1930303 1697519
36875A697519j561116j529559L42160J911312J342598k92561o69102M67535J192396
$$ 1697519 136403 -1393156 -1050996 860316 2202914 1910353 1241251 1708786 2901182
36866B901182L00744j192710j702546j030704q9456N23106Q87743J066961Q25899
$$ 2901182 3201926 2009216 306670 -724034 -813490 -290384 597359 1664320 2490219
36857B490219J38392n32185p27153n34661l71980l44736j51389L29620P09590
$$ 2490219 2628611 2096426 1369273 834612 462632 117896 -33493 296127 1005717
36848A005717O00642K10520M0250R4917j27165p67323j207822q65957o9689L11484
$$ 1005717 1606359 1816879 1857129 1952046 1824881 1057558 -150264 -1016221 -1085910 -774426
36838g74426R756l29457p5726N58299R02244P46118M23402J00164m11560r61119
$$ -774426 -764670 -1094127 -1169853 -611554 290690 1036808 1460210 1560374 1148814 187695
36828A87695q41294J78542J092447P87165k75173n44907L29479Q93301J42273
$$ 187695 -653599 -475057 617390 1404555 1129382 584475 913954 1807255 1949528
36819A949528p81009k93435J039878J185266l11050j613491j307496k96092r9832
$$ 1949528 1168519 875084 1914962 3100228 2789178 1175687 -131809 -427901 -527733
36810e27733m86792j41250R98599J620492J156865N47044N05502L42881o69011
$$ -527733 -1014525 -1155775 -157176 1463316 2620181 3167225 3672727 4015608 3346597
36801C346597j767904j687612n91044K43392M10442O90337J294244J266680K07451
$$ 3346597 1578693 -108919 -699963 -456571 -46129 644208 1938452 3205132 3412583
36792C412583p41776n73641J4608j15804o33381m83473J50970K35333j87760j62216
$$ 3412583 2670807 2097166 2111774 1995970 1362589 879116 1030086 1265419 1077659 915443
36782I15443K62891P0464p08225q73672k39621j1158m85924m20866N05686P42420
$$ 915443 1178334 1248798 540573 -333099 -572720 -583878 -1069802 -1490668 -984982 -242562
36772b42562m14790j266655m98355M88570Q5766n17701N94815K405414K318448
$$ -242562 -657352 -1924007 -2422362 -1933792 -1848026 -2365727 -1770912 634502 2952950
36763B952950L90326q15023l36912J70787l00607p05218l78771k48423p07672
$$ 2952950 3343276 2528253 2191341 2362128 2061521 1356303 977532 729109 21437
36754B1437o28130M40520J178351P31100J03794J55467R4830p00116j168057m11027
$$ 21437 -606693 -166173 1012178 1743278 1847072 2002539 2097369 1397253 229196 -181831
36744a81831N24541L52564l36181l26593J02912O7644l7310N72118J190789O19206
$$ -181831 342710 695274 359093 32500 135412 203056 165746 737864 1928653 2547859
36734B547859n82499q03379M4550N81492L65810L03895O35070M32883n37030j206404
$$ 2547859 1965360 1161981 1206531 1788023 2153833 2457728 3092798 3525681 2988651 1782247
36724A782247r98760o79450p52434m90232N21960J175473L85346j046328j414162
$$ 1782247 783487 104037 -648397 -1138629 -616669 558804 944150 -102178 -1516340
36715a516340m62622M77309M89936K6871k12665k27980j38226L78204J329859
$$ -1516340 -1978962 -1501653 -1011717 -984846 -1197511 -1425491 -1563717 -1185513 144346
36706A44346J764983Q36814p80365j542494j062913m31837l33750p7216Q68181
$$ 144346 1909329 2746143 1965778 423284 -639629 -1071466 -1405216 -1482432 -614251
36697f14251J567930R81295k50428p18107l41305r3177r9071K86497P15266J05085
$$ -614251 953679 1934974 1684546 966439 625134 531957 432886 719383 1434649 1539734
36687A539734j128012j128298M46834J496960N87384p99884o00459P31491J240706
$$ 1539734 411722 -716576 -269742 1227218 1814602 1014718 414259 1145750 2386456
36678B386456N26368j59479k73765n02998j033430j032658j41871Q28072J066106
$$ 2386456 2912824 2753345 2479580 1976582 943152 -89506 -231377 596695 1662801
36669A662801O59320L9097o35810j237225j460756j179173o33467j38283J73345
$$ 1662801 2322121 2361218 1725408 488183 -972573 -2151746 -2785213 -2923496 -2750151
36660b750151L72001O61288J051314J037837J61946r61309j044705J5064P16972
$$ -2750151 -2378150 -1716862 -665548 372289 534235 -427074 -1471779 -1456715 -739743
36651g39743J39259n63023P212J171943J265622L44309m0768M79848O05459k08872
$$ -739743 -600484 -1163507 -1156295 15648 1281270 1625579 1584811 2064659 2670118 2461246
36641B461246p34176j23752N16355j31585j406896j569679l24407Q48606Q00147
$$ 2461246 1727070 1603318 2119673 1988088 581192 -988487 -1312894 -464288 335859
36632C35859O5325j88696K11300M75642J74333j95726j19922P4654j91816o82619
$$ 335859 401184 212488 423788 899430 1073763 878037 758115 832769 640953 -41666
36622d1666o45800q5973J62033j98172m01552J12746P50389O68688l8538o56243
$$ -41666 -687466 -773439 -611406 -809578 -1211130 -1098384 -347995 320693 282155 -374088
36612c74088p63511l38193L93942P62272J32888r02678q61707M13552J132146
$$ -374088 -1137599 -1475792 -1081850 -319578 -186690 -1089368 -1951075 -1537523 -405377
36603d05377K11345p87623K4069J741544J923485L20517r29452p22778l19967
$$ -405377 -194032 -981655 -957586 783958 2707443 3027960 2098508 1375730 1055763
36594A055763q12033j332674p48911M31842R76089P07239L43900K27229P4502
$$ 1055763 243730 -1088944 -1837855 -1406013 -429924 277315 621215 848444 922946
36585I22946l41014q15350q76178k35651O74241Q99986K24076k58791L06077R65489
$$ 922946 581932 -233418 -1109596 -1345247 -671006 228980 453056 194265 500342 1465831
36575A465831K53850j337130j861747q59348O2302o0829j79783N90185J223264
$$ 1465831 1719681 382551 -1479196 -2338544 -2276242 -2337071 -2516854 -1926669 -703405
36566g03405N31459p29439j045602m81191k28773m13894r887J136940J708397
$$ -703405 -171946 -901385 -1946987 -2428178 -2656951 -3070845 -3080732 -1943792 -235395
36557b35395P93891o51937r39137K08791J309243R80808l31759r69011k60569
$$ -235395 558496 -93441 -1032578 -823787 485456 1466264 1134505 165494 -95075
36548i5075O47831N17443k68906n51291k57495j88221l48398q65O44429M15111
$$ -95075 552756 1070199 801293 250002 -7493 -195714 -544112 -544977 99452 514563
36538E14563p69237j366956m50244Q61932J101496M48666J3821N0850J4338k15686
$$ 514563 -254674 -1621630 -2071874 -1209942 -108446 340220 354041 404891 419229 203543
36528B03543k32400Q5046M30456N07036J60245n11281q88337l48430O39647Q33377
$$ 203543 -28857 56189 486645 993681 1153926 642645 -245692 -594122 45525 878902
36518H78902N1621l98233K34485R00549N17397k44197k55396O2751l42111j033133
$$ 878902 930523 532290 766775 1667324 2184721 1940524 1685128 1747879 1405768 372635
36508C72635p65651J35727J00315r57747j234390J23035J554549J374201R7267
$$ 372635 -393016 -257289 -156974 -1114721 -2349111 -2226076 -671527 702674 799941
36499G99941o30089l59859J22035L60663N43919N82312Q3194p30835j039645n52351
$$ 799941 169852 -190007 -67972 292691 836610 1418922 1502116 771281 -268364 -820715
36489h20715J13498L80550L88620M73549N90011O12484O59059O86755L12952m05924
$$ -820715 -707217 -326667 61953 535502 1125513 1737997 2397056 3083811 3396763 2990839
36479B990839o03110J60629P82856q9832j866906k511055j387983q7301J45598
$$ 2990839 2387729 2548358 3331214 3241382 1374476 -1136579 -2524562 -2611863 -2466265
36470b466265J39529Q69021J394697M79792q94700p89930N11493Q88572j57710
$$ -2466265 -2326736 -1457715 -63018 416774 -477926 -1267856 -756363 132209 -25501
36461b5501p93023j6274P53205J98036p86111p96574j06507L14600N98796J180232
$$ -25501 -818524 -834798 -81593 116443 -669668 -1466242 -1572749 -1258149 -659353 520879
36451E20879J284695K2928j653357j873546m86398Q00264Q66746L04125m0789
$$ 520879 1805574 1828502 175145 -1698401 -2184799 -1384535 -517789 -213664 -254453
36442b54453k25317m53822l46319K85706P17041K14371p11601p82639L13041J359692
$$ -254453 -479770 -933592 -1279911 -994205 -277164 -62793 -774394 -1557033 -1243992 115700
36432A15700J135985Q214o45692l75511p2182k78188k81903L50690N65894m44925
$$ 115700 1251685 1259899 614207 238696 166514 -111674 -393577 -42887 523007 78082
36422G8082j279255j07419K028742K123958l19552k235273j376597N71688Q48702
$$ 78082 -1201173 -1308592 720150 2844108 2524556 289283 -1087314 -515626 333076
36413C33076l64284q52281K8124Q73143P00711p1395p99689j136226o45784O36476
$$ 333076 -31208 -883489 -855365 17778 718489 647094 -152595 -1288821 -1934605 -1298129
36403a298129J533332R79036l40007q95667m76836m0896J56613O34301J106872
$$ -1298129 235203 1214239 874232 -21435 -498271 -539167 -382554 251747 1358619
36394A358619O12470o52021j273299p34641j02307j64628k85619K49290R29530
$$ 1358619 1971089 1319068 45769 -688872 -791179 -955807 -1241426 -992136 -62606
36385f2606Q61202J22378m28867k44482M37396Q93457N88062j33075k24354O87134
$$ -62606 798596 920974 492107 247625 685021 1578478 2166540 2033465 1809111 2496245
36375B496245J503945J005283l94943j199342q32459n7768L38456J85290m67184
$$ 2496245 4000190 5005473 4610530 3411188 2578729 2520961 2859417 3044707 2577523
36366B577523j212437j104995P0966Q02021k28622j637147r27140J459072K244735
$$ 2577523 1365086 260091 331057 1133078 904456 -732691 -1659831 -200759 2043976
36357B043976J27198k126535j770614O5546O06943l04743o25727K84277J017525
$$ 2043976 2171174 44639 -1725975 -1660429 -1053486 -1358229 -1983956 -1699679 -682154
36348f82154P73365L78307M38155L73439j64818m42291M7093N46563J69404o65783
$$ -682154 91211 469518 907673 1281112 1116294 674003 721096 1267659 1437063 771280
36338G71280q03102k4449O11884J72303r09589j325446n11101O35499R07912L27188
$$ 771280 -31822 -56271 555613 727916 -181673 -1507119 -2018220 -1382721 -474809 -147621
36328a47621n1903K47455N04212L4685p20074q85701l83129J77287M80197P25630
$$ -147621 -199524 47931 552143 586828 -133246 -1018947 -1402076 -1224789 -744592 -18962
36318a8962J007162J034731N27921l93555j194160j232164l59401O77786Q56596
$$ -18962 988200 2022931 2550852 2157297 963137 -269027 -628428 49358 905954
36309I05954J13672n09709k40309M80009Q49572Q55647Q45186N09532o31655j895291
$$ 905954 1019626 509917 269608 749617 1599189 2454836 3300022 3809554 3177899 1282608
36299A282608j760076J09129K045083K199344O42111r89158j557075j355571j065250
$$ 1282608 -477468 -368339 1676744 3876088 4518199 3529041 1971966 616395 -448855
36290d48855o89566K0233P11283P60566K48394j52839k62293n71932j142106j173780
$$ -448855 -1138421 -1118188 -406905 353661 602055 449216 186923 -385009 -1527115 -2700895
36280b700895k09791R68910J362520J053114O49488M8036j075154j911449j151256
$$ -2700895 -2910686 -1941776 -579256 473858 1123346 1171382 96228 -1815221 -2966477
36271b966477Q58120J992649R97293q48869j493845o62951L02214N49867N28228
$$ -2966477 -2108357 -115708 881585 32716 -1461129 -2124080 -1821866 -1271999 -743771
36262g43771P83225R61355M37480n70022j078115n47945L81236O81158K43352
$$ -743771 39454 1000809 1438289 868267 -209848 -757793 -376557 304601 547953
36253E47953j45146j02295j11440l68801j51295Q67635J555868P77513p08185
$$ 547953 402807 300512 189072 -179729 -331024 536611 2092479 2869992 2161807
36244B161807j216389o18103k66385n93985n62234K55911Q21296M52194r9333
$$ 2161807 945418 327315 60930 -533055 -1095289 -839378 -18082 434112 334779
36235C34779j54875k04941o10583o37026J43602P62185L50686l81747l77776Q8517
$$ 334779 179904 -25037 -635620 -1272646 -1129044 -366859 -16173 -397920 -775696 -687179
36225f87179K01672J00493K74636L71130k9227k95651J66516N60741l775o74278
$$ -687179 -485507 -385014 -110378 260752 231525 -64126 102390 663131 659356 -14922
36215a4922j14880J032646R55660l93256j239796q33272k83404l09793j87395
$$ -14922 -129802 902844 1858504 1465248 225452 -607820 -891224 -1201017 -1388412
36206a388412M81495P93423J89933m50320k58995L59974P11496Q26959P43192
$$ -1388412 -906917 -113494 76439 -373881 -632876 -272902 438594 1265553 2008745
36197B008745N2881r47355r66476L35438J329962O39233p08995q50273P6026M09933
$$ 2008745 2061626 1114271 147795 483233 1813195 2452428 1743433 893160 969186 1379119
36187A379119k37885o12879k07581j08257r25715j527504p95699N52934J058068
$$ 1379119 1141234 528355 320774 212517 -713198 -2240702 -3036401 -2483467 -1425399
36178a425399O33813L57197N61526M47629l46399r50291n02955O11947J353201
$$ -1425399 -791586 -434389 127137 574766 228367 -721924 -1224879 -612932 740269
36169G40269J298765P46925m305p64342j112368p46608j22724q005l59275l90589
$$ 740269 2039034 2785959 2781654 2017312 904944 158336 35612 27607 -331668 -722257
36159g22257J26630M65047J43827l09236l02624j21652k52188m23303j46706K82238
$$ -722257 -595627 -130580 13247 -295989 -598613 -720265 -972453 -1395756 -1542462 -1260224
36149a260224K28713j48071j26763L57478O25789L99715J97674M13645O85712
$$ -1260224 -1031511 -1179582 -1306345 -948867 -323078 76637 274311 687956 1373668
36140A373668M69784j98400p56214p13334j51880K56671o3680p42780p41999J99240
$$ 1373668 1843452 1645052 888838 175504 23624 280295 216615 -526165 -1268164 -1068924
36130a068924R99378O98603j40602l46159P9961J68869l32691o61067l66746J39938
$$ -1068924 -69546 629057 488455 142296 222257 391126 58435 -602632 -969378 -829440
36120h29440M33450M74535J25853p09833j377131r58069L23870J195240J039385
$$ -829440 -395990 78545 204398 -505435 -1882566 -2840635 -2516765 -1321525 -282140
36111b82140N11285K59055J41764J7937J54688M20201K07803l29107j43885R57465
$$ -282140 229145 488200 629964 647901 802589 1222790 1430593 1101486 957601 1915066
36101A915066J627416Q91796l27545o30087j62824p7443o30509j005898o81843
$$ 1915066 3542482 4434278 4106733 3476646 3313822 3236379 2605870 1599972 918129
36092I18129j1028L51955l3259j067529j807420j143281O18725J686326J087707
$$ 918129 907101 1259056 1225797 158268 -1649152 -2792433 -2173708 -487382 600325
36083F00325J11524L54295J247984J015622n06740j669639j446901m95468K86002
$$ 600325 711849 1066144 2314128 3329750 2823010 1153371 -293530 -788998 -502996
36074e02996P75886R26563M03755n51058r64711l93161M55600P44669M02861k63061
$$ -502996 272890 1199453 1603208 1052150 87439 -305722 149878 894547 1297408 1034347
36064A034347r84709j245425n24623O79151R71354j22521j223435p86233Q20472
$$ 1034347 49638 -1195787 -1720410 -1041259 -69905 -192426 -1415861 -2202094 -1381622
36055a381622J780101J094276m08141j269345r46432p350P80569J225962J547963
$$ -1381622 398479 1492755 1084614 -184731 -1131163 -1138513 -357944 868018 2415981
36046B415981J606337P61047j064645k540759k091960n6898J311103N96055q83720
$$ 2415981 4022318 4783365 3718720 1177961 -913999 -970897 340206 936261 52541
36037E2541q74357P19516J797927R88937p23731j646685j436444p49036J61089
$$ 52541 -821816 -102300 1695627 2684564 1960833 314148 -1122296 -1871332 -1710243
36028a710243J288219J874671J010951p14372j497315o90946K62790l4632r34325
$$ -1710243 -422024 1452647 2463598 1749226 251911 -439035 -176245 -210877 -1145202
36019a145202q96621J64829R87775R53428O09298L60042p048m09599l76768q5913
$$ -1145202 -2041823 -1876994 -889219 64209 673507 1033549 1026501 616902 240134 154221
36009A54221k36957o13458j40412J131644J553471K40838j374481j443505j18094
$$ 154221 -82736 -696194 -836606 295038 1848509 2089347 714866 -728639 -846733
36000h46733J059260J289128Q51537P3962p75928j096045n87930J22202L85927
$$ -846733 212527 1501655 2353192 2427154 1651226 555181 -32749 89453 475380
35991D75380M54993O67426N89871N718k57966K25339L07187q61776j867920r47565
$$ 475380 930373 1597799 2187670 2193388 1935422 2160761 2467948 1606172 -261748 -1209313
35981a209313J001101J599788N95399j71475n3801j94010q39980q26624r5901
$$ -1209313 -208212 1391576 1986975 1815500 1761699 1567689 727709 -98915 -194816
35972a94816q997n76327j69596J207989J336241l31078j246414L4382J245793
$$ -194816 -203813 -780140 -949736 258253 1594494 1263416 17002 51384 1297177
35963A297177L03267j027862k89270J244211P90717j011323j221872K95867P62997
$$ 1297177 1600444 572582 283312 1527523 2318240 1306917 85045 380912 1143909
35954A143909o94893j784084j056784J06532L93947N06261J033148R75360j56820
$$ 1143909 449016 -1335068 -2391852 -2285320 -1891373 -1385112 -351964 623396 466576
35945D66576r16939j64220R98469J050329L29522k4054p1657m05394n72529Q3677
$$ 466576 -450363 -614583 383886 1434215 1763737 1739683 1668026 1262632 690103 773780
35935G73780P60280J84716j059069r77772Q68434K390704J636522o23827j923811
$$ 773780 1534060 1718776 659707 -318065 550369 2941073 4577595 3953768 2029957
35926B029957j207884J40733M49922r3055j98753K96388K92363m81386p61995
$$ 2029957 822073 962806 1412728 1319673 1120920 1417308 1709671 1228285 466290
35917D66290J56467J017775N04406n87881o58332N9665N1517p69722r96706l07822
$$ 466290 622757 1640532 2144938 1557057 898725 958390 1009907 240185 -756521 -1064343
35907a064343L6942l87310l82733N42441J091408M72964r8750M30761R65164J51236
$$ -1064343 -1027401 -1414711 -1797444 -1255003 -163595 309369 210619 641380 1606544 1757780
35897A757780j068639q28930N38078R12312k63738j104278k22068J124423Q61924
$$ 1757780 689141 -139789 398289 1310601 1046863 -57415 -279483 844940 1706864
35888A706864q82639j871902p65888J028411J162883n19126j767461j025100N33866
$$ 1706864 824225 -1047677 -1813565 -785154 377729 -141397 -1908858 -2933958 -2400092
35879b400092R87622M99283N05008Q70025J50406j371652j460370N25165K218735
$$ -2400092 -1412470 -913187 -408179 461846 612252 -759400 -2219770 -1694605 524130
35870E24130J656523L608p21182o79210r37436q91341M64119J836264J060460
$$ 524130 2180653 2184261 1463079 783869 -153567 -1044908 -580789 1255475 2315935
35861B315935j219069k081126o35243Q38289N93741k30034m3593N58752J99192
$$ 2315935 1096866 -984260 -1619503 -781214 -187473 -417507 -461100 97652 296844
35852B96844p37684p65124K43103Q92637L94633m49046n66131O662M61434L96283
$$ 296844 -440840 -1205964 -962861 -70224 324409 -124637 -690768 -684106 -222672 173611
35842A73611J50369J04190J21125j00405m34790n08512l05005p4593K10491O08010
$$ 173611 323980 428170 549295 448890 14100 -494412 -799417 -874010 -663519 -55509
35832e5509N76651l23206j084833j40360J895473K165923m81693l157534k505782
$$ -55509 521142 197936 -886897 -1027257 868216 3034139 2552446 -605088 -3110870
35823c110870N64734K163108Q94228o36692r7096J354996J291349m10108j765883
$$ -3110870 -2546136 -383028 511200 -125492 -222588 1132408 2423757 2013649 247766
35814B47766j470923j10352R81291J063873L28437m67928o69193k54789K78147
$$ 247766 -1223157 -1333509 -352218 711655 1040092 572164 -97029 -351818 -73671
35805g3671M60076J44237m53815p77750m17180J91523K40384q318N84551J801108
$$ -73671 386405 530642 76827 -700923 -1118103 -926580 -686196 -694514 -109963 1691145
35795A691145J632749o20842k498417j652610M61241P79876n77252q66945M66070
$$ 1691145 3323894 2703052 204635 -1447975 -986734 -206858 -784110 -1651055 -1184985
35786a184985J098347J79199k55600Q15673J505627N20961n48035k72767J33012
$$ -1184985 -86638 92561 -163039 652634 2158261 2679222 2131187 1858420 1991432
35777A991432n34112j008740j40131N35132m70451j461958k25195J909495J930193
$$ 1991432 1457320 448580 308449 843581 373130 -1088828 -1314023 595472 2525665
35768B525665j28857j548121j211458m19009N2096O29260R27696K3549j219939
$$ 2525665 2396808 848687 -362771 -781780 -729684 -100424 827272 850821 -369118
35759c69118q83544P71786J454115M82985l68438j07891O2943o55774j124972
$$ -369118 -1252662 -480876 973239 1456224 1087786 979895 1042838 387064 -737908
35750g37908m04055O34948R26948P18361N01267L5456o90680r65884n62249j20793
$$ -737908 -1141963 -507015 419933 1138294 1639561 1675017 984337 18453 -543796 -664589
35740f64589J13803M97874O88785q4697j146725q06930Q14323J560428N69308
$$ -664589 -550786 -52912 635873 551176 -595549 -1402479 -588156 972272 1541580
35731A541580m28250j20841L84513j08324p51296m37691K12059K71496J23621
$$ 1541580 1113330 992489 1377002 1268678 517382 79691 291750 563246 686867
35722F86867J18352m68023j496892j121583J111453K482675R14132j419689j226560
$$ 686867 805219 337196 -1159696 -2281279 -1169826 1312849 2226981 807292 -419268
35713d19268Q29646J526572L56654k49501N47897R19968j9959q90864q73938q45987
$$ -419268 410378 1936950 2293604 2044103 2592000 3511968 3492009 2601145 1727207 881220
35703H81220j010149k85783J084690J143711m52890j401047l93741P58808K91686
$$ 881220 -128929 -414712 669978 1813689 1360799 -40248 -433989 324819 616505
35694F16505o28561j99383Q57986P37018l25352o67261K1988O40909P07327N88726
$$ 616505 -12056 -211439 646547 1383565 1058213 390952 412940 1053849 1761176 2349902
35684B349902K55541m90042r99024n55396K43962L24552j24564j75844R9352k4846
$$ 2349902 2605443 2115401 1116377 560981 804943 1129495 1004931 829087 928439 903593
35674I03593l06777N5496O89916M75713l99526n86814J15879L83420l52627r52442
$$ 903593 596816 652312 1342228 1817941 1418415 831601 947480 1330900 978273 25831
35664B5831n24818K00943K97153J34955M70675J017639R48858J89885o28468j045415
$$ 25831 -498987 -298044 -891 134064 604739 1622378 2571236 2761121 2132653 1087238
35654A087238r77249n07965J1949R9338k26946m09571k24098q1977j97718j96558
$$ 1087238 109989 -397976 -386027 -286689 -513635 -923206 -1147304 -1229281 -1426999 -1623557
35644a623557R2617K56965J40823K02386N19028M04734k87299n13343L34936J115119
$$ -1623557 -1530940 -1273975 -1133152 -930766 -411738 -7004 -294303 -807646 -472710 642409
35634F42409N13534p98397j064748q5312N89203K5125r82048j330082q69057J3095
$$ 642409 1155943 357546 -707202 -792514 -203311 -178186 -1160234 -2490316 -3359373 -3346278
35624c346278Q91270J105214K27709q96135p49194P10066J656551Q33293p19773
$$ -3346278 -2455008 -1349794 -1122085 -2018220 -2767414 -2057348 -400797 432496 -287277
35615b87277j234395n28471K88886O14064O41930L98382k56505q64861p15753
$$ -287277 -1521672 -2050143 -1761257 -1147193 -505263 -106881 -363386 -1228247 -1944000
35606a944000Q1643P34412Q53973O01236K8105p17183p92186M36429J886807J600406
$$ -1944000 -1862357 -1127945 -273972 327264 355369 -361814 -1154000 -717571 1169236 2769642
35596B769642n29288k249536j854995l23739M15255J81555J47287N59328N36433
$$ 2769642 2240354 -9182 -1864177 -2187916 -1772661 -1591106 -1443819 -884491 -348058
35587c48058o7280k35063M48985R60450M12409n42411p28076j87127M4600l90708
$$ -348058 -415338 -650401 -201416 759034 1171443 629032 -99044 -286171 -241571 -632279
35577f32279o75766j36827O58905O19854l17764r23740j96538J179533J468448
$$ -632279 -1308045 -1444872 -785967 -166113 -483877 -1407617 -1604155 -424622 1043826
35568A043826P9717j464613j272704N79010K149688J944169L72746j126965j618422
$$ 1043826 1123543 -341070 -1613774 -1034764 1114924 3059093 3431839 2304874 686452
35559F86452j075750n4756N88977K80171n03495o22018J21388N26726j73580q88238
$$ 686452 -389298 -444054 144923 425094 -78401 -700419 -579031 -52305 -225885 -1114123
35549a114123k07451J235825J444850Q254j181315n92752Q79345J316409L12348
$$ -1114123 -1321574 -85749 1359101 1367355 186040 -406712 472633 1789042 2101390
35540B101390q26090r07608o1396O83931M85285n30738j325847j039504p0742
$$ 2101390 1275300 367692 306296 990227 1475512 944774 -381073 -1420577 -1491319
35531a491319M29154J53456p8727K10923M74087L53766L98488P90348N87657o08765
$$ -1491319 -1062165 -908709 -987436 -776513 -302426 51340 449828 1240176 1827833 1219068
35521A219068j381565m55371R72891P82506p14457j147989J87052J254284N03775
$$ 1219068 -162497 -617868 355023 1137529 423072 -724917 -537865 716419 1220194
35512A220194r16194j235568o00954j75828o5548L22002P66607O04976O7165p2528
$$ 1220194 304000 -931568 -1532522 -1708350 -1773898 -1451896 -685289 -80313 -13148 -85676
35502h5676J82095J90463j85280n60406p90597q47020l78038O42190J316999R42537
$$ -85676 96419 286882 101602 -458804 -1249401 -2096421 -2474459 -1832269 -515270 427267
35492D27267K37539K83178P06580L04237q39548j394471q78701j76579J35671
$$ 427267 664806 947984 1654564 1958801 1119253 -275218 -1153919 -1330498 -1194827
35483a194827M36181P85039N96434L6649J73335J075673J309592J80078j026420
$$ -1194827 -758646 26393 622827 659476 832811 1908484 3218076 3398154 2371734
35474B371734j094227p00619q73465j047361l50177L73488j10578q99751j12774
$$ 2371734 1277507 576888 -296577 -1343938 -1694115 -1320627 -1431205 -2330956 -2443730
35465b443730J725465J972722r4535j920016j292928P09364J730012J361073O94673
$$ -2443730 -718265 1254457 1159922 -760094 -2053022 -1343658 386354 1747427 2442100
35456B442100N382j078132j838793j077109O27675J221890J08708r17031l19677
$$ 2442100 2447482 1369350 -469443 -1546552 -918877 303013 411721 -505310 -824987
35447h24987J060726J476425O74234l03668q57956j124562j054550m40718L55543
$$ -824987 235739 1712164 2386398 2082730 1224774 100212 -954338 -1395056 -1039513
35438a039513P62175R04275J150360J019917j82451j713238j866690m29679Q20456
$$ -1039513 -277338 626937 1777297 2797214 2614763 901525 -965165 -1394844 -574388
35429e74388O90394J60453M36546Q72787L15204o26140n15726L51791L60613o31172
$$ -574388 116006 276459 713005 1585792 1900996 1274856 759130 1110921 1471534 840362
35419H40362r53498J09111J125055Q01630j78718n49764l05573q9073P5839K73775
$$ 840362 -113136 -4025 1121030 1922660 1743942 1194178 888605 799532 875371 1149146
35409A149146o3136j123349j728325p35616J106158J982896J308469L2486r37792
$$ 1149146 1086010 -37339 -1765664 -2501280 -1395122 587774 1896243 1928729 990937
35400I90937j399621j261787n69755K5975j3671j20271M92286J231709Q42242
$$ 990937 -408684 -1670471 -2240226 -2214251 -2227922 -2348193 -1855907 -624198 218044
35391B18044m20348r24734j21933P23043O15050R6829r4993j47068k56554j1455
$$ 218044 -202304 -1127038 -1248971 -525928 89122 185951 90958 -56110 -312664 -324119
35381c24119N24188M46778m03838q20233j25041O57395N78953K80792M44949K43285
$$ -324119 200069 646847 243009 -577224 -702265 -44870 534083 814875 1259824 1503109
35371A503109r69367j787115p06130J051333J041786o17859j416707k68431J219918
$$ 1503109 533742 -1253373 -1959503 -908170 133616 -484243 -1900950 -2169381 -949463
35362i49463J506947Q96387J29136o55119r42272O9926J587417J452411o77522
$$ -949463 557484 1453871 1583007 927888 -14384 55542 1642959 3095370 2417848
35353B417848k287121j410408O73176J585472J050166K82608l41507j043969j177246
$$ 2417848 130727 -1279681 -606505 978967 2029133 2311741 1970234 926265 -250981
35344b50981j04566J099165Q14529n92684j197742k77060R92031J455412J054535
$$ -250981 -355547 743618 1558147 965463 -232279 -509339 482692 1938104 2992639
35335B992639O6076j193635j872750j240613M0769N83512K23044p929K19911J85950
$$ 2992639 3058715 1865080 -7670 -1248283 -1207514 -624002 -400958 -408887 -188976 -3026
35325c026k20839j21690O78040J139948O72164J4136j48507j82116m70665n95620
$$ -3026 -223865 -345555 332485 1472433 2144597 2158733 2010226 1828110 1357445 761825
35315G61825k81962n9765k25695j91122L37329N53868j35397q94365o10223L82843
$$ 761825 479863 420098 194403 3281 340610 894478 759081 -135284 -745507 -362664
35305c62664P96352K28479m37956l67135K01261L61025k79181r36482m83351Q21773
$$ -362664 433688 662167 224211 -142924 58337 419362 140181 -796301 -1279652 -457879
35295d57879J174417k97609j726900q48979J380567J832475o5632j379644l01035
$$ -457879 716538 418929 -1307971 -2156950 -776383 1056092 990460 -389184 -690219
35286f90219J130663O56515n07489j58741Q21079Q6100j750245j788451L84000
$$ -690219 440444 1096959 589470 430729 1251808 1337908 -412337 -2200788 -1816788
35277a816788J887502R29668q68764j361916o74201j1165L55820O85219P97612
$$ -1816788 70714 1000382 131618 -1230298 -1904499 -1915664 -1559844 -874625 -77013
35268g7013N81990L75889J70072m09875r07590l12974R16395Q52207r57520k274803
$$ -77013 504977 880866 1050938 641063 -266527 -579501 336894 1189101 231581 -2043222
35258b043222j244473Q25210J391660K19664q19301p04539j32792K22861N09673
$$ -2043222 -3287695 -2462485 -1070825 -851161 -1670462 -2375001 -2507793 -2284932 -1775259
35249a775259O84452K64637n59209p73204N2536J098834J410685R36222J55659
$$ -1775259 -1090807 -826170 -1385379 -2158583 -2106047 -1007213 403472 1339694 1495353
35240A495353o01748j083407r73270l22228K46255J89906k81846m85280q6563
$$ 1495353 893605 -189802 -1163072 -1485300 -1239045 -1049139 -1330985 -1816265 -1902828
35231a902828N57287Q17360M50164j30325k67119J66330N41044K52616m06867
$$ -1902828 -1345541 -528181 -78017 -208342 -475461 -309131 231913 484529 77662
35222G7662n68517n47N09042K66258k98503k81876K68277L79083k86715p66588
$$ 77662 -490855 -491402 17640 283898 -14605 -296481 -28204 350879 64164 -702424
35212g02424k47411N45013L39650p00293j142735l97626N48333P93257P03128
$$ -702424 -949835 -404822 -65172 -765465 -1908200 -2305826 -1757493 -964236 -261108
35203b61108Q35054Q20773K31258l83854l79330j64566l51797m88857P5654P35673
$$ -261108 573946 1394719 1625977 1242123 862793 698227 346430 -142427 -66773 668900
35193F68900N45304N0191M35856J167577N35641j350117k312107j432464m33415
$$ 668900 1214204 1264395 1700251 2867828 3403469 2053352 -258755 -1691219 -2124634
35184b124634o57234p96106O30367K270633J758013l95920j240472L35611K026553
$$ -2124634 -2781868 -3577974 -2947607 -676974 1081039 685119 -555353 -219742 1806811
35175A806811J434575p92390k189012j670019l04054N11779M88850J26635j27412
$$ 1806811 3241386 2448996 259984 -1410035 -1714089 -1202310 -713460 -586825 -714237
35166g14237r8103J95661M49360K00624n52441j064825o82504J28319K72731l37264
$$ -714237 -812340 -616679 -167319 33305 -519136 -1583961 -2266465 -2138146 -1865415 -2202679
35156b202679m98732M44833J365430Q79934n27872j127299l73291N82529P82819
$$ -2202679 -2701411 -2256578 -891148 -11214 -539086 -1666385 -2039676 -1457147 -674328
35147f74328N40876L82968J73841k09603l88289k26557j73034l46190j76545M75942
$$ -674328 -133452 249516 423357 213754 -174535 -401092 -574126 -920316 -1096861 -620919
35137f20919P43261p74j036207j174269k27045R54173J433956Q19392m71452j262598
$$ -620919 122342 121568 -914639 -2088908 -2315953 -1361780 72176 891568 420116 -842482
35127h42482o56086P01164J219488M90414k50154j46553Q9142k92371o82700k89906
$$ -842482 -1498568 -797404 422084 912498 662344 515791 604933 312562 -370138 -660044
35117f60044M07639N62575M00195N54286P55096M10979j68055l30286k67628m79572
$$ -660044 -252405 310170 710365 1264651 2019747 2430726 2262671 1932385 1664757 1185185
35107A185185o40301j82200N22726P10145M23463R2796m09704j121819j199132
$$ 1185185 544884 362684 885410 1595555 2019018 2111814 1702110 580291 -618841
35098f18841j87130O82526J09844j029029r21790K11444N28542k42228l56265
$$ -618841 -805971 -123445 -13601 -1042630 -1964420 -1752976 -1224434 -1466662 -1822927
35089a822927Q57773J706150P84485r05528j543909p90535M65399J419111J501410
$$ -1822927 -965154 740996 1525481 619953 -923956 -1714491 -1249092 170019 1671429
35080A671429L81309j210489j685961n97109N24750L21035l94560p0866R48854
$$ 1671429 2052738 842249 -843712 -1440821 -916071 -595036 -989596 -1060462 -111608
35071a11608Q95899n12229j349228k53635J387266J218410o99488j766828m22200
$$ -111608 784291 272062 -1077166 -1330801 56465 1274875 575387 -1191441 -1613641
35062a613641J529184J366835o18548j518506r8328J460433J011024l99575n67252
$$ -1613641 -84457 1282378 663830 -854676 -953004 507429 1518453 1118878 551626
35053E51626K48369J17760r88145j077607M21500J583526R67698l60672p03804
$$ 551626 799995 917755 -70390 -1147997 -726497 857029 1824727 1464055 760251
35044G60251l8343N29745M29201j26087o80353p51208k44654J54840j05731l04064
$$ 760251 721908 1251653 1680854 1554767 874414 123206 -121448 33392 -72339 -376403
35034c76403M65931J292424M38996j563808k105014m05104J128980N97629o49916
$$ -376403 89528 1381952 1820948 257140 -1847874 -2252978 -1123998 -526369 -1176285
35025a176285n80256L36485N65848L70564Q34915J314146M06509j284861j794951
$$ -1176285 -1756541 -1420056 -854208 -483644 351271 1665417 2071926 787065 -1007886
35016a007886p98772K21990M78694M10628N4193q34533j207268K25135K223610
$$ -1007886 -1806658 -1584668 -1105974 -695346 -641153 -1475686 -2682954 -2457819 -234209
35007b34209J966885o13281k142338o41479J509533J275625n66084j109383N1478
$$ -234209 1732676 1119395 -1022943 -1664422 -154889 1120736 554652 -554731 -503253
34998e03253P26812M8642l97081L52299R64997K29040q26146o61675K58325L37332
$$ -503253 223559 272201 -124880 227419 1192416 1421456 595310 -66365 191960 529292
34988E29292n06300p72071J65947J089324Q13549j76919o57972l75996j1365K3387
$$ 529292 22992 -749079 -583132 506192 1319741 1142822 484850 108854 97489 120876
34978A20876j07488k72482m67728l99429K45396J054583J155129M15854k93171
$$ 120876 13388 -259094 -726822 -1126251 -880855 173728 1328857 1744711 1451540
34969A451540l48014k08357m94338q06538k96975P80618J036586k06780j735382
$$ 1451540 1103526 895169 400831 -405707 -702682 77936 1114522 907742 -827640
34960h27640j801341l49564R58117R98212M91687N19236P11898J12933p68811
$$ -827640 -2628981 -2978545 -2020428 -1022216 -530529 -11293 700605 813538 44727
34951D4727m71693Q20954J087882m15312j667322q23226R17076J196013P9140
$$ 44727 -426966 393988 1481870 1066558 -600764 -1423990 -506914 689099 768239
34942G68239m37889J84138N44991Q0579j09075L89933L91259o41339j415233r40219
$$ 768239 330350 514488 1059479 1140058 1030983 1420916 1812175 1170836 -244397 -1184616
34932a184616j32189j02805l40712J02853Q76241J115565R23950P69908L51343
$$ -1184616 -1316805 -1419610 -1760322 -1657469 -781228 334337 1258287 2028195 2379538
34923B379538o32409j398184j088300k01438J95693M8763m3589o8311k39485q7607
$$ 2379538 1747129 348945 -739355 -940793 -745100 -696337 -739926 -808237 -1047722 -1135329
34913a135329P29525J290632N52798p93917j123886k70619L96866J90108j59611
$$ -1135329 -405804 884828 1437626 643709 -480177 -750796 -353930 -163822 -323433
34904c23433j07323j07631l80397k18991P29149J489702R54359n01984j401738
$$ -323433 -430756 -538387 -918784 -1137775 -408626 1081076 2035435 1533451 131713
34895A31713r76610L4581N01285L51904M25903R39838Q98743l16817j470920q79666
$$ 131713 -844897 -810316 -309031 42873 468776 1408614 2307357 1990540 519620 -360046
34885c60046R36236J647469M33417q70816o72739J48366J23596l92246l38592
$$ -360046 576190 2223659 2657076 1786260 1113521 1261887 1385483 993237 654645
34876F54645o3064m01413p63244j96978N03716o9536j317353j350417N0200J329249
$$ 654645 591581 190168 -573076 -770054 -266338 -335874 -1653227 -3003644 -2953444 -1624195
34866a624195J693779J589235R73816m89242j679891j049570N13991N55758r27182
$$ -1624195 69584 1658819 2632635 2143393 463502 -586068 -72077 483681 -443501
34857d43501j278845L41712J445151M57059o45772R6549J221334N22654j121045
$$ -443501 -1722346 -1380634 64517 521576 -124196 -27647 1193687 1716341 595296
34848E95296j428980n45596k44355m96442J45488J381068J342238j30434j029535
$$ 595296 -833684 -1379280 -1623635 -2120077 -1974589 -593521 748717 618283 -411252
34839d11252k91718Q64571J122904O60861J20280l05941l42890K57162P42491
$$ -411252 -702970 161601 1284505 1945366 2065646 1759705 1416815 1673977 2416468
34830B416468K5084j400507j796070p59363K28851K64847J79191N32065L94749
$$ 2416468 2441552 1041045 -755025 -1514388 -1285537 -1020690 -841499 -309434 85315
34821H5315p03795j380481m96687P76120P57257p14K25985J246305J150429m82396
$$ 85315 -618480 -1998961 -2495648 -1719528 -962271 -962985 -737000 509305 1659734 1177338
34811A177338j688218r75193O14348J164152L65243o43983j035287q32561k11203
$$ 1177338 -510880 -1486073 -871725 292427 657670 13687 -1021600 -1854161 -2065364
34802b065364O83866J310285R84132j98661j201765j126797k42130L51335O6376
$$ -2065364 -1381498 -71213 912919 714258 -487507 -1614304 -1856434 -1505099 -1438723
34793a438723m49027j99812P14766J110207L55170o36336o23168K57198Q42136
$$ -1438723 -1887750 -2087562 -1372796 -262589 92581 -543755 -1166923 -909725 -67589
34784f7589O94506M53436M79870L19594j99943m61697j67679O0483j79929l25650
$$ -67589 626917 1080353 1560223 1879817 1679874 1218177 1050498 1110981 931052 605402
34774F05402M167J22278n02429j090751p61731l944L33113N77344J196656J174827
$$ 605402 609569 731847 229418 -861333 -1623064 -1627008 -1293895 -716551 480105 1654932
34764A654932m90349k295567j746878P04747J895226N67980r25303n20219O07948
$$ 1654932 1164583 -1130984 -2877862 -2173115 -277889 290091 -635212 -1155431 -547483
34755e47483N64315j48516j02305L45990J14174k71511K33760Q93127L83604n98624
$$ -547483 16832 -131684 -233989 112001 226175 -45336 188424 1081551 1465155 866531
34745H66531m20497M70638K57723q80898r21509L94466R23774k77557j336655
$$ 866531 446034 916672 1174395 293497 -628012 -233546 690228 412671 -923984
34736i23984o24292Q12799J212591O37221J19333j95681n54754m65863M11204
$$ -923984 -1548276 -735477 477114 1114335 1233668 1037987 483233 17370 428574
34727D28574J108474N14825q45518j403061n68976P51815J386631R49057l8502
$$ 428574 1537048 2051873 1206355 -196706 -765682 -13867 1372764 2321821 2283319
34718B283319o03281k41489M03135L16190l91973o46376j49046K13754j0750j62667
$$ 2283319 1680038 1438549 1841684 2157874 1765901 1119525 970479 1184233 1173483 1010816
34708A010816O8042p8629r07754j407833q81032j09979J76943O15962J653683
$$ 1010816 1078858 1000229 92475 -1315358 -2196390 -2306369 -2129426 -1513464 140219
34699A40219K071171P96056r05083j000768K75996R55733L83159l17101n77663
$$ 140219 2211390 3007446 2102363 1101595 1377591 2333324 2716483 2399382 1821719
34690A821719j032519j651677j303611K06156J378433J095458Q9312m18518l28609
$$ 1821719 789200 -862477 -2166088 -1959932 -581499 513959 603271 184753 -143856
34681a43856j30266J37522M91615M48788k13224p77924n20124J60463K94811l07747
$$ -143856 -274122 -136600 355015 803803 590579 -187345 -707469 -547006 -252195 -559942
34671e59942r22961q87689j95354O77935J122207P69379j07920p21762n63753
$$ -559942 -1482903 -2370592 -2565946 -1888011 -765804 3575 -104345 -826107 -1389860
34662a389860O8345N04610M51163J32693j12834j93120k69758m28851l76878K06639
$$ -1389860 -1321515 -816905 -365742 -233049 -345883 -539003 -808761 -1237612 -1614490 -1407851
34652a407851Q69008N75980p10551j347038k0755J997109K140741J09581j575633
$$ -1407851 -538843 37137 -673414 -2020452 -2041207 -44098 2096643 2206224 630591
34643F30591j098282L16448O44812K7469j38067J63089r9408o63757k21741J028290
$$ 630591 -467691 -151243 493569 521038 382971 546060 446652 -217105 -438846 589444
34633E89444J269979j0321j024992m79837N00907M79327J8912K17618L75283o91920
$$ 589444 1859423 1849102 824110 344273 845180 1324507 1343419 1561037 1936320 1244400
34623A244400j936597j231018R79549J808396K09456j384609q49185M76032K23584
$$ 1244400 -692197 -1923215 -943666 864730 1074186 -310423 -1159608 -683576 -459992
34614d59992j171950j406816p1071R85524P67668K90813L85892M59289R6440N9153
$$ -459992 -1631942 -3038758 -3109829 -2124305 -1356637 -1065824 -679932 -220643 -124203 -65050
34604f5050P12023R89047J18165q44915n30353O12565J077591N49609k5892k19536
$$ -65050 646973 1636020 1754185 909270 378917 991482 2069073 2618682 2592790 2373254
34594B373254m98862r17317q40472k25644N8178l57047o46655j19630O16053N65119
$$ 2373254 1874392 957075 116603 -109041 -50863 -407910 -1054565 -1174195 -558142 6977
34584F977j77553o64540m62237n726K68170M24859O08305O86364N11432J77124
$$ 6977 -170576 -835116 -1297353 -1303079 -1034909 -610050 -1745 684619 1196051 1373175
34574A373175j35945l27839l52150k85692l97223p80502r48180l23300P57167
$$ 1373175 1237230 909391 557241 271549 -125674 -906176 -1854356 -2177656 -1420489
34565a420489J175899N04393l15360l12006J14478m2418p03941q66044k92043
$$ -1420489 -244590 259803 -55557 -367563 -253085 -295503 -999444 -1865488 -2157531
34556b157531J35311o7541k30264K56466R05952R17115L05506k95363m23990o123
$$ -2157531 -2022220 -2089761 -2320025 -2063559 -1157607 -240492 65014 -230349 -654339 -660462
34546f60462O37548P63257n2934r50118n90460P65894J289519K41197q69863o65754
$$ -660462 -22914 740343 687409 -262709 -853169 -87275 1202244 1443441 573578 -92176
34536i2176J25132L07511K48056O28391O67033l78927j237220n04443N87383k3934
$$ -92176 32956 340467 588523 1216914 1883947 1505020 267800 -236643 350740 326806
34526C26806j512330j334110L31874P54309o05030j151616K19356J195238K57448
$$ 326806 -1185524 -2519634 -2187760 -1433451 -2038481 -3190097 -2970741 -1775503 -1518055
34517a518055o12645L90573J559795P23781q62442p29433O05576Q54635J4251
$$ -1518055 -2130700 -1740127 -180332 543449 -318993 -1048426 -442850 411785 426036
34508D26036o8370O58627N10242n38216o55910M60383R23134m3483q02488k69331
$$ 426036 357666 1016293 1526535 988319 332409 792792 1715926 1672443 869955 600624
34498F00624K07427o46601j541510m87750J908510K887831J128072j500790k195145
$$ 600624 808051 161450 -1380060 -1867810 40700 2928531 4056603 2555813 360668
34489C60668m72070J513864J733629N25967m39079o66598j010191j588183j292156
$$ 360668 -111402 1402462 3136091 3662058 3222979 2556381 1546190 -41993 -1334149
34480a334149J15494J129799P25362p6947q4243J28937l25370p01767l2056P32550
$$ -1334149 -1218655 -88856 636506 559559 475316 604253 278883 -422884 -454940 277610
34470B77610J79340q85746o08486O61003Q45149l14957q01764K80931J294792
$$ 277610 456950 -428796 -1037282 -376279 468870 153913 -647851 -366920 927872
34461I27872P91295m16383q62795m75267m1281J06588K7462k50037m86639l30490
$$ 927872 1719167 1302784 439989 -35278 -76559 30029 57491 -192546 -679185 -1009675
34451a009675Q1640L47309N14301O96700M03629n36901r69901M4845J247839P63450
$$ -1009675 -928035 -580726 -66425 630275 1033904 497003 -472898 -428053 819786 1583236
34441A583236p50637r58270K78242O58237n45310j192435j0111J193297O06880
$$ 1583236 832599 -125671 152571 810808 265498 -926937 -937048 256249 863129
34432H63129p11640q85352j26679L24662M66537P92563P31154k52413j194609
$$ 863129 151489 -733863 -860542 -535880 -69343 723220 1454374 1201961 7352
34423G352j040763l72330r4558K98305J337077J795308M47051j439266j652390
$$ 7352 -1033411 -1405741 -1500299 -1201994 135083 1930391 2377442 938176 -714214
34414g14214l54343M24817P9190j07232M48693Q58635O81096N41142N62889M4882
$$ -714214 -1068557 -643740 -564550 -671782 -223089 635546 1316642 1857784 2420673 2465555
34404B465555r42023j314260p12755L4200M41472P86179P88517k85355j709019
$$ 2465555 1523532 209272 -503483 -469283 -27811 758368 1546885 1261530 -447489
34395d47489j458364P44004K374867J482723m42535p32842M99427Q32701n22584
$$ -447489 -1905853 -1161849 1213018 2695741 2253206 1520364 2019791 2852492 2329908
34386B329908j581298p74824P38137J037451K54969p3465L80378M78326k40778
$$ 2329908 748610 -26214 711923 1749374 2004343 1930878 2311256 2789582 2548804
34377B548804q41347p42509o57012j047534j019299J26951J356095J299478L35781
$$ 2548804 1707457 964948 307936 -739598 -1758897 -1631946 -275851 1023627 1359408
34368A359408k65723n37368j304367j995864j169384P86825J751733J078863M72068
$$ 1359408 1093685 556317 -748050 -2743914 -3913298 -3126473 -1374740 -295877 176191
34359A76191R65788J316291M92864m55611n00103n19950j287557j483592Q2013
$$ 176191 1141979 2458270 2951134 2495523 1995420 1475470 187913 -1295679 -1213666
34350a213666J863705J669906J65385l08286M49481N79705m06974j046285p40568
$$ -1213666 650039 2319945 2485330 2177044 2626525 3206230 2799256 1752971 1012403
34341A012403n32790p59010l94671O73700R92211k2312r62796o64925J55377L95430
$$ 1012403 479613 -279397 -674068 -368 991843 969531 6735 -658190 -502813 -107383
34331a07383J38887j38754m84082p37386k84688O43091Q21202P20m51191J91299
$$ -107383 31504 -107250 -591332 -1328718 -1613406 -970315 -149113 -148393 -599584 -408285
34321d08285O86548m2883r69906o69486L18315N62958J97084M23144J186751J251920
$$ -408285 278263 235380 -734526 -1404012 -1085697 -522739 -325655 97489 1284240 2536160
$$ [...]
##END NTUPLES=NMR SPECTRUM
##END=
