##TITLE=31Pdec_AN-AD-108
 CDCl3, 24 sc
 13.05.2021
##JCAMPDX= 6.0         $$ Bruker NMR JCAMP-DX V2.0
##DATA TYPE= NMR SPECTRUM
##DATA CLASS= NTUPLES
##ORIGIN= UXNMR, Bruker Analytische Messtechnik GmbH
##OWNER= root
$$ XWIN-NMR		Version 3.5
$$ Thu May 13 13:54:05 2021 Russian Standard Time (UT+4h)  she@DPX200
##.OBSERVE FREQUENCY= 81.013821
##.OBSERVE NUCLEUS= ^31P
##.ACQUISITION MODE= SIMULTANEOUS
##.ACQUISITION SCHEME= undefined
##.AVERAGES= 24
##.DIGITISER RES= 16
##SPECTROMETER/DATA SYSTEM= spect
##.PULSE SEQUENCE= zgpg30
##.SOLVENT NAME= CDCl3
##.SHIFT REFERENCE= (INTERNAL, CDCl3, 0, 248.564)
##AUDIT TRAIL= $$ (NUMBER, WHEN, WHO, WHERE, WHAT)
$$ ##TITLE= Audit trail, XWIN-NMR		Version 3.5
$$ ##JCAMPDX= 5.01
$$ ##ORIGIN= Bruker BioSpin GmbH
$$ ##OWNER= she
$$ F:/spectra/data/she/nmr/P31/1/pdata/1/auditp.txt
$$ ##AUDIT TRAIL=  $$ (NUMBER, WHEN, WHO, WHERE, WHAT)
(   1,<2021-05-13 13:53:09.67 +0400>,<she>,<DPX200>,
      <created by zg, POWCHK disabled, PULCHK disabled
       configuration hash MD5:
       00 E9 B6 7A A2 85 ED C7 34 08 36 98 17 FE 4E 26
       data hash MD5: 32K
       9E 66 41 30 6D 9F D1 08 C5 C9 D3 8B 22 7B 3C B3>)
(   2,<2021-05-13 13:53:12.25 +0400>,<she>,<DPX200>,
      <Start of raw data processing
       efp BC_mod = 2 LB = 1 FT_mod = 6 PKNL = 1 PHC0 = -6594.291 PHC1 = 123.6005 SI = 64K 
       data hash MD5: 64K
       7F 69 1B 69 46 ED D3 88 CE 44 5A DA EA B0 2D 98>)
(   3,<2021-05-13 13:53:31.71 +0400>,<she>,<DPX200>,
      <pk PHC0 = -47.79155 PHC1 = 106 
       data hash MD5: 64K
       C6 8E 51 3C 4E E3 48 55 AE 35 60 C1 5B D9 46 68>)
(   4,<2021-05-13 13:53:34.67 +0400>,<she>,<DPX200>,
      <abs ABSG = 5 
       data hash MD5: 64K
       04 CD 34 B8 FF E4 B6 6A 2C AA C0 A5 9D C9 57 3A>)
$$ ##END=
$$ 
$$ hash MD5
$$ 32 EA 5F 07 94 2E 54 97 2D AA FF 00 77 9E F4 35
##$RELAX= 
##$RELAX= 
##$RELAX= 
##$RELAX= 
##$RELAX= 
##$RELAX= 
##$RELAX= 
##$RELAX= 
$$ Bruker specific parameters
$$ --------------------------
##$DU= <F:/spectra>
##$EXPNO= 1
##$NAME= <P31>
##$PROCNO= 1
##$TYPE= <nmr>
##$USER= <she>
##$AMP= (0..31)
100 100 100 100 100 100 100 100 100 100 100 100 100 100 100 100 100 100 
100 100 100 100 100 100 100 100 100 100 100 100 100 100 
##$AQSEQ= 0
##$AQ_mod= 1
##$AUNM= <au_zg>
##$AUTOPOS= <>
##$BF1= 81.014009
##$BF2= 200.13
##$BF3= 200.13
##$BF4= 200.13
##$BF5= 200.13
##$BF6= 200.13
##$BF7= 200.13
##$BF8= 200.13
##$BYTORDA= 1
##$CFDGTYP= 0
##$CFRGTYP= 5
##$CHEMSTR= <none>
##$CNST= (0..31)
1 1 145 1 1 1 1 1 1 1 1 1 1 1 1 1 1 1 1 1 1 1 1 1 1 1 1 1 1 1 1 1 
##$CPDPRG= <waltz16>
##$CPDPRG1= <>
##$CPDPRG2= <waltz16>
##$CPDPRG3= <>
##$CPDPRG4= <mlev>
##$CPDPRG5= <mlev>
##$CPDPRG6= <mlev>
##$CPDPRG7= <mlev>
##$CPDPRG8= <mlev>
##$CPDPRGB= <>
##$CPDPRGT= <>
##$D= (0..31)
0 1 0 0 0 0 0 0 0 0 0 0.03 2e-05 3e-06 0 0 0 0 0 0 0 0 0 0 0 0 0 0 0 0 
0 0 
##$DATE= 1620899589
##$DBL= (0..7)
120 120 120 11 120 120 24 19 
##$DBP= (0..7)
150 150 150 150 150 150 150 150 
##$DBP07= 0
##$DBPNAM0= <>
##$DBPNAM1= <>
##$DBPNAM2= <>
$$ [...]
##$SUBNAM3= <"">
##$SUBNAM4= <"">
##$SUBNAM5= <"">
##$SUBNAM6= <"">
##$SUBNAM7= <"">
##$SUBNAM8= <"">
##$SUBNAM9= <"">
##$SW= 501.771253377433
##$SWIBOX= (0..15)
0 1 3 0 0 0 0 0 0 0 0 0 0 0 0 0 
##$SW_h= 40650.406504065
##$TD= 32768
##$TD0= 1
##$TE= 0
##$TE2= 300
##$TE3= 300
##$TEG= 300
##$TL= (0..7)
0 120 53 12 22 120 120 120 
##$TP= (0..7)
150 150 150 150 150 150 150 150 
##$TP07= 0
##$TPNAME0= <>
##$TPNAME1= <>
##$TPNAME2= <>
##$TPNAME3= <>
##$TPNAME4= <>
##$TPNAME5= <>
##$TPNAME6= <>
##$TPNAME7= <>
##$TPOAL= (0..7)
0.5 0.5 0.5 0.5 0.5 0.5 0.5 0.5 
##$TPOFFS= (0..7)
0 0 0 0 0 0 0 0 
##$TUNHIN= 0
##$TUNHOUT= 0
##$TUNXOUT= 0
##$USERA1= <user>
##$USERA2= <user>
##$USERA3= <user>
##$USERA4= <user>
##$USERA5= <user>
##$V9= 5
##$VALIST= <valist>
##$VCLIST= <CCCCCCCCCCCCCCC>
##$VD= 0
##$VDLIST= <DDDDDDDDDDDDDDD>
##$VPLIST= <PPPPPPPPPPPPPPP>
##$VTLIST= <TTTTTTTTTTTTTTT>
##$WBST= 1024
##$WBSW= 4
##$XGAIN= (0..3)
0 0 0 0 
##$XL= 0
##$YL= 0
##$YMAX_a= 7675
##$YMIN_a= -7550
##$ZGOPTNS= <>
##$ZL1= 120
##$ZL2= 120
##$ZL3= 120
##$ZL4= 120
##$ABSF1= 248.5645
##$ABSF2= -253.2056
##$ABSG= 5
##$ABSL= 3
##$ALPHA= 0
##$AQORDER= 0
##$ASSFAC= 0
##$ASSFACI= 0
##$ASSFACX= 0
##$ASSWID= 0
##$AUNMP= <proc_1d>
##$AZFE= 0.1
##$AZFW= 0.5
##$BCFW= 0
##$BC_mod= 2
##$BYTORDP= 0
##$COROFFS= 0
##$CY= -3
##$DATMOD= 1
##$DC= 0
##$DFILT= <>
##$DTYPP= 0
##$F1P= 0
##$F2P= 0
##$FCOR= 1
##$FTSIZE= 65536
##$FT_mod= 6
##$GAMMA= 0
##$GB= 0
##$INTBC= 1
##$INTSCL= 5.30512e-09
##$ISEN= 30
##$LB= 1
##$LEV0= 0
##$LPBIN= 0
##$MAXI= 10000
##$MC2= 0
##$MEAN= 0
##$ME_mod= 0
##$MI= 50
##$NCOEF= 0
##$NC_proc= -7
##$NLEV= 6
##$NOISF1= 182.463
##$NOISF2= 159.3651
##$NSP= 0
##$NTH_PI= 0
##$NZP= 0
##$OFFSET= 248.5645
##$PC= 4
##$PHC0= -6642.083
##$PHC1= 229.6005
##$PH_mod= 1
##$PKNL= yes
##$PPARMOD= 0
##$PSCAL= 0
##$PSIGN= 0
##$REVERSE= no
##$SF= 81.014009
##$SI= 65536
##$SIGF1= 159.3651
##$SIGF2= -187.1042
##$SINO= 113.3802
##$SIOLD= 16384
##$SREGLST= <1H.CDCl3>
##$SSB= 0
##$STSI= 65536
##$STSR= 0
##$SW_p= 40650.406504065
##$SYMM= 0
##$S_DEV= 0
##$TDeff= 32768
##$TDoff= 0
##$TI= <>
##$TILT= no
##$TM1= 0
##$TM2= 0
##$TOPLEV= 0
##$USERP1= <user>
##$USERP2= <user>
##$USERP3= <user>
##$USERP4= <user>
##$USERP5= <user>
##$WDW= 1
##$XDIM= 65536
##$YMAX_p= 439177082
##$YMIN_p= -40496816
$$ End of Bruker specific parameters
$$ ---------------------------------
##NTUPLES= NMR SPECTRUM
##VAR_NAME=  FREQUENCY,     SPECTRUM/REAL,   SPECTRUM/IMAG
##SYMBOL=    X,             R,               I
##VAR_TYPE=  INDEPENDENT,   DEPENDENT,       DEPENDENT
##VAR_FORM=  AFFN,          ASDF,            ASDF
##VAR_DIM=   65536,         65536,           65536
##UNITS=     HZ,            ARBITRARY UNITS, ARBITRARY UNITS
##FACTOR=    0.620285442955139, 1,           1
##FIRST=     20137.2065510759, 0,            0
##LAST=      -20513.1999529892, 0,           0
##MIN=       -20513.1999529892, -40496816,   0
##MAX=       20137.2065510759, 439177082,    0
$$ Real data points
##PAGE= N=1
##DATA TABLE= (X++(R..R)), XYDATA
$$ [...]
39656A091545m101207K437075O785055K722258m112491l652900K721700L599396
39648G490431m255576r712377m003397N702609P184857P64272l365122j186908
39640a381211J855295K086581K209360L807663L953946J564342k13103m79768
39632A3403105k498915o244278o206726p23559L433353J234125k156960M6402
39624B86547M556477L334275k759956m986378n74158L437897J524006l003886
39616A814824m670265l360871j776013m66071J061385K156314K827232M169204
39608A755739M852599J593327m257658n720904J66583O509444N644884M9085k169506
39599H423593L01860J390751j748242n066262n188252l822592k834489r50532
$$ plain form
39656 1091545 -3009662 -572587 6212468 8934726 4822235 1169335 3891035 7490431
39648 7490431 3234855 -6477522 -10480919 -4778310 2406547 3170819 -194303 -1381211
39640 -1381211 474084 2560665 4770025 8577688 12531634 14095976 13882873 13403105
39632 13403105 10904190 4659912 -1546814 -2270373 1162980 2397105 240145 286547
39624 286547 4843024 8177299 5417343 430965 -143193 3294704 4818710 1814824
39616 1814824 -2855441 -6216312 -7992325 -8458396 -7397011 -5240697 -2413465 1755739
39608 1755739 6608338 8201665 3944007 -1776897 -1610314 4899130 10544014 10593099 8423593
39599 8423593 8725453 10116204 8367962 3301700 -1886552 -5709144 -8543633 -9494165
39591i494165K065572L219464J347423j84860Q33798J352754j380586l968519
39583f209119j600583L833734N823633K554007r88742o80987J461318J379399
39575E572660r53761k161602o82988J152767N22901j925459k837004p47283J799859
39566b59910K003520J032792J809519L560084K559664j324699l395469j279213
39558D706288J180681K69442j667679j049653l532k512368o079959m361035K229576
39549g288239N682180J788682l915576m506192o63046K506538L335384L570360
39541E10091L299816J018653k256449l443580k103146j047606j605005j490612
39533g117838J171830M213167L981123K90955l350538m127616k546874m69101
$$ plain form
39591 -9494165 -7428593 -4209129 -2861706 -3046566 -2212768 -860014 -2240600 -6209119
39583 -6209119 -7809702 -3975968 1847665 4401672 3412930 2731943 4193261 5572660
39575 5572660 4618899 2457297 1774309 2927076 3449977 1524518 -1312486 -2059769 -259910
39566 -259910 1743610 2776402 4585921 8146005 10705669 9380970 5985501 4706288
39558 4706288 5886969 6156411 4488732 3439079 3435547 923179 -5156780 -9517815 -7288239
39549 -7288239 -1606059 182623 -3732953 -8239145 -8902191 -6395653 -3060269 510091
39541 510091 3809907 4828560 2572111 -871469 -2974615 -4022221 -5627226 -7117838
39533 -7117838 -5946008 -1732841 2248282 2539237 -811301 -4938917 -7485791 -7954892
39525g954892J374442K715451K512064N97782o84774O36448K347802P10241l060343
39516h05779l467201P88772L940873J672359k289252k459431j68522q5668j610886
39507d484735p16581J764345J423316r54421p5496L826254M008778j639067o532809
39498c380416n698745k467422p65034J562203O076764P606199K227213m138829
39490A021933l418521K122627L576563p71932l882925j563236K358907L247463
39482B690879J358321j032249k754808k711605k76289K336768K094643j33289
39474A572371p94878O07744J262241J71192j045458k068940l686879m108559r08889
39465i000055L514615M234824J604837N58636J898607J368327j610922k121747
$$ plain form
39525 -7954892 -6580450 -3864999 -1352935 -755153 -1439927 -803479 1544323 2254564 -805779
39516 -805779 -4272980 -3484208 456665 2129024 -160228 -2619659 -2788181 -2873849 -4484735
39507 -4484735 -5201316 -3436971 -2013655 -2968076 -3043572 782682 4791460 3152393 -3380416
39498 -3380416 -9079161 -11546583 -12311617 -10749414 -4672650 2933549 5160762 1021933
39490 1021933 -2396588 -273961 3302602 2530670 -1352255 -2915491 -556584 2690879
39482 2690879 4049200 3016951 262143 -2449462 -2725751 -388983 1705660 1572371
39474 1572371 777493 1385237 2647478 2818670 1773212 -295728 -3982607 -8091166 -9000055
39465 -9000055 -5485440 -1250616 354221 912857 2811464 4179791 2568869 447122
39457D47122J033503K221885j332703m303419k283085R65102O03290j407438j394737
39448e450480q63692j896445j485151K356099M281965l39278n707461l155636
39440a2260079M767119P334122J071340o830894r468783o161588J228306R022433
39432a1298024J0080078J285507q013705n773966M669009Q463470K207649j308149
39424C11869M507667Q412054R14042q484163o365511K962542N616558N03481k156299
39415F222240k68958j519878o573066o442484J107256O570578M145832j91866
39407C049654r45661j754344n474962o379335m21066N547890L932668j160658
39399c605814j085513L147006L758947k22640k265570J02081K008674r1026l601978
$$ plain form
39457 447122 1480625 3702510 2369807 -1933612 -4216697 -3251595 -2648305 -4055743 -5450480
39448 -5450480 -6314172 -8210617 -9695768 -7339669 -3057704 -3396982 -9104443 -12260079
39440 -12260079 -7492960 -158838 912502 -5918392 -15387175 -21548763 -20320457 -11298024
39432 -11298024 -1217946 67561 -7946144 -13720110 -9051101 -587631 1620018 311869
39424 311869 4819536 13231590 14145632 5661469 -704042 2258500 7875058 8378539 6222240
39415 6222240 5953282 4433404 -2139662 -8582146 -7474890 -904312 3241520 3049654
39407 3049654 2103993 349649 -5125313 -11504648 -11925714 -6377824 -2445156 -3605814
39399 -3605814 -4691327 -1544321 2214626 1991986 -273584 -171503 1837171 1746145 -1855833
39390a855833m504920j637545L671419P806993O190074o76276m945745j345313
39382B702854L636099O15993p099574p425642J119679N985136j14127q047026
39374h626608o846500M03313L817216K224002J510446K535063J172159j929272
39366e740181j534649K450028M080712J181384j453616l83331J569438J186495
39358A356280K6810O63162K029936J690306j96360j765343k174204j608920l56408
39349c34741R34004J639214K188837K915912K352828n93696l367931k428447Q56062
39340D162042J354504k039254m458090k600842L99507L57141j742879k292738
39332f860609o78892J213881K686893L893625L659516J039939k118127l034558
$$ plain form
39390 -1855833 -6360753 -7998298 -4326879 3480114 9670188 8993912 4048167 2702854
39382 2702854 6338953 6954946 -144628 -7570270 -6450591 -465455 -579582 -8626608
39374 -8626608 -15473108 -15069795 -11252579 -9028577 -7518131 -4983068 -3810909 -5740181
39366 -5740181 -7274830 -4824802 -744090 437294 -1016322 -1399653 169785 1356280
39358 1356280 1383090 2046252 4076188 5766494 5570134 3804791 1630587 21667 -334741
39349 -334741 599263 2238477 4427314 7343226 9696054 9102358 5734427 3305980 4162042
39340 4162042 5516546 3477292 -980798 -3581640 -3182133 -2824992 -4567871 -6860609
39332 -6860609 -7539501 -6325620 -3638727 254898 3914414 4954353 2836226 -198332
39324a98332j498402O74821K375223L229661K412856j59743k611887l162054k257101
39315a194958j099065J75654J234238Q71747l34608N08411L779134M962074O76277
39306I578904n597479p971220o012148l560020j776313J201388M767395N620350
39298c749143L020098m83724l293460m992454l222038L567104J0225072Q713012
39290I784467m79097p225732m778775K071257N136557L328040N84833j624857
39282F796693m087840n374876l278969O40497K386816P79793j626126k041647
39274e805659J78982L260106L749172j47477m887614m707845K42793L488365J977622
39265b651555M11326K297073L353907l14419l823860j356891K771360P95337m222025
$$ plain form
39324 -198332 -1696734 -1021913 1353310 4582971 6995827 6836084 4224197 1062143 -1194958
39315 -1194958 -2294023 -2118369 -884131 -12384 -346992 161419 3940553 8902627 9578904
39306 9578904 3981425 -3989795 -10001943 -13561963 -15338276 -14136888 -9369493 -3749143
39298 -3749143 -729045 -1212769 -4506229 -9498683 -12720721 -9153617 1071455 9784467
39290 9784467 9305370 2079638 -2699137 -627880 4508677 7836717 8421550 6796693
39282 6796693 2708853 -2666023 -5944992 -5304495 -2917679 -2137886 -3764012 -5805659
39274 -5805659 -5626677 -2366571 1382601 1235124 -3652490 -8360335 -8117542 -4629177 -2651555
39265 -2651555 -2240229 56844 3410751 3096332 -727528 -2084419 686941 1482278 -2739747
39256b739747k322230O009123Q773594J121010o620614m943722P81636L4282o302079
39247f208747q298495k267046M970649O488912L173678J63077k6136J081096J185177
39238B62165K54187J76828J479185J756564p20474l286459k348934L62510k9092
39229b093520l163504l368070O40864K838486m4370k347043J306623O381503M959116
39220E110085j937309n953544l405336J284179L506864L567801L453985L596217
39212I222942L671717K990421R4258m774855p763139n794805j745153q03469k615337
39203g517420k110984K083980N433722M496516J303439o50545o84936K26763J263145
39194C843680J044519j592771m914964n448266k732697J82729J641665L183739
$$ plain form
39256 -2739747 -5061977 947146 9720740 10841750 4221136 -722586 59050 93332 -6208747
39247 -6208747 -14507242 -16774288 -11803639 -5314727 -2141049 -1977972 -2004108 -923012 262165
39238 262165 516352 693180 2172365 3928929 3208455 -78004 -2426938 -2064428 -2093520
39229 -2093520 -5257024 -8625094 -7984230 -5145744 -5190114 -7537157 -6230534 150969 5110085
39220 5110085 3172776 -2780768 -6186104 -4901925 -1395061 2172740 5626725 9222942
39212 9222942 12894659 15885080 15979338 11204483 3441344 -2353461 -4098614 -4902083 -7517420
39203 -7517420 -9628404 -7544424 -2110702 2385814 3689253 3038708 2353772 2580535 3843680
39194 3843680 4888199 3295428 -1619536 -7067802 -9800499 -9617770 -7976105 -4792366
39186d792366N446669O111709L740455L91021j564053k429709l149610k991423
39178G62693j390678J23930L624r37254r80335j7836Q10716Q66231L19878l40954
39168g79985m81991J60078J025268J648482K445758L371079K935612M06354k360516
39159H370139l532405m043155m905718m013762K69957M331734L461691l03535
39151c65054n31431L466486N217920R95282m859594o542083l552123J131549M830970
39142b08078N340329K091168j306745n76925K206678J015598l741618m655259
39134A65148O07540M859344K886909q39032j188311j007394l929282n962400k498995
39125f906473K308950J952401j585376k234825o14192j029524j725118J558045
$$ plain form
39186 -4792366 654303 6766012 10506467 10897488 9333435 6903726 3754116 762693
39178 762693 -627985 -504055 -500431 -1437685 -2418020 -2435856 -1625140 -758909 -439031 -779985
39168 -779985 -1261976 -1101898 -76630 1571852 4017610 7388689 10324301 10730655 8370139
39159 8370139 4837734 794579 -4111139 -8124901 -7854944 -3523210 -61519 -365054
39151 -365054 -896485 2570001 7787921 8783203 3923609 -2618474 -6170597 -5039048 -208078
39142 -208078 5132251 7223419 5916674 5339749 7546427 8562025 4820407 165148
39134 165148 772688 5632032 8518941 7679909 6491598 5484204 1554922 -4407478 -6906473
39125 -6906473 -4597523 -2645122 -4230498 -6465323 -7079515 -8109039 -9834157 -8276112
39117h276112N303776K652280l453443l132837M297139Q516645M233452j916208
39109H224692l434017k529555k466986j083668K497325L163189j650818n595499
39101b875337k419031M063052N734418J701173k371313l213955k217273j008731
39093b606997l7185L8888l67002R39380L917843M449209M56009l377111j961163
39084A451871J950189J796552k281017l615606K74283L659982J403376l363319
39076A276311l957936M05099L882798K119936k178882l156250L89512L599867
39068B380455K353066j119173j764796Q68201K452766P78186j426512j608521
39060B913672j161006j894926k468969j376039l89413j383954k139608M75438
$$ plain form
39117 -8276112 -2972336 -320056 -3773499 -6906336 -2609197 5907448 10140900 8224692
39109 8224692 4790675 2261120 -205866 -1289534 1207791 4370980 2720162 -2875337
39101 -2875337 -5294368 -1231316 4503102 6204275 3832962 619007 -1598266 -2606997
39093 -2606997 -2644182 -2605294 -2972296 -2032916 1884927 6334136 6790145 3413034 1451871
39084 1451871 3402060 5198612 2917595 -698011 -423728 3236254 4639630 1276311
39076 1276311 -2681625 -2276526 1606272 3726208 1547326 -1608924 -1219412 2380455
39068 2380455 4733521 3614348 1849552 2717753 5170519 5948705 4522193 2913672
39060 2913672 1752666 -142260 -2611229 -3987268 -4376681 -5760635 -7900243 -7424805
39052g424805M563419M936058P08303k918754j549809K787521M630001J853938
39044G585872k344068l635753j312177J645449K715816K756572L758800M787220
39036A5957731K677697k868458p508363p123440k683585J427891K584719J654795
39028D118987N48560o3313o19204j334721j375679K89345K745797K986566k41178
39019G055160l465435k418819J437124K296369j419517m415048k470229J505806
39011a894589K778732K038566K465571K556269j810914q799421j0515583l507987
39003a6689356N328061O764205O46818m378030k017426M137789N785172O45222
38995B22455n020704m897956l60327K664419J999330L42130n99042j914749l059200
$$ plain form
39052 -7424805 -2861386 2074672 2782975 -135779 -1685588 1101933 5731934 7585872
39044 7585872 5241804 1606051 293874 1939323 4655139 7411711 11170511 15957731
39036 15957731 18635428 15766970 8258607 1135167 -1548418 -120527 2464192 4118987
39028 4118987 4667547 4604234 3985030 2650309 1274630 1563975 4309772 7296338 7055160
39019 7055160 3589725 1170906 2608030 4904399 3484882 -930166 -3400395 -1894589
39011 -1894589 884143 2922709 5388280 7944549 6133635 -2665786 -13181369 -16689356
39003 -16689356 -11361295 -4597090 -3950272 -8328302 -10345728 -6207939 -422767 222455
38995 222455 -4798249 -9696205 -10056532 -7392113 -5392783 -5050653 -5649695 -7564444 -10623644
38986a0623644j125013L382281N181683J915403j378595K01670L374991J649577
38978B578353m244121o998503l094238K992748N481762L713679P73405q84758
38970C18327j022194q41538j395103j848979j97946L078568M215363J396221j675156
38961B027563r14010J780729J755437p63802j684506n12425o31282k241683j672500
38952b856479J110514J159906k685947m362043j55229M209142K008132l344242
38944d916246k892448M119480Q680307M868984k273329m468178j036349J951294
38936D033515P58130k077227k562302n38928J153758Q70121k79605m80484O57847
38927A534825K111731K470618O80511l125593o859295p460664l781353J692823
$$ plain form
38986 -10623644 -11748657 -8366376 -3184693 -1269290 -2647885 -2446215 928776 2578353
38978 2578353 -1665768 -8664271 -11758509 -8765761 -3283999 429680 1203085 318327
38970 318327 -703867 -1545405 -2940508 -4789487 -4987433 -1908865 2306498 3702719 2027563
38961 2027563 1113553 2894282 4649719 3885917 2201411 1688986 1057704 -1183979 -2856479
38952 -2856479 -1745965 -586059 -3272006 -7634049 -7789278 -3580136 -1572004 -4916246
38944 -4916246 -7808694 -3689214 4991093 9860077 7586748 3118570 2082221 4033515
38936 4033515 4791645 2714418 152116 -386812 766946 1637067 1357462 876978 1534825
38927 1534825 3646556 6117174 6797685 3672092 -3187203 -10647867 -14429220 -12736397
38919a2736397M752772L247195j028930l870376k324993K297849N265349L479839
38911i17692o00629j920267N90153L169559L205855K280628J781152j80921m228620
38902C179218o051751k142382L495243M040097j52712k314902J89703K470097
38894B712611O68008k161622j849312P4202l37050k389668j637979L050724P040582
38885E170496N312064j384796o735334n449574M44006L384007l61700n332260
38877d953091m080953K209882N567872L211879J042414L177947M806976K97903
38869A1280829o702206p839449k164876K928382K349721j037514k295407q50945
38861d331465J065173K612864M058966M410635K197625j905686n170037n699790
$$ plain form
38919 -12736397 -7983625 -4736430 -5765360 -9635736 -11960729 -9662880 -4397531 -917692
38911 -917692 -1518321 -3438588 -2848435 321124 3526979 5807607 7588759 7407838 3179218
38902 3179218 -2872533 -5014915 -1519672 2520425 2367713 52811 242514 2712611
38894 2712611 3380619 1218997 -630315 -556113 -893163 -3282831 -4920810 -1870086 5170496
38885 5170496 10482560 9097764 2362430 -3087144 -2643138 740869 379169 -4953091
38877 -4953091 -9034044 -6824162 -1256290 1955589 2998003 6175950 10982926 11280829
38869 11280829 4578623 -3260826 -5425702 -2497320 -147599 -1185113 -3480520 -4331465
38861 -4331465 -3266292 -653428 3405538 7816173 10013798 8108112 2938075 -2761715
38853b761715m226987k742334j920969n53302K309463N332913O051813M030581
38845E519463J692922J450195K874209L410473J382948k194666m511101l655323
38837E969120q19609O79196o75095k590684k247336k99600P40488Q91517J957838
38828C605835K978833R68860l114071m104286m01108K809727J336420j542477
38820B537733q74564J546476M16005l726881m861848q33678L634330M185946J965376
38811C988895p1346j450732k465109j803911J185855M117930M064453J261595
38803H827630j416804j783782n1525J841938J899032m6106j845384j477779K65164
38794F212384J040020M42704J15409O08598O15877n65356k225485l803238m586497
$$ plain form
38853 -2761715 -6988702 -9731036 -11652005 -12205307 -9895844 -4562931 1488882 5519463
38845 5519463 7212385 8662580 11536789 14947262 16330210 14135544 9624443 5969120
38837 5969120 5149511 5828707 5153612 2562928 315592 15992 756480 1647997 3605835
38828 3605835 6584668 7553528 4439457 335171 -65937 2743790 4080210 2537733
38820 2537733 1663169 3209645 3625650 -101231 -4963079 -5796757 -2162427 2023519 3988895
38811 3988895 3917549 2466817 1708 -1802203 -616348 3501582 7566035 8827630
38803 8827630 7410826 5627044 5575519 7417457 9316489 9270383 7424999 5947220 6212384
38794 6212384 7252404 7695108 7810517 8419115 9034992 8469636 6244151 2440913 -2145584
38785b145584k415737L431169Q181193N582526k629301o860148k244425M301555
38777E201248M151655q06089k380911Q99068K756271K38494j996746k7532L199125
38768A1234583L068749m1966k500694k564438j132951R3784o78641l837930o167117
38759b526621l470785K931128O273660L389034n68721r5499K141997J12420n155298
38750C031315o485948j245960M987170O379490L448389J09375j707673k304693
38742F211465k093511j422619p82367l2478J062383J451807K24961p60676J198423
38733E057388M833456N530902J633976l331331n733598n490269l481661M27889
38725e53248M696091N666880K775886M17477J326390J845072k099347p574651
$$ plain form
38785 -2145584 -4561321 -1130152 7051041 12633567 10004266 3144118 899693 5201248
38777 5201248 9352903 8546814 6165903 7064971 9821242 10059736 8062990 8035458 11234583
38768 11234583 14303332 14261366 11760672 9196234 8063283 8157067 7478426 3640496 -2526621
38759 -2526621 -5997406 -3066278 3207382 6596416 6027695 5932196 8074193 8186613 3031315
38750 3031315 -3454633 -4700593 286577 6666067 10114456 10223831 8516158 6211465
38742 6211465 4117954 2695335 1912968 1880490 2942873 4394680 4619641 3858965 5057388
38733 5057388 9890844 15421746 17055722 13724391 7990793 2500524 -981137 -553248
38725 -553248 4142843 9809723 12585609 13003086 14329476 16174548 14075201 6500550
38717F500550q144437k760760L495593O084896M202970r77872o598529q023688
38709f221277l449986K195617K786213m63296j318538J345500K227372r08066
38701c806461l236280q92887K937162L566091J715723Q44120J240400R75422Q3845
38692C427135j48132j54561r12977j452703o23681K91319k63830j022579j05262
38683i65271J325717J135193M75917J839725L691550J888971l025470m928239
38675A438093p96199L884460K250674l951045o356959j605825L929999L031773
38667A824971k534318m875938q31183M551061N583235K687236k86088j962910
38659D156066l534310n004229m767960k376742O88566K654608K374737k35709
$$ plain form
38717 6500550 -1643887 -4404647 -909054 5175842 9378812 8400940 1802411 -6221277
38709 -6221277 -9671263 -7475646 -4689433 -5152729 -6471267 -5125767 -2898395 -3806461
38701 -3806461 -7042741 -7935628 -4998466 -1432375 283348 1127468 2367868 3343290 3427135
38692 3427135 3279003 3124442 2211465 758762 135081 426400 162570 -860009 -965271
38683 -965271 360446 1495639 1971556 3811281 7502831 9391802 6366332 1438093
38675 1438093 641894 4526354 6777028 2825983 -3530976 -5136801 -1206802 1824971
38667 1824971 -709347 -5585285 -6416468 -1865407 3717828 6405064 6118976 4156066
38659 4156066 621756 -4382473 -9150433 -11527175 -10838609 -8184001 -5809264 -6044973
38651f044973l095148k987980L15475K991605K548387J665001L348791N085419
38643C826577K569683k710403n105779l094393m66823L88224Q98114J954495K492294
38634G51989K611215K990367J593573l182265o832865l577998L268437M407067
38626B029520r94390l719030Q9432K622072j578261n843730k902057L104351M712747
38617b479346L189931L191245K781301r49305l033424J209625N054414O0811p929482
38608A095770o608459K096941M595469j780605m968752P42432N777362K746870
38600C697028j690598j08704L048954J174253k563397k583359j364180k630344
38592c020347j959920M892987J0733993O031699m752010q183714j650372L635092
$$ plain form
38651 -6044973 -9140121 -12128101 -11812626 -8821021 -6272634 -4607633 -1258842 3826577
38643 3826577 6396260 3685857 -1419922 -4514315 -4981138 -4592914 -3694800 -1740305 751989
38634 751989 3363204 6353571 7947144 4764879 -2067986 -5645984 -2377547 2029520
38626 2029520 1035130 -2683900 -2594468 27604 -1550657 -7394387 -10296444 -7192093 -2479346
38617 -2479346 710585 3901830 6683131 5733826 2700402 3910027 8964441 9025252 1095770
38608 1095770 -5512689 -3415748 1179721 -600884 -5569636 -4827204 950158 3697028
38600 3697028 2006430 1897726 4946680 6120933 3557536 974177 -390003 -3020347
38592 -3020347 -4980267 -87280 10646713 16678412 11926402 3742688 2092316 5727408
38584E727408K45311n574106m985639Q79063M478738K866932N2456K56527K467386
38575F414076K377574j185604l578070n11694M224407K642256m683337o949753
38567a250145J332875J0347871Q086625k247683p649267m471500j076649k483977
38559E88150m046184k116635q9271p7472J721797O419977P904046K846171k492560
38550A0658019k194409l57202k982029o448275l661313K593761L191100j998523
38542a198871l091005M160870J1272839R253933O46522n265864m266567K39079
38534A1750936L067692J702603k962885p291148p634676m030064L11419L388750
38526a697373N279205M626388o90344p620238q339641n00844P672306P536556
$$ plain form
38584 5727408 5972719 398613 -4587026 -3707963 770775 3637707 3690163 3946690 6414076
38575 6414076 8791650 7606046 4027976 3516282 7740689 10382945 5699608 -1250145
38567 -1250145 82730 10430601 18517226 16269543 8620276 4148776 3072127 588150
38559 588150 -3458034 -5574669 -5663940 -5741412 -4019615 2400362 10304408 13150579 10658019
38550 10658019 8463610 8106408 5124379 -1323896 -4985209 -2391448 799652 -1198871
38542 -1198871 -4289876 -129006 11143833 20397766 21044288 15778424 11511857 11750936
38534 11750936 14818628 16521231 13558346 6267198 -1367478 -5397542 -5086123 -1697373
38526 -1697373 3581832 8208220 7517876 -102362 -8442003 -8942847 -1270541 6266015
38518F266015J346982k359639j303926k31584j119407q23500J218554J033869
38510D027364j909401k125151K737006O522185L426435k733962m036885Q4170
38502E991761L117968J533845j453863k076126q02093J03950K1273m12764o94567
38493E329384n61898l14915j016947k762490l392222j015366K873751N087019
38485D226316M805195L448899J402431j900028m884725m333313J85904M893580
38477G844259N722965K204040k526133m245031j154346L409840L569081j405500
38469A3419175m736576j359493L727729K507855l145259m074531J095382L535669
38461A0969951o86291l518632J344984P107032M838860j580723k132482K527648
$$ plain form
38518 6266015 7612997 5253358 3949432 3717848 2598441 1774941 2993495 4027364
38510 4027364 2117963 -7188 2729818 9252003 12678438 9944476 5907591 5991761
38502 5991761 9109729 10643574 9189711 7113585 6311492 6415442 6436715 6023951 5329384
38493 5329384 4767486 4452571 3435624 673134 -2719088 -3734454 -860703 4226316
38485 4226316 9031511 12480410 13882841 11982813 7098088 2764775 2950679 7844259
38477 7844259 13567224 15771264 13245131 9000100 7845754 11255594 14824675 13419175
38469 13419175 8682599 7323106 11050835 13558690 10413431 6338900 7434282 10969951
38461 10969951 10283660 6765028 8110012 15217044 20055904 18475181 16342699 18870347
38453A8870347K811059k995878n809435j032676M373598L868561P21877M4771
38445B0852224k30336l353657n301616q53242N821494N605153j817023o976139
38437A3746858m096058J893354M155839L234699L354096M227237K233628k202013
38429B6547640l967749n44605M171713N076940K239733j02868O12505K888937
38421C6922246M253909M422854M621556N296014N828063N993841O584088Q490027
38413H2412598J1657039J4929142J6814303J6866228J6556930J8043774K1502126
38406A98782140K4431654K4330656K1123241J5897729Q567419j012919j0281547
38399B81838373j5377125j6100005j6773950k0488395k4644945k4547568j9931470
$$ plain form
38453 18870347 21681406 18685528 12876093 11843417 16217015 20085576 20807453 20852224
38445 20852224 20621888 17268231 11966615 11113373 16934867 22540020 20722997 13746858
38437 13746858 9650800 11544154 15699993 18934692 22288788 26516025 28749653 26547640
38429 26547640 22579891 22035286 26206999 31283939 33523672 33420804 34033309 36922246
38421 36922246 41176155 45599009 50220565 55516579 61344642 67338483 73922571 82412598
38413 82412598 94069637 108998779 125813082 142679310 159236240 177280014 198782140
38406 198782140 223213794 247544450 268667691 284565420 293132839 292119920 281838373
38399 281838373 266461248 250361243 233587293 213098898 188453953 163906385 143974915
38392A43974915j5136118j3334448j3348357j2469802j0052805p441209o002850
38385F6189326o031006o418526n256444k311084p30877l694669q887491r649780
38377B3209449l430508M074840O004667K697693o60254k119415l578087m730300
38369B1468085k603952K183735M570696K480948m4907K54711R11055q08102k390728
38360B6021541q44065J168644k44175k728758j132207L451581M861544J425627
38352C1979732k230111k912589j871198K71757M487511P933024N214148k074310
38344D0797964m578030J636974Q110185O097496m21601j283051M736462R730920
38336F4827319R338544P235348P230995Q409390R342096J0996021J3700797J6003213
$$ plain form
38392 143974915 128838797 115504349 102155992 89686190 79633385 72192176 66189326
38385 66189326 60158320 53739794 48483350 46172266 45441389 41746720 32859229 23209449
38377 23209449 19778941 23853781 29858448 32556141 31895887 29776472 26198385 21468085
38369 21468085 18864133 21047868 25618564 28099512 28054605 28309316 29220371 28412269 26021541
38360 26021541 25177476 26346120 26101945 23373187 22240980 25692561 30554105 31979732
38352 31979732 29749621 26837032 24965834 25237591 29725102 37658126 42872274 40797964
38344 40797964 36219934 37856908 45967093 52064589 51642988 50359937 55096399 64827319
38336 64827319 74165863 81401211 88632206 97041596 106383692 117379713 131080510 147083723
38328A47083723J7911066K1087280K4938056K6682547K5876647K4351930K1206100
38321C09137349J3228629J581208p642114j1819989j5275773k1300715k6165853
38314B41742742k5448264k1695082k0379493k1420343k0419371j6531974j3567349
38307A02280866j3611353j4145471j2064092p457130k987253j406937l239253
38300D7369377n561394m655450j294595o07030m396540p260810m198619J509869
38292B0904808L271710J024992l06768q1331k057389n720819n511207k04082M123792
38283A5443706K985918q29454k976588l071612j931922P47275L114003J548733
38275A5030059k722830l769099o99962K49266k752446k516683M103283Q050696
$$ plain form
38328 147083723 164994789 186082069 211020125 237702672 263579319 287931249 309137349
38321 309137349 322365978 323947186 316305072 304485083 289209310 267908595 241742742
38314 241742742 216294478 194599396 174219903 152799560 132380189 115848215 102280866
38307 102280866 88669513 74524042 62459950 55002820 52015567 50608630 47369377
38300 47369377 41807983 37152533 35857938 35250908 30854368 23593558 19394939 20904808
38292 20904808 24176518 25201510 24894742 24813411 22756022 17035203 11523996 11319914 15443706
38283 15443706 18429624 17600170 14623582 11551970 9620048 10367323 13481326 15030059
38275 15030059 12307229 8538130 7838168 8087434 5334988 2818305 6921588 14972284
38267A4972284K015054o129108n293247P84476J123633k639493j12140P106747
38259A1828206O505203k733670o602217j39581L634801l402421r722830l879846
38251d512355N767364N613615n86190k06226N365348M064275m741425q772103
38243A992303l050044L686366M429817K546251K289882K146564Q55508L52396
38235A5249043m220l236146o923057m922799J251913K850459j727194l552872
38227a014873J882188O894614M313678j685989m003359l305785l224679k490634
38219b634839O17288K545706O50296q26623J781734M047936J108362k884657j549382
38210B855821K405874J879176k376628l653040q64706J004916M07631L49813R87702
$$ plain form
38267 14972284 16987338 10858230 5564983 6349459 7473092 4833599 4721459 11828206
38259 11828206 18333409 15599739 8997522 8857941 12492742 9090321 -632509 -4512355
38251 -4512355 1255009 6868624 6282434 6076208 11441556 15505831 10764406 1992303
38243 1992303 -1057741 2628625 7058442 9604693 11894575 14041139 14896647 15249043
38235 15249043 15244823 12008677 5085620 162821 1414734 4265193 2537999 -1014873
38227 -1014873 867315 7761929 12075607 10389618 6386259 3080474 -144205 -2634839
38219 -2634839 -2017551 528155 1178451 351828 2133562 6181498 7289860 4405203 2855821
38210 2855821 5261695 7140871 4764243 1111203 246497 1251413 1659044 2008857 2996559
38201B996559m44638k747151j777757J787235L195736J763307P96599J01165l097889
38192B573166o085516k881020M466883O488161O69586m209911j856570K541639
38184A706418K298545j73126M23589K220090K21507m124620n126557j988531R85088
38175c557597J616381J376250R08966n28763j728499l49899K996454N124458M416480
38166A0274231J713853j842948m858542n059106k076717N29877l40432k388518
38158d048302j422981J609342K026616q05136k551570j257876j33505j380801
38150g964213k402899q28599J188763J087409M78225J652852K781485J275130
38142b731847o23181Q25522L381730J118654n494776q517450l942256K023021
$$ plain form
38201 2996559 2551921 -195230 -1972987 -185752 3009984 4773291 5569890 5671055 2573166
38192 2573166 -3512350 -6393370 -1926487 4561674 5231260 1021349 -835221 1706418
38184 1706418 4004963 3831837 4255426 6475516 6697023 2572403 -2554154 -4542685 -3557597
38175 -3557597 -1941216 -564966 344000 -184763 -1913262 -2263161 733293 5857751 10274231
38166 10274231 11988084 10145136 5286594 227488 -1849229 -1319352 -1659784 -4048302
38158 -4048302 -5471283 -3861941 -1835325 -2640461 -5192031 -6449907 -6583412 -7964213
38150 -7964213 -10367112 -11195711 -10006948 -8919539 -8441314 -6788462 -4006977 -2731847
38142 -2731847 -3355028 -2529506 852224 1970878 -3523898 -12041348 -15983604 -13960583
38134a3960583K346883m31919O50284N039468N577040M70138l505057j444830
38126e258576K857291L757574J733079K46605o61466k474361l387476j130882
38118d318212J652455P44037k271185k113434J112823J569654k474919n058648
38110a1157429j703490L509968M342109J490093J04769J124262Q37101j971248
38102c423865l920862k590194L28569K560175M057853M759598L215330k57809
38094D728795k302988j363978q67032l682544n995602k303782M497132N065049
38086b224950k555059q086108k791664P485002J0091896L107234l215281j979543
38078a68473J981208J615990j955556l151507p60010K118467L587531L629783
$$ plain form
38134 -13960583 -11613700 -12045619 -11395335 -6355867 -778827 -308689 -3813746 -5258576
38126 -5258576 -2401285 1356289 3089368 3335973 2674507 200146 -3187330 -4318212
38118 -4318212 -2665757 -1921720 -4192905 -6306339 -5193516 -3623862 -6098781 -11157429
38110 -11157429 -12860919 -9350951 -5008842 -3518749 -3413980 -2289718 -1452617 -3423865
38102 -3423865 -7344727 -9934921 -9606352 -7046177 -2988324 1771274 4986604 4728795
38094 4728795 2425807 1061829 194797 -3487747 -9483349 -11787131 -7289999 -2224950
38086 -2224950 -4780009 -12866117 -15657781 -8172779 1919117 5026351 1811070 -168473
38078 -168473 1812735 3428725 1473169 -1678338 -2438348 -319881 3267650 6897433
38070F897433J652250k236835n156842m479959j576336N27795J286221J268535
38062a817738p14822m861376p028748l382557K798911M482715Q80803j441466
38054a1084278J614753O066188O321488K868695J04307o40222j888713m632789
38046a270571n824592k677095K491483M289945J221076k098277j386843J379479
38038c875395J941037J114706K539649M422122J198723n676590p309732j098695
38030f744175L914340R88470l610016j686459K954933J876290k788296k308641
38022g403554L269327N987873M157967L312253L781023Q9937o416088p170929
38014c92191j100703K524878m71175k802152N77369M005779K269379n89790l36640
$$ plain form
38070 6897433 8549683 6312848 1156006 -3323953 -4900289 -4372494 -3086273 -1817738
38062 -1817738 -2532560 -7393936 -14422684 -17805241 -15006330 -10523615 -9642812 -11084278
38054 -11084278 -9469525 -3403337 2918151 5786846 5891153 5250931 3362218 -1270571
38046 -1270571 -7095163 -9772258 -7280775 -2990830 -1769754 -3868031 -5254874 -3875395
38038 -3875395 -1934358 -819652 1719997 6142119 7340842 1664252 -5645480 -6744175
38030 -6744175 -2829835 -1841365 -5451381 -7137840 -4182907 -2306617 -5094913 -7403554
38022 -7403554 -4134227 1853646 6011613 9323866 13104889 13194826 6778738 -392191
38014 -392191 -1492894 1031984 560809 -2241343 -1663974 2341805 4611184 4021394 3684754
38005C684754l05658k870763k951957J904848M354113q32002o412215m090145
37997g519025J798985K744307P81878K777857O146425L443430k844218l510119
37989C819520J418932K845445j803092n340617l888142j834531k080563j611123
37981h474171J007357K831335L112276M019761L642883k161583r322674p676743
37973a3021559L001866R786260M813577l232436l077532K425657K780427l131134
37965C45126o782741l891289R50277L141027L498915L568804K103488j155693
37957A777914k960462j201558Q80585j122946n631539o160951n04687M918360
37949a0005284L236653k765698m040820J505274N789904K991846j597894m64652
$$ plain form
38005 3684754 3379096 508333 -2443624 -538776 3815337 2983335 -3428880 -7519025
37997 -7519025 -5720040 -2975733 -2193855 584002 6730427 10173857 7329639 3819520
37989 3819520 5238452 8083897 6280805 940188 -2947954 -4782485 -6863048 -8474171
37981 -8474171 -7466814 -4635479 -1523203 2496558 6139441 3977858 -5344816 -13021559
37973 -13021559 -10019693 -233433 4580144 1347708 -1729824 695833 3476260 345126
37965 345126 -6437615 -10328904 -9378627 -6237600 -2738685 830119 2933607 1777914
37957 1777914 -1182548 -2384106 -1503521 -2626467 -8258006 -14418957 -14923644 -10005284
37949 -10005284 -6768631 -9534329 -13575149 -12069875 -6279971 -3288125 -4886019 -5350671
37941e350671M184345M950972J733287O51593K412632J551661k428397l129667
37933D575755J026199K635465k462848p048965l164842N243038P825793K286997
37925A0916592l974561m983867k335857k32169J26006k29532o47853o91625O39274
37916a413592L506007N529022L290031l242805q723920p515619j221959K422677
37908g370158J13130k061795J637246O588040M610515k432023n029440j125797
37900e070282J450652q15295j343252L684917P025073K329866m074939k842782
37892C43958K967116K772090m396057q540638m291811K115018L663737K008751
37884c357836K072683L458852K563239k63787j049999J185730K493242k94096
$$ plain form
37941 -5350671 -1166326 3784646 5517933 6169526 8582158 10133819 7705422 4575755
37933 4575755 5601954 8237419 5774571 -1274394 -4439236 803802 8629595 10916592
37925 10916592 6942031 1958164 -377693 -609862 -483856 -713388 -1361241 -2052866 -1413592
37916 -1413592 2092415 7621437 10911468 7668663 -1055257 -8570876 -9792835 -7370158
37908 -7370158 -7257028 -9318823 -7681577 -1093537 3516978 1084955 -3944485 -5070282
37900 -5070282 -3619630 -4434925 -5778177 -2093260 4931813 7261679 3186740 343958
37892 343958 3311074 6083164 1687107 -6853531 -11145342 -9030324 -5366587 -3357836
37884 -3357836 -1285153 2173699 4736938 4473151 3423152 4608882 7102124 6808028
37876F808028m698525n676403k408539Q68112J238142R28154K419664L176479
37868B655112n2737l961882k319626L404736M607970j260836n778559k156836
37860d862658M133518L763074k589427o347856l954072P8991J841462K422202
37852e514766L156199K756655Q45829l72802J42107L37037j362206l094117j926579
37843e032643K049642N092474L345916k519365o631012l993747K764357O044726
37835A120348L229881n47797j057443o03666j795998j999834P04112J931089j655709
37826f75017m569049n74302N546463M254944l136197o038552j407899K303499
37818d296110o6762k600304L49690M393423K772146k992267o139566l709939K042193
$$ plain form
37876 6808028 2109503 -3566900 -5975439 -5107327 -3869185 -2941031 -521367 2655112
37868 2655112 2602375 -1359507 -3679133 -274397 4333573 3072737 -2705822 -4862658
37860 -4862658 -729140 3033934 444507 -5903349 -9857421 -9778430 -7936968 -5514766
37852 -5514766 -2358567 398088 1243917 871115 1013222 1350259 -11947 -3106064 -5032643
37843 -5032643 -2983001 2109473 5455389 2936024 -3694988 -7688735 -4924378 1120348
37835 1120348 4350229 3802432 2744989 2141323 345325 -1654509 -950397 980692 -675017
37826 -675017 -5244066 -5818368 -271905 3983039 846842 -5191710 -6599609 -4296110
37818 -4296110 -4362872 -6963176 -6613486 -2220063 552083 -2440184 -8579750 -12289689 -10247496
37809a0247496P117603P309609J000938o572229p205151q59242L337261P05696
37801e413011j896484J969153P014181M891680j940587m558280j812155k23826
37793a969329j638336j076001K883673M830954J627164k746894l919323k518782
37785d526874n80316J687774L151817J280849k691436l178576J788912O387235
37777C319385M608751j477850n029496l290454P00024L178317K669917n42131
37769D136463m263010m625595m0262N399143N702066L35350n076803n714764k291730
37760f439142J877993N180072O996730N616634M79427m732140n256527j724193
37752A998854M07195j017628j577940K135217N888708L720290k319484m721633
$$ plain form
37809 -10247496 -3129893 4179716 5180654 -1391575 -8596726 -9455968 -6118707 -5413011
37801 -5413011 -7309495 -5340342 1673839 6565519 4624932 66652 -1745503 -1969329
37793 -1969329 -3607665 -4683666 -1799993 3030961 4658125 1911231 -2008092 -4526874
37785 -4526874 -5107190 -3419416 -267599 1013250 -1678186 -4856762 -3067850 3319385
37777 3319385 7928136 6450286 1420790 -1869664 -1169640 2008677 4678594 4136463
37769 4136463 -126547 -4752142 -4792404 606739 6308805 6644155 1567352 -4147412 -6439142
37760 -6439142 -4561149 618923 7615653 13232287 13711714 8979574 3723047 1998854
37752 1998854 2406049 1388421 -189519 1945698 7834406 11554696 9235212 4513579
37744D513579j891574O6781k117303l809348r02735L274699L932238K060392N33458
37735E660187j767769n662592o270675K50305P841039P100470q48653n769432
37727E32880l174268J060819J633968L23875n43867k295239m121487j431751N375945
37718b639125Q134898K527958m318557m217880K35723J500125m78418j20533K917692
37709C541883L538406N40451j805572j485062j179582k394760l042908j838397
37701d125541k75253N41016R71460N76403j311847k906861j785179R16315J959337
37692e440150J092443P94894J762531K648869L193670L464647J650275k649385
37684F517794n032864j913868K618138K261237j279843j566436Q04665m87033
$$ plain form
37744 4513579 2622005 2688786 571483 -3237865 -4140600 -865901 3066337 5126729 5660187
37735 5660187 3892418 -1770174 -8040849 -7790544 50495 7150965 6302312 532880
37727 532880 -2641388 -1580569 53399 377274 -166593 -2461832 -6583319 -8015070 -2639125
37718 -2639125 5495773 8023731 3705174 -512706 -276983 1223142 744724 624191 3541883
37709 3541883 7080289 7620740 5815168 4330106 3150524 755764 -2287144 -4125541
37701 -4125541 -4400794 -3859778 -2888318 -2311915 -3623762 -6530623 -8315802 -7399487 -5440150
37692 -5440150 -4347707 -3552813 -1790282 858587 4052257 7516904 9167179 6517794
37684 6517794 1484930 -428938 2189200 4450437 3170594 1604158 2408823 1921790
37676A921790m686721l675474L459217O972408J858759m053167l169296Q20875
37668e51609J885330J844800L221748J250901o570955j1054527l677936P675587
37660e976661Q672225K77195l592183J431415M809129n7392n662900m031825J068852
37651c062145K214942j90112j470231j038135n82001Q58202L776525M408075M8010
37642D963130n061042m772860L74680M652289N317552M439261L771042K505040
37634A6189092O0754k567909m571508n725687m990361j393238L143607M311043
37626D455793L44366m751921m924340O82460N997165N157937l955k675160p42261
37617C540084Q53186j266357l480022k057436p3626j388009k213027K998655R821541
$$ plain form
37676 1921790 -2764931 -6440405 -2981188 3991220 5849979 1796812 -1372484 -551609
37668 -551609 1333721 3178521 6400269 7651170 1080215 -9974312 -13652248 -5976661
37660 -5976661 2695564 2972759 -619424 811991 5621120 5563728 -99172 -4130997 -3062145
37651 -3062145 -847203 -1037315 -2507546 -3545681 -4127682 -3269480 507045 4915120 4963130
37642 4963130 -97912 -4870772 -4496092 156197 5473749 9913010 13684052 16189092
37634 16189092 16249846 13681937 9110429 3384742 -1605619 -2998857 144750 4455793
37626 4455793 4800159 48238 -4876102 -4193642 1803523 6961460 6957505 4282345 3540084
37617 3540084 4393270 3126913 -353109 -2410545 -2484171 -3872180 -6085207 -3086552 6734989
37608F734989P961911k539195r213284m345954M646679O922141K746292j01494
37600A2812085J127212K490120J265280j069612k758269l756110m087832l430688
37592B592186j890370N24601L632827N186556K357939l101135n072487j315432
37584B914685K393761K21811n028788n903183p41791M650641M861212M84849l819052
37575C4145m215173j077815J081542j424823n723690m775363K878125R917828
37567c305224R700860M558855N84374j537084m762861p935362o687085j230165
37559a0613692K967712K836433J119948J201115K513374K489501M00126j988099
37551I26418k374950m08034J387708M41259j855105j717854P95415J302550j416930
$$ plain form
37608 6734989 14696900 12157705 2944421 -1401533 3245146 10167287 12913579 12812085
37600 12812085 13939297 16429417 17694697 16625085 13866816 10110706 6022874 2592186
37592 2592186 701816 1226417 4859244 10045800 12403739 9302604 4230117 2914685
37584 2914685 5308446 5530257 501469 -5401714 -6143505 -1492864 3368348 3853197 34145
37575 34145 -4181028 -5258843 -4177301 -5602124 -11325814 -16101177 -13223052 -3305224
37567 -3305224 6395636 10954491 11538865 10001781 5238920 -2696442 -9383527 -10613692
37559 -10613692 -7645980 -4809547 -3689599 -2488484 24890 2514391 2914517 926418
37551 926418 -1448532 -1856566 -468858 -27599 -1882704 -3600558 -2805143 -1502593 -2919523
37542b919523k614387M90667L473342K216832K32242K027531M028860K88055o120241
37533A103378o604380n36736L930681K604656j4367k2437K81448j251542k008746
37524b518045J7256K010113J098267j112637j784872q74996L90255J597752K038511
37515H61604R40744j63976R45196K664258J156120k910702m368478j502574J373449
37506a004359J078962r2920L72942P89990p21850k141181r04236J848764L279155
37497B505267K634136J114454K18231J012613K563822J608990k668896n140326
37489C848291j503014L190880O55985o588938p203632J307093P770266M448187
37481E925118j836337k405114m27623k645957n829644k918840K894442K459951
$$ plain form
37542 -2919523 -5533910 -5043243 -1569901 646931 879173 2906704 6935564 7223619 1103378
37533 1103378 -5501002 -6037738 -2107057 497599 483232 460795 742243 -509299 -2518045
37524 -2518045 -2500789 -490676 607591 -505046 -2289918 -3164914 -2774659 -1176907 861604
37515 861604 1802348 1638372 2583568 5247826 6403946 3493244 -875234 -2377808 -1004359
37506 -1004359 74603 -18317 354625 1144615 422765 -1718416 -2622652 -773888 2505267
37497 2505267 5139403 6253857 6472088 7484701 10048523 11657513 8988617 3848291
37489 3848291 2345277 5536157 6192142 -396796 -7600428 -6293335 1476931 5925118
37481 5925118 4088781 1683667 1256044 -1389913 -7219557 -10138397 -7243955 -4784004
37473d784004l522599m756571K516874R936721R451436L048531k517450m196433
37465E176505l023160q48420O75042P40597K56713J37866n49083k252453k589105
37456b275498J40766L055360K455895l92287j674400j187563j177435j131117
37448b186279O52207K116212K43356k621653j828166J271911J262773j539380
37440b629019j124074L578832O148474L029737j008583j156166K24372j118407
37432E945166m040975m508524j738421J907533M361026M489511K111187o16823
37424G909680q08713P58332M11085k218739l297935j549168n94374k139887k374433
37415c904152J274864M922945M127106O27885j402530j863397k569067k302422
$$ plain form
37473 -4784004 -8306603 -13063174 -10546300 -609579 8841857 11890388 9372938 5176505
37465 5176505 2153345 1304925 1979967 2720564 2977277 3115143 2566060 313607 -2275498
37456 -2275498 -2134732 920628 3376523 2984236 1309836 122273 -1055162 -2186279
37448 -2186279 -1534072 582140 825496 -1796157 -3624323 -2352412 -1089639 -2629019
37440 -2629019 -3753093 -174261 5974213 9003950 7995367 6839201 7063573 5945166
37432 5945166 1904191 -2604333 -4342754 -2435221 1925805 6415316 8526503 7909680
37424 7909680 7100967 7859299 8270384 6051645 2753710 1204542 610168 -1529719 -3904152
37415 -3904152 -2629288 2293657 6420763 7048648 5646118 3782721 1213654 -1088768
37407a088768L97462K428230R5106l976131l808029R74721M667147L688463K90328
37398C668529k003740k120054l43999K268623L062321M20446k459624p14291M606834
37389F385045O700843K282926l770910n570869l972436l492115m435811k973659
37381h846986J665170M787177K558928k372876m172969j357159J785133J454988
37373d498594o73662n13348K153498L406057J117388j820494j579280J398702
37365a009733L276666J841714j229348k772328j443792J273879K576251J059072
37357C572381j690978k765634j292727R03388K019282J970521J044264q67934
37349B892563k580439j552787K446662N446151L523525k038575o047172n230170
$$ plain form
37407 -1088768 -691306 1736924 1832030 -2144101 -5952130 -4977409 -310262 3378201 3668529
37398 3668529 1664789 -455265 -799264 1469359 4531680 4952126 2492502 1778211 6385045
37389 6385045 13085888 15368814 11597904 6027035 2054599 -1437516 -5873327 -8846986
37381 -8846986 -7181816 -2394639 164289 -2208587 -6381556 -7738715 -5953582 -4498594
37373 -4498594 -5172256 -5685604 -3532106 -126049 991339 -829155 -2408435 -1009733
37365 -1009733 2266933 4108647 2879299 106971 -1336821 -62942 2513309 3572381
37357 3572381 1881403 -884231 -2176958 -1273570 745712 2716233 3760497 2892563
37349 2892563 312124 -1240663 1205999 6652150 10175675 8137100 2089928 -3140242
37341c140242j041775K609174K840329j28728k896256j914005K094691M362804
37333B785992K228116j292641k393226k052158k858522k844985J768807Q415345
37325C756728R252961K062853n542801n937843j130730J311908j232653m559202
37317b018779m558498j508480K319412N443812O730467N134177J378238j856672
37309A1063677k724372k041093j324077k95266J974806M114743L054080j532835
37301A2289663n366904m259488L46055L247532K669104K054368L555003L767135
37293A8302468o97105o426609o904735j867087K087380N83741l443504m938086
37285c303537k853235N95526L098827K824811n48735l380286o28241O475812R571247
$$ plain form
37341 -3140242 -4182017 -1572843 1267486 1138758 -1757498 -3671503 -1576812 2785992
37333 2785992 5014108 3721467 1328241 -723917 -3582439 -6427424 -4658617 3756728
37325 3756728 13009689 15072542 9529741 3591898 2461168 3773076 2540423 -2018779
37317 -2018779 -6577277 -8085757 -5766345 -322533 6407934 11542111 12920349 11063677
37309 11063677 8339305 6298212 4974135 4678869 6653675 10768418 13822498 12289663
37301 12289663 6922759 2663271 3009326 6256858 8925962 10980330 14535333 18302468
37293 18302468 17605363 11178754 4274019 2406932 4494312 5078053 1634549 -3303537
37285 -3303537 -6156772 -5561246 -2462419 362392 -186343 -3566629 -4194870 2280942 11852189
37276A1852189L771896m895713p571398m501872k593127l559355k395166K424960
37268g467586N312831K615124j479064j942840l94482r09766k626368j984979
37260h877130L76972O67890j269742j526030J389136M143398L600070O97148j799877
37251b598165k541286j548342M86651J805624Q95675p98451j5807L227860M561501
37242C475260J406273k479072j877122K145834L411808n77059n022688m474610
37234c991376J07149L527962L527656K391728K011449J075054j528270l518495
37226C602857k128599J431005L515838L399650L620575M704960L571368q64393
37218B0853261m285700k808634N01410k63487m557375n746347j239342L333776
$$ plain form
37276 11852189 15624085 10728372 3156974 -1344898 -3938025 -7497380 -9892546 -7467586
37268 -7467586 -2154755 460369 -1018695 -2961535 -3356017 -4265783 -6892151 -8877130
37260 -8877130 -8500158 -7832268 -9102010 -10628040 -9238904 -5095506 -1495436 -798288 -2598165
37251 -2598165 -5139451 -6687793 -6201142 -4395518 -3499843 -4298294 -4314101 -1086241 3475260
37242 3475260 4881533 2402461 525339 2671173 6082981 5505922 483234 -3991376
37234 -3991376 -3884227 -356265 3171391 5563119 7574568 8649622 7121352 3602857
37226 3602857 1474258 2905263 6421101 9820751 13441326 18146286 21717654 20853261
37218 20853261 16567561 13758927 14260337 13996850 9439475 3693128 2453786 5787562
37210E787562K400106j794904l232714m71995L028586M509791L774398J166132
37202A5166962k228598l481972r41907K274297J849120j264134k200343K44288
37194I417713K172236J264240j25981j36958p43875l206373m401539j287008M013579
37185F966034P066882O637173M165424L40481m055132o037871l494316P55462
37177A2344137K025586K67939l92601J671773L468482K541247N76918L91295J939385
37168B4834161L015806K459824J405185J861314M290441O481862N999152M329601
37160E4677346O124600J2228020J6325763J2603952M999837L646943J2046100
37153A22652561K2711390K6889849K4407131K1837907K4223993L0931861L7384877
$$ plain form
37210 5787562 8187668 6392764 3160050 2688055 5716641 10226432 14000830 15166962
37202 15166962 12938364 9456392 8514485 10788782 12637902 11373768 9173425 9417713
37194 9417713 11589949 12854189 12728208 12591250 11847375 8641002 4239463 2952455 6966034
37185 6966034 14032916 20670089 24835513 25175994 21120862 15082991 11588675 12344137
37177 12344137 14369723 14637662 14245061 15916834 19385316 21926563 22503481 22894776 24834161
37168 24834161 27849967 30309791 31714976 33576290 37866731 44348593 50347745 54677346
37160 54677346 60801946 73029966 89355729 101959681 106959518 110606461 122652561
37153 122652561 145363951 172253800 196660931 218498838 242722831 273654692 311039569
37146C11039569L8746874L3224123K2938478J0650187l845098k1531732l8755209
37139C52467192m7910528m5170250l5023515k5770980k2266401k3326351k3819879
37132A29179288j9101219j0019329l387256m433340r496322j0453559n898943
37125F6389320k443922m390537q165324q800149o195955k582171Q16291K137282
37117C6764835n34698m405730l682397J289575L187185q27788m263822k153596
37109B5373564J236624J073627J00104J258215N47775m318042o340035m43074
37101A8488758N433984K233638m224249k730968L731717L500464k696710l434495
37093B0302139K133870K962446k579072k729399N855753J0390019L485706m144509
$$ plain form
37146 311039569 349786443 383010566 405949044 416599231 412754133 391222401 352467192
37139 352467192 304556664 259386414 224362899 198591919 176325518 152999167 129179288
37132 129179288 110078069 100058740 96671484 92238144 82741822 72288263 66389320
37125 66389320 63945398 59554861 51389537 42589388 36393433 33811262 34627553 36764835
37117 36764835 36230137 31824407 28142010 29431585 32618770 31790982 27527160 25373564
37109 25373564 26610188 27683815 27783919 29042134 29589909 25271867 18931832 18488758
37101 18488758 23922742 26156380 21932131 19201163 22932880 26433344 23736634 20302139
37093 20302139 22436009 25398455 22819383 20089984 25945737 36335756 39821462 35676953
37085C5676953k128753L146120J794221k602541j615986K925448M971022O575626
37077D8742110J1746252J5566703J2073522O827194R282844J7518431K2176541
37070A43933597K1316844K0319218K1123012K2301782K5695343L2077339L4155371
37063C20922506K4891785R189617l319674j2681264k4256087l4821518l6566734
37056B43358631l1588966k8399209k6585107j9614867j0830080j0419864j6657229
37049I9263309j6956209r249431n250142r079325j0162737l281661J380935l321391
37041D3343348q579941n450281J09506n06466l218375o40299L225068P65848m556117
37032B4492291m252336K91907J212886j915988k929905n91937R01462K68726p83808
$$ plain form
37085 35676953 33548200 36694320 38488541 35886000 34270014 37195462 42166484 48742110
37077 48742110 60488362 76055065 88128587 94955781 104238625 121757056 143933597
37070 143933597 165250441 185569659 206692671 228994453 254689796 286767135 320922506
37063 320922506 345814291 355003908 351684234 339002970 314746883 279925365 243358631
37056 243358631 211769665 183370456 156785349 137170482 126340402 115920538 99263309
37049 99263309 82307100 73057669 67807527 58728202 48565465 45283804 46664739 43343348
37041 43343348 34763407 29313126 29422632 28916166 25697791 25057492 28282560 29048408 24492291
37032 24492291 20239955 20531862 21744748 19828760 16898855 16306918 17208380 17477106 16693298
37023A6693298k784856n803905n497059p957L822931N9075n480718m021005J379818
37014a640378J493077k484775j260624N297402P107095J098648l639397j110799
37006D860249K862052J763310j693835k193796m00135M55520K51734l04117k056105
36997C544877l748427j658385L433136M691626j041691p204314o049724R12448
36989g120454N833846M777277O03591k177211j593378J392626L922155L613681
36981I252133J141424j039471k527505m518469n635421k854469K353053M044533
36973B15808L52578l060744j461498J840336J346075j698916j885808J312029
36965c040140L119769J416447m89039J51300J450294P34372j020740j246747j53220
$$ plain form
37023 16693298 13908442 8104537 2607478 2599521 6422452 6481527 1000809 -3020196 -1640378
37014 -1640378 -147301 -2632076 -3892700 1404702 8511797 9610445 5971048 4860249
37006 4860249 7722301 9485611 7791776 5597980 5197845 5653365 5905099 5600982 3544877
36997 3544877 -203550 -1861935 1571201 6262827 5221136 -1983178 -8032902 -7120454
36989 -7120454 -1286608 3490669 4094260 1917049 323671 1716297 5638452 9252133
36981 9252133 10393557 9354086 6826581 2308112 -3327309 -6181778 -3828725 215808
36973 215808 568386 -2492358 -3953856 -2113520 -767445 -2466361 -4352169 -3040140
36965 -3040140 79629 1496076 1007037 1158337 2608631 3343003 2322263 1075516 922296
36956I22296j47965j708563k625911j654031l77464k51114j48673R57741J105899
36947c927785j319119l046752J25854N273889M814244j465305m377776O78358
36939c244392N513045J863359m688371l457887L590647N116224m40765k558080
36931A693780K763372N749984k53207o871032m388111K319414K311913l591247
36923b65134n282962j99563L977328K788997L71335j64962j936240o212555p350912
36914a4274668j344618O271856P265437K060776j793559p75033J086835L5869
36906a467105j815971j200158L53007n56084k643422j348093L346899N569866
36898B38939J946365l024518l357958P2259K010767J165858O73823J423054R12227
$$ plain form
36956 922296 774331 -934232 -3560143 -5214174 -5591638 -5842752 -5991425 -5033684 -3927785
36947 -3927785 -5246904 -8293656 -8167802 -2893913 1920331 455026 -3922750 -3244392
36939 -3244392 2268653 4132012 -556359 -4014246 -423599 4692625 4251860 1693780
36931 1693780 4457152 10207136 9953929 3082897 -1305214 1014200 3326113 -265134
36923 -265134 -5548096 -5747659 -1770331 1018666 1390001 1225039 -711201 -6923756 -14274668
36914 -14274668 -15619286 -9347430 -2081993 -21217 -1814776 -2589809 -1502974 -1467105
36906 -1467105 -3283076 -4483234 -4130227 -4686311 -7329733 -8677826 -5330927 238939
36898 238939 2185304 -839214 -4197172 -4124913 -2114146 -948288 -274465 1148589 2060816
36889B060816r44132q69186J422999J707672j406653l171276l66171K811661J326413
36880B572143k444930k830533k16312L07793j729663j197408L480127O468521
36872D409738K751223m081401o106763j201760M537438M440476r73504n075728
36864a300281l329341J282279K387396j231040m184725k229508J965780L253687
36856c385753J332653j29251J16766m9220j109705o94036J658967K815734J135974
36847A692129l90319J102223L346172K213105j817309m319792l359457j420083
36839b953331o71235j63014R34544R40759r16835j665608J151962M314188K612366
36830C583796k743269m478448N45615O094748M584127l008182r005275q605441
$$ plain form
36889 2060816 1116684 247498 1670497 3378169 1971516 -1199760 -1565931 1245730 2572143
36880 2572143 127213 -2703320 -2919632 -2611839 -4341502 -5538910 -2058783 4409738
36872 4409738 7160961 3079560 -3027203 -4228963 308475 4748951 3775447 -1300281
36864 -1300281 -4629622 -3347343 -959947 -2190987 -6375712 -8605220 -6639440 -3385753
36856 -3385753 -2053100 -2182351 -2065585 -2114805 -3224510 -3918546 -2259579 556155 1692129
36847 1692129 1301810 2404033 5750205 7963310 6146001 1826209 -1533248 -2953331
36839 -2953331 -3624566 -3787580 -2853036 -1912277 -2829112 -4494720 -3342758 971430 3583796
36830 3583796 840527 -3637921 -3092306 3002442 7586569 4578387 -4426888 -13032329
36822a3032329l624214J889280N339078N077690O83457m745250n742105j93777
36814a4348170P454119J0342498O161859o92467l787337j399505J742394M18385
36806E891776m035803n446712j913717J104366o83726l273324n50683N677322
36798c230501Q012622M322406r8366j100932l70185o56647j746123k716249l784500
36789a368475m536053l938114k582783j381601J116508N496966P312340K748339
36781B867127l002710j633012M381609M225919l382900o776706k60707O009271
36773B427891K883526k740358p33081M278517J587405n765427n493950K615031
36765i40446N768518q23399o841193m259437J300053K246639Q26556K000781L511427
$$ plain form
36822 -13032329 -16656543 -14767263 -9428185 -4350495 -3667038 -8412288 -14154393 -14348170
36814 -14348170 -6894051 3448447 9610306 8917839 5130502 3730997 5473391 5891776
36806 5891776 1855973 -3590739 -5504456 -4400090 -5083816 -8357140 -8907823 -3230501
36798 -3230501 4782121 9104527 9006161 7905229 7535044 6878397 5132274 2416025 -1368475
36789 -1368475 -5904528 -9842642 -12425425 -13807026 -12690518 -7193552 118788 2867127
36781 2867127 -135583 -1768595 2613014 6838933 3456033 -3320673 -3581380 2427891
36773 2427891 5311417 2571059 1837978 6116495 7703900 1938473 -3555477 -940446
36765 -940446 4828072 4004673 -2836520 -7095957 -5795904 -3549265 -2722709 -721928 2789499
36756B789499J320586j615315m95353J901452o25671o551021p687687j256463
36748a2219973N809211O198169J141836k374496o27736L147561L534296k74922
36740D333946l619158k477050J104720J725459j844148m804147k819901K250518
36732f149761M923053K791355j218294k682048m14974K661403K955515L48187
36724C214436j719030p06678J689256J949716o63425l724841m964588l924789
36716h849943j062647K490855M669015M140677K025321K63596q62915j724526
36708A089433j410642M16315J263866r61649l571778k228978J992154L480620
36700F9341N35972k022077l60160K828097L013787M00148j574354j792597j879107
$$ plain form
36756 2789499 4110085 2494770 1999417 3900869 3275198 -3275823 -10963510 -12219973
36748 -12219973 -6410762 -212593 929243 -1445253 -2072989 1074572 4608868 4333946
36740 4333946 714788 -1762262 -657542 1067917 -776231 -5580378 -8400279 -6149761
36732 -6149761 -1226708 1564647 346353 -2335695 -2750669 -89266 2866249 3214436
36724 3214436 1495406 788728 2477984 4427700 3764275 39434 -4925154 -8849943
36716 -8849943 -9912590 -7421735 -2752720 1387957 3413278 3676874 2813959 1089433
36708 1089433 -321209 95106 1358972 397323 -3174455 -5403433 -3411279 69341
36700 69341 605313 -1416764 -1776924 1051173 4064960 4465108 2890754 1098157 -780950
36691g80950k180959p21252L292915O931034N994609J16666n586245n583167p28963
36682G53688K458956M12849k865352k393748K25532M48847r74030J95739L038492
36673A300973K025253l177872n824428k335632K268671K652125Q59300J223062
36665a008548K631350J313251k093127l624371k063148N60092K802165M220122
36657B737786L711222J198348p62054o30220r91436l932263n709086j537212N566312
36648c48603P121896J068120m795044l686032J084121K020323j303502k510147
36640a348868J117351M349217K232220k037126k024401J469015J078216n113570
36632b77946q858460l510798M710231M614032l301796p064451q70390O658670
$$ plain form
36691 -780950 -2961909 -3683161 -390246 6540788 12535397 12652063 7065818 1482651 753688
36682 753688 3212644 3625493 760141 -1633607 -1408075 -959228 -1933258 -1737519 1300973
36673 1300973 3326226 148354 -5676074 -8011706 -5743035 -3090910 -2231610 -1008548
36665 -1008548 1622802 2936053 842926 -2781445 -4844593 -4284501 -1482336 2737786
36657 2737786 6449008 7647356 6885302 6255082 5263646 1331383 -4377703 -5914915 -348603
36648 -348603 6773293 7841413 3046369 -639663 444458 2464781 1161279 -1348868
36640 -1348868 -231517 4117700 6349920 4312794 2288393 3757408 4835624 -277946
36632 -277946 -9136406 -12647204 -7936973 -3322941 -6624737 -13689188 -14559578 -7900908
36624g900908N891740j18373j941317K046709N753323O133865N391231L832406
36616A9088676r10278o757005p186323r95768M458107L287258j157724k729447
36608G097496j818500k713969n001889m179009J25942K849943J384712n96490
36600b851764N53990K785171K389525M08655N81553K560202J991645k426395o233721
36591b41139n093659k68320L690156M346258K528473P4375j433003j095446K99294
36582B806989Q88930M74795O62160J123075j046948n796664p613039k801610L629595
36573g672717L908684j288857l780185J66287N247048N819898L045539N74473
36565F020170j513867m285323n301338j427886N145733Q003020M052064k490895
$$ plain form
36624 -7900908 -2009168 -2127541 -4068858 -2022149 3731174 9865039 15256270 19088676
36616 19088676 18178398 11421393 4235070 3239302 7697409 10984667 9826943 7097496
36608 7097496 5278996 2565027 -2436862 -6615871 -6489929 -3639986 -2255274 -2851764
36600 -2851764 -2297774 487397 2876922 3285577 3867130 6427332 8418977 5992582 -241139
36591 -241139 -5334798 -5603118 -1912962 2433296 4961769 5036144 3603141 2507695 2806989
36582 2806989 3695919 4170714 4832874 5955949 4909001 -887663 -8500702 -11302312 -7672717
36573 -7672717 -3764033 -5052890 -8833075 -8666788 -3419740 2400158 5445697 6020170
36565 6020170 4506303 220980 -5080358 -6508244 -1362511 6640509 10692573 8201678
36557H201678m658546m83367M716363M482359q84941m843867l534175n21130l41696
36548B132678j696338j506138j457107l950907n063859K9840O815445O444032
36540A747646K78158j551939K924073M304670j071434l865676J636272O028375
36532A0430145J3530q994338p795277K092973P690085L994823k127172m931507
36524C73262m978677k521023L302264Q587660P643871K166077j072518j136396
36516A2364520k626931n279101l885112J076873K927995K38561j071152J085113
36508D830766J564226j656323l510137j535313r6261j225607p50315K181927J574939
36499A377902l974730o182958l80880N422335L194335j906983r76915L113389
$$ plain form
36557 8201678 3543132 3059765 7776128 12258487 11373546 6529679 2995504 2474374 2132678
36548 2132678 436340 -1069798 -2526905 -6477812 -11541671 -11511831 -4696386 1747646
36540 1747646 2025804 473865 3397938 7702608 6631174 2765498 4401770 10430145
36532 10430145 10443675 1449337 -6345940 -4252967 3437118 7431941 5304769 373262
36524 373262 -4605415 -7126438 -3824174 4763486 12407357 14573434 13500916 12364520
36516 12364520 9737589 4458488 573376 1650249 4578244 4816805 3745653 4830766
36508 4830766 6394992 4738669 1228532 -306781 -403042 -1628649 -2378964 -197037 1377902
36499 1377902 -2596828 -8779786 -9160666 -3738331 -543996 -2450979 -3427894 -314505
36491c14505J335382m942135n460535K186877Q725314P243703J620254j443619
36483H950736j155472k78567K05179O79001O59763m99125k514024m468443m698757
36474c119709j432347M088811O879080L946259r90227k416246q04919o82543k417831
36465C050328j883508J674117L426911K81354m387284n543513k523356J662843
36457d242108M157912L740531R89063j577278j529684M19819J367356M94156j78511
36448C641256K75064M7098j932532l619204k627299N41204L455180M405135L112447
36439G298349M40246j605351j161127J151966K494011J257364j102777k501803
36431F270878k963823l647789m308314l484225j101412N92086l79991k676629
$$ plain form
36491 -314505 1020877 -3921258 -9381793 -7194916 1530398 8774101 10394355 8950736
36483 8950736 7795264 7516697 7721876 8400877 9060640 8561515 6047491 1579048 -3119709
36474 -3119709 -4552056 -463245 6415835 10362094 9371867 6955621 6150702 5468159 3050328
36465 3050328 1166820 2840937 6267848 6549202 2161918 -3381595 -5904951 -4242108
36457 -4242108 -84196 3656335 4645398 3068120 1538436 1958255 3325611 3819767 3641256
36448 3641256 3916320 3963418 2030886 -1588318 -4215617 -3674413 -219233 4185902 7298349
36439 7298349 7738595 6133244 4972117 6124083 8618094 9875458 8772681 6270878
36431 6270878 3307055 -340734 -4649048 -8133273 -9234685 -8642599 -9022590 -11699219
36423a1699219k637795R07143M303063L623091N18272O6787K736137L108569j375571
36414d49523n221837k653728L129735M224356l68015l698886j377610K917680
36406c497828L994188K121288P10117N92160j65789k376215m135988l011316P95044
36397d974339L622809K070758j772219j765597L255822N882301M46724o863265
36389i7006n854701J900152M921610j71878l602199Q76208N352672J384847n066669
36380c56964k950413N638351Q490513K082824m392263m221066j621330k169430
36372E00222l910055k676023M19005J817342J216229J71287j233934k649480j880433
36363h225840J458800L954706L332518J948911J885820N06769m329555q136416
$$ plain form
36423 -11699219 -14337014 -13429871 -9126808 -5503717 -4985445 -4918658 -2182521 926048 -449523
36414 -449523 -5671360 -8325088 -5195353 -970997 -1339012 -5037898 -6415508 -3497828
36406 -3497828 496360 2617648 3327765 3919925 3754136 1377921 -2758067 -5769383 -4974339
36397 -4974339 -1351530 719228 -1052991 -2818588 437234 6319535 6766259 -97006
36389 -97006 -5951707 -4051555 870055 698177 -2904022 -2027814 3324858 4709705 -356964
36380 -356964 -3307377 2330974 10821487 12904311 8512048 4290982 2669652 500222
36372 500222 -3409833 -6085856 -5666851 -3849509 -2633280 -2461993 -3695927 -6345407 -8225840
36363 -8225840 -6767040 -2812334 520184 2469095 4354915 4861684 532129 -7604287
36355g604287n116988K255483N627206K442620j311004j025912M04300q42198
36347e170780k631654j140259K003208K202143n21805j604888R49598M052524
36339a861913M430195K238891q48856l678696m776127k779155Q94048K706636
36331c674977J726134P53587J320698J136101j179512k638870p25741J715403
36323a567177R52206j130011m15036J805710J070028j626358r39967K822871K953142
36314C925408k337931o058065l752128o70111j895264k837810K352790Q777696
36306b495415P113062j258169n714448k151076K518873K434962J53728l69993
36298B31524O1310Q9750J140483K944530J960774k103193m148019j824845J74376
$$ plain form
36355 -7604287 -12721275 -10465792 -4838586 -2395966 -3706970 -4732882 -4328582 -5170780
36347 -5170780 -7802434 -8942693 -6939485 -4737342 -5259147 -6864035 -5914437 -1861913
36339 -1861913 2568282 4807173 3958317 279621 -4496506 -7275661 -6381613 -3674977
36331 -3674977 -1948843 -1195256 125442 1261543 82031 -2556839 -3282580 -1567177
36323 -1567177 -614971 -1744982 -2160018 -354308 715720 -910638 -1850605 972266 3925408
36314 3925408 1587477 -4470588 -8222716 -8892827 -10788091 -13625901 -11273111 -2495415
36306 -2495415 4617647 3359478 -2354970 -4506046 -1987173 447789 601517 231524
36298 231524 292834 382584 1523067 4467597 6428371 4325178 177159 -1647686 -1473310
36289a473310j735753l623586j074662K859908K927202L41774l59535N78286j26154
36280a685830j967359k274228k011717l189834l111917J284045N638785L390294
36272c927761k438531k398455L867280N718613j590680q137524l788246O348813
36264f346491R290172K467050m160874l048311J858086K819691o69884k600727
36256c91288N4834K932464P61742m476758n768643j306347K484149P32950k228468
36247g205365l27339L577542K454302k022953j285421N265307P942278K381904
36239A0780255l078744j344338J866121j239651o200291l435052N150986Q143353
36231A0642639J655951o000277p178700l426995M35218K863319L627408J790677
$$ plain form
36289 -1473310 -3209063 -6832649 -7907311 -5047403 -2120201 -1778427 -2137962 -1559676 -1685830
36280 -1685830 -3653189 -5927417 -7939134 -11128968 -14240885 -12956840 -7318055 -3927761
36272 -3927761 -6366292 -8764747 -4897467 821146 -769534 -8907058 -12695304 -6346491
36264 -6346491 2943681 5410731 1249857 -1798454 59632 2879323 2209439 -391288
36256 -391288 -336454 2596010 3357752 -1119006 -6887649 -8193996 -5709847 -4976897 -7205365
36247 -7205365 -7532704 -3955162 -1500860 -3523813 -4809234 456073 8398351 10780255
36239 10780255 7701511 6357173 8223294 6983643 783352 -2651700 2499286 10642639
36231 10642639 12298590 6298313 -880387 -4307382 -3872164 -1008845 2618563 4409240
36223D409240j343803k211450l49795N76652r62246j631093Q84324L506536K329085
36214E207450j523733l575365j739419J689980K755836j84068m215003m308717
36206e893039K90555L993349K243568j513655j139001K211259K270669j248372
36198A215333k152787Q03019J161237l477993o080606j901766K799957J131456
36190f502150k455347J77325O187190N369592l417858r778306o650680J031573
36182a6038661M965429L715840J045864o01024j125762n36948J100312K917099
36174d557851L826599K824286p69550n294847o328827j721785M034012M668700
36166c319263O30200j988494m88596J942136K805371L106799K577032j133771
$$ plain form
36223 4409240 3065437 853987 504192 1080844 118598 -1512495 -628171 2878365 5207450
36214 5207450 3683717 108352 -1631067 58913 2814749 2630681 -1584322 -5893039
36206 -5893039 -5602484 -1609135 634433 -879222 -2018223 193036 2463705 1215333
36198 1215333 -937454 -134435 1026802 -2451191 -8531797 -10433563 -7633606 -6502150
36190 -6502150 -8957497 -8780172 -2592982 2776610 -641248 -10419554 -17070234 -16038661
36182 -16038661 -11073232 -7357392 -6311528 -6912552 -8038314 -8575262 -7474950 -4557851
36174 -4557851 -731252 2093034 1323484 -3971363 -10300190 -12021975 -7987963 -3319263
36166 -3319263 -2689063 -4677557 -5166153 -3224017 -418646 2688153 5265185 4131414
36158D131414o133260o036189J82772M595481J646927k915392r72214N064345
36150d36116O314295J416894k264329q09574J227720n02496l472666l266961j58790
36141a952023K498312K981438J711095k70797j435043p76433O5570j603695m806619
36132c588195n058392q25613L586681L877711J454929N52870K131307L712072
36124E843370L581061K146502J31599j970061l205976k955086j941133j110446
36116E19830m09899K03146K6283p67427o22640N86280M01408k200264l855962
36107f119245j214275L288101L999864j14084m132992l974956q62967J956114
36099g174440L524002M367651M056153K042185m37470j554639j470761j920884
$$ plain form
36158 4131414 -2001846 -8038035 -7855263 -3259782 -1612855 -4528247 -5500461 -436116
36150 -436116 5878179 7295073 5030744 4221170 5448890 4946394 1473728 -1793233 -1952023
36141 -1952023 546289 3527727 5238822 4968025 3532982 2756549 2822119 1218424 -3588195
36132 -3588195 -8646587 -9472200 -5885519 -2007808 -552879 -9 2131298 5843370
36124 5843370 9424431 11570933 11702532 9732471 6526495 3571409 1630276 519830
36116 519830 109931 313077 339360 -428067 -1050707 -464427 -63019 -2263283 -6119245
36107 -6119245 -7333520 -4045419 -45555 -159639 -4292631 -8267587 -9130554 -7174440
36099 -7174440 -3650438 717213 4773366 6815551 6378081 4823442 3352681 1431797
36091A431797l231442l390337r75268K012126K077308o98288j795593J501141
36083c068556M997610K643781m036058o906908k835421J663163Q35505j269785
36075g976669J763459P047254O496613K73109l134740m82764J733706j229016
36067D490952m831518l552285L23569J698479R46996J268440J956956M38723j922779
36058H17533j915353k68167M9344m75142P67548K916649K767754N29624q03600
36049D386190j051690k333572l499695j295319K440823J440904m992314r002040
36041a3906713m983033J960145L513019K19210l37522M192146P318511L762932
36033A738695k499896l934486Q9156L176809J408684j726445j344762J666153
$$ plain form
36091 1431797 -1799645 -5189982 -6165250 -4153124 -2075816 -2774104 -4569697 -3068556
36083 -3068556 1929054 4572835 536777 -6370131 -9205552 -7542389 -6706884 -7976669
36075 -7976669 -6213210 834044 7330657 7603766 4469026 3986262 5719968 4490952
36067 4490952 -340566 -3892851 -3569282 -1870803 -923807 344633 2301589 2740312 817533
36058 817533 -1097820 -1365987 -1316643 -1791785 -1024237 1892412 4660166 5189790 4386190
36049 4386190 3334500 1000928 -2498767 -3794086 -1353263 87641 -4904673 -13906713
36041 -13906713 -18889746 -16929601 -13416582 -13197372 -13534894 -9342748 -2024237 1738695
36033 1738695 -761201 -4695687 -4606531 -1429722 -21038 -1747483 -3092245 -1426092
36025a426092K721482O47604j253812p46144O27804R94889P84020N88853m42291
36016B496313k327393l202738k482892k226260l102477k089881K568897O742640
36008c623791M902364k055144p391311o472343q99203M815099P446925O061803
36000B784399J979819j594069k013348K20630K419819K701607Q69967k315009
35992E053815m989195m809492j809461Q56225J040996M95866J273938J847137
35984a040171K36539j445055j1095K932446K985100p3900k148825j351179M8951
35975A32811L01110K35621J39062j094092k781053k297170P95999L683348M170291
35966C285927K825703R64710p09994j430973r62003m30034k11071J366889M212963
$$ plain form
36025 -1426092 1295390 1942994 689182 -56962 570842 1565731 2349751 2938604 2496313
36016 2496313 168920 -3033818 -5516710 -7742970 -10845447 -12935328 -10366431 -3623791
36008 -3623791 1278573 -776571 -8167882 -14640225 -15539428 -10724329 -3277404 2784399
36000 2784399 4764218 3170149 1156801 1377431 3797250 6498857 7368824 5053815
35992 5053815 64620 -4744872 -6554333 -5698108 -4657112 -4161246 -2887308 -1040171
35984 -1040171 -803632 -2248687 -2259782 672664 3657764 3583864 1435039 83860 132811
35975 132811 433921 669542 808604 -285488 -3066541 -5363711 -4567712 -884364 3285927
35966 3285927 6111630 7076340 6366346 4935373 3973370 3543336 3332265 4699154 8912117
35957H912117M105936j277822o735815n915347j024436Q30326q84252o79324J795720
35948h72897P81404m253612o022183j194375M020129L950126J174195j7712l08393
35939b743318j000629k15492J864776J030706k910085l504037J662587N380869
35931d34623K185602k402742j438000J888805Q32406k955566l244006J3752K714042
35922b840330M773646P262680O094082j553276q668518o857915q903J517719k469702
35913b750517l143433J231151L216185M87372o69583J815384J837061k475189
35905d51569m032264N75816M281589J438826k758875j591821K325034K795756
35897B582492L46281m81948O99954J312948J305595J655128Q59672j845310l143622
$$ plain form
35957 8912117 13018053 11740231 5004416 -910931 -1935367 -1105041 -1989293 -2668617 -872897
35948 -872897 -91493 -4345105 -10367288 -11561663 -7541534 -3591408 -2417213 -2434925 -2743318
35939 -2743318 -3743947 -3959439 -2094663 -1063957 -3974042 -7478079 -5815492 -434623
35931 -434623 1750979 -651763 -2089763 -200958 631448 -2324118 -5568124 -5554372 -2840330
35922 -2840330 1933316 9195996 15290078 13736802 5068284 -1789631 -1798534 -280815 -2750517
35913 -2750517 -5893950 -4662799 -1446614 -959242 -1628825 186559 2023620 -451569
35905 -451569 -4483833 -3908017 373572 1812398 -946477 -2538298 -213264 2582492
35897 2582492 2928773 2446825 3146779 4459727 5765322 7420450 8280122 6434812 3291190
35888C291190m85333K903669K602582m19168k294334k340115k181501j683202
35880f06212k58231L84539q89449j632808J35111J769342M81214r91338J339767
35871b68065N050047M079320j683237n547446l291574J623404L348222N25940
35863C836611l396257m274407r58194L419100M032830j11962m254746l589386
35855e296411N21007K925496J928405L26772k59193j625014m463557n584665k271823
35846a3798983K888824M502949J067106l198964l568467r4455L390771M312835
35838d498384L379740J831900n21746l098895l042871J039429N393026M873689
35830E355888l3238l610383k496605P35423K182125J160879r46191l034438m050066
$$ plain form
35888 3291190 2805857 5709526 8312108 7892940 5598606 3258491 1076990 -606212
35880 -606212 -864443 -479904 -1369353 -3002161 -2867050 -1097708 -616494 -1607832 -268065
35871 -268065 4781982 8861302 7178065 1630619 -1660955 -37551 3310671 3836611
35863 3836611 440354 -3834053 -4792247 -1373147 2659683 2547721 -1707025 -5296411
35855 -5296411 -4775404 -1849908 78497 405269 146076 -1478938 -5942495 -11527160 -13798983
35846 -13798983 -10910159 -6407210 -5340104 -8539068 -12107535 -12201990 -8811219 -4498384
35838 -4498384 -1118644 713256 191510 -2907385 -5950256 -4910827 482199 5355888
35830 5355888 5322650 1712267 -784338 -48915 2133210 3294089 2347898 -686540 -4736606
35821d736606l271473j917354j775457j820714M02757L835250M734241L005587
35813a543769K435896L425511J731651l077446m724043m0433M709931L076517
35805E993815j518179j789302J724664K603471p21165l811482m125933k935562
35797d579673n53365L318119N250153J279196n518995p499221l036245J824289
35789i515742K880499K183592J823063M08400j895980j463883K301330M245235
35781I66514J046246l240725l195559L82338K904476K773621J750090R08774q3264
35772D212511j068227j522805j537272j094416J13506J182643N14521j268053
35764d67592j570160Q2340J238593Q77771J142188L227190M956981M221441J695175
$$ plain form
35821 -4736606 -8008079 -9925433 -11700890 -13521604 -13118847 -9283597 -4549356 -1543769
35813 -1543769 892127 4317638 6049289 2971843 -1752200 -1792633 2917298 5993815
35805 5993815 4475636 2686334 4410998 7014469 6293304 2481822 -1644111 -4579673
35797 -4579673 -5133038 -1814919 3435234 4714430 -804565 -8303786 -11340031 -9515742
35789 -9515742 -6635243 -4451651 -2628588 -2220188 -4116168 -5580051 -3278721 966514
35781 966514 2012760 -1227965 -4423524 -4041186 -1136710 1636911 3387001 4295775 4212511
35772 4212511 3144284 1621479 84207 -1010209 -896703 285940 800461 -467592
35764 -467592 -2037752 -1955412 -716819 160952 1303140 4530330 9487311 13708752 15403927
35755A5403927j299102m244606n587733l506727J35252J178858j03586P91577
35747B767860L870298L145765k621932n480658m55047N210769K990633l017888
35739F409800l021058K172905L166180j801055m581089j633780P27452j489034
35731d9679k975139Q04147N203500M124389l19305k030739k12205J134349k62146
35722E417172l251622n402320m032416J432243O137739L782385l717255o792783
35714f426857j954058K365993p88709n303778k133699N288876O429309O86096
35706a836827k553764K23064K439371M33411n72602K602362M142043p16453o344498
35697b183893m691164K462254O410483L717470j077813l477616l725067l280555
$$ plain form
35755 15403927 14104825 9860219 4272486 765759 901011 2079869 1976283 2767860
35747 2767860 6638158 9783923 7161991 1681333 1226286 6437055 9427688 6409800
35739 6409800 3388742 5561647 8727827 6926772 2345683 711903 1439355 -49679
35731 -49679 -3024818 -2220671 2982829 7107218 6787913 4757174 4544969 5679318 5417172
35722 5417172 2165550 -3236770 -7269186 -5836943 300796 4083181 365926 -6426857
35714 -6426857 -8380915 -6014922 -6803631 -12107409 -14241108 -8952232 -2522923 -1836827
35706 -1836827 -4390591 -4167527 -1728156 -1294745 -1867347 735015 4877058 4160605 -2183893
35697 -2183893 -6875057 -4412803 1997680 5715150 4637337 1159721 -2565346 -5845901
35689e845901j470164K483101O532116O954396K440509l629594o101633l853776
35681b490946j030547q88169j013306J771153M447222J791896l845101m265468
35673e523266K094961P123173N114338L58872j323126j266893k730657l680994
35665A66408j513352O06432o68970j854665J111618M181038J408144l955173m149708
35656d668228J2501J012172j902372j931714K432459M610430J736524q65646L54600
35647G90726K178764K429758L319840L894171o59351p967631p702666J999442
35639a716947Q321661K336280o523621n206166K782165M921351N91644n02866
35631E003501K693824J043822o856087j0121447k983445N650513N861571Q1815
$$ plain form
35689 -5845901 -7316065 -4832964 1699152 8653548 11094057 7464463 1362830 -2490946
35681 -2490946 -3521493 -4409662 -5422968 -3651815 795407 2587303 -1257798 -5523266
35673 -5523266 -3428305 3694868 8809206 9168078 7844952 6578059 3847402 166408
35665 166408 -1346944 -740512 -1409482 -3264147 -2152529 2028509 3436653 -518520 -4668228
35656 -4668228 -4655727 -3643555 -5545927 -7477641 -5045182 -434752 1301772 436126 790726
35647 790726 2969490 5399248 8719088 12613259 11953908 3986277 -3716389 -1716947
35639 -1716947 6604714 8940994 2417373 -2788793 -6628 4914723 5506367 5003501
35631 5003501 7697325 8741147 1885060 -8236387 -11219832 -5569319 292252 374067
35623C74067l631738l625987k964160j879881Q82147L243442K686712J176430
35615c738968J874530L430736K509729j15198r30799K66000M06324j332110k284181
35606H6063q75362Q76088L20743k327851m194814k714166J478361M517711L323418
35597D90191l51000j978383n46005M17202q95293j372495J298760L666243J496534
35588B225754l087274m402973j449039J806574L325950M380259M007093j214452
35580E591892r458907j1949172l828477P372423J0035649L192404l220905k523704
35572d788797R88525Q33627j283803N91510N743775O902314J479328l876986k903791
35563C685702J237042J406716k315508l222378R03929L938148R25557m009666
$$ plain form
35623 374067 -3257671 -6883658 -9847818 -11727699 -10845552 -7602110 -4915398 -3738968
35615 -3738968 -1864438 1566298 4076027 3960829 3030030 3296030 3702354 2370244 86063
35606 86063 -789299 86789 407532 -1920319 -6115133 -8829299 -7350938 -2833227 490191
35597 490191 139191 -1839192 -2385197 -1967995 -2863288 -4235783 -2937023 729220 2225754
35588 2225754 -861520 -5264493 -6713532 -4906958 -1581008 2799251 6806344 5591892
35580 5591892 -3867015 -15816187 -19644664 -12272241 -2236592 955812 -2265093 -4788797
35572 -4788797 -3800272 -2966645 -4250448 -3658938 2084837 8987151 10466479 6589493 3685702
35563 3685702 4922744 6329460 4013952 791574 1695503 5633651 6559208 2549542
35555B549542l668607J579466M477459J345511l205705l271855N06941K699403
35547C012155N26894l355134m885390k846980J232233N205364P102853N491146
35539A1483141J132583k417882k272668l23903j215442n397179p433135l591718
35531a0036203J898368K226504k229495m670291k047464J355818J909677K116408
35523i476678M496462N421074R43726m672386l502473L781087P445803K103871
35515F540486n723264o914501j758842K243522J695598O31108K676243N107709
35507D498059L231076k216246n471170l197365J243608K286202o45002k724283
35499b995121m96434L395058L876951K65101l119896k869672m44961O37006m24074
$$ plain form
35555 2549542 -1119065 460401 4937860 6283371 3077666 -194189 312752 3012155
35547 3012155 3539049 183915 -4701475 -7548455 -6316222 -1110858 5991995 11483141
35539 11483141 12615724 10197842 7925174 7601271 6385829 988650 -6444485 -10036203
35531 -10036203 -8137835 -5911331 -8140826 -12811117 -14858581 -13502763 -11593086 -9476678
35523 -9476678 -4980216 440858 1384584 -3287802 -6790275 -3009188 4436615 6540486
35515 6540486 817222 -6097279 -7856121 -5612599 -3917001 -3285893 -609650 4498059
35507 4498059 7729135 5512889 41719 -3155646 -1912038 374164 -270838 -2995121
35499 -2995121 -3491555 -96497 3780454 4045555 925659 -1944013 -2388974 -1751968 -2176042
35490b176042j362350l52669J731673K692734J819405P61070J340774K752227
35482G206822K072608j738856n675295o130212l470539r02183M56270K221249
35474e960136M455605M605131K171875P04237K399654L871573J023324m138331
35466I132932o027192l621156j198007r85386k98516K482409M090633J774871
35458E350588j337493o71290K337227K122677k420546o133729n107648j577513
35450g437727N53805J204186K137651K543940O48408j848296j303106K129405
35442a371734M350197L374795J520137N01815j217988l933663m055253J58807
35434f72887L940592K134256k673567l900671j025699P17828j03435M67502K946483
$$ plain form
35490 -2176042 -3538392 -3891061 -2159388 533346 2352751 3113821 4454595 7206822
35482 7206822 9279430 7540574 1865279 -4264933 -7735472 -8637655 -8181385 -5960136
35474 -5960136 -1504531 3100600 5272475 5976712 8376366 12247939 13271263 9132932
35466 9132932 3105740 -515416 -1713423 -2698809 -2997325 -514916 3575717 5350588
35458 5350588 4013095 3341805 5679032 7801709 5381163 -752566 -5860214 -7437727
35450 -7437727 -6883922 -5679736 -3542085 -998145 -349737 -2198033 -3501139 -1371734
35442 -1371734 2978463 6353258 7873395 8375210 7157222 3223559 -831694 -672887
35434 -672887 3267705 5401961 2728394 -1172277 -2197976 -1480148 -1583583 -1116081 1830402
35425A830402K303361k257888l593738K056716P360152M588053k038734l327093
35417F921231J55505M45327l171226l057278K698648N930446J391229n049274
35409F264608n900810k262746P30762K312220M013277M269562J382593j667881
35401I141585j220525Q86800L60576k637216m542468m252974l229075j765340
35393g258637J98152O45591j310245k030145J447393M988384K609599l246589
35385c956497m145360J423042N367002K421828k081318j095699L381899M239414
35377E554311L76384k435590q56070J552197M28103k933653l967934j593196P18227
35368c157221N49672j9522J571443L541685K573732j0773O9002K026292j38253
$$ plain form
35425 1830402 4133763 1875875 -1717863 338853 7699005 12287058 10248324 6921231
35417 6921231 7076736 7522063 4350837 1293559 3992207 9922653 11313882 6264608
35409 6264608 363798 -1898948 -1168186 1144034 5157311 9426873 10809466 9141585
35401 9141585 7921060 8807860 9168436 6531220 1988752 -2264222 -5493297 -7258637
35393 -7258637 -7060485 -6414894 -7725139 -9755284 -8307891 -3319507 -709908 -3956497
35385 -3956497 -8101857 -6678815 -1311813 1110015 -971303 -2067002 1314897 5554311
35377 5554311 5930695 3495105 2639035 4191232 4619335 1685682 -2282252 -3875448 -3157221
35368 -3157221 -2607549 -2627071 -1055628 2486057 5059789 5049016 5118018 7144310 7006057
35359G006057p219066j0673666m179707N838477Q314191K734115j794752p97618
35351g71969J113070J96145r70480k72330k02276j686783j004357K770190M060372
35342C231582N5115k637088K085235Q119399M537608p304226j3670648o928446
35334a2511469M221914P116411J512929k499764K95131M312288L023057j512750
35326C957747k939841p86616n09317l745145m653938J128339Q549985R075470
35318A0076684K185530m327356m857222j692555L29030K13394j6347O70280J227854
35309C809292j3397l478480o765708n884786k82895M943437N172079K741998K728559
35300B970099M086216J502151m396553o366229j707851L321509L331495J161901
$$ plain form
35359 7006057 -213009 -10886675 -15066382 -9227905 -913714 1820401 25649 -771969
35351 -771969 341101 537246 -433234 -705564 -907840 -2594623 -3598980 -828790 3231582
35342 3231582 3286697 649609 2734844 10854243 15391851 8087625 -5583023 -12511469
35334 -12511469 -8289555 -1173144 339785 -2159979 -1864848 2447440 5470497 3957747
35326 3957747 1017906 231290 -278027 -4023172 -8677110 -7548771 1001214 10076684
35318 10076684 12262214 7934858 3077636 1385081 1714111 1927505 1911158 2581438 3809292
35309 3809292 3795895 317415 -6448293 -12333079 -12615974 -7672537 -2500458 241540 2970099
35300 2970099 7056315 8558466 4161913 -2204316 -3912167 -590658 2740837 3902738
35292C902738J347527K586446J873448P16859J444805J738965j113472m135286
35284H362030l004601L92543R67550j263621k195058j374057k178101m689460
35276d982775m730459r10185K700491K623246O45007M96977K636760M194605K794891
35267E468558n80492k309876k24946K917262K032232l409404p823099o494667
35259a0424432j252412K950919M016813K662797k47164k987111k668159P00923
35251g247826K819987J441129N41018L565986O362058L148546l262887m704980
35243B663031j33860K752719p14721n650381n316415q0113M437096M662501J667608
35234D287465j416505k341266j047485P93893J707679J575575O94146p79543j757737
$$ plain form
35292 3902738 5250265 7836711 9710159 10427018 11871823 13610788 12497316 8362030
35284 8362030 5357429 5749972 6717522 5453901 3258843 1884786 -293315 -4982775
35276 -4982775 -9713234 -10623419 -7922928 -5299682 -4654675 -4157698 -1520938 2673667 5468558
35267 5468558 4888066 2578190 2353244 5270506 7302738 3893334 -3929765 -10424432
35259 -10424432 -11676844 -8725925 -4709112 -2046315 -2293479 -5280590 -7948749 -7247826
35251 -7247826 -4427839 -2986710 -2445692 1120294 7482352 10630898 7368011 2663031
35243 2663031 2529171 5281890 4567169 -1083212 -6399627 -6479740 -2042644 2619857 4287465
35234 4287465 2870960 529694 -517791 276102 1983781 3559356 4253502 3473959 1716222
35225A716222q48154R19939Q71278o27565j61612K316358K173185j815647m015556
35216E28448j279005N10017l962025q936422n473167M087651R187527O327094
35208I90118J656333m50097j584252k229644k91751K294248O90779l638897l731973
35199f295136J228778M155716K092759N86511K867170M066934O46651l103270
35191F246113l096193k050788k733202k255736J074364K613349m61398k850125
35183c513616o4158L022360O03139l196909j308574L205367J763627m521776n483492
35174i494032J758292P515974L924390l694794n125277N33341N025583K955286
35166C398763k093681l936934j875180K95300Q33101J355354J855023m24906m862522
$$ plain form
35225 1716222 868068 1788007 2659285 2031720 1870108 4186466 6359651 4544004 528448
35216 528448 -750557 -240540 -4202565 -13138987 -18612154 -14524503 -5336976 990118
35208 990118 2646451 2196354 612102 -1617542 -1909293 384955 1075734 -2563163 -6295136
35199 -6295136 -5066358 -910642 1182117 1768628 4635798 8702732 9349383 6246113
35191 6246113 3149920 1099132 -1634070 -3889806 -2815442 -202093 -663491 -3513616
35183 -3513616 -3577774 -555414 47725 -3149184 -4457758 -1252391 511236 -4010540 -9494032
35174 -9494032 -7735740 -219766 3704624 9830 -5115447 -4582106 443477 3398763
35166 3398763 1305082 -2631852 -4507032 -4211732 -3378631 -2023277 -168254 -593160 -5455682
35157e455682n426564N21673N985514L657968k184605j918602L535885L906706
35149B622293l056192p325806l040301K495080K141706L59962L080601N687712
35141B965055J506615m898469m372371J557899L525778k23565k395832J70162
35133b164728K412298J064923m70720N84089J793038P85689q04258j022419n45490
35124A632422k61684K38152Q67339J115571J733661K876992J870449k683530o212742
35115A176630l380009L050281N129880J391978j452684M44297K502595r0853m796619
35106C975496o165981l427391L9622J600148P57969j667387l396153k143365J070514
35097i356528K635677J565310P26398J503785J221141j714007l978824k164109
$$ plain form
35157 -5455682 -10882246 -10360573 -4375059 -717091 -2901696 -4820298 -1284413 2622293
35149 2622293 -433899 -7759705 -10800006 -8304926 -6163220 -5803258 -2722657 2965055
35141 2965055 4471670 -426799 -4799170 -3241271 284507 60942 -2334890 -2164728
35133 -2164728 247570 1312493 841773 1425862 3218900 4004589 3200331 2177912 1632422
35124 1632422 1370738 1608890 2476229 3591800 5325461 8202453 10072902 7389372 1176630
35115 1176630 -2203379 846902 5976782 7368760 5916076 6360373 8862968 8772115 3975496
35106 3975496 -2190485 -5617876 -5578254 -3978106 -3220137 -4887524 -8283677 -10427042 -9356528
35097 -9356528 -6720851 -5155541 -4429143 -2925358 -1704217 -3418224 -7397048 -9561157
35089i561157J545084K556717P45747j38100J062977J517548j46136j166986O80222
35080b904084K869556J579079k257794l820249j250050J746783J417620r14662
35072c533801j654552m42886N23766J038034K532842L800554J800109k582559
35064A481507m195349p23461L895483N106320K959977l24549l812177o080629
35056a692878m226540J509261N517705L386640j933430m450949l093231j213786
35048f197208m24345M88407J804993K288355J826299J453684J358458J185241
35040C783884J046718L67370k063821m938473m451064m2965L413093K317899n18128
35031a085487j032760j09449l10871n66716Q84146K164336J579434J637949L723283
$$ plain form
35089 -9561157 -8016073 -5459356 -4713609 -4851709 -3788732 -2271184 -2417320 -3584306 -2904084
35080 -2904084 -34528 1544551 -713243 -4533492 -5783542 -4036759 -2619139 -3533801
35072 -3533801 -5188353 -5631239 -5107473 -4069439 -1536597 2263957 4064066 1481507
35064 1481507 -2713842 -3437303 458180 5564500 8524477 8199928 4387751 -1692878
35056 -1692878 -5919418 -4410157 1107548 4494188 2560758 -1890191 -4983422 -6197208
35048 -6197208 -6621553 -6133146 -4328153 -2039798 -213499 1240185 2598643 3783884
35040 3783884 4830602 5197972 3134151 -1804322 -6255386 -6298351 -2885258 -567359 -1085487
35031 -1085487 -2118247 -2227696 -2538567 -3105283 -2221137 -56801 1522633 3160582 6883865
35022F883865L570970j289003m788640j325130L435689Q62710n527885n088390
35014c265814K109680N450195J679433q95125J701460K512489k389776n882284
35006A020258k456696J997795R41031j803812n08992J362543j611921n277815
34998f337609k435000L797917M348987o85780k503799J252495K816113j935008
34990a681684n818843j566742O300405P505667M62747n858623m124022K593961
34982b187134O035475L174676j798282m186220l414629q15193K777397N150910
34974D737000K707785l787284o973370j739039O123742O482413j083789o871936
34966d04478m919366K38492K530041K529509K844724J900464k122922n640866
$$ plain form
35022 6883865 10454835 9165832 4377192 3052062 6487751 7350461 1822576 -3265814
35014 -3265814 -1156134 4294061 5973494 5078369 6779829 9292318 6902542 1020258
35006 1020258 -1436438 561357 1502388 -301424 -810416 552127 -1059794 -6337609
34998 -6337609 -8772609 -4974692 -625705 -1311485 -3815284 -2562789 253324 -1681684
34990 -1681684 -7500527 -9067269 -2766864 4738803 5201550 -657073 -4781095 -2187134
34982 -2187134 3848341 7023017 5224735 1038515 -2376114 -3191307 -413910 4737000
34974 4737000 7444785 3657501 -3315869 -5054908 1068834 7551247 6467458 -404478
34966 -404478 -5323844 -5085352 -2555311 -25802 2818922 4719386 2596464 -3044402
34958c044402l908050J469599M371200K324284j222365k176195j51382K385207
34950D7896L222347K409519J695430J734890Q11468k008021m048272k624925m7528
34941A192804m92043k840142k267827J272269K700009O17766p33396j941j323336
34932a875837n280458n489647P84155O227476M167630r29238j059479K855302
34924f00096M376448K877462K395941K269747j481123o722500o637669j055662
34916d577452K359202N311k397921O05931N993122P528950M329849J11005k647549
34907A1310448l924624l776245k244687p72726j156530l070567l935997j581402
34899i152330L046033O004960M208965m29154k468388J80840L049310J195274
$$ plain form
34958 -3044402 -6952452 -5482853 -1111653 1212631 -9734 -2185929 -2337311 47896
34950 47896 3270243 5679762 7375192 9110082 9921550 7913529 3865257 1240332 1192804
34941 1192804 700761 -2139381 -4407208 -3134939 -434930 182836 -550560 -552501 -1875837
34932 -1875837 -7156295 -12645942 -11861787 -5634311 -1466681 -2395919 -3455398 -600096
34924 -600096 3776352 6653814 9049755 11319502 9838379 3115879 -3521790 -4577452
34916 -4577452 -2218250 -2212939 -4610860 -4004929 1988193 9517143 13846992 13957997 11310448
34907 11310448 7385824 3609579 1364892 592166 -564364 -3634931 -7570928 -9152330
34899 -9152330 -6106297 -101337 4107628 3678474 1210086 1390926 4440236 5635510
34891E635510l549780n096422j888258J147989J20826k301452j158413L464464
34883c625536O388044M192082m70946k645691j647772j295332l350812m115785
34875f571748l43899M145735K772522l550689o360630j439775M913769M828701
34867a606014m71327l566476j349940K422755L590314J851964j127634l855022
34859d111380m646876k131462K682659O319375N737817J160927l852709n325197
34851d166846k579163J339451L670387M641825M396023M80419o963604j0479240
34843i660748l325918Q587827J1753367L447865m438335l264065Q68606m52224
34835C516375l851540j688467L862671M971548J503854m47949j39395j827886
$$ plain form
34891 5635510 2085730 -3010692 -4898950 -3750961 -3630135 -5931587 -7090000 -3625536
34883 -3625536 2762508 6954590 6483644 3837953 2190181 894849 -2455963 -6571748
34875 -6571748 -6915647 -2769912 2610 -3548079 -9908709 -11348484 -6434715 -1606014
34867 -1606014 -2077341 -5643817 -6993757 -4571002 -980688 871276 -256358 -4111380
34859 -4111380 -8758256 -10889718 -8207059 -1887684 3850133 5011060 1158351 -4166846
34851 -4166846 -6746009 -5406558 -1736171 2905654 7301677 7782096 818492 -9660748
34843 -9660748 -12986666 -4398839 7354528 10802393 6364058 3099993 3968599 3516375
34835 3516375 -335165 -2023632 1839039 6810587 8314441 7866492 7727097 5899211
34827E899211m855328m268144m91487J133437N1862N57727K469432J208646k534357
34818h29001k892292M08654J126788j900177k209747K355288N009906J498240
34810B567659k901802k865169j168442j723428k125713N68525L352917L038168
34802a257285K448528M282370M611230k38028n484072m524790K96895J741489
34794A876337o48622j415071K62180l31425m008927n530144k237369J878274K675093
34785g479674J037306l20748o64294n2252J766169L582893L090652L46263j872154
34776e65839j879649n20328J305784L230465L508436N75339k920710k134189K533290
34767C132599M603698N69261m505183l941013J326732M667614K864515q93241
$$ plain form
34827 5899211 1043883 -3224261 -3715748 -2582311 -2530449 -1972722 496710 1705356 -829001
34818 -829001 -3721293 -3312639 -2185851 -4086028 -6295775 -3940487 1069419 2567659
34810 2567659 -334143 -3199312 -4367754 -6091182 -8216895 -7648370 -4295453 -1257285
34802 -1257285 1191243 5473613 10084843 9846815 4362743 -162047 134848 1876337
34794 1876337 1227715 -187356 74824 -256601 -4265528 -9795672 -12033041 -10154767 -7479674
34785 -7479674 -6442368 -6763116 -7427410 -7479662 -5713493 -2130600 960052 1306315 -565839
34776 -565839 -2445488 -2965816 -1660032 1570433 5078869 5654208 2733498 599309 3132599
34767 3132599 7736297 8305558 3800375 -140638 1186094 5853708 8718223 7824982
34759G824982k306657o43862J857601K625467P51719j873751k068032M27683J825765
34750H420915k89914k555984o13086L397218L320601j355996m337916k449236
34742C536602n62904l131531o274146l820445K371783M680391J011764k456775
34734d645261n13868M253891N829069K550823j670932k361415N36010K336013
34726F314330j031539o831264p363426j80833P004372N906474r15306m196462
34718a293654j402546J364051L47903j106276j26784J226284J631052L149945
34710C789975M957502K082336n106014p746914r52532P232936O637329o97952
34702A0196666m963378l095570k29973N68579J171677J961432O65562k043814
$$ plain form
34759 7824982 5518325 4874463 6732064 9357531 10109250 8235499 6167467 6595150 8420915
34750 8420915 8131001 5575017 4961931 8359149 11679750 10323754 5985838 3536602
34742 3536602 2973698 -157833 -6431979 -10252424 -7880641 -3200250 -2188486 -4645261
34734 -4645261 -5159129 -905238 4923831 7474654 5803722 3442307 3978317 6314330
34726 6314330 5282791 -1548473 -8911899 -9092732 -2088360 3818114 2902808 -1293654
34718 -1293654 -2696200 -1332149 -984246 -2090522 -2217306 -991022 640030 3789975
34710 3789975 8747477 10829813 5723799 -2023115 -2975647 4257289 10894618 10196666
34702 10196666 5233288 2137718 1907745 2476324 3648001 5609433 6274995 4231181
34694D231181k553460n31979N48588n46854j456952r96908l87265J29736J215311
34685c48602J562753j26261j327298Q94900L870735K661234j575949l102794r76751
34676A531967R5506j590155k530801j330655q25685j351245N84801M476051M248818
34667C308602j737109o052696k482806M688076P084495L607713j38062p63303
34659G514910k9677l09632j549830k538718k462006j275675J94247J029639J302325
34650A875583J288177L91387j067769m84633L127276N399011J663929n124279
34642G068682p299406l196208J304194K306433J879860J232127k105288p185603
34634e995209p592468j252559M580119L798509O89141K060488N546137L893502
$$ plain form
34694 4231181 1677721 1145742 1694330 1147476 -309476 -1306384 -1693649 -1563913 -348602
34685 -348602 1214151 1087890 -239408 655492 4526227 7187461 5611512 2508718 1531967
34676 1531967 1627473 37318 -2493483 -3824138 -4649823 -6001068 -5416267 -940216 3308602
34667 3308602 1571493 -4481203 -6964009 -2275933 4808562 8416275 8278213 7514910
34659 7514910 7485233 7175601 5625771 3087053 625047 -650628 -456381 573258 1875583
34650 1875583 3163760 3555147 2487378 2002745 5130021 10529032 12192961 7068682
34642 7068682 -230724 -3426932 -2122738 183695 2063555 3295682 1190394 -5995209
34634 -5995209 -13587677 -14840236 -10260117 -6461608 -5772467 -3711979 1834158 5727660
34626E727660k430594n572528k416658J395332P11132k096165j833278J922702
34618d592397M908394L948120K96429k476446k543356r98170N88970K045644L114822
34609D292010K314873l96599j919058k36622J691508L25965k395161k535068j316556
34600a74708k172724k867921Q41481M935663J151526p880118r353313L41744Q860018
$$ plain form
34626 5727660 3297066 -2275462 -4692120 -3296788 -2585656 -4681821 -6515099 -4592397
34618 -4592397 315997 4264117 4560546 2084100 -459256 -1457426 -868456 1177188 4292010
34609 4292010 6606883 6210284 4291226 4054604 5746112 6072077 3676916 1141848 -174708
34600 -174708 -2347432 -5215353 -4373872 561791 1713317 -6166801 -15520114 -15178370 -6318352
$$ [...]
##END NTUPLES=NMR SPECTRUM
##END=
