##TITLE=31Pdec_AN-AD-106
 CDCl3, 24 sc
 13.05.2021
##JCAMPDX= 6.0         $$ Bruker NMR JCAMP-DX V2.0
##DATA TYPE= NMR SPECTRUM
##DATA CLASS= NTUPLES
##ORIGIN= UXNMR, Bruker Analytische Messtechnik GmbH
##OWNER= root
$$ XWIN-NMR		Version 3.5
$$ Thu May 13 13:36:46 2021 Russian Standard Time (UT+4h)  she@DPX200
##.OBSERVE FREQUENCY= 81.013821
##.OBSERVE NUCLEUS= ^31P
##.ACQUISITION MODE= SIMULTANEOUS
##.ACQUISITION SCHEME= undefined
##.AVERAGES= 24
##.DIGITISER RES= 16
##SPECTROMETER/DATA SYSTEM= spect
##.PULSE SEQUENCE= zgpg30
##.SOLVENT NAME= CDCl3
##.SHIFT REFERENCE= (INTERNAL, CDCl3, 0, 248.564)
##AUDIT TRAIL= $$ (NUMBER, WHEN, WHO, WHERE, WHAT)
$$ ##TITLE= Audit trail, XWIN-NMR		Version 3.5
$$ ##JCAMPDX= 5.01
$$ ##ORIGIN= Bruker BioSpin GmbH
$$ ##OWNER= she
$$ F:/spectra/data/she/nmr/P31/1/pdata/1/auditp.txt
$$ ##AUDIT TRAIL=  $$ (NUMBER, WHEN, WHO, WHERE, WHAT)
(   1,<2021-05-13 13:35:22.37 +0400>,<she>,<DPX200>,
      <created by zg, POWCHK disabled, PULCHK disabled
       configuration hash MD5:
       00 E9 B6 7A A2 85 ED C7 34 08 36 98 17 FE 4E 26
       data hash MD5: 32K
       FF DF 33 99 F0 FF 8B 3E 7F 9E 01 56 56 3D ED FA>)
(   2,<2021-05-13 13:35:24.78 +0400>,<she>,<DPX200>,
      <Start of raw data processing
       efp BC_mod = 2 LB = 1 FT_mod = 6 PKNL = 1 PHC0 = -6264.081 PHC1 = 194.6004 SI = 64K 
       data hash MD5: 64K
       3A 54 2C DA 87 77 FC AF 7E 7B DD 7E 37 D6 E0 3A>)
(   3,<2021-05-13 13:36:08.79 +0400>,<she>,<DPX200>,
      <abs ABSG = 5 
       data hash MD5: 64K
       A5 04 AE CE 89 CB 49 F5 81 C5 9C 0F DB D8 0A 9C>)
(   4,<2021-05-13 13:36:24.60 +0400>,<she>,<DPX200>,
      <pk PHC0 = -586.7599 PHC1 = 531.2001 
       data hash MD5: 64K
       29 77 F4 54 ED DD B2 94 B8 34 E1 A4 B8 79 2E E6>)
$$ ##END=
$$ 
$$ hash MD5
$$ 0F E3 EB 22 D6 D1 66 70 03 88 13 2A 6E C3 0B 5E
##$RELAX= 
##$RELAX= 
##$RELAX= 
##$RELAX= 
##$RELAX= 
##$RELAX= 
##$RELAX= 
##$RELAX= 
$$ Bruker specific parameters
$$ --------------------------
##$DU= <F:/spectra>
##$EXPNO= 1
##$NAME= <P31>
##$PROCNO= 1
##$TYPE= <nmr>
##$USER= <she>
##$AMP= (0..31)
100 100 100 100 100 100 100 100 100 100 100 100 100 100 100 100 100 100 
100 100 100 100 100 100 100 100 100 100 100 100 100 100 
##$AQSEQ= 0
##$AQ_mod= 1
##$AUNM= <au_zg>
##$AUTOPOS= <>
##$BF1= 81.014009
##$BF2= 200.13
##$BF3= 200.13
##$BF4= 200.13
##$BF5= 200.13
##$BF6= 200.13
##$BF7= 200.13
##$BF8= 200.13
##$BYTORDA= 1
##$CFDGTYP= 0
##$CFRGTYP= 5
##$CHEMSTR= <none>
##$CNST= (0..31)
1 1 145 1 1 1 1 1 1 1 1 1 1 1 1 1 1 1 1 1 1 1 1 1 1 1 1 1 1 1 1 1 
##$CPDPRG= <waltz16>
##$CPDPRG1= <>
##$CPDPRG2= <waltz16>
##$CPDPRG3= <>
##$CPDPRG4= <mlev>
##$CPDPRG5= <mlev>
##$CPDPRG6= <mlev>
##$CPDPRG7= <mlev>
##$CPDPRG8= <mlev>
##$CPDPRGB= <>
##$CPDPRGT= <>
##$D= (0..31)
0 1 0 0 0 0 0 0 0 0 0 0.03 2e-05 3e-06 0 0 0 0 0 0 0 0 0 0 0 0 0 0 0 0 
0 0 
##$DATE= 1620898521
##$DBL= (0..7)
120 120 120 11 120 120 24 19 
##$DBP= (0..7)
150 150 150 150 150 150 150 150 
##$DBP07= 0
##$DBPNAM0= <>
##$DBPNAM1= <>
$$ [...]
##$SUBNAM3= <"">
##$SUBNAM4= <"">
##$SUBNAM5= <"">
##$SUBNAM6= <"">
##$SUBNAM7= <"">
##$SUBNAM8= <"">
##$SUBNAM9= <"">
##$SW= 501.771253377433
##$SWIBOX= (0..15)
0 1 3 0 0 0 0 0 0 0 0 0 0 0 0 0 
##$SW_h= 40650.406504065
##$TD= 32768
##$TD0= 1
##$TE= 0
##$TE2= 300
##$TE3= 300
##$TEG= 300
##$TL= (0..7)
0 120 53 12 22 120 120 120 
##$TP= (0..7)
150 150 150 150 150 150 150 150 
##$TP07= 0
##$TPNAME0= <>
##$TPNAME1= <>
##$TPNAME2= <>
##$TPNAME3= <>
##$TPNAME4= <>
##$TPNAME5= <>
##$TPNAME6= <>
##$TPNAME7= <>
##$TPOAL= (0..7)
0.5 0.5 0.5 0.5 0.5 0.5 0.5 0.5 
##$TPOFFS= (0..7)
0 0 0 0 0 0 0 0 
##$TUNHIN= 0
##$TUNHOUT= 0
##$TUNXOUT= 0
##$USERA1= <user>
##$USERA2= <user>
##$USERA3= <user>
##$USERA4= <user>
##$USERA5= <user>
##$V9= 5
##$VALIST= <valist>
##$VCLIST= <CCCCCCCCCCCCCCC>
##$VD= 0
##$VDLIST= <DDDDDDDDDDDDDDD>
##$VPLIST= <PPPPPPPPPPPPPPP>
##$VTLIST= <TTTTTTTTTTTTTTT>
##$WBST= 1024
##$WBSW= 4
##$XGAIN= (0..3)
0 0 0 0 
##$XL= 0
##$YL= 0
##$YMAX_a= 4275
##$YMIN_a= -8683
##$ZGOPTNS= <>
##$ZL1= 120
##$ZL2= 120
##$ZL3= 120
##$ZL4= 120
##$ABSF1= 248.5645
##$ABSF2= -253.2056
##$ABSG= 5
##$ABSL= 3
##$ALPHA= 0
##$AQORDER= 0
##$ASSFAC= 0
##$ASSFACI= 0
##$ASSFACX= 0
##$ASSWID= 0
##$AUNMP= <proc_1d>
##$AZFE= 0.1
##$AZFW= 0.5
##$BCFW= 0
##$BC_mod= 2
##$BYTORDP= 0
##$COROFFS= 0
##$CY= -3
##$DATMOD= 1
##$DC= 0
##$DFILT= <>
##$DTYPP= 0
##$F1P= 0
##$F2P= 0
##$FCOR= 1
##$FTSIZE= 65536
##$FT_mod= 6
##$GAMMA= 0
##$GB= 0
##$INTBC= 1
##$INTSCL= 5.30512e-09
##$ISEN= 30
##$LB= 1
##$LEV0= 0
##$LPBIN= 0
##$MAXI= 10000
##$MC2= 0
##$MEAN= 0
##$ME_mod= 0
##$MI= 50
##$NCOEF= 0
##$NC_proc= -7
##$NLEV= 6
##$NOISF1= 182.463
##$NOISF2= 159.3651
##$NSP= 0
##$NTH_PI= 0
##$NZP= 0
##$OFFSET= 248.5645
##$PC= 4
##$PHC0= -6850.841
##$PHC1= 725.8005
##$PH_mod= 1
##$PKNL= yes
##$PPARMOD= 0
##$PSCAL= 0
##$PSIGN= 0
##$REVERSE= no
##$SF= 81.014009
##$SI= 65536
##$SIGF1= 159.3651
##$SIGF2= -187.1042
##$SINO= 113.3802
##$SIOLD= 16384
##$SREGLST= <1H.CDCl3>
##$SSB= 0
##$STSI= 65536
##$STSR= 0
##$SW_p= 40650.406504065
##$SYMM= 0
##$S_DEV= 0
##$TDeff= 32768
##$TDoff= 0
##$TI= <>
##$TILT= no
##$TM1= 0
##$TM2= 0
##$TOPLEV= 0
##$USERP1= <user>
##$USERP2= <user>
##$USERP3= <user>
##$USERP4= <user>
##$USERP5= <user>
##$WDW= 1
##$XDIM= 65536
##$YMAX_p= 441166963
##$YMIN_p= -48342367
$$ End of Bruker specific parameters
$$ ---------------------------------
##NTUPLES= NMR SPECTRUM
##VAR_NAME=  FREQUENCY,     SPECTRUM/REAL,   SPECTRUM/IMAG
##SYMBOL=    X,             R,               I
##VAR_TYPE=  INDEPENDENT,   DEPENDENT,       DEPENDENT
##VAR_FORM=  AFFN,          ASDF,            ASDF
##VAR_DIM=   65536,         65536,           65536
##UNITS=     HZ,            ARBITRARY UNITS, ARBITRARY UNITS
##FACTOR=    0.620285442955139, 1,           1
##FIRST=     20137.2065510759, 0,            0
##LAST=      -20513.1999529892, 0,           0
##MIN=       -20513.1999529892, -48342367,   0
##MAX=       20137.2065510759, 441166963,    0
$$ Real data points
##PAGE= N=1
##DATA TABLE= (X++(R..R)), XYDATA
$$ [...]
##PAGE= N=2
##DATA TABLE= (X++(I..I)), XYDATA
13011E424368o762345o305551m126651r33456K985350O181968N580060J50161
13003B193904n667191n999855j305364K055418R62783l22126K744763P949331
12995B611663R393315M757462k928309q426911p803016j706827L772103K971478
12987B640958j881007l429895n0940K081822l00677j915613J795057O333729N106470
12978A0379904l99103m012755m488140m775699m693241j658118K758213L867358
12970c021581J118074j348438j098115N92822K459897M088727L877902J167321
12962G836609n71148J914027N018891K233199n310837q926247m405622K262657
12954E1529L737307N05115k147612k069219j072571l69507Q28934K704849L521994
$$ y = [5424368, -1337977, -7643528, -11770179, -12703635, -9718285, -3536317, 2043743, 2193904, -3473287, -9473142, -10778506, -8723088, -7760305, -8082431, -5337668, 2611663, 12004978, 16762440, 13834131, 5407220, -2395796, -4102623, -330520, 2640958, 759951, -2669944, -2720884, -639062, -939739, -2855352, -1060295, 5273434, 10379904, 9980801, 5968046, 1479906, -3295793, -7989034, -9647152, -6888939, -3021581, -1903507, -3251945, -4350060, -3757238, -1297341, 2791386, 6669288, 7836609, 7265461, 9179488, 14198379, 16431578, 11120741, 2194494, -2211128, 51529, 3788836, 4293951, 2146339, 77120, -995451, -1364958, -536024, 2168825, 5690819]
12945E690819J631380j887427l368691n17825L778783M093075K9003k300660R57112
12936H105569N033001L502364j770251l826239j546872k16372j903655k846501
12928D531044j176239M6429p30405r23648J01071r00659l911574l346401K961286
12919c349096Q517364O863629N17403l796158m363080l724878k777870j268617
12911c381303r81912k907079l809830p62238L446146M444523L052665K464703
12903A565675J537503k557769o962920n720740N92105M669657K678528j338896
12895e536857k424757o03678J762760L641933M318493K564953j248806m858713
12887b384672o624832n900279j731646N008725R286585O895296J397439K13399
$$ y = [5690819, 7322199, 5434772, 2066081, 1548256, 5327039, 9420114, 9449117, 7148457, 8105569, 13138570, 16640934, 14870683, 11044444, 9497572, 9281200, 7377545, 4531044, 3354805, 3401234, 2670829, 1747181, 1848252, 947593, -2963981, -6310382, -3349096, 5168268, 12031897, 12549300, 8753142, 4390062, 665184, -2112686, -3381303, -4363215, -7270294, -11080124, -11842362, -8396216, -3951693, -899028, 1565675, 3103178, 545409, -6417511, -12138251, -11546146, -6876489, -4197961, -5536857, -7961614, -8565292, -6802532, -3160599, 1157894, 3722847, 2474041, -2384672, -9009504, -14909783, -16641429, -11632704, -2346119, 4549177, 5946616, 6160015]
12879F160015L596228M254058p61789n259290m072823q33156p84377k023468j8759
12870B56639L711751M082096P84923j990822k413874k108301j752901p28013k29611
12861c88113j918048m042931l394531p17607J41493j624135k639122o61200K624808
12852a2619386M652756M701776L124396O24664j198705q66733J002049K261571
12844A682388J590223p79039l539814m495848k329005N84319J75476k862904k962684
12835a2936888J288174L647928M94831j687693L334488R304757N987059l548510
12827E884146o443468k49421L476345j723072p306040m551604J885188L073981
12819e953945k38505j485328K70415J316012J175456J677972J568264j043718
$$ y = [6160015, 9756243, 14010301, 13248512, 7989222, 3916399, 3083243, 2298866, 275398, 256639, 3968390, 8050486, 8835409, 6844587, 4430713, 2322412, 569511, -158502, -388113, -2306161, -6349092, -9743623, -10461230, -10319737, -11943872, -14582994, -15244194, -12619386, -7966630, -3264854, -140458, 484206, -714499, -1581232, -579183, 1682388, 3272611, 2493572, -1046242, -5542090, -7871095, -7286776, -7111300, -9974204, -12936888, -11648714, -8000786, -7505955, -9193648, -5859160, 3445597, 9432656, 5884146, -559322, -808743, 2667602, 944530, -6361510, -10913114, -9027926, -5953945, -6192450, -7677778, -7407363, -6091351, -4915895, -3237923, -1669659, -2713377]
12811b713377l773929l479412j588954n50925J185079M888167O499124K495261
12803B961034k966181l686255p90366N30277J72550J479768L563599L148847J411294
12794E824567J193226M03849l484088n848454j621906L649365J018601n710446
12786d575286m359482N143014R183609K262715m192282q23750N217008L558284
12778A1413830k754230m378571j177600L64781m23008P95489L515286L041545
12770A0397522n96587k495087r15888J081354J452741J133234P50501j55951j340562
12761I311277k570824m539632o370303n053927l64440L260516L144023K407826
12753g75484L568399L109183k053714p390591o747299j828718J245377J618208
$$ y = [-2713377, -6487306, -9966718, -11555672, -12106597, -10921518, -6033351, 465773, 2961034, -5147, -3691402, -4481768, -3951491, -3778941, -2299173, 1264426, 4413273, 5824567, 7017793, 7421642, 3937554, -1910900, -3532806, 116559, 1135160, -4575286, -8934768, -3791754, 5391855, 7654570, 3462288, 2638538, 7855546, 11413830, 8659600, 4281029, 3103429, 3468210, 3045202, 3840691, 7355977, 10397522, 9800935, 7305848, 6389960, 7471314, 8924055, 10057289, 10807790, 10651839, 9311277, 6740453, 2200821, -4169482, -9223409, -9587849, -6327333, -3183310, -775484, 2792915, 5902098, 3848384, -3542207, -10289506, -12118224, -10872847, -9254639]
12745i254639K575230L614479J764531j009369o2674L161905K880809q48776k164742
12736F56754q274J97359k861246l155676J857965N513137K209061l399513l715346
12727b705779L75320K232458M57376L1780L186413N507145K809922k437358m418856
12718E038421j674258J495932J286471o20983j85773K508661L257342L12785k853110
12709H565488l026284j870912k235938k953181j074373K782206N050230L824103
12701I061339j1526m327388n852321j907924M523145N476057j375805p115505
12693a529928l298422M762411N329508j730029n072575j10148M499909J953997
12685D804723j968329K75890M983113L467531l802845p874690m136374K504965
$$ y = [-9254639, -6679409, -3064930, -1300399, -2309768, -2372442, 789463, 3670272, 2821496, 656754, 648480, 845839, -2015407, -5171083, -3313118, 2200019, 4409080, 1009567, -2705779, -2330459, -98001, 359375, 391155, 3577568, 9084713, 11894635, 9457277, 5038421, 3364163, 4860095, 6146566, 5525583, 5339810, 7848471, 11105813, 11418598, 8565488, 5539204, 3668292, 1432354, -1520827, -2595200, 187006, 5237236, 9061339, 9049813, 4722425, -1129896, -3037820, 1485325, 6961382, 5585577, -1529928, -4828350, -65939, 5263569, 3533540, -1539035, -1649183, 2850726, 4804723, 2836394, 3112284, 8095397, 11562928, 7760083, -114607, -4250981, -1746016]
12677a746016N127511K456035j624633l068519j329231Q32154J057357L28775
12669B033433N89336O27169j986749n293478m277765J174934M764755K326060
12661d2305k716065m849990l084191M33456L951347N493262L168793q70917j318032
12652A65358K292905L552137r29071n146227k767625K451591K452884k430320
12644c58368m565472j281561J969011J165354p48654J0795K071221K089508J60261
12635E12095j037431l74093Q91411J360634R15080K08273l91638j112533j905571
12626i33773j686557L55689K725953K726128J38167k105769j718623L80089K030382
12617A911686K281593J199716m95287j080793K93970J235486r74043m013237k747679
$$ y = [-1746016, 3381495, 5837530, 4212897, 1144378, -184853, 647301, 1704658, 2033433, 2622769, 3249938, 1263189, -4030289, -8308054, -7133120, -2368365, -42305, -2758370, -7608360, -10692551, -10259095, -6307748, -814486, 2354307, 1483390, 165358, 2458263, 6010400, 5081329, -64898, -2832523, -380932, 2071952, -358368, -4923840, -6205401, -4236390, -3071036, -3819690, -3808895, -1737674, 351834, 512095, -525336, -899429, -8018, 1352616, 2267696, 2475969, 2084331, 971798, -933773, -2620330, -2264641, 461312, 3187440, 3325607, 1219838, -498785, -118696, 1911686, 4193279, 5392995, 4897708, 3816915, 4110885, 5346371, 4372328, 359091, -2388588]
12608b388588K411369N018740K361731n01609L33903J188967j825798n100218
12600A498497l651662p6545r5846k806077l007007o22205J26681o30042J266324
12591g997882N243687N466168L70630m077239k928594J239722K764079k4524m059784
12582d003737n128768j354255M574454O884148K926012l053438n038967k427592
12574f622143J047235L078205L379174J245051k450256l362085O56514M584724
12566A556419L038231r41341j177256P30404j046219m475554k225980M160241
12558c81055M893234j402795m273771J021506N006774N0840o364211m048060L188664
12549b308874M478869n10221k725583N90406K679307m37681m006727k750854J852835
$$ y = [-2388588, 22781, 5041521, 7403252, 6901643, 7235546, 8424513, 6598715, 1498497, -2153165, -2229710, -2325556, -5131633, -8138640, -8760845, -8634164, -9264206, -7997882, -2754195, 2711973, 3082603, -994636, -3923230, -2683508, 80571, 56047, -4003737, -9132505, -10486760, -5912306, 971842, 3897854, 844416, -4194551, -6622143, -5574908, -2496703, 882471, 2127522, -322734, -3684819, -3028305, 1556419, 4594650, 3653309, 2476053, 3206457, 2160238, -2315316, -4541296, -381055, 4512179, 3109384, -1164387, -142881, 4863893, 4914733, -1449478, -5497538, -2308874, 2169995, 1659774, -1065809, -475403, 2203904, 1766223, -2240504, -4991358, -3138523]
12540c138523M791809L544122o05959m242720m351759j355095J104502J150345
12532c103278J149192K823398L334397K10463l083574j716789K640137M091902
12524F345848J278739j653384k074608j459788j138975o00363l41286j686741
12516a330558l231168j877072J907639M065777K915822R87234M3014j270273l189577
12507i79162k708668J399547M827914K780680k872261n159704p63300N587167
12499B112213O727061J527075m254211n428954l133414j437746p31464J469075
12491c150365M151207K894331k283227m906613j307544L165856K114251j921865
12483a243969j666665L422648O798890M909402R64158j515506k690507l005952
$$ y = [-3138523, 1653286, 5197408, 4591449, 348729, -4003030, -5358125, -4253623, -3103278, -1954086, 869312, 4203709, 4414172, 1330598, -386191, 2253946, 6345848, 7624587, 5971203, 3896595, 2436807, 1297832, 697469, 356183, -1330558, -4561726, -6438798, -4531159, -465382, 2450440, 3437674, 3480688, 2210415, -979162, -3687830, -2288283, 2539631, 5320311, 2448050, -2711654, -3474954, 2112213, 8839274, 10366349, 6112138, 683184, -2450230, -3887976, -4619440, -3150365, 1000842, 3895173, 1611946, -3294667, -4602211, -1436355, 677896, -1243969, -2910634, 512014, 7310904, 12220306, 13184464, 11668958, 8978451, 5972499]
12475E972499j557864N23124J17363k633794l705560j553644N20546K96699J9240
12466b001391J147923O17924l674958p546928n481563J271211N907755M379174
12458e380853p61432l977124j791802M566024R487305P690212O93780l826811
12450F699299j751448J616907m86451n656598o001271r39517J576143k048920
12442f991856m936443q13897N544606N720654R13675o15621K558739L022810k341553
12433B061114o299304k739353L289248L629955l36576j117847K116626L120593
12425C724456N7848j633142P12193K441740K44732k078044q90886P17495r71998
12416B324394l181371j836568N22064j078161n021949n299838r02440L569297
$$ y = [5972499, 4414635, 4937759, 5055122, 2421328, -1284232, -2837876, -2317330, -2020631, -2001391, -853468, -235544, -3910502, -11457430, -16938993, -15667782, -9760027, -5380853, -6142285, -10119409, -11911211, -7345187, 2142118, 9832330, 10526110, 6699299, 4947851, 6564758, 6078307, 421709, -5579562, -6519079, -4942936, -6991856, -11928299, -12742196, -7197590, -1476936, -563261, -1178882, 1379857, 4402667, 2061114, -4238190, -6977543, -3688295, -58340, -394916, -1512763, 603863, 3724456, 3782304, 2149162, 2861355, 5303095, 5547827, 3469783, 2578897, 3296392, 2324394, -856977, -2693545, -2171481, -3249642, -8271591, -13571429, -14473869, -10904572]
12408a0904572N393479N421639L375344j672094o285927n057318J093062N176449
12400c459938L787118O24995o11912n72122J7964K386014N073519L689324j546664
12391I388298m146256r44900K651943J434274j483795q17362J855720J750733
12383I688655n37532j104413l56818j371268k789862q00576K944730K938115q04363
12374G806668k467493l28957O38871j903438l146867L76108M228154K952476j406951
12365F748571l129195j563317m20576p41783k13533J689220L009439L216968L207283
12356A1803077J928356k070661n819380m198257J826119M788956R90042l990362
12348E257890l656055J50986J351986n29448q57273J421055K162828n04816l097141
$$ y = [-10904572, -5511093, -89454, 3285890, 1613796, -4672131, -9729449, -8636387, -3459938, 327180, 952175, 340263, -231859, -213895, 2172119, 7245638, 10934962, 9388298, 5242042, 4297142, 6949085, 8383359, 6899564, 6082202, 7937922, 9688655, 9151123, 8046710, 7689892, 6318624, 3528762, 2728186, 5672916, 8611031, 7806668, 5339175, 5010218, 5649089, 3745651, 598784, 974892, 5203046, 8155522, 6748571, 3619376, 2056059, 1635483, 893700, 680167, 2369387, 5378826, 8595794, 11803077, 13731433, 11660772, 5841392, 1643135, 3469254, 8258210, 9248252, 5257890, 1601835, 1752821, 3104807, 2575359, 1718086, 3139141, 5301969, 4797153, 1700012]
12339A700012k898426j993071k466860k047002J652070N707494N225572P06771
12331E586560k206967n37287J928804p0691n671300p901855k047342P324267J0349340
12322F753529L764205m355844m816499O47488K851586j007898m336961k737784
12314c238178n29132k034460l705495q52211L409808L002318j077772k713342
12306g738464l00288K329590L022567K928701K119976k92339k375606j405393
12298a711256R96049J057694q65214j540011q26797p05917l98497J161830O77300
12289b154819l892667o035400R24243J0159761Q367392l343435r199162k320702
12281g494789N547981L696021j983836k049590L22687j868220m352152Q15255
$$ y = [1700012, -1198414, -3191485, -5658345, -7705347, -6053277, -345783, 4879789, 5586560, 3379593, 2842306, 4771110, 4700419, -970881, -8872736, -10920078, -3595811, 6753529, 10517734, 6161890, 1345391, 1992879, 4844465, 3836567, -500394, -3238178, -3767310, -5801770, -9507265, -10359476, -6949668, -3947350, -5025122, -7738464, -8038752, -5709162, -2686595, 242106, 2362082, 2069743, -305863, -1711256, -715207, 342487, -522727, -2062738, -2889535, -3595452, -3993949, -2832119, -2154819, -6047486, -12082886, -11158643, -998882, 7368510, 4025075, -5174087, -7494789, -1946808, 1749213, -234623, -2284213, -1961526, -3829746, -8181898, -7366643]
12273g366643Q996193Q658028Q0951n226286k860635n15755l500887o828570n011698
12264a3575302m91861J855178J749823J203024M52178m65828p8971J963820L656976
12255c730963L453373J771486o50277l039561l435082n24862L501038M976061
12247B321213L188610J35110k670430m005148j872980L057275N211638O05538
12239E970826o101762o794690r47779M564647N812722N219184M588993J978085
12231A4290226k627671m794924j842837K810314M145487J256241l097735n854571
12223D284530n498820k961044j051531j069045r60547R09073K515995K042767
12215a788622J849968L914966M733711Q48582l837139l617750q55486j650327
$$ y = [-7366643, 1629550, 10287578, 10368529, 5142243, 2281608, 1765853, -1735034, -8563604, -13575302, -14067163, -12211985, -10462162, -9259138, -8806960, -9272788, -9351759, -7387939, -3730963, -277590, 1493896, 843619, -2195942, -5631024, -6155886, -2654848, 2321213, 5509823, 5644933, 2974503, -1030645, -2903625, 153650, 5365288, 5970826, -130936, -6925626, -7873405, -3308758, 2503964, 7723148, 12312141, 14290226, 11662555, 6867631, 5024794, 7835108, 11980595, 13236836, 10139101, 4284530, -1214290, -4175334, -5226865, -6295910, -7256457, -6347384, -3831389, -1788622, 61346, 3976312, 8710023, 9558605, 5721466, 2103716, 1248230, -402097]
12207d02097m193292j744405M048987M453639j161198l665851o5399J569628k468747
12198c628735l785323L277499J0246150P148075k186669p057784n357605k780185
12190d124577k008777j616328j547424j832401K43412M855493O227677J301923
12182A498998l688107k755617o1053j474884k820139K286275Q313293M918952
12174F217718m751474p180127K26051N212597O67153m988867k830987K778637
12166d649299L143983o50098j223983K740479N575612L586218j060426m300462
12158C162024m140364j488899Q12583Q57747Q3222O41217R51122j983045n983150
12149g087543n130485Q81769M879690K427926j781734j522025K134631M230448
$$ y = [-402097, -4595389, -6339794, -2290807, 2162832, 1001634, -2664217, -2729616, -1159988, -3628735, -7414058, -4136559, 6109591, 13257666, 11070997, 4013213, -1344392, -4124577, -6133354, -7749682, -9297106, -11129507, -10886095, -6030602, 197075, 1498998, -2189109, -4944726, -5005779, -6480663, -9300802, -7014527, 1298766, 6217718, 1466244, -5713883, -5487832, -275235, 391918, -4596949, -7427936, -4649299, -1505316, -2155414, -3379397, -638918, 4936694, 8522912, 7462486, 3162024, -978340, -2467239, -1654656, -796909, -713687, -72470, 878652, -1104393, -7087543, -12218028, -11336259, -6456569, -4028643, -5810377, -7332402, -5197771, -967323]
12141i67323L866428L353252K499790o36441m941164p120167o378049m082298
12133a4405972j31126N691734R694430P055406o78196n773231l807709J081415
12125a273249K853841J702354J696160K828977P62357n216828r022077n472583
12117a1141048J940070N011921J332594l336614l306518N71919L971905M662949
12109b92822K692131j367141n051107m063169K060825O780657M035936k688444
12101B106866m445045N48347M609058J958881l802461o245549m634017j975524
12093a1879444R29942M449685O148166L464168q80750j426854K048385L863962
12085F717260P07005l756368m534377j957592K35481P79708J144171J359084j51308
$$ y = [-967323, 2899105, 6252357, 8752147, 8115706, 3174542, -3945625, -10323674, -14405972, -14537098, -8845364, 849066, 7904472, 7226276, 1453045, -2354664, -1273249, 1580592, 3282946, 4979106, 7808083, 8570440, 3353612, -5668465, -11141048, -9200978, -4189057, -2856463, -6193077, -9499595, -8927676, -4955771, -292822, 2399309, 1032168, -4018939, -8082108, -6021283, 759374, 4795310, 2106866, -2338179, -1789832, 2819226, 4778107, 975646, -5269903, -9903920, -11879444, -10949502, -6499817, -351651, 3112517, 2231767, 804913, 2853298, 6717260, 7424265, 3667897, -866480, -2824072, -2588591, -1808883, -664712, 694372, 543064]
12076E43064k397288j707229K417098M869023J464940m535424o332940k753937
12068h432693Q10994N49885j214881r15264R42995J885325J872564K602718M173393
12059B275036M984251L924713J082295k436807m425334l318490r24762p49136
12051D11766k597061k405561R82164L260629J525357j049511j172668j112320
12043b157205l225141l696002J216294O560851M896770j147296k055818L253715
12035C646168N506472L99783m309775j706735L209793K379723k021367j756917
12027E347145L512439N390877j47453o327387m995082K271086O438557K702728
12019A4192910l907102n565736j638999J461548k40424l237627k824415k75176
$$ y = [543064, -1854224, -3561453, -1144355, 3724668, 5189608, 654184, -5678756, -8432693, -7621699, -7071814, -8286695, -9201959, -8258964, -6373639, -4501075, -1898357, 2275036, 7259287, 11184000, 12266295, 9829488, 5404154, 2085664, 1160902, 411766, -2185295, -4590856, -3608692, -348063, 1177294, 127783, -1044885, -2157205, -5382346, -9078348, -7862054, -1301203, 3595567, 2448271, 392453, 3646168, 9152640, 9552423, 5242648, 3535913, 6745706, 9125429, 7104062, 5347145, 8859584, 14250461, 14103008, 7775621, 2780539, 5051625, 11490182, 14192910, 10285808, 4720072, 3081073, 4542621, 4302197, 1064570, -1759845, -2035021]
12011b035021K56395j023118o25577J565855K289536R45741J78182M50993n43568
12002A459418k680275k956153r20162O31556R05473J603835J863248r30840m510378
11993e534278l187084K244872L864017r81649m516196m91232N910598O166268
11985C475316N74745m156725m951166l582752j298355J812102M414681N452933
11977A740779N643609M429962l92683o754066p633787r77846N419692M454244
11969E929904o05789l021314k852567k908613q78384N121830Q573994K930424
11961A2289485n903604o798252m08691K900494M25342m64081K564412K705374
11953G310479k244501m688531n49892L337477J077399k730124j900680J167894
$$ y = [-2035021, -1778626, -2801744, -3427321, -1861466, 428070, 1373811, 1551993, 2002986, 1459418, -1220857, -4177010, -5097172, -4465616, -3560143, -1956308, -93060, -1023900, -5534278, -8721362, -6476490, -2612473, -3594122, -8110318, -8601550, -2690952, 3475316, 4050061, -106664, -5057830, -8640582, -9938937, -8126835, -3712154, 1740779, 7384388, 11814350, 11421667, 4667601, -2966186, -3944032, 1475660, 5929904, 5324115, 2302801, -549766, -3458379, -4336763, 785067, 9359061, 12289485, 6385881, -412371, -821062, 2079432, 2504774, 2040693, 4605105, 7310479, 5065978, 377447, -172445, 3165032, 4242431, 1512307, -388373, 779521]
11945G79521J237651q17907j700960k280405l749820k715525K896502P737420
11937A386477N905212J42744k544556j108664L79931P98793K096454L254818J194120
11928A1505329k819168l840246n89212K858160L044066O21965k238871m117716
11920D424307l831288j091964J927659K336171k1565k774482m058060l450067
11912f539289j077432J982530L617815L179112K682639L461127L567168J094418
11904A1968088j995597k581515j228380q62855j851278j942866m60545P01182
11896A746234J41168j341683j840428K26703M446098P052626L968591k904574
11888A1494735o041790k053365K862310J733427k759517k888967J793081M177449
$$ y = [779521, 2017172, 1199265, -501695, -2782100, -6531920, -9247445, -6350943, 1386477, 7291689, 7434433, 4889877, 3781213, 4161144, 4959937, 7056391, 10311209, 11505329, 8686161, 4845915, 4256703, 7114863, 10158929, 10780894, 8542023, 4424307, 593019, -498945, 1428714, 3764885, 3743320, 968838, -3089222, -6539289, -7616721, -5634191, -2016376, 1162736, 3845375, 7306502, 10873670, 11968088, 9972491, 7390976, 6162596, 5299741, 3448463, 1505597, 1045052, 1746234, 1887402, 545719, -1294709, -1068006, 3378092, 10430718, 14399309, 11494735, 5452945, 3399580, 6261890, 7995317, 5235800, 2346833, 4139914, 8317363]
11880H317363R20816l315149l833051j605673O50534K411989L299800K023104
11872H869733n30655j405794m02382n57676k599951l703643l054049l136735l644206
11863a0165358m01749O488947R923554N896017L46026m3460J552227j618927p065651
11854D911626n980569K130752P339117L663771k727524l598503l35663K5687l669315
11845A759379n500503j718157M186449O669908M809562J921191N49176Q2619j082463
11836A1677161k888500l870158l173718j443677q5292k99673k210888m010879
11828f305624k931192J226780M464823L138880m02329m35779L486700N204179
11820G446438J401708k536248m84908M496382M301114j991935o649320m350401
$$ y = [8317363, 9238179, 5923030, 2089979, 484306, 1134840, 3546829, 6846629, 8869733, 8339078, 6933284, 6530902, 5973226, 3373275, -330368, -3384417, -6521152, -10165358, -10567107, -4078160, 5845394, 11741411, 12087437, 12043977, 13596204, 11977277, 4911626, -1068943, 1061809, 8400926, 12064697, 9337173, 5738670, 5403007, 5428694, 1759379, -3741124, -5459281, -1272832, 5397076, 10206638, 12127829, 12677005, 12759624, 11677161, 8788661, 4918503, 1744785, 301108, 215816, -83857, -2294745, -6305624, -9236816, -8010036, -3545213, -406333, -808662, -1244441, 2242259, 7446438, 8848146, 6311898, 5826990, 10323372, 14624486, 12632551, 5983231, 1632830]
11812A632830J297773M049222K751906J62998j943480l281404l348638k209495
11804h88288j320147j386590r28836J240821L692732M227456K652905L41270j555841
11795F075482k330792j723771o27999j58814L64279K195668L809036K254701j447993
11786H409797k655242m32779M98383k040483l081397J271443O194084N083398
11778A3247204O8663j975469j025290k784251p129735p156280r43866M631384
11770c067640M583310K200408J182177o30930m666745o181863k031218K214880
11762f397621N23138l075070p60871N586222O616015J63444n612426m712347m46107
11753h115623K249098L833057N615986M872105j27551m886232m255590l47313
$$ y = [1632830, 2930603, 6979825, 9731731, 9894729, 7951249, 4669845, 1321207, -888288, -2208435, -3595025, -4523861, -3283040, 409692, 4637148, 7290053, 7631323, 6075482, 3744690, 2020919, 1392920, 1234106, 1598385, 3794053, 7603089, 9857790, 8409797, 5754555, 5321776, 5820159, 3779676, 698279, 1969722, 8163806, 13247204, 13315867, 11340398, 10315108, 7530857, 401122, -6755158, -7699024, -3067640, 1515670, 3716078, 4898255, 4267325, -399420, -6581283, -8612501, -6397621, -5874483, -8949553, -9710424, -4124202, 2491813, 2655257, -2957169, -7669516, -8115623, -5866525, -2033468, 3582518, 8454623, 8327072, 3440840, -814750, -1162063]
11745a162063O24976k273158l825339q50439L528812M763447K462688l51215j202606
11736A715103o4477J158689K92887k609314m237351j415350M065275O483654L296491
11727H685607j337410k300382l78551K6945j648928j773094L99946P83053k187606
11718B69580l460602R78412O327068M863099k426704o803536m139064M58881J727408
11709b205458J256963K337119L718400K973504J505983J365752Q11688j897313
11701I866638l625313r19401L186340L025993q26390k814556j385384j56746n10803
11692E840378Q2408J694909Q04529k718550m013166j199382J155569j59294j515825
11683b8424R16192M053481K723896j896642m154462k247211K48366L24769r94039
$$ y = [-1162063, -537087, -2810245, -6635584, -7486023, -3957211, 806236, 3268924, 2917709, 1715103, 1650626, 2809315, 3102202, 492888, -3744463, -5159813, -1094538, 5389116, 8685607, 7348197, 5047815, 4669264, 4696209, 3047281, 1274187, 1674133, 2457186, 269580, -3191022, -2212610, 4114458, 8977557, 6550853, -252683, -4391747, -3932866, -2205458, -948495, 1388624, 5107024, 8080528, 9586511, 10952263, 11763951, 9866638, 6241325, 5321924, 8508264, 11534257, 10707867, 7893311, 6507927, 6351181, 5840378, 5922786, 7617695, 8422224, 5703674, 1690508, 491126, 1646695, 1487401, -28424, 887768, 4941249, 7665145, 5768503, 1614041, -633170, -384804, -60035, -1054074]
11674a054074j100461Q65679L170269L073859L15848j222108J619120M912441
11666A0580573J459271p539748j1310977m134197N263822N333537k419364p059925
11658i827008m159353P69470L079207L968671M280748K070489j600768k056144
11650c474688J058579K019253j631612m422127j613743L251824M277083J946896
11642A411465O12261P45673p01263m081179o091541m407648J0431M417496N831390
11633b252915K828041j885185k941724R58293M321396K137574k648238l143660
11625b626418J734296O157709N530523J466248j749683k208119j042617m04027
11617F857912j387835k693685j912881O01711R91290k591495n831065l407860
$$ y = [-1054074, -2154535, -1288856, 1881413, 4955272, 5271120, 4049012, 5668132, 10580573, 12039844, 4500096, -6810881, -10945078, -5681256, -347719, -2767083, -9827008, -13986361, -13216891, -10137684, -6169013, -1888265, 182224, -1418544, -3474688, -2416109, -396856, -2028468, -6450595, -8064338, -4812514, -535431, 1411465, 2023726, 2769399, 2068136, -2013043, -8104584, -12512232, -12501801, -8084305, -2252915, 575126, -1310059, -4251783, -3293490, 1027906, 3165480, 517242, -2626418, -892122, 5265587, 10796110, 12262358, 10512675, 8304556, 7261939, 6857912, 5470077, 2776392, 863511, 1465222, 2456512, -134983, -5966048, -9373908]
11609i373908K938247O002747K796964j796808k260467M79440J482798j088381
11601h19368l886751k939776J206315L668922J074281l414194l318956K264541
11593f164986O468780L750944k281449m051788j85489M307879N823670M684699
11585A2352260J499511k964802n217300k720025M18701j693932o472126n472356
11577a0270069K008363P003395M892573J805328K843675L606374j31216l300700
11569H457723n78759K987109J86348n457342n636278j634121j354363m810719
11561g840402m530308M48416K895182O19301k0233L757289O171205L577359L27745
11552E405554l44096j931092n942397o515061k94638O019444N362458J101752
$$ y = [-9373908, -6435661, -432914, 2364050, 567242, -1693225, -1213785, 269013, -819368, -4706119, -7645895, -6439580, -2770658, -1696377, -5110571, -8429527, -6164986, 303794, 4054738, 1773289, -2278499, -2463988, 1843891, 7667561, 12352260, 13851771, 10886969, 5669669, 2949644, 3368345, 1674413, -4797713, -10270069, -8261706, -1258311, 3634262, 5439590, 8283265, 11889639, 11758423, 8457723, 7878964, 10866073, 11052421, 5595079, -41199, -1675320, -3029683, -7840402, -12370710, -11922294, -9027112, -8407811, -8428044, -4670755, 1500450, 5077809, 5405554, 5061458, 3130366, -2812031, -9327092, -9621730, -3602286, 1760172, 2861924]
11544B861924M66656K704789K090638j414603l056429k193789k176125k861587
11536c578526r06147L065926M534259K396365J35223m58088j030299j903990j221576
11527A033147L88072m18393l974730o251348m624931j024704J826508L441121
11519i605258L717129K015905l68488m64394J847759K891866Q14294j032787R21727
11510G37753M517577M353127n70283m900724l531337J817367M556368J487913
11502H467761l193775l704936m80968J227460k25083o67750K458571N437193M040862
11493A3359335k63177l629912n495033o524346m777493M13192L928280J013403
11485a975751m077083l011745L833919P408905L547207j407239j062908K075308
$$ y = [2861924, 3328580, 6033369, 8124007, 6709404, 3652975, 1459186, -716939, -3578526, -4484673, -1418747, 3115512, 5511877, 5647100, 5189012, 4158713, 2254723, 1033147, 1421219, 1002826, -2971904, -9223252, -13848183, -14872887, -13046379, -9605258, -5888129, -3872224, -4240712, -4705106, -2857347, 34519, 848813, -183974, 737753, 5255330, 9608457, 9038174, 4137450, 606113, 2423480, 6979848, 8467761, 5273986, 1569050, 1088082, 2315542, 2090459, 1422709, 3881280, 9318473, 13359335, 13096158, 9466246, 3971213, -2553133, -7330626, -6917434, -2989154, -1975751, -6052834, -9064579, -5230660, 2178245, 5725452, 4318213, 3255305, 5330613]
11477E330613K243819n64480k216147j553182j105344k330608l770227l500446
11469g466002j538162n0814j225012l799626k965199L428741R906486R062468
11461E352880J740163l773785l133821n74503n70686j176099Q19732L381596K576516
11452D641993r77172l374852k954317j131909M30546P66337m71405j863531r48695
11443e883005K242791M650660M470955L202333K292036J157582j75999m03561
11435A1553792l99840k860762o590509o283261q33022L432928J633028k532098
11427b879744k998665r0014K021458K488837K833232K182727p35176l378065k635029
11418c190439j55271N59866L4969P17214J524098Q9640j707620l88436K528310
$$ y = [5330613, 7574432, 7009952, 4793805, 3240623, 2135279, -195329, -3965556, -7466002, -9004164, -9054978, -10279990, -14079616, -17044815, -13616074, -3709588, 5352880, 7093043, 3319258, 185437, -389066, -959752, -2135851, -1316119, 2065477, 4641993, 3664821, 289969, -2664348, -3796257, -3365711, -2599374, -3070779, -4934310, -5883005, -3640214, 1010446, 5481401, 8683734, 10975770, 12133352, 11957353, 11553792, 11153952, 8293190, 1702681, -4580580, -5413602, -1980674, -347646, -2879744, -5878409, -5968423, -3946965, -1458128, 1375104, 3557831, 2822655, -555410, -3190439, -3345710, -2785844, -2750875, -2033661, -509563, -419923, -2127543, -2515979, 12331]
11409A2331K473519o77905k693585j787089k6922J263290K306050J897775j094791
11400A672673l960857l047519K99520J843926J449871K242994L677918J937817
11392F116343k574022m520526j583623K286471K898587N93774j866353k225290
11384h74639N13842M394274M493781r75561o221417m891828N27038K885743J715560
11375A566793K163067M125419K331919k560207l524454L03162J303089l106578
11367B602210n322267q99777L240104O22805l968960l341966L84236J450490J082550
11358d150575L320103N703823L542527n86143p31776K101261K179542r00572k696480
11349G781710k350989k451891k359044K26934K684957P37775l049742k586192
$$ y = [12331, 2485850, 1807945, -885640, -2672729, -2699651, -1436361, 869689, 2767464, 1672673, -2288184, -5335703, -5036183, -3192257, -1742386, 500608, 4178526, 6116343, 3542321, -978205, -2561828, -275357, 2623230, 3217004, 1350651, -874639, -360797, 4033477, 8527258, 7551697, 1330280, -3561548, -3034510, -148767, 1566793, 3729860, 7855279, 10187198, 7626991, 4102537, 4405699, 5708788, 2602210, -2720057, -3619834, -379730, 243075, -3725885, -7067851, -6683615, -5233125, -4150575, -830472, 4873351, 8415878, 7829735, 7097959, 9199220, 11378762, 10478190, 7781710, 5430721, 2978830, 619786, 846720, 3531677, 4269452, 1219710, -1366482]
11341a366482R62366Q98366k765330k776636K307062M650767P693n167294m185292
11332g434780K03080K108339J749497K239883K547529K93083k224161j212049
11324a729579J869539K503301L15778j204576r90074j292424k674031k780851
11316e982917o68363J393558J447516M64265M45270J817355L449307L905874K322793
11307H594658q20401l595303m194565k690816p13878K61545j45655j194091j265897
11298e764403Q32941L886288M716846J910460j948844l341811k197287j250711
11290c156521j613466j456095N31800K696009K689512O49810j328792j877902
11282b865645j116004L59241J553667Q95195j801934l495169r37261L882816M820272
$$ y = [-1366482, -404116, 494250, -2271080, -5047716, -2740654, 1910113, 1917806, -3249488, -7434780, -7231700, -5123361, -3373864, -1133981, 1413548, 1706631, -517530, -1729579, 139960, 2643261, 2959039, 1754463, 764389, -528035, -3202066, -5982917, -6651280, -5257722, -3810206, -3345941, -2900671, -1083316, 2365991, 6271865, 8594658, 7774257, 4178954, -15611, -2706427, -3420305, -3158760, -3304415, -4498506, -5764403, -4931462, -1045174, 3671672, 5582132, 3633288, 291477, -1905810, -3156521, -4769987, -6226082, -5694282, -2998273, -308761, 341049, -987743, -2865645, -3981649, -3622408, -2068741, -1173546, -2975480, -6470649, -7407910, -3525094, 1295178]
11273A295178J23773l708891n51331N681515N729162j601092p412622n411588
11265e855896N9515K087381J264525K274088M804249M550009J126354j496748
11257H813477j820235k322104m044016m761275l005694M04058M720177Q654275
11249F638663Q217294J124592o751068o488238Q94516M182812k175885r632881
11241c990195q098556k7306N055065M639791L403769K771907l07506m944753n579362
11232g077146j108760K654435J973243K89832J447941L425632K538729m76918
11224C666988k463208k637939j915100l20947J592743J521163r54455k163315
11216c674070M07845L216900J616332k265190k119491K654101N534105K502457
$$ y = [1295178, 1418951, -2289940, -2841271, 2840244, 8569406, 6968314, -444308, -5855896, -5796381, -3709000, -2444475, -170387, 4633862, 9183871, 10310225, 8813477, 6993242, 4671138, 627122, -4134153, -7139847, -6735789, -2015612, 6638663, 14855957, 15980549, 9229481, 2741243, 3635759, 7818571, 5642686, -3990195, -12088751, -12116057, -7060992, -2421201, 982568, 3754475, 3446969, -1497784, -7077146, -8185906, -5531471, -3558228, -3268396, -1820455, 1605177, 4143906, 3666988, 1203780, -1434159, -3349259, -3670206, -2077463, -556300, -1510755, -3674070, -3266225, -49325, 1567007, -698183, -2817674, -163573, 5370532, 7872989]
11208G872989k261473k944967j52436J199809o79163k982280l047462j185388
11200d180371J006080K516212K847088J944950N92276k74140o29058q56775o94369
11191B271893J29345P46679R3116j357902k240673k293042k107133j300701R98897
11182e059521L818406M740500L237351J496470R72558J69776k635869o115323
11174F24348p211284m814380n50079L239217M774656L132928o61716l345754k439140
11165g251204M58171J577582L89504M36463L598595O300939M199011j020696l299966
11156E388399p19116J622067q44759n075119m541158J319458O245891N729178
11148I124841K026347o70784j805731k621935k516050r37575j13328j648869k592829
$$ y = [7872989, 5611516, 2666549, 2514113, 3713922, 3034759, 52479, -2994983, -4180371, -3174291, -658079, 2189009, 4133959, 4726235, 4452095, 3823037, 2966262, 2271893, 2401238, 3147917, 3241033, 1883131, -357542, -2650584, -4757717, -6058418, -5059521, -1241115, 3499385, 6736736, 8233206, 9205764, 9375540, 6739671, 624348, -6586936, -11401316, -11951395, -8712178, -3937522, -804594, -1466310, -4812064, -7251204, -6793033, -5215451, -4825947, -4389484, -790889, 5510050, 9709061, 8688365, 5388399, 4669283, 6291350, 5446591, 371472, -4169686, -2850228, 3395663, 9124841, 11151188, 10480404, 8674673, 6052738, 3536688, 2599113, 2485785, 836916, -1755913]
11139a755913M01822M673537M657966L98514k925652l545101m380604n211113
11131g686544j521983O073406R291501M063924k132461j395619K370982O73905
11123I737111m863838n145126R70958M424598L03297m910811l800841J579345
11115a705307M134538J512520k691036m220115j623336L023033N109703J922689
11107E462689l139936m262198j402619L341j774798k031337J618659M208427J383891
11098F6119l065220k995381Q74197L213669K561243J801772K094136J847020Q26875
11089G224430L99180O2391j995828m983914n853724l662708n50644J596920K790797
11080d973100L366409L146655K224380J029566n0235l91485J54393j80812l202897
$$ y = [-1755913, -1354091, 3319446, 7977412, 8375926, 5450274, 1905173, -2475431, -7686544, -9208527, -3135121, 6156380, 10220304, 8087843, 6692224, 9063206, 9737111, 4873273, -271853, 699105, 5123703, 5427000, 516189, -3284652, -1705307, 2429231, 3941751, 1250715, -2969400, -4592736, -1569703, 3540000, 5462689, 2322753, -1939445, -3342064, -3338723, -5113521, -7144858, -5526199, -1317772, 66119, -2999101, -5994482, -5120285, -1906616, 654627, 2456399, 4550535, 6397555, 7224430, 7623610, 7686001, 5690173, 706259, -5147465, -8810173, -9360817, -7763897, -4973100, -1606691, 1539964, 3764344, 4793910, 4743675, 4352190, 4506583, 4325771, 1122874]
11071A122874o635894n595747J35432M577816L778449R07103Q039N3046m80046
11062b128928Q76779M412915L701152m471180j0868772m974843P831196J1943922
11054F322241L480805n430642n451815j018822Q95990J366355K860348J933245
11046D957705l568479p332395k994702N059829P073692J179405n308873o135209
11038g069027k289725J246776J283322p69128p08407K481869L538236j978366
11030d264450q787205p193623K482381R326067P389123K352792k99997k897221
11022a892133o192276m014050M514245Q330000N97912q062828m855273M947973
11014f626430P077907J050555j733152J442855K329927j353035k664979J67674
$$ y = [1122874, -5513020, -11108767, -10973335, -6395519, -2617070, -1709967, -1701928, -1648882, -2128928, -1252149, 3160766, 6861918, 2390738, -8478034, -13452877, -5621681, 6322241, 9803046, 4372404, -1079411, -2098233, -1202243, 164112, 3024460, 4957705, 1389226, -5943169, -8937871, -3878042, 3195650, 4375055, -933818, -7069027, -9358752, -8111976, -6828654, -7597782, -8306189, -5824320, -2286084, -4264450, -13051655, -20245278, -17762897, -8436830, -1047707, 1305085, 1005088, -1892133, -8084409, -12098459, -7584214, 745786, 1343698, -6719130, -11574403, -6626430, 451477, 1502032, -231120, 1211735, 3541662, 2188627, -476352, -308678]
11006c08678J053049o24017J458784O219061M182628n177346r708945l764797
10998f670261K825957J800371r51240J794476N639681M248619J179122J699719
10990A1566444K321870j003015l156563N94955L593715j669437r162602q182705
10982e097338q13616K594917Q22799J074182L964954L113150j386819k443085
10974A829144O51687P84345l561038n129878o26924L961637L846130J834120J205078
10965D794301Q31959K69412J448951K748344k08738n355519m888014J650193M657645
10956E948534n20727n464137j966224N102514O116721J116560k623454k586988
10948E122799k118254k635772k498520j877222k207763k131029L66409L156173
$$ y = [-308678, 744371, 120354, 1579138, 7798199, 11980827, 6803481, -2905464, -6670261, -3844304, -2043933, -2995173, -1200697, 4438984, 8687603, 9866725, 11566444, 13888314, 12885299, 9728736, 10323691, 13917406, 12247969, 3085367, -5097338, -5910954, -3316037, -2493238, -1419056, 2545898, 5659048, 4272229, 1829144, 2480831, 3265176, -295862, -5425740, -6052664, -2091027, 1755103, 3589223, 4794301, 5626260, 5895672, 7344623, 10092967, 9884229, 4528710, -359304, 1290889, 5948534, 5427807, -36330, -2002554, 3099960, 9216681, 10333241, 7709787, 5122799, 3004545, 368773, -2129747, -4006969, -6214732, -8345761, -7979352, -4823179]
10940d823179K659348L9443n39441J162289J522567l67602j269187N98681K837041
10931A819960K804897J071660j37894K26056J437370J857749M57840j596387j865268
10922F075983j98284L75714k028519m919018m738669j592287J788960M005244
10914a230876N105874M426877J623785j171331j499232k59813j52559r91471o4397
10905E786857K650691L234483o54407n528617n671742j86560N560502O071944
10897A1263151K012693j250293j064379n89214k881628n154706l044020J592376
10889H83980K980910R25301J028709M244991M007133k571596q195061o052346
10881b747979n98940n2125l110346k220502K956697N217286K197206m84998N35533
$$ y = [-4823179, -2163831, -2124388, -2663829, -1501540, 21027, -346575, -1615762, -1017081, 1819960, 4624857, 5696517, 5558623, 5784679, 7222049, 9079798, 9537638, 7941251, 6075983, 5877699, 6253413, 4224894, -694124, -5432793, -7025080, -5236120, -1230876, 3874998, 8301875, 9925660, 8754329, 7255097, 6995284, 6842725, 5851254, 5786857, 8437548, 11672031, 11017624, 5489007, -182735, -369295, 5191207, 11263151, 13275844, 12025551, 10961172, 10371958, 7490330, 2335624, -708396, 883980, 3864890, 4790191, 5818900, 10063891, 14071024, 11499428, 3304367, -2747979, -3346919, -3399044, -6509390, -8729892, -5773195, -555909, 1641297, 1156299, 1691832]
10872A691832J845645J047032P25136J610152j84934m914391n801800N13948O772525
10863C305145N119378j042068k966402k97247j840l440923m009051J070278N043924
10854B781194J603855n418692p340695k225177L704763M903352K462235Q19098
10846A289933J609064K589951J583883m90780j314796p78274r19253k095354j759145
10837b84771J241286L453383J052449l971065n708316k374314J522367J987483
10829c081498N24516L42339J371105K110704L164661M887741M138926j428844
10821A2029650p237897o037609J295061N480795J636850l661278k426576K685999
10813C764995K843093l155920p008713l138068L878818O467528L551190l85435
$$ y = [1691832, 3537477, 4584509, 5309645, 6919797, 6734863, 1820472, -3981328, -3467380, 3305145, 8424523, 7382455, 4416053, 4118806, 4116966, 676043, -3333008, -2262730, 2781194, 4385049, -1033643, -8374338, -10599515, -6894752, -1991400, 470835, 1289933, 2898997, 5488948, 7072831, 6582051, 5267255, 4488981, 3569728, 1474374, -284771, 956515, 4409898, 5462347, 1491282, -4217034, -6591348, -5068981, -3081498, -2556982, -2214643, -843538, 1267166, 4431827, 9319568, 13458494, 12029650, 4791753, -1245856, 49205, 5530000, 7166850, 3505572, 1078996, 3764995, 6608088, 3452168, -3556545, -6694613, -2815795, 3651733, 7202923, 6817488]
10805F817488k066077j635142l96393L71948k82186j491402r62453J155876J233072
10796B744731k294677n117844k766111K224199L913499K116520J752789L394682
10788E967788J826020l950447o679034j521279N163861M168292l215749p228071
10780e468619l193326L770847P136432N707616J564674k797183m209682j164432
10772A346327K408790J092893l302160l385062J789849M084801o39715m967001
10764a571278j711876M076555L395453k128840l932207r26967P52531L31839K818849
10755A104059O794074M320341m217189p482213p26664N382382J112136p053716
10747g66790p229839m64234L098479J415060J772528O429765Q438348L349610
$$ y = [6817488, 4751411, 3116269, 2719876, 3091824, 2809638, 1318236, 355783, 1511659, 2744731, 450054, -4667790, -7433901, -5209702, -1296203, 820317, 2573106, 5967788, 7793808, 3843361, -2835673, -4356952, 806909, 4975201, 1759452, -5468619, -8661945, -4891098, 2245334, 7952950, 9517624, 6720441, 2510759, 1346327, 3755117, 4848010, 1545850, -1839212, -49363, 4035438, 3395723, -1571278, -3283154, 793401, 4188854, 2060014, -1872193, -2799160, -2046629, -1714790, 1104059, 7898133, 12218474, 8001285, 519072, -207592, 5174790, 6286926, -766790, -7996629, -8460863, -5362384, -3947324, -2174796, 4254969, 12693317, 16042927]
10739A6042927l786757n973223k689586J627919L100952Q83970k497480k930158
10731C778564K84727K426411j03968l500828j813592L638995O192719L690584
10723A4593612j21903k890079n153357n272416r25462M014217K671555l337664
10715C578503m562901J410711N105927j9156o741476n240386J873309M404551
10707a90918J81788l175490o68380L824233M521472J215736j981213j949671P94798
10698B572355L095336K371693n18612k461404k327238j823141j630465j40159
10690h61635K434156K667987n39931k820821n83269K796754J810190k386660l479715
10681i62944M11012M130885L372824L35358p72646j61563r16627l026888l094715
$$ y = [16042927, 12256170, 6282947, 3593361, 5221280, 8322232, 9206202, 6708722, 3778564, 4063291, 6489702, 6385734, 2884906, 1071314, 4710309, 10903028, 14593612, 14471709, 11581630, 6428273, 1155857, 230395, 4244612, 6916167, 3578503, -984398, 426313, 5532240, 5513084, -1228392, -6468778, -4595469, -190918, -9130, -3184620, -3853000, -28767, 4492705, 5708441, 3727228, 1777557, 2572355, 5667691, 8039384, 7520772, 5059368, 2732130, 908989, -721476, -861635, 1572521, 4240508, 3700577, 879756, 296487, 3093241, 4903431, 2516771, -962944, -551932, 3578953, 6951777, 7287135, 6514489, 6352926, 5436299, 2409411, -685304]
10672f85304k18432J617678p75941m373996l716109J186440M990751M919552L552199
10663F496838K687374K20772l981183n086016j020123K192426q68425n582394
10655d940731m087984K188546N382582L893677K788224L049867O99958l356777
10647E617362l170282J087380K150275j601750k779438J820228M814347M94413
10639H432535n569342n722477j512659R58125P44292N93555Q66707P36010J132973
10630F59719J938752P78190j820387j573144J935249L319575O84764o89089J633730
10621F867359J877783l349234p300825l383963L835533N863324K566499m98215
10613F478261j593974k014789p95753K365934L463153K22517k935917k175623
$$ y = [-685304, -903736, 713942, -61999, -4435995, -8152104, -6965664, -1974913, 2944639, 6496838, 9184212, 9404984, 5423801, 337785, -682338, 1510088, 641663, -4940731, -9028715, -6840169, -1457587, 2436090, 5224314, 8274181, 8974139, 5617362, 2447080, 3534460, 5684735, 4082985, 1303547, 3123775, 7938122, 8432535, 2863193, -2859284, -4371943, -3413818, -2669526, -2075971, -1209264, -473254, 659719, 2598471, 3376661, 1556274, -16870, 1918379, 5237954, 5922718, 5233629, 6867359, 8745142, 5395908, -1904917, -5288880, -1453347, 4409977, 6976476, 6478261, 4884287, 2869498, 2073745, 4439679, 7902832, 8125349, 5189432, 3013809]
10605C013809q65752k445805l034587J257745N699088L883253j860696m838052
10597H09003l747580r13199L374679P409325N657352k075759o136857n98302O041078
10588I819740L683168l358224m589262o58905L09269j844418r04137K603405K808175
10579G868811J92037o3032J273493k35618k759271j562789J113301N04685m90284
10570E841333K863308N796354J319479n477886m241799K914703M707940p34382
10562A2989050m716442l634448j981293j076222J768901M043656J027707l366174
10554E054735j402787M600333N743367J544187j137246j138685k044324j996396
10546I223184K034271M337495q81992o349702k740183L398401K26335p232534
$$ y = [3013809, 2148057, -297748, -3332335, -2074590, 3624498, 7507751, 5647055, 809003, -2938577, -3851776, -477097, 6932228, 12589580, 10513821, 4376964, 3778662, 9819740, 13502908, 10144684, 5555422, 4896517, 5205786, 3361368, 2457231, 5060636, 7868811, 8060848, 7997816, 9271309, 9035691, 6276420, 4713631, 5826932, 6331617, 5841333, 8704641, 14500995, 15820474, 10342588, 6100789, 9015492, 13723432, 12989050, 8272608, 4638160, 2656867, 1580645, 3349546, 7393202, 8420909, 5054735, 3651948, 8252281, 13995648, 15539835, 14402589, 13263904, 11219580, 9223184, 11257455, 15594950, 14712958, 8363256, 5623073, 9021474, 9247809, 2015275]
10538B015275n181895M184982P122730K935851K020047L443916j958261r370609
10530E212036n719397M585468N289202k004039q31350Q262378P769112l708959
10522A8854451q125194q07244K978450j689861k261099L534665K891865m165592
10514A1210441k623017P057886P845727n02006o53983O419908J996909j0301513
10506B0450352o395469J0945003J2128806m554734p977563O489674P701513q365644
10498C0421938p597540J3152127J4251089o722149j309137L2152098K9016910
10491A03365336j5141194n725523Q1506029J03442092m8770358k36858575k30223250
10484b48405443l3826892J15618803Q3546705r863487j5393457L4965229L5537452
$$ y = [2015275, -3166620, 1018362, 8141092, 11076943, 13096990, 16540906, 14582645, 5212036, -507361, 4078107, 9367309, 7363270, 6531920, 14794298, 22563410, 18854451, 10729257, 9922013, 12900463, 11210602, 8949503, 12484168, 15376033, 11210441, 8587424, 15645310, 23491037, 22989031, 22335048, 28754956, 30751865, 20450352, 14054883, 24999886, 37128692, 32573958, 24596395, 31086069, 38787582, 30421938, 22824398, 35976525, 50227614, 43505465, 42196328, 74348426, 103365336, 88224142, 82498619, 164004648, 267446740, 218676382, -18182193, -248405443, -282232335, -166613532, -83066827, -92930314, -108323771, -73358542, -37821090]
10477c7821090o941087j5003646J3877094K0921442n31561o945523O512903N493528
10469b0437940j0948280j1179429N544868R932419o19187k146848N953056K595640
10461b1305701r203970o270318R239776J2807001K461812j131143L912675M8146
10453i441722j0985884q705867O475482J1716491J748727m715053r05534m16282
10445a5229642o333572m871508M981256O620220k818416n596218M384961J0213710
10437h649209K282484n558925j413480N363478K626935m931936o609153k172454
10429a9062260K414077M863898N074754K722777L07747O47947R45573k109455
10421d194942l998217L48252N217909K663912k524909q12193M197795K055886
$$ y = [-37821090, -44762177, -59765823, -45888729, -24967287, -25498848, -32444371, -25931468, -20437940, -31386220, -42565649, -37020781, -27088362, -27707549, -29854397, -23901341, -21305701, -30509671, -36779989, -27540213, -14733212, -12271400, -13402543, -9489868, -9441722, -20427606, -29133473, -22657991, -10941500, -9192773, -13907826, -14813360, -15229642, -21563214, -26434722, -21453466, -14833246, -17651662, -23247880, -18862919, -8649209, -6366725, -11925650, -13339130, -7975652, -5348717, -10280653, -16889806, -19062260, -16648183, -11784285, -6709531, -3986754, -3679007, -3031060, -2085487, -4194942, -8193159, -7844907, -2626998, 36914, -2487995, -3300188, 897607, 2953493]
10413B953493m942942o024125j915975k044285n039555j717652M818254K822031
10405a1090756n288235n102980M277478Q441945L148234j17901K836651K259122
10397f36442m368667o075330K64517L136537j589563k202190O409272J1518250
10389F456384M319344n082428n691492k102268j647180r29908K947219K823102
10381A092773m340530p919487j219545N026663N70986n981737k161688O430950
10373h501615O168134j304027l324767J774289L843659n26365l935595k287092
10365h093379O9448J19939K51453J261678M06802k006059j589345K795233O470027
10356c14203N313691O26707l286501l628921j148333N97455j057092m053580l830420
$$ y = [2953493, -1989449, -8013574, -9929549, -11973834, -17013389, -18731041, -13912787, -11090756, -16378991, -21481971, -17204493, -8762548, -5614314, -5732215, -2895564, -636442, -5005109, -11080439, -10815922, -7679385, -9268948, -11471138, -5061866, 6456384, 10775728, 5693300, 1808, -2100460, -3747640, -4677548, -1730329, 1092773, -3247757, -11167244, -12386789, -7360126, -6789140, -12770877, -14932565, -8501615, -2333481, -3637508, -6962275, -5187986, -1344327, -1870692, -5806287, -8093379, -8023931, -7903992, -7652539, -6390861, -5984059, -7990118, -9579463, -6784230, -314203, 4999488, 5626195, 2339694, -1289227, -2437560, -1840105, -2897197, -6950777, -10781197]
10347a0781197r9832K260473M51748k260624j779662J521139M617468N219055
10339h51432K104603l672553p067395l568015L653982O624772L305450q62011
10331c32599k642043m288479n631334k147913N378886Q307965K664443l738124
10323b429198k941184J497103J548685k522457m204552j495005J707990K566485
10315f272133J716819M44372j44052R84824K565770J483641j904424k784945O78486
10306c231642L373186P14626m002953m425252k56893L038638J816631k048489
10298e022148l914157r34576M675626O683535J911199m380254m709421k09048
10290e899244J256010k089009l239189J255501N004060K451044j878416j140218
$$ y = [-10781197, -10881029, -8620556, -8168808, -10429432, -12209094, -10687955, -6070487, -851432, 1253171, -2419382, -9486777, -13054792, -9400810, -2776038, 529412, -332599, -2974642, -7263121, -12894455, -15042368, -9663482, -1355517, 1308926, -2429198, -5370382, -3873279, -2324594, -4847051, -9051603, -10546608, -8838618, -6272133, -4555314, -4110942, -4254994, -3270170, -704400, 779241, -1125183, -3910128, -3231642, 141544, 856170, -3146783, -7572035, -7828928, -4790290, -2973659, -5022148, -8936305, -9870881, -5195255, 1488280, 3399479, -980775, -5690196, -5899244, -4643234, -6732243, -9971432, -8715931, -3711871, -1260827, -3139243, -4279461]
10282d279461K674554K433475k756628o407551l747199K494203N417300J525099
10274b646208m579923m268748L919981J0189079N948777l125106n059249R183
10266C87786R63141n020486p871158k408208K933003J221143j694755R20486M648371
10257e920677L103581l62270pJ478430o46681k997532m95149L387370K600797
10248A47862p56685j047357P86244O42475m51385j10570r71541m533726m907551
10239a1202234J718913P820399N264611j017393j602464J302470o65723n462153
10231c843574l912309L301277O204677K027198k076786k284704j531768j72028
10223b288017M171766P582201L447916m580000o077113q69825Q57857l335223
$$ y = [-4279461, -1604907, 828568, -1928060, -8335611, -12082810, -9588607, -4171307, -2646208, -7226131, -11494879, -7574898, 2614181, 8562958, 5437852, 378603, 387786, 1350927, -3669559, -11540717, -13948925, -11015922, -9794779, -11489534, -10569048, -5920677, -2817096, -3179366, -3179373, -1700943, -2347624, -5345156, -5840305, -2452935, 147862, -608823, -1656180, -869936, -227461, -678846, -789416, -1760957, -6294683, -11202234, -9483321, -1662922, 3601689, 2584296, 981832, 2284302, 1618579, -3843574, -7755883, -4454606, 1750071, 3777269, 1700483, -584221, -2115989, -2288017, 1883749, 9465950, 12913866, 8333866, 2256753, 1386928, 2244785, -1090438]
10215a090438m393313R78923M042928J12308k996490N85035M460879K105049j759264
10206B045617o64542K166668R20147k130735j849695L49435M38188n56769j68552
10197E49762l40469k791490l961910j285384R91604r54748l082413n45633L214433
10188h206248K392231q73775m83277L056823M336420K417934O53358k84037j620601
10179A388828j410595J947837L813430n23408o019337l811772M125944O683825
10171F194752O73638m537076k348304J499630Q8672k980887q89959L804538L093640
10162D598644l016211o009804j766307L829355M164048N12589k063095k612433
10154b363214l245522l081213Q19560O695141Q034813K486315l801177m338619
$$ y = [-1090438, -5483751, -4504828, -461900, -349592, -3346082, -2761047, 1699832, 3804881, 2045617, 1381075, 3547743, 4467890, 2337155, 487460, 836895, 1275083, 718314, 549762, 209293, -2582197, -6544107, -7829491, -6837887, -7792635, -10875048, -11420681, -8206248, -5814017, -6687792, -7171069, -4114246, 222174, 2640108, 3293466, 3009429, 1388828, -21767, 1926070, 5739500, 5216092, -803245, -4615017, -489073, 6194752, 6868390, 2331314, -16990, 1482640, 1571312, -1409575, -2299534, 1505004, 4598644, 1582433, -4427371, -6193678, -2364323, 1799725, 2312314, 249219, -2363214, -5608736, -8689949, -7870389, -1175248, 6859565, 9345880, 5544703, 1206084]
10146A206084j115978l25497k002535p19826L857850M901971m97253n250851k399114
10137b345149M023631M952134j75479l424693r19882K255180J081591k186970
10129C260363l006654j576359p93929p55465L13779J825042J736924M64740R448
10120A477889M890j380421k929194j238502L116357M874334J714936j602630j96684
10111C840975L290936K722273k045933n224736l985119j517249n04523O17280
10103b806096K764556L173026P49493n63893J615248K647820j983283p562194
10095a965323n701711K445145O645258K066779m402954m988494j298130N67751
10087f631679k99611m10125J072066J815091J317606J394334K102634J410821
$$ y = [1206084, 90106, -235391, -2237926, -2957752, 900098, 5802069, 5304816, 53965, -2345149, 1678482, 6630616, 6455137, 3030444, 2110562, 4365742, 5447333, 3260363, 253709, -1322650, -2116579, -2872044, -2558265, -733223, 1003701, 1468441, 1477889, 1482779, 102358, -2826836, -4065338, -948981, 3925353, 5640289, 4037659, 3840975, 7131911, 9854184, 7808251, 2583515, -1401604, -2918853, -3423376, -2806096, -41540, 3131486, 3880979, 3317086, 4932334, 7580154, 5596871, -1965323, -7667034, -5221889, 1423369, 3490148, -912806, -5901300, -7199430, -6631679, -6931290, -7341415, -6269349, -4454258, -3136652, -1742318, 360316, 1771137]
10079A771137q25098k026210p27325J401906K177611J530788P01918K86143n8197
10070D232673o81849j265652j029092J19149P69920n32443k816111l316641j303173
10061e823219O78354O58478J94223J383451K847908J643087j797991l712364j998627
10052e926700J273098K621262P17225k685514l974615p13764M708464N946194
10044A965650J65639o687891o261736J009277O131827L877364p33401j134013
10036a667284R33742m67490m856550n402952P36675P794801Q624205K771902m303649
10027D163400p296478m885099J62946L249509K005381r99742j326138J225851
10019c700370K286457l16503k772981p81047L761365N079907J412657k915709
$$ y = [1771137, 946039, -1080171, -1807496, -405590, 1772021, 3302809, 4004727, 4290870, 4232673, 3550824, 2285172, 1256080, 1375229, 2145149, 1612706, -1203405, -4520046, -5823219, -5144865, -4486387, -4292164, -2908713, -60805, 1582282, -215709, -3928073, -5926700, -4653602, -2032340, -1315115, -4000629, -7975244, -8689008, -3980544, 1965650, 2131289, -4556602, -10818338, -9809061, -3677234, 200130, -533271, -1667284, -733542, -1201032, -6057582, -11460534, -10723859, -2929058, 5695147, 8467049, 4163400, -3133078, -8018177, -7855231, -4605722, -2600341, -3600083, -4926221, -3700370, -1413913, -1730416, -4503397, -5284444, -1523079, 3556828, 4969485, 2053776]
10011B053776l405853n25130J897847J470705o80884j715791k37828K151525K575393
10002C583760K71179k622443m077120m398074m268931k545512J525400N218449
9994g313292M760453O94418k358141j798434R4332L61873o15264j029652r05181
9985h108888j022182n63289J387173L223822K550896n9231j749624j525742q51351
9976f718416m3832K463420N997953O288598J126776n001109n714457j099329K719593
9967A9197K198444J42142k11922j45571j586284k344190K85155L732099L103415
9958E192485j210659l955834k798565o70846P8857O71792J647187P20593k563804
9949b888794m317590j598859K944168M638703K503931r12360k986500k439103
$$ y = [2053776, -1352077, -1877207, 20640, 1491345, 810461, -905330, -1143158, 1008367, 3583760, 3854939, 1232496, -2844624, -7242698, -11511629, -14057141, -12531741, -7313292, -2552839, -1858421, -4216562, -6014996, -5920664, -5558791, -6174055, -7203707, -8108888, -9131070, -9694359, -8307186, -5083364, -2532468, -2591699, -4341323, -5867065, -6718416, -6762248, -4298828, 1699125, 7987723, 9114499, 4113390, -1601067, -2700396, 19197, 2217641, 2359783, 2147861, 2002290, 416006, -1928184, -1643029, 2089070, 5192485, 3981826, 25992, -2772573, -3443419, -3364562, -2692770, -1045583, -324990, -2888794, -7206384, -8805243, -5861075, -1222372, 1281559, 369199, -2617301, -5056404]
9941e056404J58624J888731L28950k363416j974406Q06777J266303p37927m7959
9932e730727L837667M282857r41860m176680j4365N165129L399219k460392n058407
9923a697559m313236l561160q53976N211073P633910J272143n077527p80675P673572
9914E506565N754756m677473p890068k15935N380734K504547L6640K993474L237297
9905A2630537l249590o831275j351985M140839R84732m927500m730207m15760
9897c750209K580398N050365O997821K893564o538135j0018568k980310L608158
9889b156916J639823j123052K306583M195679j483003m939732R37787M715278
9881D092447k126414n843226L826309O946334j6111077m1627249k8845420J5608601
$$ y = [-5056404, -4897780, -3009049, -2680099, -5043515, -7017921, -6211144, -4944841, -5682768, -5730727, -1893060, 2389797, 1447937, -2728743, -2743108, 2422021, 5821240, 3360848, -1697559, -6010795, -9571955, -10425931, -5214858, 2419052, 3691195, -1386332, -2167007, 5506565, 11261321, 6583848, -1306220, -1522155, 3858579, 6363126, 6399766, 9393240, 12630537, 9380947, 2549672, 1197687, 5338526, 6323258, 1395758, -3334449, -3750209, -1169811, 3880554, 10878375, 13771939, 7233804, -2784764, -5765074, -2156916, -517093, -1640145, 666438, 4862117, 3379114, -1560618, -622831, 4092447, 1966033, -3877193, -50884, 6895450, -9215627, -50842876, -79688296, -64079695]
9873f4079695M0743988K3158423l869898n685606O840417O881334l167492m182504
9865c361033L093524L139101m467192o277017n9679L301562K18965j558174J543348
9856d426595M179567K918457K71260j878348l817082m120054j699994L85779m85294
9847h672304j442164N37523K757001K233410J640308L402799L679652o63245m792473
9838a319493l127617J472726L040304J732124P70129q2803j046677J115213N674480
9829H228386M618645m539535j0657501m323393O159285O622904j306895m375006
9821D26890O09727L988798O84521l647703m456080l783222k560374J383354N972593
9812a381496N696996J254315j027407k17032j523136n318768n809917k076297
$$ y = [-64079695, -23335707, -177284, -4047182, -9732788, -2892371, 3988963, 821471, -3361033, -267509, 2871592, -1595600, -7872617, -7932296, -4630734, -4411769, -5969943, -4426595, -247028, 2671429, 2942689, 1064341, -2752741, -6872795, -8572789, -8187010, -8672304, -10114468, -9576945, -6819944, -4586534, -2946226, 456573, 4136225, 3472980, -1319493, -4447110, -2974384, 65920, 1798044, 2568173, 2485370, 1438693, 2553906, 8228386, 12847031, 8307496, -2350005, -6673398, -514113, 6108791, 4801896, 426890, 1036617, 5025415, 5709936, 2062233, -2393847, -6177069, -8737443, -7354089, -1381496, 4315500, 5569815, 4542408, 4325376, 2802240, -2516528, -8326445, -10402742]
9804a0402742J11083m96276J510262O218812N674280k090525p141603k396911
9796i013620N043710N076752n78793l257013j231650K69909n12355m6637K861889
9787a387808M584663K484362j375177l219087j615770J736650L721419K556175
9779G485427m14303k395172k487795j767387o13786J328381K810611J858347q31735
9770D972588k503954k364015j772531q92564R60690K161951N80322j811603j312496
9761a981612Q20493J72892k298083j033759L461403L277960l914360q917509m005223
9752a4417798N156723P997802L973727O26257N81281j88835k636314k564685O88559
9743g83283J741601j818827m577043j426384M386416N958919K273203j626854
$$ y = [-10402742, -10291659, -10787935, -9277673, -3058861, 2615419, 524894, -6616709, -9013620, -3969910, 1106842, 528049, -2728964, -3960614, -3690705, -4203060, -4249697, -1387808, 3196855, 5681217, 4306040, 1086953, -528817, 1207833, 4929252, 7485427, 7071124, 4675952, 2188157, 420770, -193016, 1135365, 3945976, 5804323, 4972588, 2468634, 104619, -1667912, -2560476, -1599786, 562165, 1142487, -669116, -1981612, -1161119, -988227, -3286310, -4320069, -858666, 2419294, -1495066, -10412575, -14417798, -9261075, -1263273, 2710454, 3336711, 3917992, 3729157, 1092843, -1471842, -783283, 958318, -860509, -5437552, -6863936, -2477520, 3481399, 5754602, 4127748]
9735D127748k317223j371178j230257j543741q00989R11766K377404L081060L202402
9726F436992K643620J296462k55403j346062k076926k614346k300044p11826J017581
9717B090048J498535J164342J206538R67963j130197m127622m837878k233657
9709e401928J139429K881649L162252K666566J219920m27548o84408k37504j537128
9700B781300l884825l442722o6364J124908j801102l178845J394750O960668O178639
9691F066407L18668l533477k995448j017310J096744L485564K854598l533040
9683B742706j0145486q455821J80998N931688N150394L883189N218609L912050
9675H418327k316475o363617k999713J944086J162623k245623q57939M250257
$$ y = [4127748, 1810525, 439347, -790910, -2334651, -3135640, -2223874, 153530, 3234590, 6436992, 9080612, 10377074, 10121671, 8775609, 6698683, 4084337, 1784293, 1072467, 2090048, 3588583, 4752925, 5959463, 6927426, 5797229, 1669607, -3168271, -5401928, -4262499, -1380850, 1781402, 4447968, 5667888, 5240340, 4555932, 4318428, 2781300, -1103525, -4546247, -4612611, -3487703, -5288805, -8467650, -7072900, -112232, 6066407, 6385075, 2851598, -143850, -1161160, -64416, 3421148, 6275746, 2742706, -7402780, -15858601, -15677603, -9745915, -4595521, -712332, 4506277, 8418327, 6101852, -261765, -3261478, -1317392, -154769, -2400392, -3258331, 991926]
9667I91926N664101J656977k349427l034872k328785j544487P26518L829774L945718
9658G557443j55377m331232m252883p34991K029175J888258N60495M82514J323994
9649D367396Q04883j229169j844709J54954J007296k581890o688309m560512K570440
9640g999620N905225J915739k390114o51013L238874K342567k058271l497747
9632c194360r85799Q64905M95957Q18896K278171J402800k374768m132063k35707
9623e061968N982291P926638L303035l643715o665082l784392P09536J249480
9615A5823j995345l385475O9991M273496M120586O64751j431159r30658k54926
9606A147084n68078j025562j674592k878696k846972Q1277L499659L493930N40734
$$ y = [991926, 6656027, 8313004, 5963577, 2928705, 599920, -944567, -218049, 3611725, 7557443, 7402066, 3070834, -1182049, -1917040, 112135, 2000393, 2560888, 3043402, 4367396, 5172279, 3943110, 2098401, 2253355, 3260651, 678761, -6009548, -10570060, -7999620, -2094395, -178656, -2568770, -3219783, 19091, 2361658, 303387, -3194360, -4180159, -3315254, -2819297, -2000401, 277770, 1680570, -694198, -4826261, -5061968, 920323, 8846961, 12149996, 8506281, 1841199, -1943193, -1233657, 15823, -1979522, -5364997, -5295006, -1021510, 3099076, 3763827, 2332668, 1402010, 1147084, 579006, -446556, -2121148, -4999844, -7846816, -7765539, -4265880, -771950, -231216]
9597b31216j354226r28931o68750j652020j903642m34316J113107J562810J422617
9588c074567O52612j189256k427211q58626J836602J582930j508120k590681N77024
9579f999293M257465M618396K724585J188038j97586k332890l591360k309933
9571b642578k59399j84890j393319j001978J312450K799020J760891j59300l96560
9562a65663J131697J863494j30655l108565l193919K40906K698845N37785k959205
9553c085280j725055L433143M829695p45011o104332l202836N164098Q635026
9545G199448K964751m819275n838063J7456N196396M163931q42606l832269k595696
9536A614073k07809L91371K69006J340222K090779k87l122146k647684J718752
$$ y = [-231216, -1585442, -2514373, -3183123, -4835143, -6738785, -7173101, -6059994, -4497184, -3074567, -2421955, -3611211, -6038422, -6897048, -5060446, -3477516, -4985636, -7576317, -6999293, -2741828, 1876568, 4601153, 5789191, 5591605, 3258715, -332645, -2642578, -2901977, -3086867, -4480186, -5482164, -4169714, -1370694, 390197, 230897, -165663, 966034, 2829528, 2698873, -409692, -3603611, -3362705, -663860, -126075, -3085280, -4810335, -1377192, 3452503, 2707492, -3396840, -6599676, -1435578, 7199448, 10164199, 5344924, -493139, -475683, 4720713, 8884644, 8042038, 4209769, 1614073, 1406264, 1797635, 2066641, 3406863, 5497642, 5497355, 2375209, -272475, 1446277]
9527A446277M580378K116556k868054n134754l281776K46791K789171K927950
9519B822539N95665k171221k518521m97941O14642q34530k353155j353602J143751
9510d552373K896548L554083L163001Q51883k305430k586889R55198L816846K434861
9501H227728m37065j073771j427327m584896p097541l219321M991422R367134
9493D746363O894737K116065j488021m802295p056927m661242J513721M972015
9485B234416K835875k45354m65312l35445k046348k396892N32027K117729j156287
9476A074409m358350j475657M336336N448586J432505j701298j715676j768089
9468A272766k872333k345454K6658R67099m04937j333458o01117K46744R79934
$$ y = [1446277, 6026655, 8143211, 5275157, 140403, -3141373, -2894582, -105411, 2822539, 3418204, 1246983, -1271538, -1769479, -1154837, -1989367, -4342522, -5696124, -4552373, -1655825, 1898258, 5061259, 5913142, 3607712, 1020823, 1976021, 5792867, 8227728, 7790663, 6716892, 5289565, 704669, -6392872, -9612193, -4620771, 4746363, 11641100, 13757165, 12269144, 7466849, 409922, -4251320, -2737599, 2234416, 5070291, 4824937, 4359625, 4024180, 1977832, -419060, 112967, 2230696, 1074409, -3283941, -4759598, -423262, 5025324, 6457829, 4756531, 3040855, 1272766, -1599567, -3945021, -3918363, -2951264, -3356201, -4689659, -5290776, -5044032, -4064098]
9459d064098K770498M331950L390060J591104J984860K358125j618582o871546
9451C872371n503212J692013M190821k048792p337162l477118L076662K297897
9443c236520k616975j033877O608168Q643842O41443p471115o237414M14318K674992
9434a613138q62207l091424J59337M794401M986328Q80594k352404j456285J381628
9425B826830K239028N46390j378232k314237k580428j382174J997073M276361
9417D230611R47125n410034n927294J715828P773049L800354m365700n444869
9409b680930n3361J601658k400175k535327N153005J0763010N375474n073443
9401A0149911q793359m489667l2546Q26535J165491K248958J241527j803453k335678
$$ y = [-4064098, -1293600, 3038350, 6428410, 8019514, 10004374, 12362499, 10743917, 3872371, -1630841, 61172, 4251993, 2203201, -5133961, -8611079, -5534417, -3236520, -5853495, -6887372, -279204, 8364638, 9006081, 1534966, -4702448, -4288130, -1613138, -2475345, -5566769, -5407432, -613031, 4373297, 5253891, 2901487, 1445202, 2826830, 5065858, 5612248, 4234016, 1919779, -660649, -2042823, -45750, 4230611, 5177736, -232298, -6159592, -4443764, 3329285, 7129639, 2763939, -2680930, -2734291, -1132633, -3532808, -6068135, -915130, 9847880, 15223354, 10149911, 1356552, -3133115, -3165661, -2339126, -1173635, 1075323, 2316850, 513397, -1822281]
9392a822281J149575L991122K521191n58465j139194m1629o06545k688741l043630
9383b238597m11483L103061N005080M062910m7043n640547q273630m911158Q99141
9374h452266K168833j909052l964971J022689P582801P177446P49294k856251
9366A518523j51374K789633J009263j792650o06409K010913N76149l566219m011307
9357b223478O04862M610984L595765n26854l602994m089295k689643o59873L47276
9348d633250n60333j818443j169020Q98310J937206J268400O9156j338891k784792
9339h131657j997823K361976O222872M210287j724344l963864m44852K579782
9331h87623J128131n38299J404897K868104o28458m715533k462105L640488M641890
$$ y = [-1822281, -672706, 3318416, 5839607, 5281142, 4141948, 4100319, 3493774, 805033, -2238597, -2650080, 452981, 5458061, 9520971, 9473928, 3833381, -4440249, -9351407, -8452266, -6283433, -8192485, -12157456, -11134767, -3551966, 3625480, 4374774, 1518523, 1367149, 4156782, 5166045, 3373395, 2766986, 4777899, 5354048, 1787829, -2223478, -1618616, 2992368, 6588133, 6061279, 2458285, -1631010, -4320653, -4980526, -4633250, -5193583, -7012026, -8181046, -7282736, -5345530, -4077130, -4007974, -5346865, -8131657, -10129480, -7767504, -1544632, 2665655, 941311, -3022553, -3467405, -887623, 240508, -297791, 1107106, 3975210, 3346752, -1368781, -3830886, -190398, 4451492]
9322D451492j099530n468775k772149K985785N235156L109605m29998l600543
9314B411043n266578l533876R85246L563638J264195k032326j210418J504367
9306b314709l57728o151406p041167R22574R158902P669021o31361m183427N30879
9297b398422N109642L006648j423966j677291M65509l84464l307705l300520l85118
9288d295687J032287M37368J540287M618824N419024K352389j357674l524222
9280F222596n090319n587782k762931J859775L296274R46657M9564L030025N542504
9271G506363L985118R25499l75068j126527k916768l804039k441641j124744j071065
9262d42872M4205K231434J045284m150871o351501j278096M590956L441657j807668
$$ y = [4451492, 3351962, -2116813, -4888962, -1903177, 3331979, 6441584, 6011586, 2411043, -2855535, -6389411, -5404165, -1840527, -576332, -2608658, -3819076, -2314709, -2672437, -8823843, -15865010, -14942436, -5783534, 1885487, 1254126, -2929301, -2398422, 2711220, 5717868, 4293902, 2616611, 3082120, 2697656, -610049, -3910569, -4295687, -3263400, -2826032, -1285745, 3333079, 8752103, 11104492, 9746818, 6222596, 1132277, -4455505, -7218436, -5358661, -2062387, -1115730, -1066166, 1963859, 7506363, 11491481, 12416980, 12041912, 10915385, 7998617, 4194578, 1752937, 628193, -442872, -398667, 1832767, 2878051, -1272820, -7624321, -8902417, -4311461, -869804, -2677472]
9253b677472k792580J273490M277995L807473K712750K097275M97353j392961
9245G803323k061368l364898o685339p550156j751425N648943O027367K44243
9237a689310k950263n32207K079921J744466J502094K774227K677340P95048L81854
9228F783170J291577j67710l051656k150375J850675J886675l306575o049326
9220b913545k309695J878205J077425j298008n68134J539791K221676K887324
9212B515039L806430J402632l532620l522111L018135N858117j828378j0716871
9204b999627q312658K069675P049929L177890j177659j401143j541118l441204
9196f575915k437306L301383P908868N960045l17682m692980l904484J93259K592332
$$ y = [-2677472, -5470052, -4196562, 81433, 3888906, 6601656, 8698931, 9196284, 7803323, 5741955, 2377057, -4308282, -11858438, -13609863, -7960920, -1933553, -1689310, -4639573, -5171780, -3091859, -1347393, 154701, 2928928, 5606268, 6401316, 6783170, 8074747, 7907037, 4855381, 2705006, 4555681, 6442356, 3135781, -2913545, -5223240, -3345035, -2267610, -3565618, -4133752, -2593961, -372285, 2515039, 6321469, 7724101, 4191481, 669370, 3687505, 9545622, 7717244, -2999627, -11312285, -9242610, -2192681, 985209, -192450, -1593593, -3134711, -6575915, -9013221, -5711838, 2197030, 8157075, 7839393, 3146413, -758071, -564812, 2027520]
9187B027520j60516m751998l508052M494525R490824L997859n425510p435014
9179a270362k326210P36684o40220r28376N95060j161140m905487k909691M336037
9170h473705O377430o4661m919121j589230K617145P74335j150935L296604O888351
9161C756213L79167r404314q253381K683374Q158507K260167m058039j667922
9153f146228L566321K297365l567819n494705j706209J769106Q71888j832003
9145a0242284j986184J077070M512591N748449M990630L848517K304965q72604
9137I381150m378088m511695j183395K37899l049619n491344j271887N235816
9129e031163N001645j404981m256577J25826M181257J974995j896124j286794
$$ y = [2027520, 1867004, -2884994, -6393046, -1898521, 7592303, 11590162, 6164652, -1270362, -3596572, -2859888, -3500108, -4428484, -3833424, -4994564, -9900051, -12809742, -8473705, -2096275, -2160936, -7080057, -8669287, -6052142, -5277807, -6428742, -3132138, 3756213, 4135380, -5268934, -13522315, -10838941, -2680434, -420267, -4478306, -6146228, -2579907, -282542, -3850361, -9345066, -11051275, -9282169, -8410281, -10242284, -12228468, -11151398, -6638807, -890358, 4100272, 7948789, 10253754, 9381150, 5003062, 491367, -692028, -454129, -3503748, -8995092, -10266979, -5031163, -29518, -1434499, -5691076, -5565250, -1383993, 591002, -1305122, -2591916]
9121b591916J551920J618435L77191J701096L278671L14532m938269n468183l24438
9112d480961M122735L721566R11330r15078j511062j197772O04070K869781L274727
9103G399336J990547J237022P30827j810667n169747m992440j023947J462505
9095a76564k84723k270547o15737K290746K412964O10522M7133M28506l53981
9086B088319j343330k05242J837117J431435j486727l802465l890929k429640
9078g801462K56246L535207M360035O44351l840774l170931J946355M471586J072913
9069A473526l591008m424380k295334j40789K033863M349022L993988R3k740649
9060a341668k9664L963825K201056l824165n707707j142524K691644R32674j513491
$$ y = [-2591916, -1039996, 578439, 955630, 2656726, 5935397, 6249929, 1311660, -4156523, -4480961, -358226, 3363340, 4274670, 3359592, 1848530, 650758, 1254828, 4124609, 7399336, 9389883, 10626905, 11357732, 9547065, 4377318, -615122, -1639069, -176564, -461287, -2731834, -3347571, -1056825, 1356139, 1966661, 2013794, 2442300, 2088319, 744989, 539747, 2376864, 3808299, 2321572, -1480893, -5371822, -7801462, -7545216, -4010009, 350026, 994377, -2846397, -6017328, -4070973, 400613, 1473526, -2117482, -6541862, -8837196, -8977985, -6944122, -2595100, 1398888, 1398981, -1341668, -1371332, 2592493, 4793549, 969384, -4738323, -5880847, -3189203, -2256529, -3770020]
9051c770020J062260N205783L974780j534936l879392p90723K359339J824442
9043D451533L66964J019592J853769J59842k550685l342993k559673k246539k150144
9034d998334n76430K240707M295255M174353J565776k703900n622017l880016
9026e504606R80541K741338j077461m773936k767884J549044J390789k052045
9018i514220j686645L145646N093725Q56178l450763k246500J334619J775724
9010d692236q5032m355K135511L139275K146076P96154k38698r96756m36773J596189
9000C359355K580997P64234j650554j871570q02462p38320j224278p43557j55164
8991d81319o79073p63136J001528K082568l34057l654985k737607K435752O462355
$$ y = [-3770020, -2707760, 2498023, 6472803, 4937867, 1058475, 267752, 2627091, 4451533, 4818497, 5838089, 7691858, 7851700, 5301015, 1958022, -601651, -2848190, -4998334, -5574764, -3334057, 961198, 5135551, 6701327, 3997427, -1624590, -5504606, -4524065, -1782727, -2860188, -7634124, -10402008, -8852964, -7462175, -9514220, -11200865, -8055219, -2961494, -2105316, -5556079, -7802579, -6467960, -4692236, -4777268, -4781623, -2646112, 493163, 2639239, 3435393, 3196695, 2199939, 1763166, 3359355, 5940352, 6704586, 5054032, 3182462, 2380000, 1641680, 417402, -326155, -481319, -1160392, -1923528, -922000, 1160568, 826511, -2828474, -5566081, -3130329, 3332026]
8982C332026N594614J318488k821817m690288m234811l228527l385812l118856
8974a1234983R50250O982662P188162j246578r269004o825257K969595Q442980
8966b042173N596236Q59563r95110j808626k336904L59161N157586N588497J72901
8957A0551131l985931k331920O4952k065517m733221j556382N060378P089457
8949H092947K484709k864790l574187k57475K708673J576020l597349q047270
8941c478722o600610m75641L474633K159143L60016K362472M611498J919431l069141
8932A263079l314880J530207M135570L0965o100871o501173K65253P783580Q746625
8923G838355K737140l356619l531287l8787M65366k728941l262861J758013O188760
$$ y = [3332026, 8926640, 10245128, 7423311, 2733023, -1501788, -4730315, -8116127, -11234983, -10284733, -3302071, 3886091, 2639513, -6629491, -13454748, -10485153, -2042173, 3554063, 4413626, 3418516, 1609890, -727014, -367853, 4789733, 10378230, 10551131, 6565200, 4233280, 4298232, 2232715, -2500506, -4056888, 1003490, 8092947, 10577656, 7712866, 4138679, 3881204, 6589877, 8165897, 4568548, -3478722, -10079332, -10554973, -7080340, -4921197, -4561181, -2198709, 2412789, 4332220, 1263079, -2051801, -521594, 3613976, 3644941, -2455930, -8957103, -8691850, -908270, 7838355, 10575495, 7218876, 3687589, 3648802, 4114168, 1385227, -1877634, -119621, 6069139]
8914F069139L671082k859328n616966k624495J307296K164443M23961j655876
8906H79256k384954j069674R58491J047873p28328o49098K786655N186386K316670
8897H343277k920848m151068l81070L250688K580526j428368m858452m416397
8889c981712r2868L777512K460175k407074l804780M71632L812052J074459k925551
8880a616155j455572K802748K571045j603938k942888m82958Q9954k489579k671801
8871g799144J503201M220964J372012k815367k573720J298015L983231L345303
8863B534495P06040k132339l836294l443468j209774J421163K941988K108483
8855i09706j138802l498015m57577O141604P225983j178196r322776n820111M920502
$$ y = [6069139, 9740221, 6880893, 1263927, -1360568, -53272, 2111171, 2535132, 879256, -1505698, -2575372, -1616881, -569008, -1297336, -1946434, 840221, 6026607, 8343277, 5422429, 1271361, 890291, 4140979, 6721505, 5293137, 434685, -3981712, -4074580, -297068, 2163107, -243967, -4048747, -3577115, 234937, 1309396, -1616155, -3071727, -268979, 2302066, 698128, -2244760, -2727718, -2637764, -5127343, -7799144, -6295943, -2074979, -702967, -3518334, -6092054, -4794039, -810808, 2534495, 3240535, 1108196, -2728098, -6171566, -7381340, -5960177, -3018189, -909706, -2048508, -5546523, -6004100, 137504, 7363487, 6185291, -3137485, -8957596, -4037094]
8846d037094P951792l24593p352083l859472L450700M156469o60494l108439j446127
8837e229341P6253K57464J855549M950944N756581K287502k751949n222502l666214
8828a685713j76632K014631J987671J433688Q31295j803292n708290n147174K062546
8819f191270P826960L769419m913106n804877J767609O028882J927188k018373
8811B392432L13895K967228M91661k089258k08516N71627m203362o999320l03000
8802g066613Q654977P862622p97251n564394l084167o4380K56635P80824J273397
8793B251650j729280o116180n903457j523896J219309J519313K968147M019781
8785c294613J91101m903960k784759M971380P339971J337302l404725p97971L105425
$$ y = [-4037094, 3914698, 3590105, -3761978, -7621450, -4170750, -14281, -674775, -3783214, -5229341, -5153088, -4895624, -3040075, 1910869, 7667450, 9954952, 7203003, 1980501, -1685713, -1862345, 152286, 2139957, 3573645, 4404940, 2601648, -3106642, -8253816, -6191270, 1635690, 5405109, 492003, -5312874, -3545265, 2483617, 4410805, 2392432, 2706327, 5673555, 6165216, 4075958, 3867442, 4439069, 235707, -6763613, -7066613, 1588364, 9450986, 8653735, 3089341, 5174, -59206, 197429, 978253, 2251650, 522370, -5593810, -11497267, -13021163, -11801854, -10282541, -7314394, -3294613, -3103512, -8007472, -10792231, -5820851, 1519120, 2856422, -548303, -1346274, 1759151]
8776A759151K378858N36634J477275J546023k261150n160286k959535L00511J37682
8767b244837m67507J866942L327157J49612l314405j934958J047765O06547m76823
8758a440507K200701M666959J196671l858608k417391K539180J167440n599369
8750a544924o108145K629908Q675265L193728o278410p708223j349538L577245
8742d913094L369221K284540L037155K928264l8472l050373k596303N21737K435884
8733C978559J186175j230513j826115m77841M28797j28863n56320j26028q72568
8724C75283l632125m899958j355684M430115P101782N771446L373827M63125l993254
8715G634557o516563j980985O097021P001205j622628q352653m376674K875026
$$ y = [1759151, 4138009, 4674643, 6151918, 7697941, 5436791, 276505, -2683030, -2382519, -2244837, -2712344, -845402, 2481755, 2631367, -683038, -2617996, -1570231, -963684, -1440507, 760194, 5427153, 6623824, 2765216, 347825, 2887005, 4054445, -1544924, -7653069, -5023161, 3652104, 6845832, 567422, -7140801, -8490339, -4913094, -1543873, 740667, 3777822, 6706086, 6667614, 3617241, 1020938, 1542675, 3978559, 5164734, 3934221, 2108106, 1630265, 2059062, 1930199, 1373879, 1247851, 375283, -3256842, -8156800, -9512484, -5082369, 2019413, 7790859, 11164686, 11627811, 7634557, 1117994, -862991, 5234030, 12235235, 10612607, 2259954, -2116720, 758306]
8707G58306J583267n528455o181656P90366L672919k031622n613673R56743R052025
8698b541780O726467k529682n877437r85812K634122O98669q2620M267214O929484
8689I238625J899422m998352m635636J396934L803262j50604l718948j780911
8681A053792K414073L269978J73338l494394m838999k922412J255352M576778
8673A487506M146399J043469o95219M23805J793688J339265N6295j286277l711972
8664D596959o106608m336650K006700O171819K684397l874231m617311R11859
8656b563066M574706K077152j578940j080930J279882O66086k173882k865508
8648a664500p08802R07593J86425j164269j354943n31215N55413J278274Q48089
$$ y = [758306, 2341573, -3186882, -9368538, -8578172, -4905253, -6936875, -12550548, -11593805, -2541780, 4184687, 1655005, -4222432, -5208244, -2574122, -1875453, -1958073, 2309141, 9238625, 11138047, 6139695, 1504059, 2900993, 6704255, 6553651, 2834703, 1053792, 3467865, 6737843, 6911181, 3416787, -1422212, -4344624, -3089272, 1487506, 5633905, 6677374, 5982155, 6405960, 8199648, 9538913, 9595208, 8308931, 4596959, -1509649, -5846299, -3839599, 2332220, 5016617, 1142386, -3474925, -2563066, 2011640, 4088792, 2509852, 1428922, 2708804, 3374890, 1201008, -1664500, -2373302, -1465709, -1279284, -2443553, -3798496, -4329711, -3774298, -2496024, -1647935]
8639a647935l63619l9048K749432M473395J295729m104267m699720P60080M858134
8630C282181J677936m571172n697482j229175J900750L97620r93474K236705O978004
8621C981893P049052K018244k685240l355448j950111k068580l826374m233445
8613e070009j460797K725077M913144L820537J400570q5977j040512l002486m785050
8604b585503l022896K384492O276965M295311q85059k626036J042910N099538
8596I979722M110133j588329o987549p553865k721978L744256O455676L529148
8588H967214p40732p67812K698877L324663j570002o843399p100658m208695l076539
8579i317083l276156n72976M689945O984362L966163q8451j035333k87827q32428
$$ y = [-1647935, -2011554, -2050602, 698830, 5172225, 6467954, 2363687, -2336033, -1575953, 3282181, 4960117, 388945, -5308537, -6537712, -4636962, -4239342, -5232816, -2996111, 3981893, 11030945, 13049189, 10363949, 7008501, 5058390, 2989810, -836564, -5070009, -6530806, -3805729, 1107415, 4927952, 6328522, 6242545, 5202033, 2199547, -2585503, -5608399, -3223907, 3053058, 7348369, 6463310, 3837274, 4880184, 9979722, 14089855, 12501526, 5513977, -2039888, -4761866, -1017610, 5438066, 8967214, 8226482, 7458670, 10157547, 13482210, 11912208, 5068809, -2031849, -6240544, -9317083, -12593239, -13166215, -8476270, -1491908, 2474255, 2385804, 1350471, 1062644, 230216]
8570B30216j894184j171414M49504L25699j356503j939530m20690J697282L003397
8561a076223L002406J147279k122355m034688k313980R22164J447036p57245j223570
8552e009176J928108M533457K389062k405949m462753k575011m62376n91989r04456
8543g561083J268577M617678N230391J780207k353601k726898R77053M348533
8535E580857L260867j388899n086284n171714l047837j112682M8888P24048P72179
8526e420577N48821R47407J221584o98467m074878m664976p66863L294553L386001
8517f227395K016558L540400N736670K944353l654374o594358l598455o82406
8509f519007j642060k282597R50087L931653K026737j868332k838982k180730
$$ y = [230216, -1663968, -2835382, -2385878, -2060179, -3416682, -5356212, -5776902, -4079620, -1076223, 1926183, 3073462, 951107, -3083581, -5397561, -4475397, -3028361, -3785606, -5009176, -3081068, 1452389, 3841451, 1435502, -3027251, -5602262, -6064638, -6656627, -7561083, -6292506, -1674828, 3555563, 5335770, 2982169, 255271, 1232324, 5580857, 8841724, 7452825, 2366541, -2805173, -5853010, -6965692, -6916804, -6192756, -5420577, -4871756, -3924349, -2702765, -3401232, -7476110, -12141086, -12907949, -9613396, -6227395, -4210837, -670437, 5066233, 8010586, 4356212, -2238146, -5836601, -6519007, -8161067, -10443664, -9493577, -5561924, -3535187, -5403519, -8242501, -10423231]
8501a0423231l035551k689220K348930P340796N055505j519001k476595L235689
8493b162678N932459Q28824m809519l968051N2731J225726L89049R44434J641792
8484G4767L54947m72278J206223J699369j933196m942968k069224K725816K247750
8475a108794j711972j600175K691889L953446L49936k232560j346201j308865
8467b313296l211231j798630L705872N359434j041981p587799n505689J883559
8459a0509761N262978L115426J087098J240151N92405j281663j186711J226064
8451d54013K445187R45442j162979k300025k534186j158348J935507L325055k6525
8442A015115m607051m168845N11380K392654o34245k517919Q84365N510634O290373
$$ y = [-10423231, -13458782, -16148002, -13799072, -6458276, -1402771, -2921772, -5398367, -2162678, 3769781, 4598605, -210914, -4178965, -4126234, -2900508, -2511459, -1567025, 74767, 429714, -42564, 1163659, 2863028, 929832, -4013136, -6082360, -3356544, -1108794, -2820766, -4420941, -1729052, 2224394, 2574330, 341770, -1004431, -2313296, -5524527, -7323157, -3617285, 1742149, 700168, -6887631, -12393320, -10509761, -5246783, -2131357, -1044259, 195892, 788297, -493366, -1680077, -454013, 1991174, 2936616, 1773637, -526388, -3060574, -4218922, -2283415, 1041640, 1015115, -3591936, -7760781, -7249401, -4856747, -5490992, -8008911, -7124546, -1613912, 4676461]
8433D676461M330922K592795P7664m300885o717124l555953J577383K311201q73137
8424A19327j707682J839068M618224K185641l277757o491008m955439K9626N196241
8415b443759O831023L212693k771443n411855k269511K736032L722236m03803
8407C201613m794740m212583J016846N286014M212370j02777j870743Q84855M230711
8398G851566M077696R05393k520934m775443n027904k284594J537014J427006
8390A189800l581240o574516j707403N845412O102496q95350m874464q59066L837224
8381a517107J768835l289561l199835J838553M669568K480526k89350P7474J502848
8372D041951L50004k963390m447431j317626M462183P424814M343559j396640
$$ y = [4676461, 9007383, 11600178, 11677842, 7376957, 659833, -2896120, -1318737, 992464, 119327, -1588355, 250713, 4868937, 7054578, 3776821, -2714187, -7669626, -7640000, -2443759, 4387264, 7599957, 4828514, -583341, -2852852, -116820, 3605416, 3201613, -1593127, -5805710, -4788864, 497150, 4709520, 4606743, 2736000, 3620855, 7851566, 11929262, 12834655, 10313721, 5538278, 510374, -1774220, -237206, 1189800, -2391440, -8965956, -10673359, -4827947, 1274549, 379199, -4495265, -5354331, -1517107, 251728, -3037833, -6237668, -4399115, 270453, 2750979, 2461629, 2539103, 4041951, 4391955, 1428565, -3018866, -4336492, 125691, 7550505, 11894064, 10497424]
8364A0497424l490589r33265J138598j55991j253678O70855J745063j989565o328381
8355i9529m409991J964486M382336O16092k610643q12759K046516J494978j98292
8346B373194P04709K232078L70725l432704m026263l01728L497154L745721J149866
8337F312752j345026j662319J99062K120058J633156p52971j439043J166500L406893
8328I639062J112461m048896o537494m377198q04516J242428K127530K324887
8320F78264M74084l257730n196144k479948K609464N367860M386797K018516K42931
8311D844094j030581j889968j589924l70470K40609j85331k82343M47195L47152
8302E30433j480908k877929j491449J323252K114318L15477j133391k64259J508454
$$ y = [10497424, 7006835, 6073570, 7212168, 7056177, 5802499, 6473354, 8218417, 6228852, -99529, -4509520, -2545034, 1837302, 2453394, -157249, -970008, 1076508, 2571486, 2373194, 3077903, 5309981, 5680706, 2248002, -1778261, -2079989, 1417165, 5162886, 6312752, 4967726, 3305407, 3504469, 5624527, 7257683, 6504712, 5065669, 6232169, 9639062, 10751523, 6702627, 165133, -4212065, -5016581, -3774153, -1646623, 678264, 1152348, -2105382, -7301526, -9781474, -7172010, -1804150, 2582647, 4601163, 4844094, 3813513, 1923545, 333621, -36849, 203760, 18429, -263914, 183281, 530433, -950475, -3828404, -5319853, -3996601, -1882283, -1566806, -2700197, -2964456, -1456002]
8293a456002K089308J254001m95792l049363n140280m177121K00511M377206M928690
8284a468842K820990J032223r4413j924867l473593k172051J717092M981792N618372
8275G036703L934324K16850m626802o647723k412647M282348N102861j229786
8267E656128n935086k480951L752179L738609j715547m079588m93022K865446
8259A308168J236409k056757j916029J035340K778149K053700N92450n87382j848149
8250B595899k981953l120706k197777r21536L00173J365429J971115J944584J580006
8241E35234J119671M56671l91338j155480j653103j535506j92635J876511K346769
8232A406794k73478l677839l938742p58085K018042J528174j065686l101855l014628
$$ y = [-1456002, 633306, 1887307, 1391515, -1657848, -6798128, -10975249, -10774738, -6397532, -1468842, 1352148, 2384371, 2289958, 365091, -3108502, -5280553, -3563461, 1418331, 7036703, 10971027, 11187877, 6561075, -86648, -2499295, 1783053, 6885914, 5656128, -278958, -2759909, 992270, 4730879, 3015332, -1064256, -1557278, 1308168, 2544577, 487820, -1428209, -392869, 2385280, 4438980, 5031430, 4444048, 2595899, -386054, -3506760, -5704537, -6626073, -6325900, -4960471, -2989356, -1044772, 535234, 1654905, 2111576, 1720238, 564758, -1088345, -2623851, -2816486, -939975, 1406794, 1133316, -2544523, -6483265, -7241350, -5223308, -3695134, -4760820, -7862675, -10877303]
8223a0877303J46962O020625J0371968P628197j155428p040707m153863J703136
8215B643587J014950n412061p587688j333339N555123M932563l73650j943978
8207b504493J690997M131476J420537k710818l210249q17335K47596o50737K28883
8198b174143M326485O745429K005955p249039j1497660n931282K943869N948744
8190d881642L431800K902195N778983M762309k991512q461260l424747N360808
8182B476934M357710o555619j2824082n910543M897240O697744P73740j899163
8174g986039K269163O361245N112735J028877k405773n322556o723368k723191
8166a0388907N917309J0576604N043782n069437r374882o224268k480040j669240
$$ y = [-10877303, -10730341, -4709716, 5662252, 13290449, 12135021, 5094314, 940451, 2643587, 3658537, -1753524, -9341212, -10674551, -5119428, -186865, -560515, -2504493, -813496, 3317980, 4738517, 2027699, -1182550, -1999885, -1752289, -2403026, -2174143, 2152342, 8897771, 10903726, 3654687, -7842973, -13774255, -10830386, -4881642, -1449842, 1452353, 7231336, 11993645, 9002133, 540873, -2883874, 2476934, 6834644, 279025, -12545057, -18455600, -13558360, -6860616, -6086876, -7986039, -5716876, 644369, 5757104, 6785981, 4380208, -942348, -7665716, -10388907, -4471598, 6105006, 11148788, 6079351, -3295531, -9519799, -11999839, -13669079]
8158a3669079k25697L895710O584017M596499J078952p0167m79050l075321n427285
8149f791421l150187K144096M274612J400082j837264j493463J172502L399470
8141h81573M628677M771014K763829p90174k754869j659920N419L5138Q9540K061279
8131H268360L662622J701758j917070k025603K099608M961065J960022m543668
8123A4167094p937019m756512J733372M961982J903457l533404n028221j756829
8115b46080Q80302m60614k024976L79387L580531J843618k825829k746089L012092
8106A392342O263384K182263l367865l309550L41726J449562j46808l78380Q00367
8097E227041K27974j458692q63001J132734M72126k171629j866829J472264J936945
$$ y = [-13669079, -13894776, -9999066, -3415049, 1181450, 2260402, 2190235, 1711185, -1364136, -6791421, -9941608, -7797512, -3522900, -2122818, -3960082, -5453545, -4281043, -881573, 3747104, 8518118, 11281947, 10491773, 7736904, 6076984, 6082403, 6117541, 6207081, 8268360, 11930982, 13632740, 11715670, 9690067, 11789675, 16750740, 18710762, 14167094, 6230075, 1473563, 3206935, 8168917, 10072374, 6538970, 1510749, -246080, 634222, 173608, -1851368, -1471981, 2108550, 3952168, 1126339, -1619750, 1392342, 7655726, 9837989, 6470124, 3160574, 3502300, 4951862, 4805054, 4426674, 5227041, 5455015, 3996323, 3133322, 4266056, 4738182, 2566553, 699724, 2171988, 4108933]
8088D108933k259044m708025n73511N674502O919065K959246j425501l912450
8080F783215m976636m051702q24562J748559P97757j634993j701405l1P7006j320931
8070e103723j136723O38212J209502O54846J451092K337912p59011o455066p411744
8061a4574703r83419N842064O118849K081109k20994m36964j779142k934531L92415
8052f495316O835998R267067M384802k964050o572290n552507k551956O14459
8044c033793L006934L165845N34376k965863m492710k714693J575863N709341
8036G85300O108453J618384l664912l898797J027681M555230J741398m446791
8028C825946p504823n414474j270464K041351M144490N067962M350745K445032
$$ y = [4108933, 1849889, -2858136, -3431647, 2242855, 9161920, 12121166, 10695665, 6783215, 1806579, -2245123, -3069685, -1321126, -523369, -2158362, -3859767, -3859798, -3782792, -5103723, -6240446, -5602234, -4392732, -3737886, -2286794, 51118, -707893, -7162959, -14574703, -15558122, -9716058, -3597209, -1516100, -1737094, -2174058, -3953200, -6887731, -6495316, 340682, 9607749, 13992551, 11028501, 4456211, -1096296, -3648252, -3033793, -26859, 3138986, 3673362, 707499, -3785211, -6499904, -4924041, 785300, 6893753, 8512137, 4847225, 948428, 1976109, 6531339, 8272737, 3825946, -3678877, -9093351, -10363815, -8322464, -4177974, 889988, 5240733, 7685765]
8020G685765N87149q41614j997004k107996n17493J231802Q27175j282179k162721
8011A422884n54477J377435J029328j570313m108478m094116p34821L731622M990235
8002A489299J028259m626533o338627k962291J493288L678132M114111L953026
7994A828664K227985j523702m632274m015300j57751L645690M985711L835870
7986F194893J573731j22663m55942n41168k022506m146693m162510j368589J595715
7977c455732K511192J976362Q69449j268385l371682k095951K885328O136877
7969D187458L132793k797155m638234j018576L137224L883330J555387k091800
7961E350427n170483m832105k88390L732991K040168k551272k042697M455397
$$ y = [7685765, 8272914, 7431300, 5434296, 3326300, 2808807, 4040609, 4867784, 3585605, 1422884, 868407, 2245842, 3275170, 1704857, -2403621, -6497737, -7232558, -3500936, 1489299, 2517558, -2108975, -8447602, -11409893, -9916605, -6238473, -2124362, 1828664, 4056649, 2532947, -2099327, -6114627, -6272378, -2626688, 2359023, 6194893, 7768624, 7645961, 7190019, 6648851, 4626345, 479652, -3682858, -5051447, -3455732, -944540, 1031822, 1901271, 632886, -2738796, -4834747, -1949419, 4187458, 7320251, 4523096, -115138, -1133714, 2003510, 5886840, 7442227, 5350427, 179944, -4652161, -4940551, -1207560, 832608, -1718664, -3761361, 694036]
7953F94036Q067336K613813o455364r783490n774407K23752M269161N876884M571199
7944D302920K66775l934999m310159j697286k17711j139717j825493p68927J95729
7935i128868l53281o41411J585508N227009O337783K458582l807359o224049j535300
7926f081386N474625O534684N71732m104641j163566M409579L614582k914467
7918F341142n843769j316837L631482K279656k103090k546992P03556J717141
7910B862289j327483m184260l828067k012579o97590J069849L691198M602056
7902A75413K275573m48798m01632Q89932k2200k466793k832560q90207J22016
7893c599256j71037J353889M122905K554991m223555p663039j248339Q108098
$$ y = [694036, 8761372, 11375185, 4919821, -4863669, -10638076, -10414324, -6145163, -268279, 4302920, 4569695, 634696, -3675463, -5372749, -5590460, -6730177, -8555670, -9324597, -9128868, -9482149, -10123560, -8538052, -3311043, 3026740, 5485322, 1677963, -4546086, -6081386, -606761, 5927923, 6499655, 2395014, 1231448, 5641027, 9255609, 6341142, 497373, -819464, 2812018, 5091674, 2988584, 441592, 1145148, 2862289, 1534806, -2649454, -6477521, -8490100, -9187690, -8117841, -4426643, 175413, 2450986, 2002188, 1600556, 2490488, 2468288, 1495, -2831065, -3721272, -3599256, -3770293, -2416404, 1706501, 4261492, 37937, -7625102, -8873441, -765343]
$$ [...]
##END NTUPLES=NMR SPECTRUM
##END=
