##TITLE=31Pdec_AN-AD-100
 CDCl3, 24 sc
 13.05.2021
##JCAMPDX= 6.0         $$ Bruker NMR JCAMP-DX V2.0
##DATA TYPE= NMR SPECTRUM
##DATA CLASS= NTUPLES
##ORIGIN= UXNMR, Bruker Analytische Messtechnik GmbH
##OWNER= root
$$ XWIN-NMR		Version 3.5
$$ Thu May 13 13:44:28 2021 Russian Standard Time (UT+4h)  she@DPX200
##.OBSERVE FREQUENCY= 81.013821
##.OBSERVE NUCLEUS= ^31P
##.ACQUISITION MODE= SIMULTANEOUS
##.ACQUISITION SCHEME= undefined
##.AVERAGES= 24
##.DIGITISER RES= 16
##SPECTROMETER/DATA SYSTEM= spect
##.PULSE SEQUENCE= zgpg30
##.SOLVENT NAME= CDCl3
##.SHIFT REFERENCE= (INTERNAL, CDCl3, 0, 248.564)
##AUDIT TRAIL= $$ (NUMBER, WHEN, WHO, WHERE, WHAT)
$$ ##TITLE= Audit trail, XWIN-NMR		Version 3.5
$$ ##JCAMPDX= 5.01
$$ ##ORIGIN= Bruker BioSpin GmbH
$$ ##OWNER= she
$$ F:/spectra/data/she/nmr/P31/1/pdata/1/auditp.txt
$$ ##AUDIT TRAIL=  $$ (NUMBER, WHEN, WHO, WHERE, WHAT)
(   1,<2021-05-13 13:43:27.04 +0400>,<she>,<DPX200>,
      <created by zg, POWCHK disabled, PULCHK disabled
       configuration hash MD5:
       00 E9 B6 7A A2 85 ED C7 34 08 36 98 17 FE 4E 26
       data hash MD5: 32K
       6A 40 F2 EF 8C 2A AE 22 B1 62 5F 9C 68 97 DA 90>)
(   2,<2021-05-13 13:43:29.71 +0400>,<she>,<DPX200>,
      <Start of raw data processing
       efp BC_mod = 2 LB = 1 FT_mod = 6 PKNL = 1 PHC0 = -6850.841 PHC1 = 725.8005 SI = 64K 
       data hash MD5: 64K
       43 A7 8A EA A8 8A 7F 0D F4 A4 CD 8D 41 29 5F 3E>)
(   3,<2021-05-13 13:43:50.14 +0400>,<she>,<DPX200>,
      <pk PHC0 = 256.55 PHC1 = -602.2 
       data hash MD5: 64K
       48 09 A9 9A 9E C2 5E A8 B4 07 99 9A 94 62 3D 31>)
(   4,<2021-05-13 13:43:54.09 +0400>,<she>,<DPX200>,
      <abs ABSG = 5 
       data hash MD5: 64K
       FC 30 F0 7D 28 B8 E5 87 D2 4C DD D6 40 8C 25 EE>)
$$ ##END=
$$ 
$$ hash MD5
$$ F5 31 C8 DD D8 73 7B 5D DA 45 D3 C2 5E 05 73 B8
##$RELAX= 
##$RELAX= 
##$RELAX= 
##$RELAX= 
##$RELAX= 
##$RELAX= 
##$RELAX= 
##$RELAX= 
$$ Bruker specific parameters
$$ --------------------------
##$DU= <F:/spectra>
##$EXPNO= 1
##$NAME= <P31>
##$PROCNO= 1
##$TYPE= <nmr>
##$USER= <she>
##$AMP= (0..31)
100 100 100 100 100 100 100 100 100 100 100 100 100 100 100 100 100 100 
100 100 100 100 100 100 100 100 100 100 100 100 100 100 
##$AQSEQ= 0
##$AQ_mod= 1
##$AUNM= <au_zg>
##$AUTOPOS= <>
##$BF1= 81.014009
##$BF2= 200.13
##$BF3= 200.13
##$BF4= 200.13
##$BF5= 200.13
##$BF6= 200.13
##$BF7= 200.13
##$BF8= 200.13
##$BYTORDA= 1
##$CFDGTYP= 0
##$CFRGTYP= 5
##$CHEMSTR= <none>
##$CNST= (0..31)
1 1 145 1 1 1 1 1 1 1 1 1 1 1 1 1 1 1 1 1 1 1 1 1 1 1 1 1 1 1 1 1 
##$CPDPRG= <waltz16>
##$CPDPRG1= <>
##$CPDPRG2= <waltz16>
##$CPDPRG3= <>
##$CPDPRG4= <mlev>
##$CPDPRG5= <mlev>
##$CPDPRG6= <mlev>
##$CPDPRG7= <mlev>
##$CPDPRG8= <mlev>
##$CPDPRGB= <>
##$CPDPRGT= <>
##$D= (0..31)
0 1 0 0 0 0 0 0 0 0 0 0.03 2e-05 3e-06 0 0 0 0 0 0 0 0 0 0 0 0 0 0 0 0 
0 0 
##$DATE= 1620899006
##$DBL= (0..7)
120 120 120 11 120 120 24 19 
##$DBP= (0..7)
150 150 150 150 150 150 150 150 
##$DBP07= 0
##$DBPNAM0= <>
##$DBPNAM1= <>
##$DBPNAM2= <>
$$ [...]
##$SUBNAM3= <"">
##$SUBNAM4= <"">
##$SUBNAM5= <"">
##$SUBNAM6= <"">
##$SUBNAM7= <"">
##$SUBNAM8= <"">
##$SUBNAM9= <"">
##$SW= 501.771253377433
##$SWIBOX= (0..15)
0 1 3 0 0 0 0 0 0 0 0 0 0 0 0 0 
##$SW_h= 40650.406504065
##$TD= 32768
##$TD0= 1
##$TE= 0
##$TE2= 300
##$TE3= 300
##$TEG= 300
##$TL= (0..7)
0 120 53 12 22 120 120 120 
##$TP= (0..7)
150 150 150 150 150 150 150 150 
##$TP07= 0
##$TPNAME0= <>
##$TPNAME1= <>
##$TPNAME2= <>
##$TPNAME3= <>
##$TPNAME4= <>
##$TPNAME5= <>
##$TPNAME6= <>
##$TPNAME7= <>
##$TPOAL= (0..7)
0.5 0.5 0.5 0.5 0.5 0.5 0.5 0.5 
##$TPOFFS= (0..7)
0 0 0 0 0 0 0 0 
##$TUNHIN= 0
##$TUNHOUT= 0
##$TUNXOUT= 0
##$USERA1= <user>
##$USERA2= <user>
##$USERA3= <user>
##$USERA4= <user>
##$USERA5= <user>
##$V9= 5
##$VALIST= <valist>
##$VCLIST= <CCCCCCCCCCCCCCC>
##$VD= 0
##$VDLIST= <DDDDDDDDDDDDDDD>
##$VPLIST= <PPPPPPPPPPPPPPP>
##$VTLIST= <TTTTTTTTTTTTTTT>
##$WBST= 1024
##$WBSW= 4
##$XGAIN= (0..3)
0 0 0 0 
##$XL= 0
##$YL= 0
##$YMAX_a= 15243
##$YMIN_a= -16569
##$ZGOPTNS= <>
##$ZL1= 120
##$ZL2= 120
##$ZL3= 120
##$ZL4= 120
##$ABSF1= 248.5645
##$ABSF2= -253.2056
##$ABSG= 5
##$ABSL= 3
##$ALPHA= 0
##$AQORDER= 0
##$ASSFAC= 0
##$ASSFACI= 0
##$ASSFACX= 0
##$ASSWID= 0
##$AUNMP= <proc_1d>
##$AZFE= 0.1
##$AZFW= 0.5
##$BCFW= 0
##$BC_mod= 2
##$BYTORDP= 0
##$COROFFS= 0
##$CY= -3
##$DATMOD= 1
##$DC= 0
##$DFILT= <>
##$DTYPP= 0
##$F1P= 0
##$F2P= 0
##$FCOR= 1
##$FTSIZE= 65536
##$FT_mod= 6
##$GAMMA= 0
##$GB= 0
##$INTBC= 1
##$INTSCL= 5.30512e-09
##$ISEN= 30
##$LB= 1
##$LEV0= 0
##$LPBIN= 0
##$MAXI= 10000
##$MC2= 0
##$MEAN= 0
##$ME_mod= 0
##$MI= 50
##$NCOEF= 0
##$NC_proc= -5
##$NLEV= 6
##$NOISF1= 182.463
##$NOISF2= 159.3651
##$NSP= 0
##$NTH_PI= 0
##$NZP= 0
##$OFFSET= 248.5645
##$PC= 4
##$PHC0= -6594.291
##$PHC1= 123.6005
##$PH_mod= 1
##$PKNL= yes
##$PPARMOD= 0
##$PSCAL= 0
##$PSIGN= 0
##$REVERSE= no
##$SF= 81.014009
##$SI= 65536
##$SIGF1= 159.3651
##$SIGF2= -187.1042
##$SINO= 113.3802
##$SIOLD= 16384
##$SREGLST= <1H.CDCl3>
##$SSB= 0
##$STSI= 65536
##$STSR= 0
##$SW_p= 40650.406504065
##$SYMM= 0
##$S_DEV= 0
##$TDeff= 32768
##$TDoff= 0
##$TI= <>
##$TILT= no
##$TM1= 0
##$TM2= 0
##$TOPLEV= 0
##$USERP1= <user>
##$USERP2= <user>
##$USERP3= <user>
##$USERP4= <user>
##$USERP5= <user>
##$WDW= 1
##$XDIM= 65536
##$YMAX_p= 434154504
##$YMIN_p= -104079815
$$ End of Bruker specific parameters
$$ ---------------------------------
##NTUPLES= NMR SPECTRUM
##VAR_NAME=  FREQUENCY,     SPECTRUM/REAL,   SPECTRUM/IMAG
##SYMBOL=    X,             R,               I
##VAR_TYPE=  INDEPENDENT,   DEPENDENT,       DEPENDENT
##VAR_FORM=  AFFN,          ASDF,            ASDF
##VAR_DIM=   65536,         65536,           65536
##UNITS=     HZ,            ARBITRARY UNITS, ARBITRARY UNITS
##FACTOR=    0.620285442955139, 1,           1
##FIRST=     20137.2065510759, 0,            0
##LAST=      -20513.1999529892, 0,           0
##MIN=       -20513.1999529892, -104079815,  0
##MAX=       20137.2065510759, 434154504,    0
$$ Real data points
##PAGE= N=1
##DATA TABLE= (X++(R..R)), XYDATA
$$ [...]
43678A11288L49319j22166l98098j32725K19251j81696j208736j490669j83939
$$ 111288 460607 338441 -59657 -192382 26869 -154827 -1363563 -2854232 -3038171
43669c038171J586811K024761R80145j32915m88391o06221q69690p00142J83960
$$ -3038171 -1451360 573401 1553546 1420631 932240 326019 -543671 -1243813 -1059853
43660a059853Q58222M77435l35343m13135J72058L36409k62343p84836n62502
$$ -1059853 -201631 275804 -59539 -472674 -300616 35793 -226550 -1011386 -1573888
43651a573888N3664M21341M30161L06816J81081J10004P4485j80578p93389j211596
$$ -1573888 -1520224 -1098883 -668722 -361906 -180825 -70821 3664 -176914 -970303 -2181899
43641b181899o50525O75956J491836R80364k27104r30026o62365J86492R24085
$$ -2181899 -2832424 -2156468 -664632 315732 88628 -841398 -1503763 -1317271 -393186
43632c93186Q92830n3667j021465p79385N32766J229835K53029j309123j670997
$$ -393186 499644 445977 -575488 -1354873 -822107 407728 660757 -648366 -2319363
43623b319363n81825P74736J441670J297169N81821k17859m85389k71291l50377
$$ -2319363 -2901188 -2126452 -684782 612387 1194208 976349 490960 219669 -130708
43614a30708p77951m40230R12965J516828J35153j474884q96420J007894J213663
$$ -130708 -908659 -1348889 -435924 1080904 1216057 -258827 -1155247 -147353 1066310
43605A066310o82287j782733m66649J256216J122502j82782q08054o50872o11159
$$ 1066310 384023 -1398710 -1865359 -609143 513359 330577 -477477 -1128349 -1739508
43596a739508m86621L92962J409190J334598K01493q97865j346311j201654n06904
$$ -1739508 -2226129 -1833167 -423977 910621 1112114 214249 -1132062 -2333716 -2840620
43587b840620M85127J012472P46824L92737M54615K78992o32625j336020p90486
$$ -2840620 -2355493 -1343021 -596197 -203460 251155 530147 -102478 -1438498 -2228984
43578b228984L44654P08961L45028K78982N70583M31847n7135m7369L60204J52990
$$ -2228984 -1884330 -1175369 -830341 -551359 19224 451071 393936 346567 706771 859761
43568H59761o82065q49105K13268J281097R65363n16012j733687j619547l41872
$$ 859761 177696 -671409 -458141 822956 1788319 1272307 -461380 -2080927 -2422799
43559b422799Q96191Q69963l16495j031718j7966J678686J730864l89273k464357
$$ -2422799 -1526608 -656645 -973140 -2004858 -2022824 -344138 1386726 997453 -1466904
43550a466904k207147n0179J514056R94192m86599p85689N20712J589376P43465
$$ -1466904 -3674051 -3724230 -2210174 -1215982 -1702581 -2488270 -1967558 -378182 365283
43541C65283j110622j482233K92713J950193J323698p12630j611760o67181M75070
$$ 365283 -745339 -2227572 -1934859 15334 1339032 626402 -985358 -1652539 -1177469
43532a177469N38219R5061J9212M2810l27962o27823k31435L70371K22591m70243
$$ -1177469 -639250 -544189 -524977 -482167 -810129 -1437952 -1669387 -1299016 -1076425 -1546668
43522a546668n00905M41640J072956L13651r63009r90577L77560J454192J213921
$$ -1546668 -2047573 -1605933 -532977 -219326 -1182335 -2172912 -1795352 -341160 872761
43513H72761O16793O71661O04624n49399j675167j030043O24942Q55379m90448
$$ 872761 1489554 2161215 2765839 2216440 541273 -488770 136172 991551 501103
43504E01103r04124N68594J601813M70153j038561o66646O31190N88040n54308
$$ 501103 -403021 165573 1767386 2237539 1198978 532332 1163522 1751562 1197254
43495A197254r05871l39106j98319n03756k84437k6136q63076j775767o85956
$$ 1197254 291383 -47723 -246042 -749798 -1034235 -1060371 -1923447 -3699214 -4385170
43486d385170J735960K510147Q86917o69629o29277l62039r26188j005014L37364
$$ -4385170 -2649210 -139063 747854 78225 -551052 -913091 -1839279 -2844293 -2506929
43477b506929J554352J200018L62551N31950J006972M91253m37560n78872l72817
$$ -2506929 -952577 247441 609992 1141942 2148914 2640167 2202607 1623735 1250918
43468A250918p89248j217708o16584L05419K29124l48442j8902R35630J090587
$$ 1250918 461670 -756038 -1372622 -1067203 -838079 -1186521 -1205423 -269793 820794
43459H20794M96337M35625Q40096L20976j118927j690718o26188O20142O64136
$$ 820794 1317131 1752756 2592852 2913828 1794901 104183 -522005 98137 762273
43450G62273l8874m89229o49559p47240m13246M49970R89776O04825j3381J7068
$$ 762273 723399 234170 -415389 -1162629 -1575875 -1125905 -136129 468696 455315 472383
43440D72383L83552K87111j07955m0333M27115M87016k7986m08856l37334l99771
$$ 472383 855935 1143046 1035091 994758 1421873 1908889 1880903 1472047 1134713 734942
43430G34942r53973j323793p72158K86143Q35316P41305Q11929J353601J568152
$$ 734942 -219031 -1542824 -2314982 -2028839 -1193523 -452218 359711 1713312 3281464
43421C281464P95267l56921p82972l65646J2431k46069q05844j006463o09827
$$ 3281464 4076731 3719810 2936838 2571192 2583623 2337554 1531710 525247 -84580
43412h4580N3242L33890j74843r84303r76830J61048J232369J007487l9281m60058
$$ -84580 -31338 302552 127709 -856594 -1833424 -1672376 -440007 567480 528199 68141
43402F8141M8885M74051K80725K2197L7269r2198m46824m26220M7652K07636j82528
$$ 68141 117026 591077 871802 893999 931268 839070 392246 -33974 13678 221314 38786
43391C8786l45197R1122M54766L94756N10899R14969O52829m98284j184282o11616
$$ 38786 -306411 -215289 239477 634233 1145132 2060101 2712930 2214646 1030364 418748
43381D18748q903n04182j044860k56408R49332Q02378k72388m32310L44137L34328
$$ 418748 409845 -94337 -1139197 -1395605 -446273 356105 83717 -348593 -4456 329872
43371C29872p44174j159327j27042R58520R12707L23965q1169p02867j624702
$$ 329872 -414302 -1573629 -1700671 -742151 170556 494521 413352 -289515 -1914217
43362a914217j634802p6372J610429J653301L93833l74539O9241P70410P46593
$$ -1914217 -3549019 -3625391 -2014962 -361661 32172 -342367 -273126 497284 1243877
43353A243877J57845k29189o9607K38306O7015n83886q81775k09500P61363P72734
$$ 1243877 1401722 1172533 1102926 1341232 1408247 824361 -57414 -266914 494449 1267183
43343A267183k70124j126081r37153k07535J99661J37289j05742k95269j08719
$$ 1267183 997059 -129022 -1066175 -1273710 -1074049 -936760 -1042502 -1337771 -1446490
43334a446490O19254J185707N80972q18737j301963k24752Q73139N23493m72709
$$ -1446490 -827236 358471 939443 120706 -1181257 -1406009 -532870 -9377 -482086
43325d82086m41936M72289O71567k36248q42494j94961P78903P29745j76517n99267
$$ -482086 -924022 -451733 219834 -16414 -858908 -1053869 -274966 454779 278262 -321005
43315c21005O5859Q62791N55383o43236j181152j97213J162317J182213n8319
$$ -321005 -255146 607645 1163028 519792 -661360 -858573 303744 1485957 1427638
43306A427638q68177m33370K10512M4077m60683m42284m024M11644Q60503J137590
$$ 1427638 559461 126091 336603 380680 -80003 -522287 -526311 -114667 745836 1883426
43296A883426L88308j301153k116624q56626R60249J082279k33488r26722m05116
$$ 1883426 2271734 970581 -1146043 -2002669 -1042420 39859 -193629 -1120351 -1525467
43287a525467J16981J94329O37139J326368R71595m26028j121196l99143K95527
$$ -1525467 -1408486 -1214157 -577018 749350 1720945 1294917 173721 -225422 70105
43278G0105q9330n88994k62410J40362j01358j89378M06244N01358o27399j341957
$$ 70105 -19225 -608219 -870629 -730267 -831625 -1021003 -614759 -113401 -740800 -2082757
43268b082757j03501J630110J463526q8946n47767M29669P95990k01715r83215
$$ -2082757 -2186258 -556148 907378 818432 270665 700334 1496324 1294609 311394
43259C11394o27064j82832k92101n5175P05987M77424j225862k298469r79076
$$ 311394 -315670 -498502 -790603 -845778 -139791 337633 -888229 -3186698 -4165774
43250d165774J339203K136007J272771M80098L47859j1071p65296r14962j11747
$$ -4165774 -2826571 -690564 582207 1062305 1410164 1399093 633797 -281165 -392912
43241c92912P22047Q53842N44640J65874l69082j002747j273440r66524m04330
$$ -392912 329135 1182977 1727617 1893491 1524409 521662 -751778 -1718302 -2122632
43232b122632J9838Q8920k90298p62025m61993Q68812K017461J614053J54073
$$ -2122632 -2102794 -2013874 -2304172 -3066197 -3528190 -2659378 -641917 972136 1126209
43223A126209n00650L10809J252564J048518P4558o45619q81371q64065m81847
$$ 1126209 625559 936368 2188932 3237450 3312008 2666389 1785018 920953 439106
43214D39106K60117O75702K49325m45829n77194l49565m86552p66619k68899R22922
$$ 439106 699223 1374925 1624250 1178421 601227 251662 -234890 -1001509 -1270408 -347486
43204c47486J486234P37236k91718l49858K63686L79940j10902k14626L37083
$$ -347486 1138748 1875984 1584266 1234408 1498094 1878034 1767132 1552506 1889589
43195A889589M97146l59145j214624q77073J07965K61503m96784p73100l2649
$$ 1889589 2386735 2027590 812966 -64107 43858 305361 -191423 -964523 -997172
43186i97172N07511q8919r08918o71706K60017O16109K70483J64847N35835O37481
$$ -997172 -489661 -578580 -1487498 -2159204 -1899187 -1283078 -1012595 -847748 -311913 325568
43176C25568K17544n5081J14747R2121n12476j068541q64457r8671N71499Q82841
$$ 325568 543112 488031 602778 694899 182423 -886118 -1750575 -1849246 -1277747 -394906
43166c94906R00682O04964K5479n35362p83961p27235n10592k19997P1585L24763
$$ -394906 505776 1110740 1136219 600857 -183104 -910339 -1420931 -1640928 -1569343 -1244580
43156a244580N70443O56265K19297n98582p89909L21724J758265J813953L00714
$$ -1244580 -674137 -17872 201425 -397157 -1187066 -865342 892923 2706876 3007590
43147C007590j227805j610096j243977q54808m28088K7682q1316q31673j148691
$$ 3007590 1779785 169689 -1074288 -1929096 -2357184 -2329502 -2410818 -3242491 -4391182
43138d391182k87352Q91337J168951P55064O79839R93169Q38557K2986p10153
$$ -4391182 -4678534 -3787197 -2618246 -1863182 -1183343 -190174 648383 671369 -38784
43129c8784r16204q78061p32125j58550P85508J307844P91194l39840r96268n56418
$$ -38784 -954988 -1833049 -2565174 -2723724 -1938216 -630372 160822 -179018 -1175286 -1731704
43119a731704M75000R50381L47524n31875n23028L12179P47347J69796n71188
$$ -1731704 -1256704 -306323 41201 -490674 -1013702 -701523 45824 215620 -355568
43110c55568m93609K00312P08288P21790L06074m65797j052661n81946O65515
$$ -355568 -849177 -648865 59423 781213 1087287 621490 -431171 -1013117 -347602
43101c47602R84319l40664j460505m65543J453196J488561n45293j861436q48198
$$ -347602 636717 296053 -1164452 -1629995 -176799 1311762 766469 -1094967 -1943165
43092a943165P73649Q45761j88406n50597K6709L88341Q0926k10496q5583L4267
$$ -1943165 -1169516 -323755 -512161 -1062758 -1036049 -647708 -566782 -777278 -862861 -828594
43082h28594j27519j94679J12032L70684J3789p81808j140565n05036O02005J134388
$$ -828594 -956113 -1150792 -1038760 -668076 -654287 -1436095 -2576660 -3081696 -2479691 -1345303
43072a345303Q06647L41515K81184K23876k77112p67833o52768k87488k92324
$$ -1345303 -538656 -197141 84043 307919 30807 -737026 -1389794 -1677282 -1969606
43063a969606l03244L41779J082021Q21179l6016K7556J041261J195591k78225
$$ -1969606 -2272850 -1931071 -849050 -27871 -63887 -36331 1004930 2200521 1922296
43054A922296j642996j121762O06886J592245J147015j3771j154692j746089j157385
$$ 1922296 279300 -842462 -235576 1356669 2503684 2489913 1335221 -410868 -1568253
43045a568253M92108J742380J320684j50169j031679p56833K578O42265Q99967
$$ -1568253 -1076145 666235 1986919 1836750 805071 48238 50816 693081 1593048
43036A593048L88770q07538j497219p10826O60392R44543J03468m33380j16841
$$ 1593048 1981818 1174280 -322939 -1033765 -373373 571170 674638 241258 124417
43027A24417K21056J90113L63548P09749L13173p87751j224219n28872n1075o21485
$$ 124417 345473 535586 899134 1608883 1922056 1134305 -89914 -618786 -669861 -1291346
43017a291346r66357J16619J431039J075322m55857q83461M47475J665552J107323
$$ -1291346 -2257703 -2141084 -710045 365277 -90580 -974041 -526566 1138986 2246309
43008B246309n71848j570186j183881k59213O4407l50201m69559O57040K319262
$$ 2246309 1674461 104275 -1079606 -1338819 -1274412 -1624613 -2094172 -1437132 882130
42999H82130K486876L89154j994444k173435l55315J012265O43543l02566m60624
$$ 882130 3369006 3758160 1763716 -409719 -765034 247231 890774 588208 127584
42990A27584l7648K12512K35481R6742m78359j121575p27469O61760J270732J49734
$$ 127584 89936 302448 537929 634671 156312 -965263 -1692732 -1030972 239760 389494
42980C89494j058178n13029R14913J126902J98311o4427N72137N18546n45466
$$ 389494 -668684 -1181713 -266800 860102 1058413 993986 1566123 2084669 1539203
42971A539203r59092o6966N19712l09894j275523q99921K16067P31377N96582
$$ 1539203 580111 513145 1032857 722963 -552560 -1452481 -1236414 -505037 91545
42962I1545L07962l61607j335056j382183j0842J149269O98756j54253L21109
$$ 91545 399507 37900 -1297156 -2679339 -2690181 -1540912 -842156 -996409 -675300
42953f75300J265332P81076m92545m01245P38426N38699j092241j538093r0134
$$ -675300 590032 1371108 878563 477318 1215744 1754443 662202 -875891 -966025
42944i66025O25382p40238j657961K6089K198589J761858l93920r86402M67340
$$ -966025 -340643 -1080881 -2738842 -2712753 -514164 1247694 853774 -132628 334712
42935C34712J409241N88926n29340p54796p27201r72250q04077K4330M90710j0916
$$ 334712 1743953 2332879 1803539 1048743 321542 -650708 -1454785 -1430455 -939745 -950661
42925i50661o51745n62473L3483O29718J119581J192601L62533q62451j133440
$$ -950661 -1602406 -2164879 -2131396 -1501678 -382097 810504 1173037 310586 -822854
42916h22854j77269P00655O18111K71306L79979M25371n3720k64559M45706J106341
$$ -822854 -1000123 -299468 318643 589949 969928 1395299 1341579 1077020 1522726 2629067
42906B629067M79438r07562j533885j097696n43233l24847p0040K78136L51507
$$ 2629067 3108505 2200943 667058 -430638 -973871 -1298718 -1368758 -1090622 -739115
42897g39115K89633N19690O68865j3786j091244j127106K32636J540952J416320
$$ -739115 -449482 70208 739073 725287 -365957 -1493063 -1260427 280525 1696845
42888A696845K02446p53865p35779o9881N06800M52399k00376q16518q38538m68451
$$ 1696845 1899291 1145426 409647 339766 846566 1298965 1098589 282071 -556467 -1024918
42878a024918k12689L813M78730P32428J7287j148134j264008j8795J101129R36659
$$ -1024918 -1237607 -1233794 -755064 -22636 -5349 -1153483 -2417491 -2436286 -1335157 -398498
42868c98498J63890p7279J15595P4664p3317J20160L20403n3243p07865r40420
$$ -398498 -234608 -311887 -196292 -121628 -194945 -74785 245618 192375 -515490 -1455910
42858a455910p36797m44715P4075Q97834J245979M90619m66274j86564J152090
$$ -1455910 -2192707 -2637422 -2563347 -1665513 -419534 71085 -395189 -581753 570337
42849E70337J918614J265935l2200r57756j256670j026486m34431O6976K25335
$$ 570337 2488951 3754886 3722686 2764930 1508260 481774 47343 114319 339654
42840C39654N66463J412456J670675J33247k143135k593878o30854J386542J319154
$$ 339654 906117 2318573 3989248 4122495 1979360 -614518 -1245372 141170 1460324
42831A460324j99282j208247r85490j59140N78551Q35319M60672p0130L740M99873
$$ 1460324 1261042 52795 -932695 -1091835 -513284 322035 782707 712577 716317 1216190
42821A216190M10674l41016n97716J4215L19721l11852p75535k85830P1237o36891
$$ 1216190 1626864 1285848 688132 702347 1022068 710216 -65319 -351149 -279912 -916803
42811i16803j204516k27376J298027J486567O86801P22023J584989J375245m64440
$$ -916803 -2121319 -2348695 -1050668 435899 1122700 1844723 3429712 4804957 4340517
42802D340517k130380k118776j042281j82995K46507O59104J000966Q37745K2594
$$ 4340517 2210137 91361 -950920 -1133915 -887408 -228304 772662 1610407 1633001
42793A633001j012451j400972o00680O30018P79193k64109p25581L30969J173636
$$ 1633001 620550 -780422 -1381102 -751084 28109 -236000 -961581 -630612 543024
42784E43024J6448j787587j515632P06289K070337J268789j01032n15721l90050
$$ 543024 559472 -1228115 -2743747 -2037458 32879 1301668 1200636 684915 294865
42775B94865l98899k22711K40897L54664J40567M10319R73624O29623n40357r45515
$$ 294865 -104034 -326745 -85848 268816 409383 819702 1793326 2422949 1882592 937077
42765I37077j58519L84863P4322J07679Q25098O68810p93804j449737j38161R53645
$$ 937077 778558 1163421 1237743 1345422 2170520 2839330 2045526 595789 457628 1411273
42755A411273j93562j764821r27613J363939J732071l28197j878404j166523K67611
$$ 1411273 1217711 -547110 -1474723 -110784 1621287 1293090 -585314 -1751837 -1484226
42746a484226O53895M82658Q40871J272880P23158n31514j175208o38504K61463
$$ -1484226 -830331 -347673 493198 1766078 2489236 1957722 782514 144010 405473
42737D05473M35425j20947l31187M46594J243661O21602j063035j773783n98651
$$ 405473 840898 719951 388764 835358 2079019 2700621 1637586 -136197 -734848
42728g34848R12190J031763J48988l66612l45108l86686k58679N69012J400281
$$ -734848 177342 1209105 1358093 991481 646373 259687 1008 570020 1970301
42719A970301J021201l27810j158844q14590j17975j3639n59191j182204j209404
$$ 1970301 2991502 2663692 1504848 690258 572283 558644 -547 -1182751 -2392155
42710b392155l91193O04234P89012L13103K94141P53419L03435j231472j809452
$$ -2392155 -2783348 -2179114 -1390102 -1076999 -782858 -29439 273996 -957476 -2766928
42701b766928k90672J366273J065719q1067R8740R80807N11738p72210o16298
$$ -2766928 -3057600 -1691327 -625608 -706675 -607935 372872 884610 112400 -503898
42692e03898O62413M99596j237649j673560K13546J721580Q04159q14718p22364
$$ -503898 158515 658111 -579538 -2253098 -2039552 -317972 486187 -328531 -1050895
42683a050895N60107J046125L88505m18150r08811j029475m31635O78102J156151
$$ -1050895 -490788 555337 943842 525692 -383119 -1412594 -1844229 -1166127 -9976
42674i976N63184l4117J30394L58262J04094Q6669N95940M41001r38669j969468
$$ -9976 553208 519091 649485 1007747 1111841 1198510 1794450 2235451 1296782 -672686
42664f72686j240480J80484N32185J10194K85395R32717R06655K15027k80555
$$ -672686 -1913166 -1732682 -1200497 -1090303 -804908 127809 1034464 1249491 968936
42655I68936o06397j179813j284776j00674J316091J241941J17631n0986J019989
$$ 968936 362539 -817274 -2102050 -2202724 -886633 355308 472939 421953 1441942
42646A441942J509746N78762m61126o14300o54215j185077j222739k3261J224387
$$ 1441942 2951688 3530450 3069324 2455024 1800809 615732 -607007 -630268 594119
42637E94119J043813p9887o01315l01301k44593p55416r42269k86144N51350Q12175
$$ 594119 1637932 1558045 956730 655429 410836 -344580 -1286849 -1572993 -1021643 -209468
42627b09468N69972J94798k75836p18669o06321J69434O89554J35283p63963n03119
$$ -209468 360504 555302 279466 -439203 -1045524 -876090 -186536 -51253 -815216 -1318335
42617a318335R28059J760801R30663l27209l26984N76403P04660l00842j140678
$$ -1318335 -390276 1370525 2301188 1973979 1646995 2223398 2928058 2627216 1486538
42608A486538j036817o10244l21696L13759J259506J239371l39482j891079j527918
$$ 1486538 449721 -160523 -482219 -168460 1091046 2330417 1990935 99856 -1428062
42599a428062K29190J124798L15782o54212k84728P96118R67898K9109o21396
$$ -1428062 -1198872 -74074 241708 -412504 -697232 98886 1066784 1095893 474497
42590D74497r5848P21968N36777m37419q68546l90947r8817o42579j067949l93618
$$ 474497 378649 1100617 1637394 1199975 331429 -59518 -158335 -800914 -1868863 -2262481
42580b262481P11316J025329P05706O62212O58941j82775j308018j144600K80079
$$ -2262481 -1551165 -525836 179870 842082 1501023 1318248 10230 -1134370 -854291
42571h54291J113161N29133j11472K73309P03791k0131j214979j426889n70654
$$ -854291 258870 788003 676531 949840 1653631 1633500 418521 -1008368 -1579022
42562a579022L28290P16532P06769L53261k73359p75384q84537p44312m11204
$$ -1579022 -1250732 -534200 172569 525830 252471 -522913 -1407450 -2151762 -2562966
42553b562966J67915N39241K11878j58439M61386J387928Q51488q66975j314917
$$ -2562966 -2395051 -1855810 -1643932 -1802371 -1340985 46943 898431 31456 -1283461
42544a283461K04270J224466J62015r52624j7334J412319Q52869p30066o71396
$$ -1283461 -1079191 145275 307290 -645334 -662668 749651 1602520 872454 201058
42535B01058P57101J097162J63759J0019Q33842O92266n73514q28311L49618P16935
$$ 201058 958159 2055321 2219080 2229099 3062941 3755207 3181693 2353382 2703000 3419935
42525C419935n50103j222278K7017J146446J54542j557937j614751k96328M77372
$$ 3419935 2869832 1647554 1674571 2821017 2975559 1417622 -197129 -493457 -16085
42516a6085K50316m0265n2532N54M11985J235531J375912J21586j241291j069227
$$ -16085 234231 193966 141434 141988 553973 1789504 3165416 3287002 2045711 976484
42506I76484P8525K98335p01942j312995n94768N10405P89980K97788j44513j00295
$$ 976484 1055009 1353344 651402 -661593 -1256361 -745956 44024 341812 197299 97004
42496I7004K45173M88952L86817P6218m5272J89937N04559N62250L04253j45637
$$ 97004 342177 831129 1217946 1294164 1248892 1438829 1943388 2505638 2809891 2664254
42486B664254n27754m34161J77605N13096k21568j467577j743135o11709P62800
$$ 2664254 2136500 1702339 1879944 2393040 2171472 703895 -1039240 -1650949 -888149
42477h88149J268365R78172L32289n69485j322710j116200k2548P17443M54432
$$ -888149 380216 1358388 1690677 1121192 -201518 -1317718 -1340266 -622823 -168391
42468a68391O1438L21027N96158R7728o80781r20119q00238p06997k11282Q38560
$$ -168391 -106953 214074 810232 907960 227179 -692940 -1493178 -2200175 -2411457 -1572897
42458a572897J280178K48368j071104r70584K11925P85638L82105R3681L07478
$$ -1572897 -292719 -44351 -1115455 -2086039 -1874114 -1088476 -706371 -612690 -305212
42449c05212L04398o3172j00501K21136J42277l40459l92681O576p7248p47712
$$ -305212 -814 -63986 -164487 56649 198926 -141533 -534214 -527638 -604886 -1352598
42439a352598r43604k98090K22788N6759r1388K62215N21589L81268N73763J312046
$$ -1352598 -2296202 -2594292 -2371504 -2314745 -2406133 -2143918 -1622329 -1241061 -667298 644748
42429F44748J405879J27949j249768j161101n4034M51062K2386k83814p621J61122
$$ 644748 2050627 2178576 928808 -232293 -286327 164735 187121 -96693 -104314 56808
42419E6808j58740l59701K9380N18320M22896j77264o80893p71648o01868l61519
$$ 56808 -101932 -461633 -432253 86067 508963 331699 -349194 -1120842 -1722710 -2084229
42409b084229r841M71333P35212L39970m71655p15582N5417Q05229K75129r97455
$$ -2084229 -2094070 -1622737 -887525 -547555 -1019210 -1734792 -1679375 -874146 -599017 -1596472
42399a596472j203670l539P84642P918q28403J54810K034472K133933j07566k244912
$$ -1596472 -2800142 -2803681 -2019039 -2011121 -2839524 -2684714 -650242 1483691 1376125 -868787
42389h68787k089144k64033J113422J062496K40770l30503k07526L74484P65984
$$ -868787 -2957931 -3221964 -2108542 -1046046 -805276 -1135779 -1343305 -968821 -202837
42380b02837N36177P1678J09847N63138N14270l23371r45421m41653O09319Q87705
$$ -202837 333340 405018 514865 1078003 1592273 1268902 323481 -118172 491147 1378852
42370A378852Q2960q60417j069027o30706j58588o331o3111m3838J49076L17498
$$ 1378852 1461812 601395 -467632 -1098338 -1256926 -1263257 -1326368 -1370206 -1221130 -903632
42360i03632K73479J81169L12353M99286K92453k60569n58015l68018j86607l39297
$$ -903632 -630153 -448984 -136631 362655 655108 394539 -163476 -531494 -718101 -1057398
42350a057398l96780J481M00407L16730K08550P51849J495608J250591j94363
$$ -1057398 -1454178 -1452697 -1052290 -735560 -527010 224839 1720447 2971038 2776675
42341B776675j598999j683569m57878R16392J161540o5720j641010j756041O5856
$$ 2776675 1177676 -505893 -963771 -47379 1114161 1048441 -592569 -2348610 -2282754
42332b282754K006040J908859M2439j220073n75608O27836N48829n51484r34530
$$ -2282754 -276714 1632145 1674584 454511 -121097 506739 1055568 504084 -430446
42323d30446n027R18825N50371n73344q38261K38962J293349R18949l67076q23607
$$ -430446 -435473 483352 1033723 460379 -377882 -138920 1154429 2073378 1706302 882695
42313H82695j5181N47784k61887j461418j540483o86991n5329L00485J008401
$$ 882695 867514 1415298 1153411 -308007 -1848490 -2535481 -2590810 -2290325 -1281924
42304a281924J493717O22410q89783r59434O00646J506843M64635r17880q31629
$$ -1281924 211793 834203 -55580 -1015014 -414368 1092475 1557110 639230 -192399
42295a92399P4172K67128q7279O2260M84348K13939n14919o50349j26791K51439
$$ -192399 -118227 148901 61622 123882 608230 822169 307250 -343099 -469890 -218451
42285b18451K87142L32285J80715n71422j359006j150302N6956J274027J752952
$$ -218451 68691 400976 581691 10269 -1348737 -2499039 -2442083 -1168056 584896
42276E84896J328007J42660j010187r01170M20651J061066j67870j638674j123920
$$ 584896 1912903 2055563 1045376 144206 564857 1625923 1458053 -180621 -1304541
42267a304541P66416J495438L97552p34014o88556j70785O6598K45465L27522
$$ -1304541 -538125 957313 1354865 620851 -67705 -238490 -171892 73573 401095
42258D01095k33567r99562o90559N99447J133583J51148r58416q60862m2823M76932
$$ 401095 167528 -832034 -1522593 -923146 210437 361585 -596831 -1457693 -1500516 -1023584
42248a023584P19352J083894J345040J182278P30465M4419r40841j588249j007078
$$ -1023584 -304232 779662 2124702 3306980 4037445 4081864 3141023 1552774 545696
42239E45696L01415O91184k70056j177493j012823m03986j06346Q5697K36100
$$ 545696 847111 1538295 1268239 90746 -922077 -1326063 -1432409 -1346712 -1110612
42230a110612j73797q02328l72480J068623J703882P88812o2492L16067O65045
$$ -1110612 -1284409 -2086737 -2459217 -1390594 313288 1102100 1039608 1355675 2020720
42221B020720k46288j251125q94812q2592l06618p82022P9485J517955J477967
$$ 2020720 1774432 523307 -371505 -454097 -760715 -1542737 -1463252 54703 1532670
42212A532670J00253n34006J49108N74556j17726q73952p40115j51816K15476
$$ 1532670 1632923 1098917 1248025 1822581 1704855 830903 90788 -61028 154448
42203A54448L26716J95623k57985n96372l02185K18162K44700P0225L58997N85311
$$ 154448 481164 676787 418802 -177570 -479755 -261593 -16893 53332 412329 997640
42193I97640k02658j311417j019193O41556J640158Q94733l07109m57603J74660
$$ 997640 794982 -516435 -1535628 -894072 746086 1640819 1333710 876107 1050767
42184A050767M89512K05361k75541o70611p63706l29222L40759N19581M6658m02131
$$ 1050767 1540279 1745640 1470099 799488 35782 -293440 47319 566900 613558 211427
42174B11427k82611K40785P85443J077347P75421j70594r73016p57650J01602
$$ 211427 -71184 169601 955044 2032391 2807812 2637218 1664202 906552 1008154
42165A008154L97146j19648m71149j26875K45037N3175l02707l03358j55806j98606
$$ 1008154 1405300 1285652 814503 687628 932665 985840 683133 379775 223969 25363
42155B5363k13070J11270N55605O43436J75189o66774j377062j358009n84404
$$ 25363 -187707 -76437 479168 1122604 1297793 631019 -746043 -2104052 -2688456
42146b688456J45386K07340O0615L74080O91404J14126r48554j081505K0511J062126
$$ -2688456 -2543070 -2335730 -2275115 -1901035 -1209631 -1095505 -2044059 -3125564 -3105053 -2042927
42136b042927J049856M75804J89772J81169N5974r9470O1535N04149P36170K03520
$$ -2042927 -993071 -517267 -327495 -146326 -90352 -189822 -128287 375862 1112032 1315552
42126A315552j073500k015248j282556Q15833K088846J170460m84767p33546J23383
$$ 1315552 242052 -1773196 -3055752 -2239919 -151073 1019387 534620 -198926 -75543
42117g5543K83568l10502j60650O95165N73144o38552r81136J26825O95983m17647
$$ -75543 208025 -102477 -263127 432038 1005182 366630 -614506 -487681 208302 -209345
42107b09345j499244r19062K71685N18952M06885R97991J378008K92661j132058
$$ -209345 -1708589 -2627651 -2355966 -1837014 -1430129 -432138 945870 1238531 106473
42098A06473q67713O55685J134960n1240j131717p75223K83073P01130J94815
$$ 106473 -761240 -105555 1029405 978165 -153552 -928775 -645702 55428 250243
42089B50243n17093n31604L99741J248311N60968j348617k178628p63580R14165
$$ 250243 -266850 -798454 -398713 849598 1410566 61949 -2116679 -2880259 -1966094
42080a966094N64355q36608o55443J101314J922463R93900K71357Q64071J232984
$$ -1966094 -1401739 -2238347 -2893790 -1792476 129987 1123887 1395244 2259315 3492299
42071C492299J57429j037759q70738k32549n48447j038749j01329J593158J798551
$$ 3492299 3649728 2611969 1741231 1508682 960235 -78514 -179843 1413315 3211866
42062C211866J53297j276322j080336j88566M4435k47047k79555n2629N7133J63977
$$ 3211866 3365163 2088841 1008505 819939 864374 617327 337772 285143 342276 506253
42052E06253L57208J43739n72115p39068L60110J504127R37173r12013j798774
$$ 506253 863461 1007200 435085 -303983 56127 1560254 2497427 1585414 -213360
42043b13360q40050M15538N51896J57613K37087L86973j14570p01831n20842k1783
$$ -213360 -1053410 -637872 -85976 71637 308724 695697 581127 -120704 -641546 -663329
42033f63329j0282l1531O13076J083968J95152j212752j238859J8618N90909j55236
$$ -663329 -673611 -705142 -92066 991902 1187054 -25698 -1264557 -1245939 -655030 -810266
42023h10266o91376m9114Q00557R00412O48806M56756o6857p78883o49976L49061
$$ -810266 -1501642 -1550756 -750199 150213 799019 1255775 1188918 410035 -239941 109120
42013A09120P12420l04369j474914j606687j110129o38177R5001J064501J248656
$$ 109120 821540 517171 -957743 -2564430 -3674559 -4312736 -4217735 -3153234 -1904578
42004a904578L86297k39388Q3209L53645k7976l1622P56938Q83217k66359q14770
$$ -1904578 -1518281 -1757669 -1674460 -1320815 -1348791 -1380413 -623475 259742 -6617 -821387
41994h21387M18980J406858K02439j445209r03330P93517P93335n92933p07805
$$ -821387 -402407 1004451 1206890 -238319 -1141649 -348132 445203 -147730 -855535
41985h55535N03742N31446q88859j178153L90242J373946N20326k91513J60638
$$ -855535 -351793 179653 -709206 -1887359 -1497117 -123171 397155 105642 266280
41976B66280K61336r99877j681876l27357J066195K50737j319120p56651J535856
$$ 266280 527616 -472261 -2154137 -2481494 -1415299 -1164562 -2483682 -3240333 -1704477
41967a704477K511446J136207m69922n34084J68674J53706n44896q47493l06367
$$ -1704477 806969 1943176 1473254 939170 1107844 1261550 716654 -130839 -437206
41958d37206M72752P02129K59198l11527n31476n06868m69091j70854N69703J054938
$$ -437206 35546 737675 996873 685346 153870 -352998 -822089 -992943 -423240 631698
41948F31698N27219l35883j42131Q55877P79053q90473k055049r25128J207903
$$ 631698 1158917 823034 680903 1536780 2315833 1425360 -629689 -1554817 -346914
41939c46914J705524J99386j204029r54370K64999R47403O02819j60819n97366
$$ -346914 1358610 1557996 353967 -600403 -335404 611999 1214818 1053999 456633
41930D56633m65860n7048K41418M58223Q96469J367732J077017k90363j771536
$$ 456633 -9227 -66275 175143 633366 1529835 2897567 3974584 3684221 1912685
41921A912685k011639q11278O66138J170698N07959n44790j142609j076359o82364
$$ 1912685 -98954 -910232 -244094 926604 1434563 889773 -252836 -1329195 -2011559
41912b011559k54631J98824O19846P53993N64411L41720J13700m46526j094036
$$ -2011559 -2266190 -2067366 -1447520 -693527 -129116 212604 326304 -120222 -1214258
41903a214258q44183M51195J254594L43735j047894p43678J076083J965233P20698
$$ -1214258 -2058441 -1607246 -352652 -8917 -1056811 -1800489 -724406 1240827 1961525
41894A961525j056656j439067n52616L11871N73756M09211m284l91061l25312
$$ 1961525 904869 -534198 -1086814 -774943 -201187 208024 203740 -187321 -512633
41885e12633O0260Q0586l35066m15194P9335L47431k2283k68275J65919N89331
$$ -512633 -452373 -371787 -706853 -1122047 -1042712 -695281 -717564 -985839 -819920 -230589
41875b30589K87296k17343j31295K11291j9349p08751r85417m97680K57525O26974
$$ -230589 56707 -160636 -291931 -80640 -99989 -808740 -1794157 -2291837 -2034312 -1407338
41865a407338L41875l12960o08748j13949N74993N12159j79797m98103k01372
$$ -1407338 -1065463 -1378423 -1987171 -2101120 -1526127 -1013968 -1193765 -1691868 -1893240
41856a893240p9069l81339l06299N22371J347402J534878J296766P43806l85851
$$ -1893240 -1972309 -2353648 -2659947 -2137576 -790174 744704 2041470 2785276 2399425
41847B399425j573333j622208n24352L14059K85421K94347O60780L91103n44246
$$ 2399425 826092 -796116 -1320468 -1006409 -720988 -426641 234139 625242 80996
41838H0996n02043R29652J654376M17584q85370l73425O14654Q2738r29701l49334
$$ 80996 -421047 508605 2162981 2580565 1695195 1321770 1936424 2019162 1089461 740127
41828G40127Q80835L00622j531316j708905J56320J345386N10735o21867o36498
$$ 740127 1620962 1921584 390268 -1318637 -1162317 183069 693804 71937 -564561
41819e64561m02593p00500o37024L18079J012898O32520J37265M66965R37906
$$ -564561 -967154 -1667654 -2304678 -1986599 -973701 -341181 -203916 263049 1200955
41810A200955N70428l30563q71212p29104k9441Q09381Q52828l57173j493029
$$ 1200955 1771383 1440820 569608 -159496 -188937 620444 1473272 1116099 -376930
41801c76930q26674R48951J314653l08545j642357j096133Q2276K63254j54774
$$ -376930 -1203604 -254653 1060000 751455 -890902 -1987035 -1904759 -1641505 -1796279
41792a796279j44273J07081K15472O86204J508475J393914m9523j108063n67729
$$ -1796279 -1940552 -1833471 -1617999 -931795 576680 1970594 1921071 813008 245279
41783B45279K35995j62882o88326K45051J594953J261477l04917q68161j03680
$$ 245279 481274 318392 -369934 -124883 1470070 2731547 2426630 1558469 1454789
41774A454789K92432j37721j19630M91497J94106j226375j861151p50531M92937
$$ 1454789 1747221 1609500 1489870 1981367 2175473 949098 -912053 -1662584 -1169647
41765a169647L35213m15660l83822J11343J80012K69325J100998J769334Q81621
$$ -1169647 -834434 -1250094 -1633916 -1522573 -1342561 -1073236 27762 1797096 2678717
41756B678717r66444j768542r96080j26812j43795k32335M30266J073152N77261
$$ 2678717 1712273 -56269 -1052349 -1179161 -1322956 -1555291 -1125025 -51873 525388
41747E25388o23929j081666l57925N39491O53686J19323m04082n89888m38981
$$ 525388 -98541 -1180207 -1538132 -998641 -344955 -225632 -629714 -1219602 -1658583
41738a658583M1135P54730J371815J521015J008493j13447j348932j747534p92841
$$ -1658583 -1617448 -862718 509097 2030112 3038605 2925158 1576226 -171308 -964149
41729i64149N73802P02264n44656j272898j06159J636869J637178j00747j282074
$$ -964149 -390347 311917 -232739 -1505637 -1611796 25073 1662251 1561504 279430
41720B79430o56787M40352M32808k35846k48331M04730P35047M88674K04708k7710
$$ 279430 -377357 62995 495803 259957 11626 416356 1151403 1640077 1844785 1817075
41710A817075n52501j068519q29920K5352M77285J23201l57280m45324m22458
$$ 1817075 1264574 196055 -633865 -608513 -131228 -8027 -365307 -810631 -1233089
41701a233089m33767n4908O11944N45311n64464j284029k99412J399649J715946
$$ -1233089 -1666856 -1721764 -1109820 -564509 -1128973 -2413002 -2712414 -1312765 403181
41692D03181M81888l90956J10921P46697K56003o85235q11932k41308K13429N96650
$$ 403181 885069 494113 605034 1351731 1607734 922499 110567 -130741 82688 679338
41682F79338J151736J034986m73912k069394j787371p0703P02638j10467n58499
$$ 679338 1831074 2866060 2392148 322754 -1464617 -1535320 -832682 -943149 -1501648
41673a501648M81421J439599Q68091q4423J79914Q69370K90304j091022j406949
$$ -1501648 -1020227 419372 1287463 1203040 1382954 2252324 2542628 1451606 44657
41664D4657m43187L60438N35076R19262J454407R15107p73577j921791j428815
$$ 44657 -398530 -38092 496984 1416246 2870653 3785760 3012183 1090392 -338423
41655c38423j82386N01185M35268j4090p09126j254828r15303K46204J094116
$$ -338423 -520809 -19624 415644 401554 -307572 -1562400 -2477703 -2231499 -1137383
41646a137383R03285K55596k8090N8256K12798M69207P58227O18644q3638p72709
$$ -1137383 -234098 21498 -6592 51664 264462 733669 1491896 2110540 2026902 1254193
41636A254193r16741o02945j42127K56554L05417j28499n56708m18991j5975K9632
$$ 1254193 337452 -265493 -407620 -151066 154351 25852 -530856 -949847 -965822 -936190
41626i36190Q135N82854J222797P42573n74063j127219n12870m2848l35898l76286
$$ -936190 -928055 -345201 877596 1620169 1046106 -81113 -593983 -636831 -972729 -1349015
41616a349015L13158O12018l2626l68801L92556R47452J53825p84106k72352R33515
$$ -1349015 -1035857 -423839 -456465 -825266 -432710 514742 668567 -115539 -387891 545624
41606E45624R80783j30196q46020n47173J02368O31468Q81490L33163r89232j642648
$$ 545624 1526407 1396211 550191 3018 105386 736854 1618344 1951507 962275 -680373
41596f80373n54571R96290J039476j00477m85224L07233R10189P12642M13159
$$ -680373 -1234944 -238654 800822 700345 215121 522354 1432543 2145185 2558344
41587B558344J04875q60612j859434j186095J073349K440784J282031j034528
$$ 2558344 2663219 1802607 -56827 -1242922 -169573 2271211 3553242 2518714
41579B518714k202521j778013q93391l36491j648M22912R95559J378016R71038
$$ 2518714 316193 -1461820 -2355211 -2691702 -2693350 -2270438 -1274879 103137 1074175
41570A074175k41603j157107p98593J43605K51355l72698l64194M62460P85399
$$ 1074175 832572 -324535 -1123128 -979523 -728168 -1100866 -1465060 -1002600 -217201
41561b17201J50751k72610J01825K59983l53256o35732J52952Q99998N39831j04312
$$ -217201 -66450 -339060 -237235 22748 -330508 -966240 -813288 86710 626541 522229
41551E22229Q5062M81833J3321o74031k81626P25051P64569k35784p87166k97004
$$ 522229 607291 1089124 1102445 428414 146788 871839 1636408 1400624 613458 316454
41541C16454J87696j41019p45557q54824m84450J175M09788N62180L84496K36417
$$ 316454 504150 363131 -382426 -1237250 -1721700 -1720525 -1310737 -748557 -364061 -127644
41531a27644M29409N42177O3051m99324k25074O00460P16689j40926p67323l59860
$$ -127644 301765 843942 906993 407669 182595 783055 1499744 1358818 591495 231635
41521B31635L12838K01287n32729r74596o62820K20869J170775J405897M13238
$$ 231635 544473 745760 213031 -761565 -1424385 -1203516 -32741 1373156 1786394
41512A786394j021675j243244Q6396J177837M96813r38423j020710L09001J104077
$$ 1786394 764719 -478525 -392129 785708 1282521 344098 -676612 -367611 736466
41503G36466M73077k45681J26234P27205K53653p86281q52538K07291R58009M90305
$$ 736466 1209543 963862 1090096 1817301 2070954 1284673 432135 639426 1597435 2087740
41493B087740m95990r11663n77956M9940O37012R36082O05480l24174j118609
$$ 2087740 1591750 680087 102131 152071 789083 1725165 2330645 2006471 887862
41484H87862j048246l26503J26651j11776m09002L5408R62358J162281J0589j464345
$$ 887862 -160384 -486887 -360236 -472012 -881014 -845606 116752 1279033 1289622 -174723
41474a74723j613959k33055J101076J018491j4552n82720j91230N19293R25667
$$ -174723 -1788682 -2021737 -920661 97830 83278 -499442 -690672 -171379 754288
41465G54288Q77524L45209m36744p56058l20883j065n25516r37961L1410J412388
$$ 754288 1631812 1977021 1540277 784219 463336 462271 -63245 -1001206 -969796 442592
41455D42592R81412j053843j871351l58762J007534J78610j106553l85901J198473
$$ 442592 1424004 370161 -1501190 -1859952 -852418 -673808 -1780361 -2166262 -967789
41446i67789Q08077j134866j482204M42178J759173P53678o20007l16778N31631
$$ -967789 -159712 -1294578 -2776782 -2334604 -575431 178247 -441760 -758538 -226907
41437b26907o5450j434944j369934L80852J922902J993934J138081L00500k59783
$$ -226907 -292357 -1727301 -3097235 -2716383 -793481 1200453 2338534 2639034 2379251
41428B379251n84067o44162n20837k87166K07317Q88113J110947M75975l02082
$$ 2379251 1795184 1151022 630185 343019 550336 1438449 2549396 3025371 2723289
41419B723289j69151P32428J110186J73146j427240k443897k270208j172776J67142
$$ 2723289 2554138 3286566 4396752 4569898 3142658 698761 -1571447 -2744223 -2577081
41410b577081J004979Q16551k30404j102936o93670Q94812K144371J706689Q8535
$$ -2577081 -1572102 -755551 -985955 -2088891 -2782561 -1887749 256622 1963311 2051846
41401B051846r21523n87683p0498m82402j155460q77900j5178Q8600n71226o10427
$$ 2051846 1130323 542640 472142 -10260 -1165720 -2043620 -2058798 -1970198 -2541424 -3151851
41391c151851M14272J262020J003573K56185j86861n28185r47321p68685K68467
$$ -3151851 -2737579 -1475559 -471986 -215801 -402662 -930847 -1878168 -2646853 -2378386
41382b378386J063394P06629P000J40918O45854L09309n77985o31689J85112L57947
$$ -2378386 -1314992 -608363 -601363 -460445 185409 494718 -83267 -714956 -529844 -171897
41372a71897o81436j519278q95788M51448R85156M49252k27665m48081l44099
$$ -171897 -853333 -2372611 -3268399 -2816951 -1831795 -1382543 -1610208 -2058289 -2402388
41363b402388k2611N74985J090471Q96023M1957n79890l29929L84650P38019N15960
$$ -2402388 -2424999 -1850014 -759543 136480 178437 -401453 -731382 -346732 391287 907247
41353I07247J04986k41597n78762q06174n88425J25660Q70272J080366N24196
$$ 907247 1012233 770636 191874 -614300 -1202725 -1077065 -206793 873573 1397769
41344A397769n93835j591742j545172k14614J277139J464496L66189n37503l47667
$$ 1397769 803934 -787808 -2332980 -2547594 -1270455 194041 560230 22727 -324940
41335c24940K45710L85681L04169M33479M10292m1673k82893N0094P9822p31993
$$ -324940 -79230 306451 610620 1044099 1454391 1412718 1129825 1179919 1259741 527748
41325E27748j132550N6317J564599J281411l82714j092333k80383K79315k59141
$$ 527748 -604802 -548485 1016114 2297525 1914811 822478 542095 821410 562269
41316E62269n81231J01211N97401L2823n58630j84247M36639M21954K28934L39696
$$ 562269 -18962 82249 679650 712473 153843 -30404 406235 828189 1057123 1396819
41306A396819J22882o59809q67797N2342P30633O6014q29236n88195P0709r1054
$$ 1396819 1519701 859892 -7905 44437 775070 841084 11848 -576347 -505638 -596692
41296e96692l90939M07457J471309J078239l83841j014252m60661j7602k7398
$$ -596692 -987631 -580174 891135 1969374 1585533 571281 110620 93018 65620
41287F5620M12311J224253J185474K03441l85444j40603j29078p58509r61221
$$ 65620 477931 1702184 2887658 3091099 2705655 2565052 2435974 1677465 716244
41278G16244k43584K35001m04666j169901o32933R57996J968345J338010k94465
$$ 716244 472660 707661 302995 -866906 -1499839 -541843 1426502 2764512 2470047
41269B470047j228559m46070J055219J169270n78017k091406j494403J91233O93358
$$ 2470047 1241488 795418 1850637 3019907 2441890 350484 -1143919 -952686 -259328
41260b59328j14183m85208J25672N75165M36080N15824Q27117L86392o05517p10713
$$ -259328 -373511 -858719 -733047 -157882 278198 794022 1621139 2007531 1402014 691301
41250F91301J33063L50472l03706j51096J069502J120966q72522k257777q21500
$$ 691301 824364 1174836 871130 720034 1789536 2910502 2037980 -219797 -1041297
41241a041297J461256J451773k34692n56901Q54538J378264p2272j470312j138766
$$ -1041297 419959 1871732 1637040 1080139 1934677 3312941 3240669 1770357 631591
41232F31591l0308L82085K10516O409n58682j494322j524319R3452J841499J686077
$$ 631591 601283 983368 1193884 1200293 641611 -852711 -2377030 -2283578 -442079 1243998
41222A243998l4066j042209k70920R03554Q15143l62283j239294j058959j48532
$$ 1243998 1209932 167723 -103197 800357 1615500 1253217 13923 -1045036 -1193568
41213a193568Q74078J474239J120365k15405j510256j546185m60812M02850L84007
$$ -1193568 -319490 1154749 2275114 2059709 549453 -996732 -1457544 -1054694 -670687
41204f70687K21026M55626L19114q33597j970723j606137j9597J117442J054097
$$ -670687 -449661 5965 325079 -508518 -2479241 -4085378 -4104975 -2987533 -1933436
41195a933436N73928M32539N08280N57268N82027L26834m51937j127892p83134
$$ -1933436 -1359508 -926969 -418689 138579 720606 1047440 595503 -532389 -1315523
41186a315523K73593P72911L41057j83893l17599l46028j15249Q58419J806078
$$ -1315523 -1041930 -269019 72038 -111855 -429454 -775482 -890731 -32312 1773766
41177A773766J200182n84527j202982J01510J039856j61758j825247j488088J79368
$$ 1773766 2973948 2389421 1186439 1287949 2327805 2166047 340800 -1147288 -967920
41168i67920O10753n60659j272170m93792N68867Q49303P91228Q53425N09776
$$ -967920 -357167 -917826 -2189996 -2683788 -2114921 -1265618 -474390 379035 888811
41159H88811m62240j092227n25055O60338J194344O53986k51972o09238k14990
$$ 888811 426571 -665656 -1190711 -530373 663971 1317957 1065985 456747 241757
41150B41757K97625K57806j21353q7537K65013j11271j361349j882289m93344
$$ 241757 539382 797188 675835 588298 853311 742040 -619309 -2501598 -2994942
41141b994942J472365J809103N89377j29452M29663P48355l25345j668786j588736
$$ -2994942 -1522577 286526 875903 746451 1176114 1924469 1599124 -69662 -1658398
41132a658398k34405P69597M77589m52333p35428J20575J255599J280342m0375
$$ -1658398 -1892803 -1123206 -645617 -1097950 -1833378 -1712803 -457204 823138 782763
41123G82763j178383o09174J029337J589335L01216j182292j112979P1998O64315
$$ 782763 -395620 -1004794 24543 1613878 1915094 732802 -380177 -308179 356136
41114C56136J35050m31181j48560M54613L81298k89697m76884K93101R95075L95142
$$ 356136 491186 60005 -88555 366058 747356 457659 -19225 273876 1268951 1664093
41104A664093j071476j619248m82721R81948J129431J18599o52276n11860R5990
$$ 1664093 592617 -1026631 -1509352 -527404 602027 720626 68350 -443510 -347520
41095c47520O79660J030869Q05487q4337q34522o12829Q4605R6623m93667m30830
$$ -347520 332140 1363009 2168496 2084159 1249637 636808 721413 818036 324369 -106461
41085a06461O24856J437037J006832j32091r08359r80618n57652P6729M10377
$$ -106461 518395 1955432 2962264 2830173 1921814 941196 383544 460273 870650
41076H70650J4155n87725l58545N48783P25991k63527r16764k6334J323821J332041
$$ 870650 884805 297080 -61465 487318 1213309 949782 33018 6684 1330505 2662546
41066B662546J55530n32234j56690K20605p8965l68759m2009L03428n3218o43524
$$ 2662546 2818076 2285842 2129152 2349757 2270792 1902033 1860024 2163452 2110234 1466710
41056A466710n10890K50773O31556K97827R8061O19792J036654K18629j378226
$$ 1466710 955820 1206593 1838149 2135976 2234037 2853829 3890483 4109112 2730886
41047B730886j993906q79146O84750J177043P29707M41846O00617O77246N75730
$$ 2730886 736980 -142166 542584 1719627 2449334 2891180 3491797 4169043 4744773
41038D744773O60973P88604M97124L6297K8706K24775j28480p61610o94460j21650
$$ 4744773 5405746 6194350 6691474 6727771 6756477 6981252 6852772 6091162 5396702 5275052
41028E275052l01704j250002j391410k03248O92515J87762l91141L96578J443943
$$ 5275052 4973348 3723346 2331936 2128688 2821203 3008965 2617824 3014402 4458345
41019D458345Q01695r98825j577826k39688J251368J453186Q95406N80572M77356
$$ 4458345 5260040 4261215 2683389 2443701 3695069 5148255 6043661 6624233 7101589
41010G101589J97190j3660K57066Q09908J111172R93294Q04474J068117J949969
$$ 7101589 7298779 7285119 7542185 8352093 9463265 10456559 11261033 12329150 14279119
41001A4279119K890193L131602K855433L111295M250223N514048O881797R811669
$$ 14279119 17169312 20300914 23156347 26267642 30517865 36031913 42913710 52725379
40993E2725379J4811995K0100612K4976906L2427687M3926753N2055426M4210828
$$ 52725379 67537374 87637986 112614892 145042579 188969332 241024758 285235586
40986B85235586J6990766j6660024l8752279m3078268l7516292l1699658k7594883
$$ 285235586 302226352 285566328 246814049 203735781 166219489 134519831 106924948
40979A06924948k2540757j6203721j1094778q571776p550982o576368n135783
$$ 106924948 84384191 68180470 57085692 48513916 40962934 34386566 29250783
40972B9250783l321741j726578j317027k127446k537730j195512P85211J097052
$$ 29250783 25929042 24202464 22885437 20757991 18220261 17024749 17809960 18907012
40964A8907012n01839j915329j839110j347780j688536k181967j567355k47915
$$ 18907012 18405173 16489844 14650734 13302954 11614418 9432451 7865096 7617181
40956G617181K97751k87067j010310j163407r13714m35267L27829R95350R45844
$$ 7617181 7914932 7627865 6617555 5454148 4540434 4105167 4432996 5428346 6374190
40947F374190L26777n9673L5725J49354J78119N25868J050989J069715O94699
$$ 6374190 6700967 6641294 6677019 6826373 7004492 7530360 8581349 9651064 10345763
40938A0345763Q84689J678063J737702M50016p96773n05476P95392J504383J251444
$$ 10345763 11230452 12908515 14646217 15096233 14299460 13793984 14589376 16093759 17345203
40929A7345203J070371J823624L429792N162106O108430O223994P399773J1898664
$$ 17345203 18415574 20239198 23668990 28831096 34939526 41163520 48563293 60461957
40921F0461957J8945839K5229427L0292486L7901387M8072766N0705572L4167917
$$ 60461957 79407796 104637223 134929709 172831096 220903862 271609434 305777351
40914C05777351J138349l0323438m4589413m2857959l6652024l2099056k6658044
$$ 305777351 306915700 276592262 232002849 189144890 152492866 120393810 93735766
40907I3735766j8548170j1623819r393052r688621q328413n001703k668928k855636
$$ 93735766 75187596 63563777 54170725 44482104 36153691 31151988 28483060 25627424
40899B5627424m072951m266475l035159j476281p83037j055521j304298q39078
$$ 25627424 21554473 17287998 14252839 12776558 11993521 10938000 9633702 8794624
40891H794624l27456p21799j558151j557960o78629p3895p5007J00471M89835
$$ 8794624 8467168 7745369 6187218 4629258 3950629 3876734 3801727 3902198 4392033
40882D392033J23872r13814j115169m1559O89528j6061r47160o91987J54151M31482
$$ 4392033 4515905 3602091 2486922 2445363 3134891 3118830 2171670 1479683 1633834 2065316
40872B065316N19573J181023J605472O53431q69000j219423l46389M21589O84680
$$ 2065316 2584889 3765912 5371384 6024815 5155815 3936392 3590003 4011592 4696272
40863D696272R41080Q01707m83862j940619j681435M2190R12331P4231p18223
$$ 4696272 5637352 6439059 5955197 4014578 2333143 2375333 3287664 3361895 2643672
40854B643672k19395L55788k58326j055445n64205N07774L63290r87710j734611
$$ 2643672 2424277 2780065 2521739 1466294 902089 1409863 1773153 785443 -949168
40845i49168q79917O05909J249793O66551l79167q13501j62332R49527J373161
$$ -949168 -1829085 -1223176 26617 693168 314001 -499500 -661832 287695 1660856
40836A660856P84448O2796L0441L84511L33435k57409q82627j097768p46628M1700
$$ 1660856 2445304 2508100 2538541 2923052 3256487 2999078 2116451 1018683 272055 313755
40826C13755O95487N92325k6456k04362K73491M19359l73215j199247r64539n9875
$$ 313755 1009242 1601567 1575111 1370749 1644240 2063599 1690384 491137 -473402 -533277
40816e33277L23150k5596l24497j84374O5987K14802L43812K98769j18823n00040
$$ -533277 -210127 -235723 -560220 -744594 -678607 -463805 -119993 178776 59953 -440087
40806d40087j91618O92867J323219J207373O05076n6832o30148j124416j529530
$$ -440087 -631705 61162 1384381 2591754 3196830 3139998 2509850 1385434 -144096
40797a44096j695424j271439j69204Q41350Q00747P8419J09977J082898J294583
$$ -144096 -1839520 -3110959 -3280163 -2438813 -1638066 -1559647 -1449670 -366772 927811
40788I27811j42324j462930p79968Q33619R61100l37021q39177P0231O63842J07215
$$ 927811 785487 -677443 -1457411 -623792 337308 287 -838890 -768659 -104817 2398
40778B398k67368L38562P33872J30724k83249L78053Q80350M5313j020246q13968
$$ 2398 -264970 73592 807464 938188 654939 1032992 1913342 1958655 938409 124441
40768A24441p4633l87445j307454j174630l6764N81188M10940O05221J255182
$$ 124441 49808 -337637 -1645091 -2819721 -2856485 -2275297 -1864357 -1259136 -3954
40759c954J068303j63587r34612m64201J77357J26509M3835M11122L13909p64265
$$ -3954 1064349 900762 -33850 -498051 -320694 -194185 -150350 260772 574681 -189584
40749a89584j493877o23674Q82207J315371Q07703O14913O71944K275r05929n13830
$$ -189584 -1683461 -2307135 -1424928 -109557 698146 1313059 1985003 1987278 1081349 567519
40739E67519R02729J201411k26805j319141o44429L66426M4953o71525j38956
$$ 567519 1470248 2671659 2444854 1125713 481284 847710 892663 221138 82182
40730H2182Q48380M10804r09296q57221O51829J286558K02510o83511j50833L31580
$$ 82182 930562 1341366 432070 -425151 226678 1513236 1715746 1032235 881402 1212982
40720A212982n37590j476397r19257K58171M11917p7334P9310M90218M3070n21730
$$ 1212982 675392 -801005 -1720262 -1462091 -1050174 -1127508 -1048198 -557980 -514910 -1036640
40710a036640L80380K081230K196492K76338j466904j392015k74206N08124O79993
$$ -1036640 -656260 1424970 3621462 3897800 2430896 1038881 764675 1272799 1952792
40701A952792M15373k63312q22904m89689L29149L58711m81583r22385n44516
$$ 1952792 2368165 2104853 1281949 792260 1121409 1480120 998537 76152 -468364
40692d68364l46625p04881p01087q9762O9464m69855m49864M97283R04333J26820
$$ -468364 -814989 -1519870 -2220957 -2310719 -2241255 -2711110 -3160974 -2663691 -1759358 -1632538
40682a632538k84462N73758J022524k20007j256268J28670K467685K536064L02496
$$ -1632538 -1917000 -1343242 -320718 -540725 -1796993 -1668323 799362 3335426 3637922
40673C637922j201391o17397K34867j23759o68870j41722P90139Q54806Q1309
$$ 3637922 2436531 1819134 2054001 1930242 1261372 1119650 1909789 2764595 2845904
40664B845904p04147j140639j231064q99297l22142L9691J51678L95596O46206
$$ 2845904 2141757 1001118 -229946 -1129243 -1451385 -1411694 -1260016 -864420 -218214
40655b18214K99545n10784p56551l1297P01275M75630k70729l41461N38980J274994
$$ -218214 81331 -429453 -1186004 -1217301 -516026 -40396 -311125 -652586 -113606 1161388
40645A161388O71084j003716j944884p58521J517072K242894N03141j500106j368329
$$ 1161388 1832472 828756 -1116128 -1874649 -357577 1885317 2388458 888352 -479977
40636d79977K54156R02330l4731q44246m70390J43612Q4230n9154M00195Q45749
$$ -479977 -225821 676509 641778 -202468 -672858 -529246 -445016 -504170 -103975 741774
40626G41774M31800m25096o43957J2317Q03805J016330N61170j67449p06777r19587
$$ 741774 1173574 748478 104521 116838 920643 1936973 2498143 2330694 1623917 704330
40616G04330r60534p50401K8057J009564J023618k18260j140506l44835J057936
$$ 704330 -256204 -1006605 -978548 31016 1054634 836374 -304132 -648967 408969
40607D08969Q85724p51993j559675n61857O14108M78670k62242k92942K75331
$$ 408969 1294693 542700 -1016975 -1578832 -964724 -486054 -748296 -1041238 -765907
40598g65907N09725J38866m31782o87333j37994J082807J608126K59660j761327
$$ -765907 -256182 -117316 -549098 -1236431 -1374425 -291618 1316508 1576168 -185159
40589a85159j934891o5783J248293N22226n66182k43027N99984M71241k2837K75876
$$ -185159 -2120050 -2185833 -937540 -415314 -981496 -1224523 -624539 -153298 -176135 99741
40579I9741O18192j29839r61359l56138P08786K15474j185559r63709R99177J971516
$$ 99741 717933 588094 -373265 -729403 -20617 194857 -990702 -1954411 -955234 1016282
40569A016282O50093r51939q28915K38661N15518m4411m61264n47655n54834r4987
$$ 1016282 1666375 714436 -114479 124182 639700 595289 134025 -413630 -968464 -1063451
40559a063451J073661J886219J060564q91054j958300j063835O34749J164698
$$ -1063451 10210 1896429 2956993 2065939 107639 -956196 -321447 843251
40551H43251o6j448917j526692k31071Q64117N50802o17033j152942m37597P78391
$$ 843251 843185 -605732 -2132424 -2363495 -1499378 -948576 -1565609 -2718551 -3156148 -2377757
40541b377757J366129Q24838m39869j361274j010306L43612J243153O38561p90018
$$ -2377757 -1011628 -186790 -626659 -1987933 -2998239 -2654627 -1411474 -772913 -1562931
40532a562931j428862o03203Q32258J531374Q86020m84997j197939m95309O87104
$$ -1562931 -2991793 -3594996 -2762738 -1231364 -345344 -830341 -2028280 -2523589 -1836485
40523a836485Q05337l3221j68214Q30462J185432j90193j565180r28078P78033
$$ -1836485 -1031148 -1064369 -1232583 -402121 783311 593118 -972062 -1900140 -1122107
40514a122107J148720J4367p68578n41438k94146k33222M36879J290573R11815
$$ -1122107 26613 40980 -727598 -1269036 -1563182 -1796404 -1359525 -68952 842863
40505H42863l60951n87393L86101M81605q56098j406703l0613J123156K38048
$$ 842863 481912 -105481 280620 762225 -93873 -1500576 -1531189 -408033 -169985
40496a69985r55712j34750J541579J280620p68633j847706q64384N19648R62964
$$ -169985 -1125697 -1260447 281132 1561752 793119 -1054587 -1918971 -1399323 -436359
40487d36359J014115J272432J174627K79432q42903j575169j861138j553528m37854
$$ -436359 577756 1850188 3024815 3304247 2461344 886175 -974963 -2528491 -2966345
40478b966345P82498Q12703m45365j506610j179761P7646J074377J277035Q69582
$$ -2966345 -2183847 -1371144 -1816509 -3323119 -4502880 -4425234 -3350857 -2073822 -1204240
40469a204240K37667j14812K24792R85935J297732O92590l67961j142303j320710
$$ -1204240 -966573 -1081385 -856593 129342 1427074 2119664 1751703 609400 -711310
40460g11310r52800k08671N36098Q25886O14085L18234K07330L8906m97138j190897
$$ -711310 -1664110 -1872781 -1336683 -510797 103288 421522 628852 667758 170620 -1020277
40450a020277j381784o29148O85314J524987J223397K92667k12183p8715J6237
$$ -1020277 -2402061 -3031209 -2345895 -820908 402489 695156 482973 404258 420495
40441D20495j10328K02165R78061J024888k04316j310378q81246K10408J57187
$$ 420495 310167 512332 1490393 2515281 2310965 1000587 119341 329749 486936
40432D86936q06348q43774K94005Q22152L4187m46804M71371J305729L79038j326247
$$ 486936 -319412 -1163186 -869181 -47029 -12842 -459646 11725 1317454 1696492 370245
40422C70245j591589k74653P39829M45788k66520m57207l35442k90125r2099L91418
$$ 370245 -1221344 -1495997 -756168 -310380 -576900 -1034107 -1369549 -1659674 -1751773 -1360355
40412a360355O98907N41009K83787J99926j8956m89028n93297R3369Q68587O95902
$$ -1360355 -661448 -120439 163348 363274 344318 -144710 -738007 -644638 223949 919851
40402I19851l16513r88508n88623L53498Q53160N73929o0988m74270m12559m2370
$$ 919851 603338 -385170 -973793 -620295 232865 806794 745806 271536 -141023 -183393
40392a83393K41959K09915M3074O6762K84710M10406L09788J05134j33876m35112
$$ -183393 58566 268481 311555 378317 663027 1073433 1383221 1488355 1354479 919367
40382I19367o67320o63437n88646o57567n20264K94841J233210J061757k05639
$$ 919367 252047 -411390 -1000036 -1657603 -2177867 -1883026 -649816 411941 206302
40373B06302r09862j08289Q42798L34381r14990j036702k4971M89803J40022J82114
$$ 206302 -703560 -811849 30949 365330 -549660 -1586362 -1611333 -1121530 -981508 -799394
40363g99394Q22569O37854o39001j164830l0154R82959L32819o16308N0829J452174
$$ -799394 23175 661029 22028 -1142802 -1172956 -189997 142822 -473486 -422657 1029517
40353A029517J375709p0805q94175o09757n48251j030192q67468J14187M98225
$$ 1029517 2405226 2334421 1440246 830489 282238 -747954 -1615422 -1501235 -1003010
40344a003010k34128p82624k83099M23210N03590L49510L33999N7680l98290j78401
$$ -1003010 -1237138 -2019762 -2302861 -1879651 -1376061 -1026551 -692552 -634872 -1033162 -1211563
40334a211563N72547M51636p01389r90083M81504J647897M53663j780648k194223
$$ -1211563 -639016 -187380 -888769 -1878852 -1397348 250549 704212 -1076436 -3270659
40325c270659n34454Q73218P43471J04358L8050K77497L72349M80727N28730M9773
$$ -3270659 -3805113 -2931895 -2188424 -2084066 -2046016 -1768519 -1396170 -915443 -386713 -336940
40315c36940o78656o71074J31948N64336J13106k11147L53257R12087L69453o64691
$$ -336940 -1015596 -1686670 -1554722 -990386 -877280 -1088427 -735170 176917 546370 -118321
40305a18321p54958R7269M86895j53956o90887j02962Q85762Q17880m02294j346580
$$ -118321 -873279 -776010 -289115 -443071 -1133958 -1236920 -351158 466722 64428 -1282152
40295a282152r23217L61061J183090Q73660j68135j043603r87154J21154J422200
$$ -1282152 -2205369 -1844308 -661218 212442 44307 -999296 -1986450 -1865296 -443096
40286d43096J646891N44195o24958o24457J30718K95879l96196r11669o01300
$$ -443096 1203795 1747990 1123032 498575 629293 925172 528976 -382693 -983993
40277i83993N0730N03452Q14102Q91762K79803p69591j114725l35246M71416K97422
$$ -983993 -933263 -429811 384291 1276053 1555856 786265 -328460 -663706 -192290 105132
40267A05132l30651m24714j19418p9957j36951K12224N52566J73214m70496l35260
$$ 105132 -225519 -650233 -769651 -849608 -986559 -774335 -221769 -48555 -519051 -854311
40257h54311L89987N07882j36412l24233M89761J188229O96325m34560r72258
$$ -854311 -464324 43558 -92854 -417087 72674 1260903 1957228 1522668 550410
40248E50410p29800m40139l92543j33100N42005J044123P22016k03656p70962
$$ 550410 -179390 -619529 -1012072 -1145172 -603167 440956 1162972 959316 188354
40239A88354l58170N71755R93210M78395m53673j090663j193463q57501k52600
$$ 188354 -169816 401939 1395149 1873544 1419871 329208 -864255 -1721756 -1974356
40230a974356K86361M34937L82595N85740Q21712L30437p06695r02654K95652
$$ -1974356 -1687995 -1253058 -870463 -284723 536989 867426 160731 -741923 -446271
40221d46271J341801O19056j037785j399239m6897J127320O90464n93574j192583
$$ -446271 895530 1514586 476801 -922438 -969335 157985 848449 254875 -937708
40212i37708o99318K62561J015515J108287L95478n98837r71784n18301j6528
$$ -937708 -1637026 -1374465 -358950 749337 1144815 545978 -425806 -944107 -960635
40203i60635j43773o27203p40291j65600Q31763J627106J540363M51979q03236
$$ -960635 -1104408 -1731611 -2471902 -2637502 -1805739 -178633 1361730 1813709 1010473
40194A010473j193405o59985J9458L95262N90836N12060j28349q56080o27883
$$ 1010473 -182932 -842917 -823459 -428197 162639 674699 546350 -309730 -937613
40185i37613N88572J419331Q67333l22462p50385j78991M24667K36899o25280
$$ -937613 -349041 1070290 1937623 1615161 864776 685785 1110452 1347351 722071
40176G22071j398946j386804n94632J94437L00661M2369J69109N20087K03591
$$ 722071 -676875 -2063679 -2658311 -2463874 -2163213 -2120844 -1951735 -1431648 -1228057
40167a228057p59640j131403l05162O33468N00041k55210m18026Q9218L64015
$$ -1228057 -1987697 -3119100 -3424262 -2790794 -2290753 -2545963 -2963989 -2874771 -2510756
40158b510756J97827L29318R84108J294722O18185l48878m29627M01068R27013
$$ -2510756 -2312929 -1983611 -999503 295219 913404 564526 134899 535967 1462980
40149A462980L27945o41243o18889M21491R81687J00459j158997j082930K92275
$$ 1462980 1790925 1149682 530793 952284 1933971 2034430 875433 -207497 84778
40140H4778J225111O65901m96742r28178o29148n37060r20135r97242j35492J132975
$$ 84778 1309889 1975790 1479048 550870 -78278 -615338 -1535473 -2532715 -2668207 -1535232
40130a535232J627950R85235K07024L42552R01932M72343j017482j881076j114793
$$ -1535232 92718 1077953 1284977 1627529 2529461 3001804 1984322 103246 -1011547
40121a011547O2921J99497j42223L00312J022445O48320m23619n88399Q6972L4359
$$ -1011547 -948626 -749129 -891352 -591040 431405 1079725 656106 67707 154679 189038
40111A89038p57694n27050R33808J445573k6995j509668j112946J81208M69944
$$ 189038 -568656 -1095706 -161898 1283675 1256680 -252988 -1365934 -1184726 -714782
40102g14782j83983n47919l61454k9242M67726Q78048L20966r69785j172603K99453
$$ -714782 -898765 -1446684 -1808138 -1837380 -1369654 -491606 -170640 -1140425 -2313028 -2013575
40092b013575J329789L45196q77109n2931J681630J591225j57845r82129j71001
$$ -2013575 -683786 -338590 -1215699 -1268630 413000 2004225 1846380 864251 693250
40083F93250M95103J99874P7423N50474N59399p2974j41327M70021L18335q42116
$$ 693250 1188353 1388227 1465650 2016124 2575523 2502549 2361222 2831243 3149578 2307462
40073B307462j259970j27372R30678M91262n73057r48133r68417j347189j412824
$$ 2307462 1047492 920120 1850798 2342060 1769003 820870 -147547 -1494736 -2907560
40064b907560l34467J009791J083210l0184q01905l45107P44154J358763R21062
$$ -2907560 -3242027 -2232236 -1149026 -1179210 -1981115 -2326222 -1582068 -223305 697757
40055F97757k71893j215763j054030q6708N51381L80346K7471K4847R3970k3617
$$ 697757 425864 -789899 -1843929 -1930637 -1379256 -998910 -971439 -946592 -852622 -876239
40045h76239o287K65857K88510j10369k40914L49670R94402Q55228J74484j42748
$$ -876239 -882526 -616669 -328159 -438528 -679442 -329772 664630 1519858 1694342 1551594
40035A551594J86971N65528L28726n47932j401246j435401n65633L86606O86067
$$ 1551594 1738565 2304093 2632819 2084887 683641 -751760 -1317393 -930787 -244720
40026b44720N59310N23432L45854l68105r92169n97359L24316L26464o98612j196874
$$ -244720 314590 838022 1183876 815771 -176398 -773757 -449441 -122977 -821589 -2018463
40016b018463k95484R27585J073762J49645q65738j149310l65972J050307J707648
$$ -2018463 -2313947 -1386362 -312600 -162955 -1028693 -2178003 -2543975 -1493668 213980
40007B13980N95162j167726j377777J53866J232883N21827p05083q79802l26871
$$ 213980 809142 -358584 -1736361 -1582495 -349612 172215 -532868 -1412670 -1739541
39998a739541L3029L69050Q89125P58653k68642o57708N76371J712222P03272
$$ -1739541 -1706512 -1337462 -448337 310316 41674 -616034 -39663 1672559 2375831
39989B375831j357501j664225j1056R89935N9040r78256l32620R98718R46384
$$ 2375831 1018330 -645895 -656951 332984 392024 -586232 -918852 79866 1026250
39980A026250n61306j682729j186031K63978J188212R13981K6187m55865j87637
$$ 1026250 464944 -1217785 -2403816 -2139838 -951626 -37645 -11458 -467323 -654960
39971f54960K62482K45085j90241n25912m67451j03125L48991O32865N38190J66285
$$ -654960 -392478 -147393 -337634 -863546 -1330997 -1434122 -1085131 -452266 85924 252209
39961B52209j30132k28847k95192k70947J11198O28110O12641K2631l30591p2327
$$ 252209 122077 -106770 -401962 -672909 -561711 66399 679040 701671 371080 298753
39951B98753P5285m39755r22526m86449M94477R51499O51426K11723n5029l70175
$$ 298753 374038 -65717 -988243 -1474692 -980215 -28716 622710 834433 779404 409229
39941D09229p52362q89819o98267l87542n4768L14828O10117P56498Q71822R27106
$$ 409229 -343133 -1232952 -1931219 -2318761 -2373529 -2058701 -1448584 -692086 179736 1106842
39931A106842O14533q7991o32755n65090q1734L67805N69143L85337k91296j109865
$$ 1106842 1721375 1633384 1000629 435539 353805 721610 1290753 1676090 1384794 274929
39921B74929j364097q23967M7704P70897J067487N68819o24444j240657j62542
$$ 274929 -1089168 -1913135 -1865431 -1094534 -27047 541772 -82672 -1323329 -1485871
39912a485871J519813J564489o1572r76330j19178P09243J36636n15266J2889
$$ -1485871 33942 1598431 1536859 560529 441351 1150594 1287230 771964 784853
39903G84853L78285p82201j894032r28648Q66645Q96765l86837m48367P46309
$$ 784853 1163138 380937 -1513095 -2441743 -1575098 -678333 -1065170 -1513537 -767228
39894g67228P58672q02038j421021L0123J414704Q70243n35498j029855o96422
$$ -767228 -8556 -810594 -2231615 -2201492 -786788 83455 -452043 -1481898 -2178320
39885b178320l73759P2990Q84015J289445O30212m73532j070697j042248o44628
$$ -2178320 -2552079 -2479089 -1595074 -305629 324583 -148949 -1219646 -2261894 -2906522
39876b906522P4526Q47523J170673J069572Q94413L85422p30529j438286n80173
$$ -2906522 -2831996 -1984473 -813800 255772 1150185 1535607 805078 -633208 -1213381
39867a213381P86298M65133j209800j417585O97454K405771J572487k40416p49210
$$ -1213381 -427083 38050 -1171750 -2589335 -1891881 513890 2086377 1845961 1096751
39858A096751n40193j202021j886398p23975J521838K232787Q95365m25544m77273
$$ 1096751 556558 -645463 -2531861 -3255836 -1733998 498789 1394154 968610 491337
39849D91337j80480l50803l81346J18252L07867k90101o78422K9079R89155P95050
$$ 491337 310857 -39946 -421292 -303040 4827 -285274 -963696 -934617 54538 849588
39839H49588l64619r26051k19090N64876J05279j074295j248831L1600J167111
$$ 849588 484969 -441082 -660172 -95296 9983 -1064312 -2313143 -2281543 -1114432
39830a114432P03817o41324j130394m56867K97720O92915J220707J637985R21695
$$ -1114432 -410615 -1051939 -2182333 -2639200 -2341480 -1648565 -427858 1210127 2131822
39821B131822o72268j374649n31256K89843j35942p52845k53522N65124K90638
$$ 2131822 1459554 84905 -446351 -156508 -292450 -1045295 -1298817 -733693 -443055
39812d43055n02704k07484J012322J428733M36682q04958j285246j060208l76272
$$ -443055 -945759 -1153243 -140921 1287812 1724494 919536 -365710 -1425918 -1802190
39803a802190N33073Q46171k9094j010420m04929J372824J914958K06921j772275
$$ -1802190 -1269117 -422946 -452040 -1462460 -1867389 -494565 1420393 1627314 -144961
39794a44961j757868j29116J031886Q14640J25372k5388L02611M51859L5737p17069
$$ -144961 -1902829 -2031945 -1000059 -185419 -60047 -85435 217176 669035 704772 -12297
39784a2297j105329n89502M39933Q74896K50132n24830l53559M86133P42652L1032
$$ -12297 -1117626 -1707128 -1267195 -392299 -142167 -666997 -1020556 -534423 208229 239261
39774B39261o21159l11017M72709O93577K75423m5686m3175j93198n57447n20147
$$ 239261 -381898 -692915 -220206 473371 748794 703108 659933 466735 -90712 -610859
39764f10859M4774L61363O9010o4955M12174N29590m94158j426131n81158J264177
$$ -610859 -566085 -204722 -135712 -200667 211507 741097 246939 -1179192 -1760350 -496173
39754d96173J629333J04286q70516K53283J737118J295686m91763j349859p26419
$$ -496173 1133160 1237446 366930 620213 2357331 3653017 3161254 1811395 1084976
39745A084976j2830N8740J83185O51336N85388m99371j711571j991602j366343
$$ 1084976 1072146 1130886 1314071 1965407 2550795 2051424 339853 -1651749 -3018092
39736c018092m61723M22649J143690J282704O51719q2291k4396O98486R49791
$$ -3018092 -3479815 -3057166 -1913476 -630772 20947 -61344 -85740 612746 1562537
39727A562537J01931r72874r86980l5209N07436l3676p09641m98226J70987L18256
$$ 1562537 1664468 691594 -295386 -330595 176841 143165 -566476 -1064702 -893715 -575459
39717e75459J0036j19292k33614p27610q74719J61576J318037P78264q56127r77413
$$ -575459 -565423 -684715 -918329 -1645939 -2520658 -2359082 -1041045 -262781 -1118908 -2096321
39707b096321R16145K110526Q35504r83445r17257K34952K20358q53112j092688
$$ -2096321 -1180176 930350 1765854 782409 -134848 100104 320462 -532650 -1625338
39698a625338j48055O26041P41480Q84629R57113J14324j242708j576812m91058
$$ -1625338 -1773393 -1147352 -405872 478757 1435870 1550194 307486 -1269326 -1760384
39689a760384Q19814J441774J457821R04374k58019j185426r09106k2677J22001
$$ -1760384 -940570 501204 1959025 2863399 2605380 1419954 510848 488171 610172
39680F10172k67553Q7374Q77196M64300r45558j073055O48507J707884L93737
$$ 610172 342619 429993 1307189 1771489 825931 -247124 401383 2109267 2503004
39671B503004j339476q94582R41477J394712j4824j084771m68450O22115N40374
$$ 2503004 1163528 268946 1210423 2605135 2590311 1505540 1037090 1659205 2199579
39662B199579o15268j530305j367259m01994M68509N36902p8585n21546j57411
$$ 2199579 1584311 54006 -1313253 -1715247 -1246738 -709836 -788421 -1309967 -1467378
39653a467378O30399Q71561J59131q58178j120720k46436R82378J377102P33868
$$ -1467378 -836979 34582 193713 -664465 -1785185 -2031621 -1049243 327859 1061727
39644A061727Q0739J70537L44778k87155j151063j001997r6561O5324p34227r57233
$$ 1061727 1142466 1313003 1657781 1370626 219563 -782434 -878995 -813671 -1547898 -2505131
39634b505131Q7598R74096N24169k02173K29056J077956N99948r98466j723654
$$ -2505131 -2417533 -1443437 -919268 -1121441 -892385 185571 785519 -212947 -1936601
39625a936601p22853P09882J218295R36007N49160J66778j92460o7927N95223
$$ -1936601 -2659454 -1949572 -731277 204730 753890 920668 728208 660281 1255504
39616A255504Q01093k76765j771935j870946j93694J474505J337581j57432j036923
$$ 1255504 2056597 1779832 7897 -1863049 -2056743 -582238 755343 597911 -439012
39607d39012m82467K92920R2189n01235k94350M43628M49423l23058n03282M49487
$$ -439012 -921479 -628559 -536370 -1037605 -1331955 -888327 -438904 -761962 -1265244 -815757
39597h15757J248401P20865m22857p42496j61552K08120j34986n83221n96871
$$ -815757 432644 1153509 730652 -11844 -173396 34724 -100262 -683483 -1280354
39588a280354l84801k58418p9834L20326O74061O01351J73659j57403j46462m2382
$$ -1280354 -1665155 -1923573 -2003407 -1683081 -1009020 -407669 -234010 -391413 -537875 -580257
39578e80257j93499n02691n21687j03703L66556N62151O48266P92012O63737J7274
$$ -580257 -773756 -1276447 -1798134 -1901837 -1535281 -973130 -324864 467148 1130885 1148159
39568A148159n47459k03676P76107J142504L21149p48432p91373K21757J036366
$$ 1148159 600700 397024 1173131 2315635 2636784 1888352 1096979 1318736 2355102
39559B355102N18978j020092j943042j022951Q65281J498492J73553j148619n39677
$$ 2355102 2874080 1853988 -89054 -1112005 -246724 1251768 1425321 276702 -262975
39550b62975J032646J141563m14028j412356o75834M29697N13599J21580J47322
$$ -262975 769671 1911234 1497206 84850 -590984 -161287 352312 473892 621214
39541F21214R0001o70007j236932m72441R72241J442490O01209l45497m39940
$$ 621214 711215 41208 -1195724 -1668165 -695924 746566 1347775 1002278 562338
39532E62338P7198M16064P0979p67278j197797n24757N34921N13766n23107p16557
$$ 562338 639536 1055600 1126579 359301 -838496 -1363253 -828332 -314566 -837673 -1554230
39522a554230P24970J926804J011079r85631j669035p49368J05741K18119M55879
$$ -1554230 -829260 1097544 2108623 1122992 -546043 -1295411 -1189670 -971551 -515672
39513e15672J021793R05116j37569r56681q82427n90482n40941j11384R53592
$$ -515672 506121 1411237 1273668 316987 -565440 -1155922 -1696863 -1808247 -854655
39504h54655J581411Q09533p53551j716457j453944l16788R52438J505347Q67554
$$ -854655 726756 1536289 782738 -933719 -2387663 -2704451 -1752013 -246666 620888
39495F20888l11909o77418J61406J039498P95040k72728j051003j083027p63143
$$ 620888 308979 -368439 -207033 832465 1627505 1354777 303774 -779253 -1542396
39486a542396n30076m58625l78731j9588O90870J278440J093606J92755o54691
$$ -1542396 -2072472 -2531097 -2909828 -2929416 -2238546 -960106 133500 326255 -328436
39477c28436r67456r38449p07713r4222O51383P81548K79227J92066R56261J323150
$$ -328436 -1295892 -2234341 -2942054 -3036276 -2384893 -1603345 -1324118 -1132052 -175791 1147359
39467A147359J18355j609085j685319J04549J561019J061585l46327o62534K81240
$$ 1147359 1265714 -343371 -2028690 -1924141 -363122 698463 352136 -310398 -29158
39458b9158R58997N76616k2551j9070Q2817m69392j195502j044013j10989M72465
$$ -29158 929839 1506455 1483904 1464834 1547651 1078259 -117243 -1161256 -1272245 -799780
39448g99780L21755K59352P04670Q34464P0937o56191k23607Q31649J023379J06962
$$ -799780 -478025 -218673 485997 1320461 1391398 735207 511600 1343249 2366628 2473590
39438B473590o94985n53571N0152L39421J19267m85700j173396j218870j47875
$$ 2473590 1778605 1225034 1275186 1614607 1733874 1248174 74778 -1144092 -1291967
39429a291967J139709J075406l53463j259409l71086J189129J501562L40195r10756
$$ -1291967 -152258 923148 569685 -689724 -1060810 128319 1629881 1970076 1059320
39420A059320j179260n51117L55762R20675P05627q9101n86169k84833K06685
$$ 1059320 -119940 -671057 -315295 605380 1311007 1221906 635737 350904 557589
39411E57589J33783k19950j44619K02474J59846j48728o9939K38363J6233n59545
$$ 557589 691372 471422 326803 529277 689123 540395 470456 708819 725052 165507
39401A65507m47366L80039N62130n26880j584254j201966J87834J203410J412186
$$ 165507 -281859 98180 660310 133430 -1450824 -2652790 -2464956 -1261546 150640
39392A50640J189186N28819n81171j192917m26003P92997P17790m59009o70272
$$ 150640 1339826 1868645 1287474 94557 -331446 461551 1179341 720332 50060
39383E0060P47833J745711N95904j400603j813561n37435M72267K65577k08121
$$ 50060 797893 2543604 3139508 1738905 -74656 -612091 -139824 125753 -82368
39374h2368j26122J14381J24453K69803O29309M96704m09002j275902j380806
$$ -82368 -208490 -94109 30344 300147 929456 1426160 1017158 -258744 -1639550
39365a639550j013018o34462r0831O49646R40859M98765J28975M57932P44745
$$ -1639550 -2652568 -3287030 -3377861 -2728215 -1787356 -1288591 -1159616 -701684 43061
39356D3061R3075q21807n90927O94911J432603P66295l47860o15599J6353O67453
$$ 43061 136136 -685671 -1276598 -581687 850916 1617211 1269351 653752 670105 1337558
39346A337558P44890M28364K50326M10821M31556l01091j455806j748570n81960
$$ 1337558 2082448 2510812 2761138 3171959 3603515 3302424 1846618 98048 -483912
39337d83912Q27106Q32528m36797j252351n96373O75364J123807L70268p75418
$$ -483912 343194 1175722 738925 -513426 -1109799 -434435 689372 1059640 284222
39328B84222j235971n78248N47790R50313L13613k65404J88402R59908O52727
$$ 284222 -951749 -1529997 -982207 -31894 281719 16315 204717 1164625 1817352
39319A817352o09469j329540q91417k10490M5778L62760R97105J145176L31164
$$ 1817352 1207883 -121657 -1013074 -1223564 -1177786 -815026 182079 1327255 1658419
39310A658419n56835n69831p9949R0675N0767K90877M70709n4034r01949j019599
$$ 1658419 1101584 531753 451804 542479 593246 884123 1354832 1300798 398849 -620750
39300f20750k58362L79059J74784l55935k20205P15161J407418P40563r99710
$$ -620750 -879112 -500053 -325269 -681204 -901409 -186248 1221170 1961733 962023
39291I62023k069372j195096O93817J507340O69583l70363m43575j04133j85711
$$ 962023 -1107349 -2302445 -1608628 -101288 568295 197932 -245643 -349776 -535487
39282e35487k93508K16078Q27280O82972O0913j92250j21759l46998p35637o13369
$$ -535487 -828995 -612917 214363 897335 958248 765998 644239 297241 -438396 -1051765
39272a051765k0574L52926K88353J12948q5660l55776l12520K93556P60314L11697
$$ -1051765 -1072339 -719413 -431060 -318112 -403772 -759548 -1072068 -778512 -18198 293499
39262B93499m84554m03863M96663R26690L61198k83964j60081M53527Q23499N49615
$$ 293499 -191055 -594918 -98255 828435 1189633 905669 745588 1199115 2022614 2572229
39252B572229l99577j484805j522159J9535J726313J642522L2866q47526m7715
$$ 2572229 2172652 687847 -834312 -814777 911536 2554058 2586924 1739398 1691683
39243A691683P71361N1861j332183j632578p68642N3195K89850K64455J04884
$$ 1691683 2463044 2514905 1182722 -449856 -1218498 -1165303 -875453 -610998 -506114
39234e06114k21618k68341L40155J042097J017552M29002Q6546J93270K94252
$$ -506114 -727732 -996073 -655918 386179 1403731 1832733 1919279 2112549 2406801
39225B406801J77476j4788l06667p43783r95413p87395l83761k4874N38317J210742
$$ 2406801 2584277 2569489 2262822 1519039 523626 -263769 -647530 -672404 -134087 1076655
39215A076655J045981l17644j447746q03105Q45991J330357K24816o95210k92379
$$ 1076655 2122636 1804992 357246 -445859 400132 1730489 1955305 1260095 967716
39206I67716M48825L42414k47739m71578m45898n92775o11132j99649Q6095j96312
$$ 967716 1416541 1758955 1511216 1039638 593740 965 -610167 -809816 -723721 -920033
39196i20033l37907L80116J146591O15049q56034j392046j79086J375950J539193
$$ -920033 -1257940 -877824 268767 883816 27782 -1364264 -1543350 -167400 1371793
39187A371793M06106n15785l84707R5655p0992o35520m30170P50645J392247J68206
$$ 1371793 1777899 1262114 877407 973062 902070 266550 -163620 587025 1979272 2147478
39177B147478j852500k205414l71590J332790R26494n57118q32378K87399J033427
$$ 2147478 294978 -1910436 -2282026 -949236 -22742 -579860 -1412238 -1124839 -91412
39168i1412O05455J3544k0741j27342p19975r71321k33416P30882Q95755M17241
$$ -91412 514043 527587 506846 379504 -340471 -1311792 -1545208 -814326 81429 498670
39158D98670l050l61615r07729j112620k86813J062005J598915Q76992k03952
$$ 498670 495620 134005 -773724 -1886344 -2173157 -1111152 487763 1364755 1160803
39149A160803p12445o71693n57535m83698k37954K29370O47091O49737J11246
$$ 1160803 448358 -223335 -780870 -1264568 -1502522 -1273152 -626061 23676 134922
39140A34922o45906j043208p86902j30464M82715Q37121Q97599O38509J40764
$$ 134922 -510984 -1554192 -2341094 -2471558 -1988843 -1151722 -254123 384386 525150
39131E25150l59458o76141p01439k27217P81716J653053J431496J62871r31648
$$ 525150 165692 -510449 -1211888 -1439105 -657389 995664 2427160 2590031 1658383
39122A658383j021880o91705p82006r76057m67454N21820R87524O51427K06433
$$ 1658383 636503 -55202 -837208 -1813265 -2280719 -1758899 -771375 -119948 86485
39113H6485J58312L19982L88367K18376l39671j065730j082361P8436J338956
$$ 86485 244797 564779 953146 1171522 831851 -233879 -1316240 -1237804 101152
39104A01152J173386k05624j005152l43041O69200O77329k32534j064446j130030
$$ 101152 1274538 1068914 63762 -279279 389921 1067250 834716 -229730 -1359760
39095a359760k94118J067018J961046J550836L46815l37486k86138m66084r96390
$$ -1359760 -1653878 -586860 1374186 2925022 3271837 2934351 2648213 2182129 1185739
39086A185739p35918M32950P80848n48051j693240p02049J330232J794494L73040
$$ 1185739 449821 882771 1663619 1115568 -577672 -1279721 50511 1845005 2218045
39077B218045q62201p42252k24037k72850n03484l67887j07159J83P2995n4011
$$ 2218045 1355844 613592 389555 116705 -386779 -754666 -861825 -861642 -788647 -842658
39067h42658p02204j230762m35494J405725K272140J027930q52749j236615j33184
$$ -842658 -1544862 -2775624 -3211118 -1805393 466747 1494677 641928 -594687 -727871
39058g27871O41835J01530q50290r76927k89477L43139N29780O25774P75218M24170
$$ -727871 -86036 15494 -834796 -1811723 -2101200 -1758061 -1228281 -602507 172711 596881
39048E96881p14251j695106j284525J79071R84325M32043j95757K71161J111432
$$ 596881 -117370 -1812476 -3097001 -2917930 -1933605 -1501562 -1697319 -1426158 -314726
39039c14726J111795N29014K10048j34217r84672j329866j30312J248110O49016
$$ -314726 797069 1326083 1536131 1401914 417242 -912624 -1042936 205174 854190
39030H54190j155293j271612O17781J555878J69061j046438K133J438154O06759
$$ 854190 -301103 -1572715 -954934 600944 770005 -276433 -274300 1163854 1770613
39021A770613j504138j956287m30869Q44561Q20053M81921M53258K78340n5617
$$ 1770613 266475 -1689812 -2120681 -1276120 -456067 25854 479112 757452 701835
39012G01835p3539j30721p75852j131434n8988J405656J205722l11118q05406
$$ 701835 628296 497575 -278277 -1409711 -1468699 -63043 1142679 831561 26155
39003B6155P3553J07756j363390j863533R6821K111503J404395q41291j381386
$$ 26155 99708 207464 -1155926 -3019459 -2922638 -811135 593260 -248031 -1629417
38994a629417J95026J290249M65684q77372j113873m30990L10133R23856J290927
$$ -1629417 -1434391 -144142 321542 -555830 -1669703 -2100693 -1790560 -866704 424223
38985D24223Q04658n76845j648540j290195O3072J047025J030160M30352k46266
$$ 424223 1228881 652036 -996504 -2286699 -2223627 -1176602 -146442 283910 37644
38976C7644q09643r49687l44627N44787O41792k33354p43394K07122J638758J655671
$$ 37644 -771999 -1721686 -2066313 -1521526 -879734 -1113088 -1856482 -1649360 -10602 1645069
38966A645069K42364o44899j14405K58491q94147k244279j711744J69416R98395
$$ 1645069 1887433 1242534 1128129 1386620 492473 -1751806 -3463550 -3294134 -2295739
38957b295739J81334m50781J65283Q22243M50208q0828K27459O35859J33449n71892
$$ -2295739 -2114405 -2565186 -2399903 -1577660 -1127452 -1208280 -980821 -344962 -211513 -783405
38947g83405k17986P81261R83895K34121l13191j84553m0775j94113j37059K57345
$$ -783405 -1001391 -220130 763765 997886 684695 500142 459367 265254 128195 385540
38937C85540L48904r0305l71878j1403N14583N99022L58674J52691j32645p04404
$$ 385540 734444 644139 272261 260858 775441 1374463 1733137 1885828 1753183 1048779
38927A048779j163618q52012J59810R34360O89834k73010q82247m93502M28102
$$ 1048779 -114839 -966851 -807041 127319 817153 544143 -338104 -831606 -403504
38918d03504R08691N27499l41860j117439j423858j059840j03903Q87692J263391
$$ -403504 505187 1032686 690826 -426613 -1850471 -2910311 -3014214 -2126522 -863131
38909h63131R40423L11261l83520j008383j057355j34340J078849J357486O15967
$$ -863131 77292 388553 5033 -1003350 -2060705 -2195045 -1116196 241290 857257
38900H57257o957L5150N7609k75739k08349M99082O98913k76163j231567r47001
$$ 857257 850300 885450 943059 667320 458971 958053 1656966 1380803 149236 -797765
38890g97765j31350J1120p6262N02356Q76591k46701j740134j261301Q42341J661175
$$ -797765 -929115 -917995 -994257 -491901 384690 137989 -1602145 -2863446 -2021105 -359930
38880c59930K15157r88318j8062J424539Q50805j047925j559207l0978J444183
$$ -359930 -144773 -1133091 -1151153 273386 1124191 76266 -1482941 -1513919 -69736
38871f9736J170003j66917r02033m83926L41426P26301N93292M26958L92155k9291
$$ -69736 1100267 933350 31317 -452609 -111183 615118 1208410 1635368 2027523 1998232
38861A998232j129776k014102j467953J73843J162427P32806J60583O49364J331243
$$ 1998232 868456 -1145646 -2613599 -2439756 -1277329 -544523 -383940 265424 1596667
38852A596667O44520j068657j887858j035807J93923M71518J07585N7413K47346
$$ 1596667 2241187 1172530 -715328 -1751135 -1557212 -1085694 -978109 -920696 -673350
38843f73350n9990o76640m92254O90968J391521L56425j420205j798206m23048
$$ -673350 -733340 -1409980 -1902234 -1211266 180255 536680 -883525 -2681731 -3104779
38834c104779Q63835Q02229K98672M26866N04501l41025j094614l80254R17950
$$ -3104779 -2240944 -1438715 -1140043 -713177 -208676 -549701 -1644315 -2024569 -1106619
38825a106619R27451O5811L50590J602364J379380p73210k125631j045285M59352
$$ -1106619 -179168 -113357 237233 1839597 3218977 2445767 320136 -725149 -265797
38816b65797K66162n04643p818Q32443K42179q10943k14610J264793R97445r56518
$$ -265797 365 -504278 -512096 320347 562526 -248417 -463027 801766 1799211 842693
38806H42693j741387l24379J026899O19154k66574o7450N16595K68531k84938
$$ 842693 -898694 -1223073 -196174 422980 156406 88956 605551 874082 589144
38797E89144j43768J48918m16818j277034j096678Q845O57283L36632j6881L87563
$$ 589144 445376 594294 177476 -1099558 -2196236 -2187391 -1530108 -1193476 -1210357 -822794
38787h22794J084736J104405K37171p04912p41191J48769Q22816K59796j031446
$$ -822794 261942 1366347 1603518 898606 157415 306184 1129000 1388796 357350
38778C57350j513794n86503P09404J128529N38337m64305j324029j498531o45917
$$ 357350 -1156444 -1742947 -1033543 94986 633323 169018 -1155011 -2653542 -3299459
38769c299459N64849Q13701J3868k45806Q79561J808551P88542j097446j220788
$$ -3299459 -2734610 -1920909 -1907041 -2152847 -1273286 535265 1323807 226361 -994427
38760i94427O17639J768586O80878r41650j008252j25965p7610o27901j23741
$$ -994427 -376788 1391798 2072676 1131026 122774 -3191 -80801 -708702 -832443
38751h32443J305350J590738O1615j270410p36915M68771K59420j126052j633258
$$ -832443 472907 2063645 2125260 854850 117935 586706 846126 -279926 -1913184
38742a913184m74367J068263J749670J621401J025818r4250j337386j623565o53035
$$ -1913184 -2387551 -1319288 430382 2051783 3077601 2983351 1645965 22400 -630635
38733f30635L61169K43925n73843q17672j19330P69566J095476P35673N963n95268
$$ -630635 -269466 -25541 -599384 -1417056 -1536386 -766820 328656 1064329 1070292 475024
38723D75024o79668l87438k16250k20962O4175O35279P22417j505o97036n69772
$$ 475024 -204644 -592082 -808332 -1029294 -965119 -329840 392577 391072 -305964 -875736
38713h75736j15597k70709q47227q05808J67698J234468J475532P85510j69554
$$ -875736 -991333 -1262042 -2109269 -2915077 -2747379 -1512911 -37379 748131 578577
38704E78577m74771K15912J023954O00909r77132j871958q28356R44897J338450
$$ 578577 103806 319718 1343672 1944581 967449 -904509 -1732865 -787968 550482
38695E50482J84529p52633l39194O70647R88092L33530o03613j032500p11247
$$ 550482 735011 -17622 -356816 313831 1301923 1635453 1031840 -660 -711907
38686g11907j30218K4987j96517r2853L98267L43727o22497j330661o28247R03051
$$ -711907 -842125 -817138 -1013655 -1106508 -708241 -364514 -987011 -2317672 -2945919 -2042868
38676b042868J818577J652738Q81983p6875p19741l24593P35661O99475j012055
$$ -2042868 -224291 1428447 2310430 2233555 1513814 1189221 1924882 2624357 1612302
38667A612302k232084j044469R81443J112326j07724Q4308J738557J945782j95107
$$ 1612302 -619782 -1664251 -682808 429518 321794 406102 2144659 4090441 3895334
38658C895334j974716j472368k62319k03668m95838J20136P61016K37642n13519
$$ 3895334 1920618 448250 185931 -17737 -513575 -393439 367577 605219 91700
38649I1700j13781P07255M48303n11176o96730l9892L29316P9267k02279k73388
$$ 91700 -22081 685174 1133477 622301 -74429 -114321 214995 294262 91983 -181405
38639a81405k39334L4885L53924m7855j026224r90760P48593K326381J707759
$$ -181405 -420739 -385854 -31930 -79785 -1106009 -2096769 -1348176 978205 2685964
38630B685964l29826j440224j033763l74373l2618N97315J435401J392841J76993
$$ 2685964 2356138 915914 -117849 -492222 -524840 72475 1507876 2900717 3077710
38621C077710j091494j397583r13095l92934k58704k87630J93860J381220K056449
$$ 3077710 1986216 588633 -324462 -717396 -976100 -1263730 -1069870 311350 2367799
38612B367799P29126j763044k461695k70481K035183J557460o13574j367520k96549
$$ 2367799 3096925 1333881 -1127814 -1398295 636888 2194348 1580774 213254 -83295
38603h3295L96532o2534j83440O23159J003430L05306l12379j78144k38661j002918
$$ -83295 313237 250703 67263 690422 1693852 1999158 1686779 1508635 1269974 267056
38593B67056j417338q14804j61547k69485l83273L11419J185293J319187R46746
$$ 267056 -1150282 -1965086 -2126633 -2396118 -2779391 -2467972 -1282679 36508 983254
38584I83254O59499K82300l78499o83753j94889K78875j97087j138922j287028
$$ 983254 1642753 1925053 1546554 862801 667912 946787 749700 -389222 -1676250
38575a676250l71198O76623R94799N64111p2652l38577p1816K44224p533o88538
$$ -1676250 -2047448 -1370825 -376026 188085 115433 -223144 -294960 -50736 -58269 -746807
38565g46807j000578n97464J2848L41834M76228N10708K13757l38269n29475j04957
$$ -746807 -1747385 -2344849 -2332001 -1990167 -1513939 -1003231 -789474 -1127743 -1657218 -1762175
38555a762175L30183K31022l5453J77926P65726J039937O53563r1721o54081o67533
$$ -1762175 -1431992 -1200970 -1236423 -1058497 -292771 747166 1400729 1309008 654927 -12606
38545a2606j87548K45602O1565o02120q97605k52639Q49961J334532P14784l41395
$$ -12606 -200154 45448 107013 -495107 -1392712 -1645351 -795390 539142 1253926 912531
38535I12531p09542r8733N49272K68103n41438o40478J40689N73014p867n84559
$$ 912531 202989 104256 653528 921631 380193 -260285 -119596 453418 445551 -139008
38525a39008j27599P15919P70251K40447N7879M2855o44334j632293j615805m16788
$$ -139008 -266607 449312 1219563 1460010 1517889 1560744 916410 -715883 -2331688 -2748476
38515b748476P59718J133182J010966O97423J79557j34181J65043L79020m18964
$$ -2748476 -1988758 -855576 155390 852813 1032370 898189 1063232 1442252 1023288
38506A023288j481379j161517L62138J150733N78002J58436O95968Q99276p1621
$$ 1023288 -458091 -1619608 -1257470 -106737 471265 629701 1325669 2224945 2153324
38497B153324q61763k62119N72399P8368j021999r76114J14920O90075L29441
$$ 2153324 1291561 1029442 1601841 1680209 658210 -317904 -202984 487091 816532
38488H16532J5478J39965O4652l72471n12486k02209j06807m11200l78268L62299
$$ 816532 832010 971975 1036627 664156 151670 -50539 -157346 -568546 -946814 -584515
38478e84515J011693O56399m46212j175982q92156o9665L63234N6865n26985p77545
$$ -584515 427178 1083577 637365 -538617 -1430773 -1500438 -1137204 -1080339 -1607324 -2384869
38468b384869n03027J99817J118255J658008J062788m27666j255078l60594J149298
$$ -2384869 -2887896 -2688079 -1569824 88184 1150972 723306 -531772 -892366 256932
38459B56932J338776R1218r63969r71506o85052o86429m74696J99950O32608M35437
$$ 256932 1595708 1686926 722957 -248549 -933601 -1620030 -2094726 -1894776 -1262168 -826731
38449h26731J96080K76698K17939j25743j55747K39595L56612O6273R7899M76197
$$ -826731 -630651 -353953 -136014 -261757 -417504 -177909 178703 244976 342875 819072
38439H19072L09756l36910k40287O02390N05805r33657j632688k90062J276014
$$ 819072 1128828 791918 551631 1154021 1659826 726169 -906519 -1196581 79433
38430G9433R46126m54615q67489k88038j9789m8589L98280Q00601K88471l18530
$$ 79433 1025559 570944 -296545 -584583 -604372 -652961 -254681 545920 834391 515861
38420E15861J77745R08063K96481r72547j024973j45147j52248q53922k64220
$$ 515861 693606 1601669 1898150 925603 -99370 -244517 -396765 -1250687 -1514907
38411a514907J565879K111220M20539j270038j003311K69614O98411R4810o93885
$$ -1514907 50972 2162192 2582731 1312693 309382 578996 1277407 1372217 678332
38402F78332j209140j115525q6703J144787J165266P6377l36947N82973J215639
$$ 678332 -530808 -1646333 -1733036 -588249 577017 653394 316447 899420 2115059
38393B115059L69569o89773l45789P66813R08760j00482r65131r53856m69290
$$ 2115059 2484628 1794855 1449066 2215879 3124639 3024157 2059026 1105170 635880
38384F35880m2263J15790j03633n17201n72152o3710M66220M60229k5667o52182
$$ 635880 593617 709407 605774 88573 -483579 -547289 -81069 379160 353493 -298689
38374b98689j064447p36030M59329J392102O87636j082817j711800m49246Q14672
$$ -298689 -1363136 -2099166 -1639837 -247735 439901 -642916 -2354716 -2803962 -1989290
38365a989290L98922p17538o36404N88602J425134J281634Q20907M42794j1392
$$ -1989290 -1590368 -2307906 -2944310 -2355708 -930574 351060 1171967 1614761 1603369
38356A603369l68669k86385r8771l43094o53981k41169O91925J093464N93692
$$ 1603369 1234700 948315 849544 506450 -147531 -388700 303225 1396689 1990381
38347A990381q0934k80437j78633k02287l59899l45913J8351N07590N70890n2792
$$ 1990381 1909447 1629010 1450377 1248090 888191 542278 560629 1068219 1639109 1586317
38337A586317p37434n44858L92882P84571r7098j309559j439114l19943J018812
$$ 1586317 848883 304025 696907 1481478 1384380 74821 -1364293 -1684236 -665424
38328f65424J595136J144201Q1979p15273n99113M8985K88223P019q1595P7857
$$ -665424 929712 2073913 2155892 1440619 841506 890491 1178714 1185733 1104138 1181995
38318A181995k33827q15697m39467Q18027J024491n70760j825390p93189J154376
$$ 1181995 948168 132471 -306996 511031 1535522 964762 -860628 -1653817 -499441
38309d99441J474272L33640j77276K81435J90969p27139j084694n13121k27185
$$ -499441 974831 1308471 1131195 1412630 1603599 876460 -208234 -721355 -948540
38300i48540o65042q81596n43060k75131J39968J459205K639866J606091j019319
$$ -948540 -1613582 -2495178 -3038238 -3313369 -3173401 -1714196 925670 2531761 1512442
38291A512442j931908m2947J617489N83509j308087j166382M10223Q54434p5556
$$ 1512442 -419466 -462413 1155076 1738585 430498 -735884 -325661 528773 453217
38282D53217n16434M8922L92854M8748k50931k90195l84787j13731Q96597J459531
$$ 453217 -63217 -14295 378559 427307 176376 -113819 -498606 -612337 284260 1743791
38272A743791L36965j218403r09981Q49870J318100k81365j601868j000563J07612
$$ 1743791 2080756 862353 -47628 802242 2120342 1838977 237109 -763454 -655842
38263f55842p5056r49273r83457k56923J40468J11469L99221J076796J393385
$$ -655842 -730898 -1680171 -2663628 -2920551 -2780083 -2668614 -2269393 -1192597 200788
38254B00788Q22630l66001j242327q34234O62421J486199L70136j228090p99719
$$ 200788 1023418 657417 -584910 -1419144 -756723 729476 1099612 -128478 -928197
38245i28197J267824J817820l09930k264191j415350Q28942J558146O79683J24196
$$ -928197 339627 2157447 1847517 -416674 -1832024 -1003082 555064 1234747 1358943
38236A358943K29344j94388r97253p54831N05524J187802Q04242M77719N95280
$$ 1358943 1588287 1393899 396646 -358185 147339 1335141 2139383 2617102 3212382
38227C212382J97081q70097j296380n15858K29768j24948r00343r41552k79475
$$ 3212382 3409463 2539366 1242986 727128 956896 831948 -68395 -1009947 -1289422
38218a289422K59653K34722j59403l53267K15200J248522J394953N521j351310
$$ -1289422 -1029769 -795047 -954450 -1307717 -1092517 156005 1550958 1556479 205169
38209B05169p15332J218963J842187M37263r35284p67427n5151p8563l86911k17733
$$ 205169 -510163 708800 2550987 2988250 2052966 1285539 1230388 1151825 764914 547181
38199E47181m9789l43581l51224L58183O31899m59988j766274j566877r007J343403
$$ 547181 497392 153811 -197413 160770 792669 332681 -1433593 -3000470 -3009477 -1666074
38189a666074J562738Q09579l36252r35620j46739J329450J482132k29764j746467
$$ -1666074 -103336 706243 369991 -565629 -712368 617082 2099214 1869450 122983
38180A22983j328544j7640M03640K40388O58465J135998N09552n93213q14768
$$ 122983 -1205561 -1223201 -819561 -579173 79292 1215290 1724842 1131629 316861
38171C16861n85879j060780j454319k55304J552771J532460j84676r93857k5708
$$ 316861 -269018 -1329798 -2784117 -3039421 -1486650 45810 -138866 -1132723 -1158431
38162a158431Q22411M55238Q6267M26762L82218l65327l54261P33550R26365o16917
$$ -1158431 -336020 119218 205485 632247 1014465 649138 294877 1028427 1954792 1337875
38152A337875j702175o29511Q18408L25546j109208j045076K44081N03147m93243
$$ 1337875 -364300 -993811 -175403 150143 -959065 -2004141 -1760060 -1256913 -1750156
38143a750156o85166O43304J666863R32502o04753j208925n88163K48316M60364
$$ -1750156 -2435322 -1792018 -125155 807347 202594 -1006331 -1594494 -1346178 -885814
38134h85814J22980r2080K22746N92110K66632m75692n44440J08305J55911p96268
$$ -885814 -762834 -854914 -632168 -40058 226574 -249118 -793558 -685253 -529342 -1325610
38124a325610j101797L58025J962303J637059J78305q3582Q11748O34860j055445
$$ -1325610 -2427407 -2069382 -107079 1529980 1708285 1624703 2436451 3071311 2015866
$$ [...]
##END NTUPLES=NMR SPECTRUM
##END=
