##TITLE=1H_ANY-949-p
 CD3CN, 8 sc, 
 12.3.2019
##JCAMPDX= 6.0         $$ Bruker NMR JCAMP-DX V2.0
##DATA TYPE= NMR FID
##DATA CLASS= NTUPLES
##ORIGIN= UXNMR, Bruker Analytische Messtechnik GmbH
##OWNER= root
$$ XWIN-NMR		Version 3.5
$$ Tue Mar 12 16:15:38 2019 Russian Standard Time (UT+4h)  she@DPX200
##.OBSERVE FREQUENCY= 200.1316
##.OBSERVE NUCLEUS= ^1H
##.DELAY= (6, 6)
##.ACQUISITION MODE= SIMULTANEOUS
##.ACQUISITION SCHEME= undefined
##.AVERAGES= 8
##.DIGITISER RES= 18
##SPECTROMETER/DATA SYSTEM= spect
##.PULSE SEQUENCE= zg30
##.SOLVENT NAME= CDCl3
##.SHIFT REFERENCE= (INTERNAL, CDCl3, 0, 15.7039)
##AUDIT TRAIL= $$ (NUMBER, WHEN, WHO, WHERE, WHAT)
$$ ##TITLE= Audit trail, XWIN-NMR		Version 3.5
$$ ##JCAMPDX= 5.01
$$ ##ORIGIN= Bruker BioSpin GmbH
$$ ##OWNER= she
$$ F:/spectra/data/she/nmr/H-F/1/audita.txt
$$ ##AUDIT TRAIL=  $$ (NUMBER, WHEN, WHO, WHERE, WHAT)
(   1,<2019-03-12 16:14:11.84 +0400>,<she>,<DPX200>,
      <created by zg, POWCHK disabled, PULCHK disabled
       configuration hash MD5:
       00 E9 B6 7A A2 85 ED C7 34 08 36 98 17 FE 4E 26
       data hash MD5: 16K
       D5 B9 26 7E E4 7F 8C 67 5F 79 99 65 DD 48 CB 33>)
$$ ##END=
$$ 
$$ hash MD5
$$ 27 58 FA 11 DD C3 0F 8C 8D E6 EB 5D 53 0C 48 8D
##$RELAX= 
##$RELAX= 
##$RELAX= 
##$RELAX= 
##$RELAX= 
##$RELAX= 
$$ Bruker specific parameters
$$ --------------------------
##$DU= <F:/spectra>
##$EXPNO= 1
##$NAME= <H-F>
##$PROCNO= 1
##$TYPE= <nmr>
##$USER= <she>
##$AMP= (0..31)
100 100 100 100 100 100 100 100 100 100 100 100 100 100 100 100 100 100 
100 100 100 100 100 100 100 100 100 100 100 100 100 100 
##$AQSEQ= 0
##$AQ_mod= 1
##$AUNM= <au_zg>
##$AUTOPOS= <>
##$BF1= 200.13
##$BF2= 200.13
##$BF3= 200.13
##$BF4= 200.13
##$BF5= 200.13
##$BF6= 200.13
##$BF7= 200.13
##$BF8= 200.13
##$BYTORDA= 1
##$CFDGTYP= 0
##$CFRGTYP= 5
##$CHEMSTR= <none>
##$CNST= (0..31)
1 1 145 1 1 1 1 1 1 1 1 1 1 1 1 1 1 1 1 1 1 1 1 1 1 1 1 1 1 1 1 1 
##$CPDPRG= <>
##$CPDPRG1= <>
##$CPDPRG2= <>
##$CPDPRG3= <>
##$CPDPRG4= <mlev>
##$CPDPRG5= <mlev>
##$CPDPRG6= <mlev>
##$CPDPRG7= <mlev>
##$CPDPRG8= <mlev>
##$CPDPRGB= <>
##$CPDPRGT= <>
##$D= (0..31)
0 1.2 0 0 0 0 0 0 0 0 0 0.03 0 0 0 0 0 0 0 0 0 0 0 0 0 0 0 0 0 0 0 0 
##$DATE= 1552392851
##$DBL= (0..7)
120 120 120 120 120 120 120 120 
##$DBP= (0..7)
150 150 150 150 150 150 150 150 
##$DBP07= 0
##$DBPNAM0= <>
##$DBPNAM1= <>
##$DBPNAM2= <>
##$DBPNAM3= <>
##$DBPNAM4= <>
##$DBPNAM5= <>
##$DBPNAM6= <>
##$DBPNAM7= <>
##$DBPOAL= (0..7)
0.5 0.5 0.5 0.5 0.5 0.5 0.5 0.5 
##$DBPOFFS= (0..7)
0 0 0 0 0 0 0 0 
##$DE= 6
##$DECBNUC= <off>
##$DECIM= 24
##$DECNUC= <off>
##$DECSTAT= 4
##$DIGMOD= 1
##$DIGTYP= 9
##$DL= (0..7)
0 120 120 120 120 120 120 120 
##$DP= (0..7)
150 150 150 150 150 150 150 150 
##$DP07= 0
##$DPNAME0= <>
##$DPNAME1= <>
##$DPNAME2= <>
##$DPNAME3= <>
##$DPNAME4= <>
##$DPNAME5= <>
##$DPNAME6= <>
##$DPNAME7= <>
##$DPOAL= (0..7)
0.5 0.5 0.5 0.5 0.5 0.5 0.5 0.5 
##$DPOFFS= (0..7)
0 0 0 0 0 0 0 0 
##$DQDMODE= 0
##$DR= 18
##$DS= 0
##$DSLIST= <SSSSSSSSSSSSSSS>
##$DSPFIRM= 0
$$ [...]
##$SUBNAM2= <"">
##$SUBNAM3= <"">
##$SUBNAM4= <"">
##$SUBNAM5= <"">
##$SUBNAM6= <"">
##$SUBNAM7= <"">
##$SUBNAM8= <"">
##$SUBNAM9= <"">
##$SW= 24.9336934301222
##$SWIBOX= (0..15)
0 0 2 0 0 0 0 0 0 0 0 0 0 0 0 0 
##$SW_h= 4990.01996007984
##$TD= 16384
##$TD0= 1
##$TE= 0
##$TE2= 300
##$TE3= 300
##$TEG= 300
##$TL= (0..7)
0 120 120 120 120 120 120 120 
##$TP= (0..7)
150 150 150 150 150 150 150 150 
##$TP07= 0
##$TPNAME0= <>
##$TPNAME1= <>
##$TPNAME2= <>
##$TPNAME3= <>
##$TPNAME4= <>
##$TPNAME5= <>
##$TPNAME6= <>
##$TPNAME7= <>
##$TPOAL= (0..7)
0.5 0.5 0.5 0.5 0.5 0.5 0.5 0.5 
##$TPOFFS= (0..7)
0 0 0 0 0 0 0 0 
##$TUNHIN= 0
##$TUNHOUT= 0
##$TUNXOUT= 0
##$USERA1= <user>
##$USERA2= <user>
##$USERA3= <user>
##$USERA4= <user>
##$USERA5= <user>
##$V9= 5
##$VALIST= <valist>
##$VCLIST= <CCCCCCCCCCCCCCC>
##$VD= 0
##$VDLIST= <DDDDDDDDDDDDDDD>
##$VPLIST= <PPPPPPPPPPPPPPP>
##$VTLIST= <TTTTTTTTTTTTTTT>
##$WBST= 1024
##$WBSW= 4
##$XGAIN= (0..3)
0 0 0 0 
##$XL= 0
##$YL= 0
##$YMAX_a= 516114
##$YMIN_a= -759547
##$ZGOPTNS= <>
##$ZL1= 120
##$ZL2= 120
##$ZL3= 120
##$ZL4= 120
##$ABSF1= 10
##$ABSF2= 0
##$ABSG= 5
##$ABSL= 3
##$ALPHA= 0
##$AQORDER= 0
##$ASSFAC= 0
##$ASSFACI= 0
##$ASSFACX= 0
##$ASSWID= 0
##$AUNMP= <proc_1d>
##$AZFE= 0.1
##$AZFW= 0.1
##$BCFW= 1
##$BC_mod= 2
##$BYTORDP= 1
##$COROFFS= 0
##$CY= 11.3945322036743
##$DATMOD= 1
##$DC= 2
##$DFILT= <>
##$DTYPP= 0
##$F1P= 18.9103706918063
##$F2P= -1.10871071338519
##$FCOR= 0.5
##$FTSIZE= 0
##$FT_mod= 4
##$GAMMA= 1
##$GB= 0.15
##$INTBC= 1
##$INTSCL= 1
##$ISEN= 128
##$LB= 0.24
##$LEV0= 0
##$LPBIN= 0
##$MAXI= 10000
##$MC2= 0
##$MEAN= 0
##$ME_mod= 0
##$MI= 1.114404
##$NCOEF= 0
##$NC_proc= 0
##$NLEV= 6
##$NOISF1= 3.799351
##$NOISF2= 2.8
##$NSP= 1
##$NTH_PI= 0
##$NZP= 0
##$OFFSET= 15.70392
##$PC= 1
##$PHC0= -8860.428
##$PHC1= 15.60025
##$PH_mod= 1
##$PKNL= yes
##$PPARMOD= 0
##$PSCAL= 0
##$PSIGN= 0
##$REVERSE= no
##$SF= 200.130013532006
##$SI= 16384
##$SIGF1= 3
##$SIGF2= 2
##$SINO= 400
##$SIOLD= 16384
##$SREGLST= <1H.CDCl3>
##$SSB= 0
##$STSI= 0
##$STSR= 0
##$SW_p= 3612.71676300578
##$SYMM= 0
##$S_DEV= 0
##$TDeff= 0
##$TDoff= 0
##$TI= <>
##$TILT= no
##$TM1= 0
##$TM2= 0
##$TOPLEV= 0
##$USERP1= <user>
##$USERP2= <user>
##$USERP3= <user>
##$USERP4= <user>
##$USERP5= <user>
##$WDW= 1
##$XDIM= 8192
##$YMAX_p= 0
##$YMIN_p= 0
$$ End of Bruker specific parameters
$$ ---------------------------------
##NTUPLES= NMR FID
##VAR_NAME=  TIME,          FID/REAL,        FID/IMAG
##SYMBOL=    X,             R,               I
##VAR_TYPE=  INDEPENDENT,   DEPENDENT,       DEPENDENT
##VAR_FORM=  AFFN,          ASDF,            ASDF
##VAR_DIM=   8192,          8192,            8192
##UNITS=     SECONDS,       ARBITRARY UNITS, ARBITRARY UNITS
##FACTOR=    0.0002004,     1,               1
##FIRST=     0,             0,               0
##LAST=      1.6414764,     0,               0
##MIN=       0,             -759547,         0
##MAX=       1.6414764,     516114,          0
$$ Real data points
##PAGE= N=1
##DATA TABLE= (X++(R..R)), XYDATA
$$ [...]
$$ plain form
2445 -2387 -4820 -3356 -897 -2897 -4177 -1587 -1942 -5437 -1601 1793 -2583 -5490 -1278 1941 182
2460 182 -2824 -1949 527 1136 -383 -142 462 -141 896 1284 471 1022 1711 -829 -168 3230 1627 -1869
2478 -1869 -65 1800 317 269 761 -1814 -2221 616 30 -1537 -1796 -2974 -2679 239 -247 -4453 -4408
2495 -4408 -1415 -146 -2382 -4538 -3130 -1293 -2947 -3326 -653 -1710 -4626 -2315 190 -1302 -990
2510 -990 -623 -2434 -949 3644 1533 -1988 342 2925 1951 2074 2558 1153 1276 3708 4677 3014 1106
2527 1106 1727 4975 4978 2705 2309 2670 2419 3827 4037 1687 1455 2524 839 1173 3808 833 -2777
2544 -2777 -218 2730 846 -930 -1759 -2348 -281 973 -1766 -4111 -2130 -1180 -915 -1202 -2835 -3490
2560 -3490 -2687 -913 -356 -1301 -3320 -2559 -64 -234 -1004 -203 -890 -1578 1056 2715 -45 -852 785
$$ packed form
2445b387k433J464K459k000j280K590l55l495L836L394m376k907M212L219j759
2460A82l006Q75K476O09j519K41O04o03J037L88q13N51O89k540O61L398j603l496
2478a869J804J865j483m8M92k575m07K837n86j567k59j178K95K918m86m206M5
2495d408K993J269k236k156J408J837j654l79K673j057k916K311K505j492L12
2510i90L67j811J485M593k111l521K330K583r74J23M84j405J23K432R69j663j908
2527A106O21L248Lk273l96L61k51J408K10k350k32J069j685L34K635k975l610
2544b777K559K948j884j776q29n89K067J254k739k345J981R50K65k87j633o55
2560c490Q03J774N57r45k019P61K495j70p70Q01o87o88K634J659k760q07J637
$$ plain form
2577 785 598 2297 4291 908 -1519 2594 4926 2483 1116 1064 1859 3161 3501 2343 1812 1109 1564
2594 1564 3607 2505 630 787 934 439 2427 1808 -1697 -1667 1393 927 -328 4 -1946 -2467 419
2611 419 1681 -1991 -2902 -1960 -643 273 48 -2242 -2663 -626 508 107 -1173 -1513 -980 571 409
2628 409 829 453 -1415 -204 3352 2544 32 413 815 1509 4014 3339 -540 -226 3195 3426 2052
2645 2052 2053 764 1235 3465 3373 1148 94 667 1912 2455 1287 -24 -211 -559 544 2013 -312
2662 -312 -3018 -1742 180 -842 -752 -1964 -4693 -2856 877 -1172 -4084 -3447 -3076 -2480 -1150 -2577
2678 -2577 -4409 -3790 -2192 -1715 -1843 -3176 -4194 -2963 -1425 -1015 -1515 -3008 -3866 -1077 583 -818
2694 -818 -1661 -2049 -2561 358 2873 -981 -3464 106 1494 235 895 158 -2559 -557 3195 799
$$ packed form
2577G85j87J699J994l383k427M113K332k443j367n2P95J302L40j158n31p03M55
2594A564K043j102j875J57J47m95J988o19l505L0L060m66j255L32j950n21K886
2611D19J262l672r11R42J317R16k25k290m21K037J134m01j280l40N33J551j62
2628D09M20l76j868J211L556q08k512L81M02O94K505o75l879L14L421K31j374
2645B052Jj289M71K230r2k225j054N73J245N43j168j311j87l48J103J469k325
2662c12k706J276J922j022R0j212k729J837L733k049k912O37L71N96J330j427
2678b577j832O19J598M77j28j333j018J231J538M10n00j493q58K789J660j401
2694h18q43l88n12K919K515l854k483L570J388j259O60p37k717K002L752k396
$$ plain form
2710 799 -1919 -1080 367 76 446 799 -804 -2328 -1918 1350 740 -2661 -2763 -824 -1345 -962 526
2727 526 -2814 -5617 -901 1697 -2270 -3933 -2357 -1978 -966 476 -1400 -4018 -2030 472 287 -814
2743 -814 -1332 -952 12 887 1499 1255 -1330 -718 2415 2828 1720 1850 482 687 4601 4979 592 332
2761 332 3607 3805 3711 4201 1307 -115 4164 5393 2518 1297 2644 2163 2452 3598 2845 1004 783
2778 783 2125 3191 1781 735 779 542 1024 2831 1985 -1884 -1579 2877 1824 -89 -72 -945 -859 2648
2796 2648 2797 -1664 -1769 1190 1710 633 748 -117 -506 739 1717 1053 325 359 828 1502 1725 2145 942
2815 942 -1446 862 4151 2073 -624 261 588 945 3042 2031 -2370 -978 3259 1523 -706 70
2831 70 -377 -1052 665 1054 -1464 -2438 -890 -511 -713 -1427 -1803 -2493 -2892 -1424 -49 -2345 -5045 -2698
$$ packed form
2710G99k718Q39J447k91L70L53j603j524M10L268o10l401j02J939n21L83J488
2727E26l340k803M716K598l967j663J576L79J012J442j876k618J988K502j85j101
2743h14n18L80R64Q75O12k44k585O12L133M13j108J30j368K05L914L78m387k60
2761C32L275J98r4M90k894j422M279J229k875j221J347m81K89J146p53j841k21
2778G83J342J066j410j046M4k37M82J807q46l869L05M456j053j913J7q73Q6L507
2796B648J49m461j05K959N20j077J15q65l89J245R78o64p28L4M69O74K23M20j203
2815I42k388K308L289k078k697Q85L27L57K097j011m401J392M237j736k229P76
2831G0m47o75J717L89k518r74J548L79k02p14l76o90l99J468J375k296k700K347
$$ plain form
2849 -2698 -1210 -2290 -1746 -2574 -4920 -3834 520 -1569 -4531 -3460 -1963 -1883 -402 -1153 -3806 -2460
2865 -2460 402 7 -1411 -993 -878 -946 90 1247 585 -1014 -1450 1311 2247 317 252 452 -435 1658
2883 1658 3770 654 -2463 680 3049 509 451 121 -1658 -57 2334 422 -1915 -1418 -332 28
2899 28 122 -714 -1602 -1483 -1274 -305 -310 -1859 -2473 -1232 -954 -111 73 -2398 -2934 811 1384 -1617 -1658 -323
2919 -323 -1383 335 2445 -818 -2334 896 2102 398 502 1172 -51 685 2680 2141 388 -101
2935 -101 1301 2604 1317 1042 1783 857 -199 3062 3304 -246 -659 2099 1734 1011 1736 -389 -1203
2952 -1203 1508 2415 -489 -698 526 -57 62 1018 -123 -1472 -736 -22 260 -789 -1665 -1004 -801 -410
2970 -410 4 -830 -2861 -1209 761 -624 -1246 -97 -1158 -1895 1143 1825 -1747 -1590 1197 727 528
$$ packed form
2849b698J488j080N44q28k346J086M354k089k962J071J497Q0J481p51k653J346
2865b460K862l95j418M18J15o8J036J157o62j599m36K761R36j930o5K00q87K093
2883A658K112l116l117L143K369k540n8l30j779J601K391j912k337M97J086L60
2899B8R4q36q88J19K09R69nj549o14J241K78Q43J84k471n36L745N73l001m1J335
2919c23j060J718K110l263j516L230J206j704J04O70j223P36J995n39j753m89
2935a01J402J303j287k75P41r26j056L261K42l550m13K758l65p23P25k125q14
2952a203K711R07k904k09J224n83J19R56j141j349P36P14K82j049q76O61K03L91
2970d10M14q34k031J652J970j385o22J149j061p37L038O82l572J57K787m70j99
$$ plain form
2987 528 978 -47 -646 1557 2162 1144 306 463 1564 1972 1668 1441 1019 432 1570 2963 1690 128
3005 128 1472 1833 1057 1756 1788 -628 36 2150 873 28 677 -378 -693 1776 1594 -1561 -1641 686
3023 686 109 -382 -581 -1083 -991 -793 -402 217 -1513 -2111 -323 28 -1045 -704 -467 -1992 -849 1679
3041 1679 -632 -2349 269 484 -1338 464 1217 -1201 -1013 1396 1185 -154 -174 -99 352 1410 1071
3058 1071 292 -505 365 1303 1138 -189 53 836 -200 -41 1527 144 -1687 486 1039 -271 -528
3075 -528 -75 -1201 -426 830 -686 -1522 -201 -533 -1101 341 -151 -1789 -1477 106 121 -517 -1558 -1133
3093 -1133 293 -571 -627 -120 -279 -944 535 498 -1238 -38 692 -812 -76 1973 6 -1302 552
3110 552 1489 227 620 961 -24 192 1262 794 289 -28 -141 1260 1245 276 -135 216 430 786 354
$$ packed form
2987E28M50j025n99K203O05j018q38J57J101M08l04k27m22n87J138J393j273j562
3005A28J344L61p76O99L2k416O64K114j277q45O49j055l15K469j82l155q0K327
3023F86n77m91j99n02R2J98L91O19j730n98J788L51j073L41K37j525J143K528
3041A679k311j717K618K15j822J802P53k418J88K409k11j339k0P5M51J058l39
3058A071p79p97Q70R38j65j327K42P83j036J59J568j383j831K173N53j310k57
3075e28M53j126P75J256j516q36J321l32n68J442m92j638L12J583J5o38j041M25
3093a133J426q64n6N07j59o65J479l7j736J200P30j504P36K049j967j308J854
3110E52R37j262L93L41r85K16J070m68n05l17j13J401j5r69m11L51K14L56m32
$$ plain form
3129 354 -920 -233 856 -153 -721 875 120 -1434 123 375 -796 -374 -115 -1310 -551 483 -1010
3146 -1010 -1706 -706 -398 -652 -1135 -1005 -894 -794 -1034 -782 -425 -1807 -1377 397 -929 -1621 -691 -49
3164 -49 -1579 -477 -113 -1171 -508 -105 -1213 -777 741 -406 -1314 9 419 -688 -516 -616 -552 205
3182 205 40 -940 -432 -94 -160 28 -319 -805 301 -130 -991 -285 298 -1233 -473 762 -954 -1489 381
3201 381 314 -1505 -287 891 -243 -511 19 -68 571 412 57 570 775 338 1291 945 291 1396 2150
3220 2150 487 613 2535 1995 796 1907 2135 976 1634 1997 1394 1312 1830 1592 1668 1717 1169 1398 1714
3239 1714 864 997 1229 989 600 1095 785 359 908 509 137 1125 751 475 269 638 150 1303 674
3258 674 -564 800 1502 -399 -109 1429 532 -328 1089 1081 -36 428 959 248 254 291 401 0 -14 -53
$$ packed form
3129C54j274O87J089j009n68J596p55j554J557K52j171M22K59j195P59J034j493
3146a010o96J000L08k54m83J30J11J00k40K52L57j382M30J774j326o92R30O42
3164d9j530J102L64j058O63M03j108M36J518j147r08J323M10j107J72j00O4P57
3182B05j65r80N08L38o6J88l47m86J106m31q61P06N83j531P60J235j716n35J870
3201C81o7j819J218J178j134k68N30q7O39j59l55N13K05m37R53l46o54J105P54
3220B150j663J26J922n40j199J111K28j159O58L63o03q2N18k38P6M9n48K29L16
3239A714q50J33K32k40l89M95l10m26N49l99l72R88l74k76k06L69m88J153o29
3258F74j238J364P02j901K90J538q97q60J417qj117M64N31p11OL7J10m01j4l9
$$ plain form
3278 -53 647 333 -595 327 407 -841 -386 362 -1301 -1042 724 -411 -1659 -471 178 -1104 -1055 -799 -1160
3297 -1160 -780 -586 -1294 -994 -725 -1277 -1100 -618 -1028 -996 -796 -891 -634 -453 -1142 -1301 -424 -1033 -706 -416
3317 -416 -1586 -1919 -120 -246 -1674 -831 -360 -1564 -1065 104 -1420 -2061 -234 -362 -1094 -1309 -1101 -1100
3335 -1100 -931 -883 -604 -507 -1452 -1192 -161 -457 -981 -285 -922 -1189 360 343 -1656 -728 679 -309 -680
3354 -680 626 -78 -881 695 623 162 400 682 -6 637 1140 50 -32 544 1093 954 587 -125 583 647
3374 647 327 957 997 -497 -228 1580 402 -290 525 22 -279 1145 495 -831 26 764 19 208 616
3393 616 -445 -500 697 499 23 105 -49 158 703 741 367 -283 -217 936 1690 96 -302 933 761 162
3413 162 1486 1163 -694 476 2301 1009 75 1134 873 672 1429 1075 141 655 769 880 1116 265
$$ packed form
3278e3P00l14r28R22Q0j248M55P48j663K59J766j135j248J188O49j282M9K56l61
3297a160L80J94p08L00K69n52J77M82m10L2K00r5K57J81o89j59Q77o09L27K90
3317d16j170l33J799j26j428Q43M71j204M99J169j524o41J827j28p32k15K08J
3335a100J69M8K79R7r45K60J031k96n24O96o37k67J549j7j999R28J407r88l71
3354f80J306p04q03J576p2m61K38K82o88O43N03j090q2N76N49j39l67p12P08O4
3374F47l20O30M0j494K69J808j178o92Q15n03l01J424o50j326Q57P38p45J89M08
3393F16j061n5J197j98m76Q2j54K07N45L8l74o50O6J153P54j594l98J235j72n99
3413A62J324l23j857J170J825j292r34J059k61k01P57l54r34N14J14J11K36q51
$$ plain form
3431 265 1 510 634 373 1117 -70 -1141 -172 728 3 -534 -417 -1190 -173 551 -936 -1155 -358 -736
3450 -736 -666 302 -766 -1911 -441 -55 -767 -429 -396 -1376 -952 483 509 -517 -737 -274 756 499 15
3469 15 -197 85 191 1087 1254 -381 -477 1608 1181 -39 1028 434 -342 1010 1739 97 -275 740
3487 740 202 334 860 56 -825 -323 176 104 291 -696 -1254 -307 -26 -466 -711 -1592 -1305 446 -19 -1278
3507 -1278 -1009 -602 -1038 220 121 -1610 -1191 560 -35 -408 216 -354 -851 602 1255 -38 -351 274
3525 274 291 904 1211 1032 -44 75 1242 1981 871 -454 504 1024 568 596 777 -769 -183 1432 433
3544 433 -1087 211 358 -523 788 804 -835 -1252 -7 -4 1 154 -857 -1338 -174 607 -202 -792 -1333
3563 -1333 -63 651 -11 -555 -474 -834 -202 1119 -355 -1248 -226 714 -404 283 170 -1190 -414 1098
$$ packed form
3431B65k64N09J24k61P44j187j071R69R00p25n37J17p73J017P24j487k19P97l78
3450g36P0R68j068j145J470L86p12L38L3r80M24J435K6j026k20M63J030k57m84
3469A5k12K82J06Q96J67j635r6K085m27j220J067n94p76J352P29j642l72J015
3487G40n38J32N26q04q81N02M99p2J87r87n58R47K81m40k45q81K87J751m65j259
3507a278K69M07m36J258r9j731M19J751n95l73O24n70m97J453O53j293l13O25
3525B74J7O13L07j79j076J19J167P39j110j325R58N20m56K8J81j546N86J615r99
3544D33j520J298J47q81J311J6j639m17J245LNJ53j011m81J164P81q09n90n41
3563a333J270P14o62n44Q1l60O32J321j474q93J022R40j118O87j13j360P76J512
$$ plain form
3581 1098 222 -460 107 28 -613 800 726 -407 -667 145 640 687 -99 -618 -594 -85 369 104 -628 -1266
3601 -1266 -60 309 -499 -594 -344 -1434 -580 861 -581 -1940 -470 155 -835 -295 -427 -1328 -1657 -153
3619 -153 158 -885 -1419 -1155 -338 -662 -450 -504 -947 -1171 329 727 -1794 -1352 223 -516 -822 820 356
3638 356 -1728 -325 1136 460 -528 -236 -342 396 1185 149 -468 36 491 557 1132 478 14 80 556
3657 556 1379 1125 -292 -549 857 1322 290 416 334 95 1424 1210 -294 -107 1016 -109 387 1869
3675 1869 450 -913 263 1435 1026 420 84 80 786 1011 377 77 370 -166 1073 1040 311 295 76
3694 76 260 1834 1293 -986 -189 1958 1269 555 914 1005 346 1272 1586 845 359 549 416 1688 2010
3713 2010 470 -23 947 1835 1607 641 317 975 1308 600 1107 1321 -293 -407 978 1228 -466 -722
$$ packed form
3581A098q76o82N67p9o41J413p4j133k60Q12M95M7p86n19K4N09M54k65p32o38
3601a266J206L69q08r5K50j090Q54J441j442j359J470O25r90N40j32r01l29J504
3619a53L11j043n34K64Q17l24K12n4m43k24J500L98k521M42J575p39l06J642m64
3638C56k084J403J461o76r88K92j06P38P89j036o17N04M55O6N75o54m64O6M76
3657E56Q23k54j417k57J406M65j032J26q2k39J329k14j504J87J123j125M96J482
3675A869j419j363J176J172m09o06l36mP06K25o34l00K93n36J239l3p29j6k19
3694G6J84J574n41k279P97K147o89p14L59R1o59R26L14p41m86J90j33J272L22
3713B010j540m93R70Q88k28r66l24O58L33p08N07K14j614j14J385K50j694k56
$$ plain form
3731 -722 -295 79 844 -47 -1311 -624 414 -479 -1091 -205 -661 -1605 -930 -20 -341 -1551 -2037 -796 321
3750 321 -488 -1649 -1269 -558 -1055 -664 -527 -1218 -789 -922 -915 -27 -302 -2079 -1393 772 329 -1101 -1186 -218
3770 -218 -299 695 -649 -1117 -42 162 -586 47 608 -914 -1284 -346 558 77 -1495 -1599 152 600 -1203
3789 -1203 -1325 -197 -1001 -1547 -446 -104 -1171 -1458 -1147 -977 -256 -908 -2013 -1077 553 -230 -1731 -1315
3807 -1315 -575 -583 -883 -1055 98 -83 -1282 -347 1454 251 -1535 -158 1221 669 103 -47 112 1076
3825 1076 1218 108 566 1380 551 103 1898 1798 405 -204 1040 1671 1612 20 395 1669 1432 176
3843 176 504 823 507 551 469 807 1272 264 -995 1112 2212 -104 -1265 581 1142 45 -210 367
3861 367 601 500 116 286 995 550 -856 299 1324 787 -583 -617 898 1393 51 -1221 451 1192
$$ packed form
3731g22M27L74P65q91j264O87J038q93o12Q86m56r44O75R10l21j210m86J241J117
3750C21q09j161L80P11m97L91J37o91M29j33PQ88k75j777O86K165m43j430q5R68
3770b18q1R94j344m68J075K04p48O33N61j522l70R38R04m81j572j04J751M48j803
3789a203j22J128q04n46J101L42j067k87L11J70P21o52j105R36J630p83j501M16
3807a315P40ql00j72J153j81j199R35J801j203j786J377J379n52n66j50J59R64
3825A076J42j110M58Q14q29m48J795j00j393o09J244O31n9j592L75J274k37j256
3843A76L28L19l16M4q2L38M65j008j259K107J100k316j161J846N61j097k55N77
3861C67K34j01l84J70P09m45j406J155J025n37j370l4J515M95j342j272J672P41
$$ plain form
3879 1192 -404 -496 1186 345 -1021 30 917 504 -122 -391 -485 1569 1343 -993 -1187 912 922 -416
3897 -416 -646 681 917 -882 -703 926 842 -1510 -671 1327 889 -742 -729 28 271 186 -217 -729 569
3916 569 -86 -1151 -593 1083 -351 -1978 -527 944 254 -1372 -1444 55 831 -1089 -1489 -23 400
3933 400 -524 -888 -88 264 -909 -1656 -210 1227 -464 -2137 18 1567 -432 -841 -57 553 85
3950 85 -89 119 -77 498 -403 -667 743 1438 -813 -1161 1057 1880 53 -1055 520 1691 191 -1089
3968 -1089 467 1277 -323 -988 1031 764 -154 -758 -37 619 1107 -765 -1552 640 1335 -1131 -1618 756
3986 756 305 -1260 -1166 621 696 -757 -1233 128 1189 -420 -1373 -508 816 409 -725 -892 845 670
4004 670 -1003 -742 1025 628 -1453 -387 1646 835 -1148 -511 481 813 117 -622 150 1522 494
$$ packed form
3879A192j596r2J682q41j366J051Q87m13o26k69r4K054k26k336j94K099J0j338
3897d16k30J327K36j799J79J629q4k352Q39J998m38j631J3P57K43q5m03n12J298
3916E69o55j065N58J676j434j627J451J471o90j626p2J499P76j920m00J466M23
3933D00r24l64Q00L52j173p47J446J437j691j673K155J549j999m09P84O10m68
3950H5j74K08j96N75r01k64J410O95k251l48K218Q23j827j108J575J171j500j280
3968a089J556Q10j600o65K019k67r18o04P21O56M88j872p87K192O95k466m87K374
3986G56m51j565R4J787P5j453m76J361J061j609r53Q65J324m07j134j67J737j75
4004F70j673K61J767l97k081J066K033q11j983O37R92L32o96p39P72J372j028
$$ plain form
4021 494 -917 111 1122 233 -1171 509 1902 476 -1336 -292 1613 638 -1364 -158 1424 323
4037 323 -631 -275 186 426 -157 -1140 -226 1098 -165 -1649 -92 1333 -864 -1598 51 492 52 -1077
4055 -1077 -661 538 242 -1146 -826 929 334 -1279 -625 661 827 -307 -1267 555 1486 -727 -1111
4072 -1111 1244 1436 -815 -402 1267 1163 -40 36 341 1138 952 -644 -746 1317 1026 -431 -481 948
4090 948 1044 -868 -878 809 994 -1076 -1570 890 992 -1725 -960 959 571 -652 -922 -757 421 45
4108 45 -1149 -1082 807 213 -1574 -824 894 268 -1195 -771 518 912 -770 -543 718 1028 -587 -640
4126 -640 1067 1209 -223 -650 539 1318 466 -974 271 1833 132 -1428 516 1613 142 -543
4142 -543 239 799 611 -379 -893 508 1195 -636 -1093 758 1084 -649 -1135 610 1277 -276 -1054 -14
$$ packed form
4021D94j411J028J011q89j404J680J393j426j812J044J905r75k002J206J582j101
4037C23r54L56M61K40n83r83R14J324j263j484J557J425k197p34J649M41m40j129
4055a077M16J199k96j388L20J755n95j613O54J286J66j134r60J822R31k213l84
4072a111K355J92k251M13J669j04j203P6L05P97j86j596j02K063k91j457n0J429
4090I48R6j912j0J687J85k070m94K460J02k717P65J919l88j223k70J65J178l76
4108D5j194O7J889n94j787P50J718o26j463M24J289L94j682K27J261L10j615n3
4126f40J707J42j432m27J189P79q52j440J245J562j701j560J944J097j471o85
4142e43P82N60j88r90n14J401O87j831m57J851L26j733m86J745O67j553p78J040
$$ plain form
4160 -14 1129 -232 -1389 98 1334 176 -531 -333 -6 363 -474 -921 705 1103 -1322 -996 1525
4177 1525 1019 -580 -760 899 665 -58 -484 241 1280 264 -1027 286 1229 -44 -490 -27 910
4194 910 767 -1073 -314 1205 1219 -989 -578 1372 949 -1056 -306 687 511 -450 -785 73 358 -78 -1647
4213 -1647 -378 1132 -394 -1820 -232 679 -162 -1452 -837 511 -221 -1638 -652 504 -326 -1363
4229 -1363 -658 517 -228 -660 -1163 -438 953 -149 -1333 31 1314 -179 -1194 828 1015 -267
4245 -267 -726 412 845 351 -605 -226 1073 611 -476 -13 972 494 -577 -292 500 930 -353 -1088
4263 -1088 434 1135 -702 -1147 737 706 -760 -978 -404 -51 -110 -736 -570 540 80 -945 -382 683
4281 683 203 -990 -950 702 289 -886 -1069 1041 829 -746 -425 900 317 -150 310 617 640 846 -245
$$ packed form
4160a4J143j361j157J487J236j158p07J98L27L69q37m47J626L98k425L26K521
4177A525n06j599j80J659k34p23m26P25J039j016j291J313R43j273m46M63R37
4194I10j43j840P59J519J4k208M11J950m23k005P50R93j76r61l35Q58K85m36j569
4213a647J269J510j526j426J588R11q41j290O15J348p32j417R86J156q30j037
4229a363P05J175p45m32n03P25J391j102j184J364J283j493j015K022J87j282
4245b67m59J138M33m94r56L79J299m62j087M63R85m78j071K85P92M30j283p35
4263a088J522P01j837m45J884l1j466k18N74L53n9o26J66J110m60j025N63J065
4281F83m80j193M0J652m13j175j83K110k12j575L21J325n83m67M60L07K3K06j091
$$ plain form
4300 -245 16 1488 953 -678 -421 1667 956 -360 94 1011 584 -82 215 959 539 -583 -487 812
4318 812 679 -387 -769 -56 490 -143 -739 -821 442 -78 -1007 -364 525 -374 -1373 176 450 -349 -796
4337 -796 -817 400 1010 -560 -754 175 161 -408 -261 377 426 -447 -276 293 829 -157 -1046 399 1230 144
4357 144 -823 126 696 283 206 -159 260 671 -280 -327 946 659 -751 -82 1002 667 -451 -312 345
4376 345 735 420 -852 -397 245 30 -610 24 -144 -264 -558 -584 115 231 -910 -1022 387 540 -1137
4395 -1137 -904 309 -79 -469 -271 260 -129 -574 -701 409 542 -369 -782 298 294 77 -140 -348 218
4414 218 863 364 -281 816 918 -542 267 1300 533 -651 147 972 966 291 -166 134 815 224 -253
4433 -253 395 144 -208 -234 179 189 50 -637 -388 498 545 -839 -667 408 -302 -615 35 -237 -529 -164
$$ packed form
4300b45K61J472n35j631K57K088p11j316M54R17m27o66K97P44m20j122R6J299
4318H12j33j066l82P13N46o33n96q2J263n20r29O43Q89q99r99J549K74p99m47
4337g96k1J217O10j570j94R29j4n69J47O38M9q73J71N69N36r86q89J445Q31j086
4357A44r67R49N70m13p7l65M19M11r51m7J273k87j410O69J084l35j118J39O57
4376C45L90l15j272M55O42k15o40O34j68j20k94k6O99J16j141j12J409J53j677
4395a137K33J213l88l90J98N31l89m45j27J110J33r11m13J080mk17k17k08N66
4414B18O45m99o45J097J02j460Q09J033p67j184P98Q25oo75m57L00O81n91m77
4433b53O48k51l52k6M13J0j39o87K49Q86M7j384J72J075p10l13O50k72k92L65
$$ plain form
4453 -164 -256 5 -41 -328 -828 234 854 -517 -659 -305 425 313 -53 -461 293 324 -170 434 512 -108 -187
4474 -187 561 558 282 154 -363 38 962 365 -860 164 473 -187 -268 386 292 -608 8 388 371 -222 -569
4495 -569 -173 208 -161 -57 -188 -565 -157 328 -516 -575 55 -129 -808 535 435 -731 -1067 926 461
4514 461 -518 -103 -388 -199 53 85 -355 124 -273 -34 246 73 -259 -14 -51 374 643 -269 -632 237 210
4535 210 -192 128 447 -172 -74 762 -126 -200 308 292 -186 1020 534 -348 -240 627 -24 -183 103 -24 -220
4556 -220 71 111 -112 -385 -333 253 235 -461 -533 -127 -647 48 453 -937 -989 387 406 -836 -577 79 -676
4577 -676 -373 569 37 -1104 -241 -68 29 12 -100 -325 -241 -122 394 66 -280 104 500 -84 37 673 -214
4598 -214 -435 835 849 -231 -79 327 -125 382 671 -165 -448 172 208 -60 290 379 -510 347 575 147
$$ packed form
4453a64r2K61m6k87n00J062O20j371j42L54P30j12l66m08P54L1m94O04P8o20p9
4474a87P48lk76j28n17M01R24n97j225J024L09o60q1O54r4r00O16L80j7n93l47
4495e69L96L81l69J04j31l77M08M85q44n9O30j84o79J343j00j166l36J993m65
4514D61r79M15k85J89K52L2m40M79l97K39K80j73l32K45l7M25K69r12l63Q69k7
4535B10m02L20L19o19R8Q36q88p4N08j6m78J206m86q82J08Q67o51j59K86j27j96
4556b20K91M0k23k73N2N86j8o96p2M06n20O95M05j390n2J376J9j242K59O56p55
4577f76L03R42n32j141Q63J73R7j7j12k25Q4J19N16l28l46L84L96n84J21O36q87
4598b14k21J270J4j080J52M06m52N07K89q36k83O20L6k68L50Q9q89Q57K28m28
$$ plain form
4618 147 -469 -354 347 -18 -182 250 -105 -622 -14 232 322 -757 -411 261 -322 -215 390 -226 -728 653
4638 653 792 -558 16 213 -40 193 325 72 -55 452 348 307 352 230 434 498 397 477 244 -257 -25
4659 -25 722 227 92 247 324 -26 1026 861 -522 135 646 238 119 606 -5 41 638 323 -424 -54
4679 -54 -212 -234 -21 5 -428 -209 -281 -15 304 -284 -781 -44 -75 -516 180 -65 -825 -135 389 -237 -316 121
4701 121 -95 -430 424 198 -680 -213 612 408 82 29 -152 -144 59 185 200 -89 -91 359 467 -125 286 319
4723 319 -290 123 652 -178 -414 86 -16 -93 220 -71 -863 -109 328 -191 -92 -230 -655 42 14 -396 -656
4744 -656 -341 -563 -288 -317 -569 -614 -507 -163 -386 -212 -358 -336 -107 -164 -49 189 63 -654 493 601 -198
4765 -198 83 538 -3 -2 649 216 -425 155 928 40 -23 40 510 286 324 501 385 -84 -122 346 497 -218
$$ packed form
4618A47o16J15P01l65j64M32l55n17O08K46R0j079L46O72n83J07O05o16n02J381
4638F53J39j350N74J97k53K33J32k53j27N07j04m1M5j22K04O4j01Q0k33n01K32
4659b5P47m95j35J55P7l50J052j65j383O57N11m08j19M87o11M6N97l15p47L70
4679e4j58k2K13K6m33K19p2K66L19n88m97P37l1m41O96k45p60O90N24o26p9M37
4701A21k16l35Q54k26q78M67Q25k04l26n3j81QK03J26J5k89kM50J08n92M11L3
4723C19o09M13N29q30k36N00j02p7L13k91p92P54M37n19R9j38m25O97k8m10k60
4744f56L15k22K75k9k52m5J07L44k23J74j46K2K29n7J15K38j26p17J147J08p99
4765a98K81M55n41JO51m33o41N80P73q88o3O3M70k24L8J77j16m69l8M68J51p15
$$ plain form
4787 -218 -89 129 -352 246 415 -268 -516 74 98 -223 -351 40 -341 22 305 -217 -79 29 -269 255
4807 255 239 -561 -282 100 268 -57 332 -75 -87 -136 -138 166 30 -31 64 350 27 229 206 158 -193 603 543
4830 543 -127 -104 565 -19 58 611 -334 -88 328 410 63 5 220 85 245 200 -377 -136 54 -128 91 48
4852 48 -234 84 54 135 201 305 -300 -265 707 61 -657 -77 -182 -383 285 57 -290 -244 92 26 106 149 -192
4875 -192 -234 86 67 -166 31 -76 119 30 102 344 2 -475 69 417 300 27 479 66 19 571 85 -262
4897 -262 472 669 -48 310 381 -416 -152 525 240 -353 -282 372 -304 148 261 -167 -228 -73 -187 55 -423
4918 -423 -611 -126 -188 -166 -35 -97 -650 -365 -80 -644 -469 31 -500 -361 -240 14 -353 -115 -243 -334 -15
4939 -15 78 -54 209 -20 102 -168 -121 96 -54 263 -16 150 252 68 7 622 5 -124 515 393 65
$$ packed form
4787b18J29K18m81N98J69o83k48N90K4l21j28L91l81L63K83n22J38J08k98N24
4807B55j6q00K79L82J68l25L89m07j2m9kL04j36o1R5K86l23K02k3m8l51P96o0
4830E43o70K3O69n84P7N53r45K46M16Q2l47n8K15j35J60m5n77K41J90j82K19m3
4852D8k82L18l0Q1O6J04o05L5R72o46p18N80j05k01O68k28l47M6L36o6Q0M3l41
4875a92m2L20j9k33J97j07J95q9P2K42l42m77N44L48j17k73M52m13m7N52m86l47
4897b62P34J97p17L58P1p97K64O77k85n93P1O54o76M52J13m28o1J55j14K42m78
4918d23j88M85o2K2J31o2n53K85K85n64J75N00n31J39J21K54l67K38j28r1L19
4939a5R3j32K63k29J22k70M7K17j50L17k79J66J02j84o1O15o17j29O39j22l28
$$ plain form
4960 65 636 453 -398 116 359 -6 91 136 3 -208 17 -39 -352 -147 -101 116 -101 -167 33 2 -177 -345
4982 -345 129 -247 -639 50 204 -504 -165 248 -247 -384 -29 11 -220 205 14 -228 48 -45 142 214 76
5003 76 230 110 230 -34 411 575 214 282 488 140 458 621 294 411 343 357 358 527 2 84 308 217 -266
5026 -266 143 243 69 -47 2 -105 -236 30 -270 -433 -102 -517 -208 -469 -499 -309 -419 -562 -501 -50 -477
5047 -477 -857 -72 -385 -625 -259 -162 -524 -695 166 -322 -519 -209 -193 63 250 243 25 201 379 -101 136
5068 136 197 496 452 169 181 647 661 216 754 648 -164 226 941 237 279 193 -277 -129 256 147 -422 -107
5090 -107 -163 -219 -317 -339 -110 -555 -323 -250 -88 -486 -711 -186 -294 -724 186 285 -309 -513 166 -322 -264 361
5112 361 -54 -524 84 154 -174 48 298 562 177 339 313 539 447 320 522 449 670 604 635 439 418 445 355
$$ packed form
4960F5N71j83q51N14K43l65R7M5j33k11K25n6l13K05M6K17k17o6K00l1j79j68
4982c45M74l76l92O89J54p08L39M13m95j37L55M0k31M25j91k42K76r3J87P2j38
5003G6J54j20J20k64M45J64l61O8K06l48L18J63l27J17o8J4JJ69n25Q2K24r1m83
5026b66M09J00j74j16M9j07j31K66l00j63L31m15L09k61l0J90j10j43O1M51m27
5047d77l80P85l13k40L66R7l62j71Q61m88j97L10J6K56J87pk18J76J78m80K37
5068A36O1K99m4k83J2M66J4m45N38j06q12L90P15p04M2q6m70J48L85j09n69L15
5090a07n6n6r8k2K29m45K32P3J62l98k25N25j08m30R10R9n94k04O79m88N8O25
5112C61m15m70O08P0l28K22K50K64l85J62k6K26r2j27K02p3K21o6L1j96k1K7r0
$$ plain form
5135 355 599 673 168 -153 534 559 146 304 335 -15 229 392 -173 -301 90 -302 -390 -369 -185 -413 -304 -373
5157 -373 -391 -737 -717 -500 -112 -521 -599 -104 -443 -782 -476 -255 -802 -814 -134 -451 -326 534 -582 -465 251
5178 251 249 -170 166 234 380 -102 119 651 261 103 116 723 380 -243 305 526 -76 643 652 -64 170 506
5200 506 345 -145 457 -203 -766 -101 48 -615 -759 -117 -501 -467 -781 -787 -495 -837 -626 -150 -673 -765 -466
5221 -466 -607 -602 -157 -370 -1014 -296 8 -458 -594 125 -312 -282 346 441 -324 -176 365 194 356 502 544 215
5243 215 559 633 501 401 763 588 582 240 672 488 117 302 784 334 422 389 284 21 430 684 -277 304
5265 304 324 -131 -216 129 -193 -509 -195 116 -190 -557 -142 -283 -310 -161 -232 -412 -238 -189 -113 -366 -375 -214 -94
5288 -94 -287 216 421 -193 234 459 344 -13 512 481 282 269 158 -54 426 881 411 -137 510 201 177
$$ packed form
5135C55K44P4n05l21O87K5m13J58L1l50K44J63n65j28L91l92q8K1J84k28J09o9
5157c73j8l46K0K17L88m09p8M95l39l39L06K21n47j2O80l17J25Q60j116J17P16
5178B51km19L36O8J46m82K21N32l90j58J3O07l43o23N48K21o02P19Rp16K34L36
5200E06j61m90O02o60n63O65J49o63j44O42l84L4l14oK92l42K11M76n23r2K99
5221d66j41NM45k13o44P18L04m66j36P19m37L0O28R5p65J48N41j71J62J46M2l29
5243B15L44P4j32j00L62j75ol42M32j84l71J85M82m50Q8l3j05k63M09K54r61N81
5265C04K0m55q5L45l22l16L14L11l06l67M15j41k7J49p1j80J74M9P6k53rJ61J20
5288i4j93N03K05o14M27K25j15l57N25l1j99j3j11k12M80M55m70n48O47l09k4
$$ plain form
5309 177 386 308 541 -174 262 355 326 -121 -69 97 -327 -375 193 -454 -181 -100 -173 -717 -265 -477 -683 -440
5331 -440 234 -223 -722 -164 -443 -110 -445 -260 -709 -543 43 -90 117 -307 -270 -109 82 59 302 177 -374
5352 -374 504 387 -135 151 351 -118 207 679 42 28 761 523 118 333 476 257 85 592 108 204 289
5373 289 460 210 -88 -41 -120 92 -186 -2 183 -42 -315 73 -61 -306 -30 -530 -504 -245 -178 -653 -402
5394 -402 196 -534 -356 -125 -552 -449 -220 32 272 308 -264 -62 349 24 74 55 -150 -99 101 121 139 404
5416 404 288 -324 378 460 -43 -289 383 189 149 106 247 -44 484 53 -114 255 -63 -27 277 -198 -64
5437 -64 -48 -278 -179 191 -2 -130 -47 -4 -43 -397 -331 -572 -185 198 -184 -224 -96 -257 -63 128 -102 -70 -11
5460 -11 2 -95 27 -119 -274 -28 425 -112 160 84 -171 205 182 55 13 66 -25 28 283 142 2 323 10
$$ packed form
5309A77K09p8K33p15M36R3k9m47N2J66m24m8N68o47K73Q1p3n44M52k12k06K43
5331d40O74m57m99N58k79L33l35J85m49J66N86j33K07m24L7J61J91k3K43j25n51
5352c74Q78j17n22K86K00m69L25M72o37j4P33k38m05K15J43k19j72N07m84R6Q5
5373B89J71k50k98M7p9K12k78J84J85k25k73L88j34k45K76n00K6K59O7m75K51
5394d02N98p30J78K31m27J03K29K52K40L6n72K02M11l25N0j9k05N1K00K0J8K65
5416D04j16o12P02Q2n03k46O72j94m0m3J41k91N28m31j67L69l18L6L04m75J34
5437f4J6k30R9L70j93j28Q3M3l9l54O6k41L87L83l82m0J28j61J94J91k30L2N9
5460a1J3r7J22j46j55K46M53n37K72p6k55L76k3j27m2N3r1N3K55j41j40L21l13
$$ plain form
5483 10 89 95 46 -50 123 157 -77 236 -17 -117 368 301 43 -12 371 -129 -131 170 140 -509 -77 20 -174 -189 205
5508 205 -272 16 -142 134 -174 -280 -200 239 -12 -84 -150 -216 -147 -128 314 -308 -252 150 307 -473 350 -100
5530 -100 -187 -49 425 -267 -158 25 71 305 -68 -252 68 240 304 -143 -30 156 304 -58 -23 201 31
5551 31 -278 -90 370 33 -299 180 130 -435 159 371 -412 -378 101 -6 -44 241 -339 -413 119 283 178 -277
5573 -277 -132 210 23 -337 236 28 -116 -102 337 59 35 93 429 -102 286 707 183 -130 669 314 -152
5594 -152 -156 429 299 102 218 80 71 303 226 312 -311 -21 -315 -51 137 -11 -101 -267 82 -84 31 19 -148
5617 -148 -106 34 67 3 -203 -72 362 -285 -224 -11 -246 -157 596 29 -342 -310 -83 145 -303 175 -22 -38
5639 -38 17 98 496 122 -250 313 34 -170 297 234 -223 98 69 -35 -165 468 -85 -405 -76 -434 -337 -196
$$ packed form
5483A0P9Om9r6J73L4k34L13k53j00M85o7k58n5L83n00kL01l0o49M32R7j94j5L94
5508B05m77K88j58K76l08j06Q0M39k51p2o6o6O9J9M42o22N6M02J57p80Q23m50
5530a00q7J38M74o92J09J83M6K34l73j84L20J72O4m47J13J86J48l62L5K24j70
5551C1l09J88M60l37l32M79n0n65N94K12p83L4M79j07l8K85n80p4N32J64j05m55
5573b77J45L42j87l60N73k08j44J4M39k78k4N8L36n31L88M21n24l13P99l55m66
5594a52mN85j30j97J16j38rK32p7Q6o23K90k94K64J88j48r0j66L49j66J15j2j67
5617a48M2J40L3o4k06J31M34o47O1K13k35Q9P53n67l71L2K27K28m48M78j97j6
5639c8N5Q1L98l74l72N63k79k04M67o3m57L21k9j04j30O33n53l20L29l58R7J41
$$ plain form
5661 -196 -74 -246 -107 -29 -277 -311 63 -158 -140 -273 -319 -308 -73 -134 11 -67 -314 50 391 -236 -215 371 88
5684 88 -42 -109 95 -140 129 200 -30 181 123 -175 292 236 241 -170 232 334 332 353 -374 102 547 164 92 244
5708 244 341 -130 -16 72 313 -4 30 -157 333 468 -232 -245 17 115 -391 -211 -186 -123 -182 34 -150 63 -178
5731 -178 -66 -159 75 -30 36 -222 -153 273 -88 -179 262 52 -142 18 410 -190 -387 -94 250 176 -127 360
5753 360 77 190 33 -131 -28 -42 -247 -125 150 137 365 -161 -234 194 266 -626 -53 630 -125 -285 12
5774 12 89 -215 -507 362 195 -124 38 95 336 1 -265 -415 16 254 -341 -436 -193 -84 189 -491 84
5795 84 413 -399 -371 63 16 -205 -13 -155 99 232 -9 -152 75 599 -157 -269 117 452 -94 -38 502
5816 502 480 -61 -310 98 624 2 -105 249 118 -244 184 99 141 687 117 -149 358 268 -113 84 530
$$ packed form
5661a96J22j72J39P8k48l4L74k21J8j33m6J1K35o1J45p8k47L64L41o27K1N86k83
5684H8j30o7K04k35K69P1k30K11n8k98M67n6Nm11M02J02kK1p27M76M45l83p2J52
5708B44R7m71J14Q8K41l17L4j87M90J35p00j3K62R8n06J80K5O3n9K16j84K13k41
5731a78J12r3K34j05O6k58O9M26l61r1M41k10j94J60L92o00j97K93L44p4l03M87
5753C60k83J13j57j64J03j4k05J22K75j3K28n26p3M28P2q92N73O83p55j60K97
5774A2P7l04k92Q69j67l19J62N7K41l35k66j50M31K38n95r5K43J09K73o80N75
5795H4L29q12K8M34m7k21J92j42K54J33k41j43K27N24p56j12L86L35n46N6N40
5816E02k2n41k49M08N26o22j07L54j31l62M28q5M2N46n70k66N07r0l81J97M46
$$ plain form
5837 530 460 -327 -231 280 567 -158 -383 121 476 18 -197 -335 -71 396 -464 -648 49 38 -631 -361 267
5858 267 278 -961 -805 231 33 -589 -232 22 -337 -217 -84 -352 -49 -48 -559 -78 316 -103 -143 -243 128
5879 128 40 -585 -24 387 218 -133 177 664 146 -224 276 325 15 81 -287 87 304 -26 -645 132 322
5900 322 -196 -758 286 65 -207 -390 -454 117 -90 -568 -170 44 -200 -295 -122 8 198 -122 -78 -452 540
5921 540 -545 -777 137 821 -422 -648 374 107 -652 -642 217 387 -12 -199 -262 -49 119 -179 -49 413
5941 413 482 -165 -211 -17 538 40 -535 365 359 -463 -67 587 308 -278 -27 149 185 70 -425 98 340 221
5963 221 -384 357 371 266 -425 -348 435 161 -246 -446 281 256 -373 -32 195 95 -282 -74 96 142 44 -266
5985 -266 -303 399 -93 -799 -179 792 -236 -441 246 125 176 -25 -317 545 503 -346 -361 279 415 193 -317
$$ packed form
5837E30p0p87R6N11K87p25k25N04L55m58k15j38K64M67q60j84O97j1o69K70O28
5858B67J1j239J56J036j98o22L57K54l59J20J33k68L03Jn11M81L94m19m0j00L71
5879A28q8o25N61M11j69l51L10M87n18l70N00M9l10O6l68L74K17l30o19P77J90
5900C22n18n62J044k21k72j83o4N71k07m78L98K14k44r5J73J30J90l20M4l74R92
5921E40j085k32R14O84j243k26J022k67p59J0Q59J70l99j87o3K13J68k98J30M62
5941D13O9o47m6J94N55m98n75R00oq22L96O54k79n86K51J76L6j15m95N23K42j19
5963B21o05P41J4j05o91P7P83k74m07k00P27k5o29L41K27j00l77K08J70M6r8l10
5985b66l7P02m92p06O20R71j028k05O87j21N1k01k92Q62m2q49j5O40J36k22n10
$$ plain form
6006 -317 53 484 71 -333 -7 526 272 -629 101 312 -143 -10 266 283 110 57 -156 416 358 31 -132
6027 -132 229 253 99 -485 49 434 -43 -200 179 908 -24 -450 294 527 -86 -244 186 381 185 166 -17
6048 -17 249 619 -366 -429 485 257 -165 -270 255 324 -282 -67 -16 204 -216 -474 -34 411 -228 -281 89 161
6070 161 29 -368 -142 386 257 -521 -341 335 268 -631 -105 503 281 -463 -78 257 232 -55 -469 4 192
6091 192 -348 -305 34 594 -88 -626 -52 486 48 -433 -276 284 42 -549 -62 280 36 -457 -294 146
6111 146 83 -529 -608 45 29 -415 -737 -66 -42 -498 -440 -218 223 -211 -442 -184 224 -84 -531 -85 520 -55
6133 -55 -416 -82 185 269 -191 -411 32 378 -436 -318 524 638 -112 -327 220 342 90 -270 74 734 388
6154 388 -309 124 83 21 -281 -28 96 -196 -272 -203 176 241 -490 -483 398 355 -68 -270 38 167 -85 -117 90
$$ packed form
6006c17L70M31m13m04L26N33k54r01P30K11m55J33K76J7j73n3k13N72n8l27j63
6027a32L61K4j54n84N34L85m77j57L79P29r32m26P44K33o13j58M30J95j96j9j83
6048a7K66L70r85o3R14k28m22j05N25O9o06K15N1K20m20k58M40M45o39n3L70P2
6070A61j32l97K26N28j29p78J80O76o7q99N26O08k22p44L85L35k5k87m14M73J88
6091A92n40M3L39N60o82n38N74N38m38m81J57N60k42n91M87L42k44m93J63M40
6111A46o3o12p9O53j6m44l22O71K4m56N8K22M41m34k31K58M08l08m47M46O05n75
6133e5l61L34K67Q4m60k20M43L46q14J18Q42J14p50k15N47J22k52l60L44O60l46
6154C88o97M33m1o2l02K53J24k92p6O9L79O5p31PQ81m3m23k02L08J29k52l2K07
$$ plain form
6177 90 352 -78 -414 22 369 -121 -228 -162 424 257 15 220 333 220 -89 -62 268 432 -220 28 246
6198 246 423 -294 -35 556 148 267 -227 232 385 181 -354 287 337 235 7 -75 452 102 -288 -371 87
6219 87 345 -294 -217 404 219 -103 -154 29 98 -547 -445 -157 351 111 -880 30 247 -95 -538 -298 508
6240 508 143 -249 -203 337 369 -129 -238 394 307 -325 -300 219 283 231 -495 -38 480 105 -631 -172 408 54
6262 54 -328 343 330 115 -242 -87 571 252 -317 1 157 85 -220 195 224 240 -180 -172 -63 259 90 -585
6284 -585 -58 227 -186 -416 -126 -6 -122 -244 -131 51 47 -277 -213 115 82 -492 -140 279 221 -149 -216 19
6306 19 95 -106 -436 84 537 244 -221 398 123 -114 -266 12 -85 431 -107 42 357 366 69 15 70 -105
6328 -105 152 -68 -4 113 -52 -337 478 376 -94 -228 -62 188 98 -339 -216 285 51 -392 -324 106 252
$$ packed form
6177I0K62m30l36M36L47m90j07O6N86j67k42K05J13j13l09K7L30J64o52K48K18
6198B46J77p17K59N91m08J19m94M59J53k04n35O41N0j02k28q2N27l50l90q3M58
6219H7K58o39P7O21j85l22n1J83O9o45J02K88N08k40r91R10K17l42m43K40Q06
6240E08l65l92M6N40L2m98j09O32q7o32K5N19O4n2p26M57N18l75p36M59N80l54
6262E4l82O71j3k15l57J55O58l19n69L18J56p2l05M15K9J6m20QJ09L22j69o75
6284e85N27K85m13k30K90J20j16j22J13J82ml24O4L28l3n74L52M19n8l70o7K35
6306A9P6k01l30N20M53k93m65O19k75k37j52K78r7N16n38J49L15Rk97n4N5j75
6328a05K57k20O4J17j65k85Q15j02m70j34J66K50r0m37J23N01k34m43O8M30J46
$$ plain form
6349 252 -458 -149 22 7 -103 -245 95 53 -214 -534 288 300 -226 -427 97 -70 -166 -129 314 76 -44 -303
6371 -303 331 -22 -77 -343 -345 346 227 -170 -21 32 -87 154 66 176 99 -224 84 101 328 43 -315 -182
6393 -182 501 2 -403 -266 292 -99 -520 79 276 -455 -310 -98 -231 -145 -125 -140 -40 52 -8 -543 -83 219
6415 219 39 -32 -45 -109 114 -47 161 466 218 91 162 114 27 -149 -137 114 339 146 -221 64 228 -197
6437 -197 162 215 206 -15 120 281 -81 -236 173 302 317 -17 31 155 375 18 -79 69 162 -154 -260 -52
6459 -52 153 19 -126 -276 190 330 -380 178 -28 -96 73 182 345 116 -11 36 -83 110 -124 -257 335
6480 335 142 216 -195 25 12 301 -54 -178 89 116 -5 375 390 -3 67 -173 89 -283 364 -23 -85 491
6502 491 -43 -190 27 500 -198 40 -51 -32 23 -226 358 186 -33 -324 -112 44 -8 121 84 -136 -5 -172
$$ packed form
6349B52p10L09J71j5j10j42L40m2k67l20Q22J2n26k01N24j67r6L7M43k38j20k59
6371c03O34l53n5k66kO91j19l97J49N3j19K41q8J10p7l23L08J7K27k85l58J33
6393a82O83m99m05J37N58l91m21N99J97p31J45K12j33Q6K0j5J00R2o0n35M60L02
6415B19j80p1j3o4K23j61K08L05k48j27P1m8q7j76J2K51K25j93l67K85J64m25
6437a97L59N3rk21J35J61l62j55M09J29J5l34M8J24K20l57r7J48R3l16j06K08
6459e2K05j34j45j50M66J40p10N58k06o8J69J09J63k29j27M7j19J93k34j33N92
6480C35j93P4m11K20j3K89l55j24K67K7j21L80J5l93P0k40K62l72O47l87o2N76
6502D91n34j47K17M73o98K38r1J9N5k49N84j72k19k91K12J56n2J29l7k20J31j67
$$ plain form
6524 -172 -390 -200 -53 -265 -296 86 299 -447 -204 -70 -157 -179 -361 115 -249 -90 -89 -151 -217 -233 -239 -60 -241
6547 -241 -213 263 -23 -305 420 -273 -194 -45 80 56 -325 85 35 -239 177 -144 -68 -254 -146 -138 214 -219
6569 -219 -252 -201 -102 -28 69 -325 119 -69 -446 -31 -31 89 -163 -124 233 -156 -28 37 -170 -77 351 -267 137
6592 137 77 120 279 130 154 163 203 -32 -75 -62 -147 -140 485 149 185 89 -37 89 293 228 -188 -178 171 -59 -133
6617 -133 101 -213 -83 160 157 -26 -220 171 24 272 231 -118 189 188 103 56 -38 390 88 164 138 186 -102 96
6641 96 33 -2 129 131 -272 183 -31 74 177 -36 -34 195 177 -101 265 6 -155 52 -1 18 -157 348 -127
6664 -127 -71 99 -108 159 -102 289 -72 122 -241 145 54 59 122 -58 -211 -281 54 1 26 354 -139 399 6
6687 6 -170 -72 -96 -38 -84 103 -271 -153 -94 28 -113 141 35 159 314 233 48 131 101 46 -118 400 -37 -92
$$ packed form
6524a72k18J90J47k12l1L82K13p46K43J34q7k2j82M76l64J59Jo2o6j6oJ79j81
6547b41K8M76k86k82P25o93P9J49J25k4l81M10n0k74M16l21P6j86J08QL52m33
6569b19l3N1R9P4R7l94M44j88l77M15%J20k52L9L57l89J28O5k07R3M28o18M04
6592A37o0M3J59j49K4RM0k35m3J3q5PO25l36L6r6j26J26K04o5m16J0L49k30p4
6617a33K34l14J30K43lj83j94L91j47K48m1l49L07jq5m7r4M28l02P6k6M8k88J98
6641I6o3l5J31Km03M55k14J05J03k13KK29j8k78L66k59j61K07n3J9j75N05m75
6664a27N6J70k07K67k61L91l61J94l63L86r1NO3j80j53p0L35n3K5L28m93N38l93
6687Fj76R8k4N8m6J87l74J18N9J22j41K54j06J24J55q1j85Q3l0n5j64N18m37n5
$$ plain form
6711 -92 44 37 -326 262 -72 -212 -42 -171 -2 -16 -123 -56 104 -97 -158 -267 -262 -167 96 -120 -403 -135 125
6734 125 -52 -247 182 -85 -313 143 -107 -231 16 102 331 -18 553 -216 105 -65 94 149 200 37 -389
6755 -389 303 -22 163 142 60 -71 150 125 -34 -60 -292 -112 -177 62 -221 -314 -4 103 177 -273 45 -280
6777 -280 -169 -89 -36 -194 165 -303 56 -71 -99 193 -102 -68 162 -28 -164 -131 70 -112 -30 270 294 -79
6799 -79 42 56 -75 31 98 126 54 -110 39 152 125 -313 -60 -43 -342 -89 36 -85 -144 3 52 -218 -5
6822 -5 -118 199 -45 -171 -247 -272 -136 -227 265 75 1 -159 111 145 -140 256 257 272 97 56 12 26 -137 54
6846 54 -40 247 152 73 -93 34 422 1 -81 -28 29 -75 170 102 61 96 160 154 -141 -22 190 -124 -66 -164 71
6871 71 112 -238 -90 -25 -69 192 233 166 -126 -43 100 -10 241 -83 32 95 128 -15 54 385 76 104 174 89
$$ packed form
6711i2J36pl63N88l34j40J70j29J69j4j07O7J60k01o1j09NR5K63k16k83K68K60
6734A25j77j95M29k67k28M56k50j24K47Q6K29l49N71p69L21j70J59N5N1j63m26
6755c89O92l25J85k1q2j31K21k5j59k6k32J80o5K39k83r3L10J07P4m50L18l25
6777b80J11Q0N3j58L59m68L59j27k8K92k95L4K30j90j36L3K01j82Q2L00K4l73
6799g9J21J4j31J06O7K8p2j64J49J13k7m38K53J7k99K53J25j21n9J47M9k70K13
6822ej13L17k44j26p6k5J36r1M92j90p4j60K70L4k85L96JJ5j75m1m4J4j63J91
6846E4r4K87r5p9j66J27L88m21q2N3N7j04K45o8m1L5O4ok95J19K12l14N8r8K35
6871G1M1l50J48O5m4K61M1o7k92Q3J43j10K51l24J15O3L3j43O9L31l09K8P0q5
$$ plain form
6895 89 -20 30 121 32 -30 73 -191 452 256 62 -44 -122 115 -246 -166 24 -6 89 216 311 -66 74 -220
6918 -220 -30 -84 -118 121 97 -188 -168 -127 -99 -19 38 -257 -10 -7 -225 -293 -229 -123 -172 138 -12 -217 146 -89
6942 -89 -45 -60 86 -94 42 -42 41 70 1 -22 -176 206 -145 -285 158 -79 119 108 -166 105 -117 154 -27
6965 -27 154 -77 -8 25 -139 -161 -169 120 4 312 145 2 -283 -69 138 -158 -40 -188 -192 19 29 64 -232
6988 -232 -179 43 -20 204 -115 -18 -71 15 -98 -305 123 -43 15 -156 193 89 -59 -53 20 43 -184 102 228
7011 228 -19 19 243 35 65 48 118 -47 109 -189 -245 56 -65 -127 64 -10 -149 24 85 -82 12 -32 26 -10
7035 -10 -114 -119 -209 127 140 -10 -26 113 1 175 51 82 -103 82 -119 -10 69 140 51 34 -73 251 122 124
7059 124 284 257 -13 78 154 -148 135 -28 -199 -21 116 69 105 -22 342 27 243 -138 32 -46 96 -114
$$ packed form
6895H9j09N0R1q9o2J03k64O43j96j94j06p8K37l61Q0J90l0R5J27R5l77J40k94
6918b20J90n4l4K39k4k85K0M1K8Q0N7k95K47Lk18o8O4J06m9L10j50k05L63k35
6942h9M4j5J46j80J36q4Q3K9o9k3j54L82l51j40M43k37J98j1k74K71k22K71j81
6965b7J81k31O9L3j64k2qK89j16L08j67j43k85K14K07k96J18j48mK11J0L5k96
6988b32N3K22o3K24l19R7n3Q6j13k07M28j66N8j71L49j04j48OP3K3k27K86J26
7011B28k47L8K24k08L0j7P0j65J56k98n6L01j21o2J91p4j39J73O1j67R4m4N8l6
7035a0j04nr0L36J3j50j6J39j12J74j24L1j85J85k01J09P9P1q9j7j07L24j29K
7059A24J60k7k70R1P6l02K83j63j71J78J37m7L6j27L64l15K16l81J70p8J42k10
$$ plain form
7081 -114 -209 -5 -139 -116 74 -97 94 -16 -2 173 -317 163 -231 -139 -58 -40 -18 -99 58 -90 -101 98 3
7104 3 58 83 -115 -124 -137 70 70 9 93 108 -243 99 -153 -100 -65 160 -171 -39 21 110 -150 135 77 23 -109 66
7130 66 -50 279 -88 -142 -78 -317 164 -48 -74 19 176 -516 426 -35 -294 -324 -5 86 161 91 55 -21 -177 -53
7154 -53 -95 33 -14 16 -250 -143 -55 264 310 35 319 -8 -99 -269 -152 91 -252 43 135 -130 2 228 -144
7177 -144 -76 113 -90 -94 141 -84 -243 46 304 61 -2 -190 214 90 78 -429 -162 398 114 45 23 350
7199 350 507 -239 24 -92 151 -310 -149 46 -175 -71 -83 63 135 -30 33 150 -161 68 221 -187 -435
7220 -435 50 -55 358 23 -81 50 -18 219 -256 34 158 65 303 -166 -23 56 103 -69 237 145 58 -19
7242 -19 -19 -65 369 -61 -73 -74 -61 -133 107 157 41 -227 153 -257 92 -38 -109 13 109 104 -96 134 -78 -186 -57
$$ packed form
7081a14r5K04j34K3J90j71J91j10J4J75m90M80l94R2Q1J8K2q1J57j48j1J99r5
7104CN5K5j98rj3K07%o1Q4J5l51L42k52N3L5K25l31J32O0Q9k60K85n8n4j32J75
7130F6j16L29l67n4O4k39M81k12k6R3J57o92R42m61k59l0L19R1P5p0l6p6j56J24
7154e3m2J28m7L0k66J07Q8L19M6k75K84l27r1j70J17K43l43K95R2k65J32K26l72
7177a44O8J89k03mK35k25j59K89K58k43o3j88M04j24j2n07K67N60k84o9k2L27
7199C50J57p46K63j16K43m61J61J95k21J04j2J46P2j65O3J17l11K29J53m08k48
7220d35M85j05M13l35j04J31o8K37m75K90J24r3K38m69J43P9M7j72L06r2q7p7
7242a9%m6M34m30j2jJ3p2K40N0j16k68L80m10L49j30p1J22R6nk00K30k12j08J29
$$ plain form
7267 -57 -114 -220 -236 -93 -154 30 171 -58 -89 -310 -70 -373 -247 32 -66 109 -194 -98 231 -135 46 -266
7289 -266 226 -8 -121 -103 -25 -59 -180 8 -4 -278 33 100 241 -272 -269 248 -111 -168 18 -33 -19 -94 37 -129
7313 -129 -212 -182 -78 -7 -8 -158 171 -28 75 72 143 -63 170 77 138 327 19 109 63 363 25 -10 105 192 -12
7338 -12 -29 260 166 8 22 267 -25 38 329 196 136 89 -152 333 -354 -69 -114 -1 -27 -335 -110 -5 -289
7361 -289 18 -98 174 118 -167 138 189 265 -253 44 26 388 -18 -36 -78 -111 282 79 94 -13 -179 4 -6
7384 -6 248 -58 74 -113 223 359 -261 233 34 -45 139 206 24 -177 122 -101 -8 20 136 -80 -246 -140
7406 -140 -189 -213 -32 -291 -239 -23 -76 -47 -136 1 -38 23 5 -247 141 69 -96 -23 -207 -104 -75 9 -13 57 29
7431 29 -101 107 -61 -9 158 260 -71 -61 -95 27 -7 -82 -4 338 -116 -71 -31 34 -261 -116 170 68 -241
$$ packed form
7267e7n7j06j6J43o1J84J41k29l1k21K40l03J26K79r8J75l03R6L29l66J81l12
7289b66M92k34j13J8P8l4j21J88j2k74L11O7J41n13LN17l59n7J86n1J4p5J31j66
7313a29q3L0J04P1jj50L29j99J03lP1k06K33r3O1J89l08R0m6L00l38l5J15Q7k04
7338a2j7K89r4j58J4K45k92O3K91j33o0m7k41M85o87K85m5J13k6l08K25J05k84
7361b89L07j16K72n6k85L05N1P6n18K97j8L62m06j8m2l3L93k03J5j07j66J83j0
7384fK54l06J32j87L36J36o20M94j99p9J84O7j82k01K99k23R3K8J16k16j66J06
7406a40m9k4J81k59N2K16n3K9q9J37l9O1j8k52L88p2j65P3j84J03K9Q4k2P0k8
7431B9j30K08j68N2J67J02l31J0l4J22l4p5P8L42m54M5M0O5k95J45K86j02l09
$$ plain form
7454 -241 48 48 28 -123 58 -224 87 -293 23 -33 100 -13 213 -76 6 -101 -230 121 111 -282 119 235
7476 235 106 -12 -309 -6 51 280 -109 -101 -45 -107 127 77 37 264 -34 -214 89 326 -22 105 -74 357
7498 357 -79 143 83 91 237 259 -17 -17 40 -216 -96 64 271 -355 -188 -64 417 265 121 211 126 -167 299
7521 299 -98 -113 305 21 -90 51 26 -28 -253 -213 -39 52 -145 -76 -376 -107 68 1 55 -261 -31 -284 -307
7544 -307 -146 96 44 -62 111 166 132 165 -11 117 211 333 -120 -230 31 119 239 103 210 78 98 74 -91
7567 -91 125 80 107 97 182 97 -52 -240 -52 91 -174 -4 -107 -26 203 -103 -136 -39 -207 -261 -15 2 -318 -178
7591 -178 183 174 -9 115 125 -64 17 57 -66 -112 -58 44 253 90 -88 9 67 -123 -48 167 -5 -11 4 74 148
7616 148 192 108 140 -276 39 204 -132 -156 -9 -45 123 -150 67 118 -129 25 -257 -38 -203 -216 79 -213
$$ packed form
7454b41K89%k0j51J81k82L11l80L16n6J33j13K26k89Q2j07j29L51j0l93M01J16
7476B35j29j18k97L03N7K29l89QN6o2K34n0m0K27k98j80L03K37l48J27j79M31
7498C57m36K22o0QJ46K2k76%N7k56J20J60K07o26J67J24M81j52j44R0q5k93M66
7521B99l97j5M18k84j11J41k5n4k25M0J74R1j97O9l00K69J75o7N4l16K30k53k3
7544c07J61K42n2j06J73N5l4L3j76J28R4J22m53j10K61Q8J20j36J07j32K0k4j65
7567i1K16m5K7j0Q5q5j49j88J88J43k65J70j03Q1K29l06l3R7j68n4K46J7l20J40
7591a78L61rj83J24J0j89Q1M0j23m6N4J02K09j63j78R7N8j90P5K15j72oJ5P0P4
7616A48M4q4L2m16L15J65l36k4J47l6J68k73K17N1k47J54k82K19j65j3K95k92
$$ plain form
7638 -213 -98 369 -2 51 211 90 9 28 138 165 -153 -44 -10 -27 99 -107 -124 -164 -244 36 -109 39 -6
7661 -6 -150 -336 -164 95 -27 -112 10 -93 -298 -393 -234 302 295 -96 -42 -357 -99 234 27 -186 -187 14 125
7684 125 173 -102 -145 -7 9 -146 -74 33 -264 182 13 -87 20 171 -18 -11 285 286 -401 232 321 31 87
7707 87 40 -32 -311 133 -111 -324 -2 60 22 67 -70 62 328 -475 74 189 284 102 -24 30 -4 140 79
7730 79 7 -69 96 173 -34 -124 -133 -156 -22 -128 114 333 -135 -108 -331 -136 133 -177 176 -11 228 -193 -114
7753 -114 -215 -71 -228 71 -71 -331 102 -169 26 -80 -42 89 198 205 -49 -49 5 -61 -87 -25 -349 94 90 107
7777 107 -168 -68 -7 -50 -135 -7 97 248 -283 96 264 216 136 -240 244 -102 -88 -257 147 10 -213 174
7799 174 126 -77 -31 169 -116 124 -36 -148 197 112 1 -71 158 -4 39 14 -13 167 -11 112 140 21 235
$$ packed form
7638b13J15M67l71N3J60j21q1J9J10K7l18J09L4j7J26k06j7m0q0K80j45J48m5
7661fj44j86J72K59j22q5J22j03k05r5J59N36pl91N4l15K58L33k07k13jK01J11
7684A25M8k75m3J38J6j55P2J07k97M46j69j00J07J51j89PK96Jo87O33Q9k90N6
7707H7m7p2k79M44k44k13L22O2l8M5j37J32K66q03N49J15R5j82j26N4l4J44o1
7730G9p2p6J65P7k07r0rk3J34j06K42K19m68K7k23J95K69l10L53j87K39m21P9
7753a14j01J44j57K99j42k60M33k71J95j06L8J31J09Pk54%N4o6k6O2l24M43mJ7
7777A07k75J00O1m3q5J28J04J51n31L79J68m8q0l76M84l46J4j69M04j37k23L87
7799A74m8k03M6K00k85K40j60j12L45q5j11p2K29j62M3k5k7J80j78J23K8j19K14
$$ plain form
7822 235 -388 -537 -337 -153 113 15 175 245 190 36 -4 162 86 -135 98 68 146 -249 -22 -36 48 163 -165
7845 -165 218 -33 -113 -178 -220 86 -85 15 -27 321 75 -51 44 -464 127 28 -197 -26 -55 -136 -72 300 -64
7868 -64 -71 34 -175 -118 -17 16 -209 -133 -28 -3 -55 81 -243 -21 283 -29 -362 108 220 -110 72 -38 -276
7891 -276 114 293 -127 -414 -51 -27 -245 136 -82 237 -67 -26 300 -12 -201 -202 311 -376 -8 -16 12 248
7913 248 -178 -70 73 31 58 -128 -237 14 161 216 40 130 239 -520 -175 -196 -199 -522 -292 205 103 -382
7935 -382 -255 -8 498 -181 -209 -256 193 -171 -63 77 -220 14 -130 -161 18 111 -58 -223 301 33 163
7956 163 -218 502 267 -416 -49 3 364 -366 -154 -64 191 -26 -228 124 388 -334 -8 316 127 -64 -198
7977 -198 11 23 267 -25 160 61 109 139 -72 -29 167 -169 35 1 160 -56 -311 -91 59 87 -64 71
$$ packed form
7822B35o23j49K00J84K66r8J60P0n5j54m0J66p6k21K33l0P8l95K27j4Q4J15l28
7845a65L83k51q0o5m2L06j71J00m2L48k46j26R5n08N91r9k25J71k9q1O4L72l64
7868f4pJ05k09N7J01L3k25P6J05K5n2J36l24K22L04l12l33M70J12l30J82j10k38
7891b76L90J79m20k87L63K4k18L81k18L19l04M1L26l12j89jN13o87L68qK8K36
7913B48m26J08J43m2K7j86j09K51J47N5j76R0J09p59L45k1ll23K30M97j02m85
7935c82J27K47N06o79k8m7M49l64J08J40k97K34j44l1J79R3j69j65N24k68J30
7956A63l81P20k35o83L67N2L61p30K12R0K55k17k02L52K64p22L26L24j89j91j34
7977a98K09J2K44k92J85r9M8L0k11M3J96l36K04l4J59k16k55K20J50K8j51J35
$$ plain form
7999 71 165 -93 -236 47 273 -124 -377 89 24 137 -182 -121 63 42 28 -80 -165 -68 105 192 99 -125 -164 101
8023 101 190 210 215 7 221 80 -107 -155 -112 70 -310 -202 13 92 148 -139 91 -10 -106 -60 168 -116 176
8046 176 58 10 5 83 342 -265 -154 217 -180 -235 196 -80 -33 -354 5 135 -104 -301 117 47 98 -87 11
8069 11 113 -165 -99 -53 241 -80 -397 93 -189 -136 153 -47 -35 -80 -155 -79 87 208 47 206 58 188 -26
8092 -26 -275 254 81 159 42 14 176 -181 237 12 189 236 -109 -147 -29 15 109 -63 -175 331 -150 18
8114 18 -157 0 26 -278 152 -281 249 -19 -99 332 20 77 -256 51 72 -92 -273 34 267 -288 -258 -326
8136 -326 -102 105 127 -166 -265 146 -122 91 -103 204 -32 77 380 41 -28 58 331 117 192 125 241 350
8158 350 -190 -161 214 423 71 -365 38 174 -182 132 245 142 -18 12 35 151 40 -324 -132 132 66
$$ packed form
7999G1R4k58j43K83K26l97k53M66o5J13l19O1J84k1j4j08q5R7J73Q7r3k24l9K65
8023A01Q9K0Nk08K14j41j87m8M3J82l80J08K15P9N6k87K30j01r6M6K28k84K92
8046A76j18m8nP8K59o07J11L71l97n5M31k76M7l21L59J30k39j97M18p0N1j85R8
8069A1J02k78O6M6K94l21l17M90k82N3K89k00J2m5p5P6J66J21j61J59j48J30k14
8092b6k49N29j73P8j17k8J62l57M18k25J77M7l45l8J18M4R4j72j12N06m81J68
8114A8j75J57K6l04M30m33N30k68q0M31l12N7l33L07K1j64j81L07K33n55L0o8
8136c26K24K07K2k93r9M11k68K13j94L07k36J09L03l39o9Q6K73k14P5o7J16J09
8158C50n40K9L75K09l52m36M03J36l56L14J13j03j60L0K3J16j11l64J92K64o6
$$ plain form
8179 66 274 -250 -52 -91 -194 -39 -73 115 -267 -170 -124 -185
$$ packed form
8179F6K08n24J98l9j03J55l4J88l82R7M6o1
8191a85
$$ Imaginary data points
##PAGE= N=2
##DATA TABLE= (X++(I..I)), XYDATA
$$ plain form
0 0 0 0 0 8 -8 0 -8 14 -16 16 -24 27 -39 45 -54 62 -77 91 -107 123 -147 170 -198 225 -259 295 -337 383 -432
29 -432 486 -549 615 -687 769 -856 953 -1059 1176 -1303 1444 -1597 1769 -1959 2169 -2402
45 -2402 2670 -2971 3315 -3709 4177 -4732 5405 -6242 7314 -8744 10751 -13775 18825 -28788
59 -28788 55741 -274903 -759547 74073 269970 -357614 -463170 -54940 -197966 -370115
69 -370115 -87472 -81188 -493110 -365282 60877 -110842 -478684 -246845 23596 -190256
79 -190256 -317672 -84008 -43491 -192903 -127720 -28386 -115434 -79197 61059 -20028 -142073
90 -142073 -17570 111628 68394 -8387 -56156 -13267 159924 160051 -87965 -98446 176915
101 176915 160688 -94988 -39355 147792 20866 -110994 48727 102264 -86898 -96347 40251
$$ packed form
0@%%%Qj6QqK2l0L2m0N1o6Q4r9J16j39J68j98K30k70L17l68M23m84N54o32P20q15
29d32R18j035J164j302J456j625J809k012K235k479K747l041L366l728M128m571
45b402N072n641O286p024P886q909J0137j1647J3556j6058J9495k4526L2600m7613
59b8788Q4529l30644m84644Q33620J95897o27584j05556M08230j43026j72149
69c70115K82643O284m11922J27828M26159j71719l67842K31839K70441k13852
79a90256j27416K33664M0517j49412O5183R9334q7048L6237J40256q1087j22045
90a42073J24503J29198m3234p6781m7769M2889J73191J27k48016j0481K75361
101A76915j6227k55676N5633J87147j26926j31860J59721N3537j89162r449J36598
$$ plain form
112 40251 -37688 -115945 30005 5762 -230914 -144659 118095 -22486 -261506 -113986 20743
123 20743 -117183 -107057 9624 -138224 -221883 28957 93824 -171338 -193552 44137 52085
134 52085 -87479 -53691 9531 -16410 22561 53308 -35587 -5306 161234 89660 -108615
145 -108615 34844 274008 114807 -91049 79160 223894 96046 75329 161019 59541
155 59541 30272 235620 225970 -23066 10872 230650 172526 21466 88550 135702 38893
166 38893 62378 156893 62855 -44620 65149 133025 -12627 -60839 82222 78700 -88214
177 -88214 -84767 56246 51363 -64823 -108863 -62401 16907 29387 -86625 -149723 -35168 36913
189 36913 -46802 -83603 -40655 -53175 -45348 25908 -3445 -87689 -28108 59028 -2306 -43847
$$ packed form
112D0251p7939p8257J45950k4243k36676Q6255K62754j40581k39020J47520J34729
123B0743j37926J0126J16681j47848q3659K50840O4867k65162k2214K37689P948
134E2085j39564L3788O3222k5941L8971L0747q8895L0281J66540p1574j98275
145a08615J43459K39164j59201k05856J70209J44734j27848k0717Q5690j01478
155E9541k9269K05348r650k49036L3938K19778n8124j51060O7084M7152r6809
166C8893K3485R4515r4038j07475J09769O7876j45652m8212J43061l522j66914
177h8214L447J41013m883j16186m4040M6462P9308J2480j16012o3098J14555P2081
189C6913q3715l6801M2948j2520P827P1256k9353q4244N9581Q7136o1334m1541
$$ plain form
201 -43847 42337 55343 -33027 -57 101996 54017 -20276 54084 84397 -8944 34868 158057
213 158057 44518 -104883 48136 199578 39529 -94099 20044 91409 26745 8745
223 8745 7620 -40500 -12076 51979 -6424 -80907 -27710 14054 -51328 -71518 -8415 -20775
235 -20775 -95249 -73552 -10806 -37930 -73236 -44911 -53467 -84470 -29904 9718 -57194 -87618
247 -87618 -30794 -9857 -14292 474 -40790 -77793 14811 81653 -19760 -83667 16050 74571
259 74571 5199 -22118 28535 32546 -25 18768 46714 26930 10591 21595 12426 14457 58745
272 58745 45319 -31536 -15949 66491 43722 -22309 3175 25405 -11807 6761 47360 -5890
284 -5890 -54396 -199 42598 5123 -29060 -25720 -13730 4892 11409 -19025 -40175 -13108 6938
$$ packed form
201d3847Q6184J3006q8370L2970J02053m7979p4293P4360L0313r3341M3812J23189
213A58057j13539j49401J53019J51442j60049j33628J14143P1365o4664j8000
223H745j125m8120K8424O4055n8403p4483N3197M1764o5382k0190O3103j2360
235b0775p4474K1697O2746k7124l5306K8325q556l1003N4566L9622o6912l0424
247h7618N6824K0937m435J4766m1264l7003R2604O6842j01413o3907R9717N8521
259G4571o9372k7317N0653M011l2571J8793K7946j9784j6339J1004r169K031M4288
272E8745j3426p6855J5587Q2440k2769o6031K5484K2230l7212J8568M0599n3250
284e890m8506N4197M2797l7475l4183L340J1990J8622O517l0434k1150K7067K0046
$$ plain form
297 6938 -20352 -30978 4996 1701 -52484 -39722 28619 14266 -52538 -40371 6522 2781 -8957
310 -8957 -12489 -32744 -20818 20865 10155 -26220 -13393 2496 -9991 3703 26423 120
322 120 -30240 -1894 37398 22168 -13099 -6815 21606 18163 4288 16134 18406 -651 2962
335 2962 21836 19721 13232 4398 -12443 4886 40287 15101 -32152 -13197 24025 10791 -11204
348 -11204 -9113 -8483 -12598 -8779 -3021 -3503 -17843 -32531 -17975 5467 -4908 -29954 -32062 -14409
362 -14409 2097 -4630 -27219 -23934 -2245 -5265 -14005 1888 3208 -18043 -11063 15995 17713
375 17713 3414 -5683 -678 21996 32300 10376 515 18845 25529 19195 23481 24246 15384 13150
389 13150 21025 31374 30418 7535 -2118 24504 36760 11500 -2711 7704 13608 12158 7006
$$ packed form
297F938k7290j0626L5974l295n4185J2762O8341j4353o6804J2167M6893l741j1738
310h957l532k0255J1926M1683j0710l6375J2827J5889j2487J3694K2720k6303
322A20l0360K8346L9292j5230l5267O284K8421l443j3875J1846K272j9057L613
335B962J8874k115o489q834j6841J7329L5401k5186m7253J8955L7222j3234k1995
348a1204K091O30m115L819N758m82j4340j4688J4556K3442j0375k5046k108J7653
362a4409J6506o727k2589L285K1689l020q740J5893J320k1251O980K7058J718
375A7713j4299r097N005K2674J0304k1924r861J8330O684o334M286P65q862k234
389A3150P875J0349r56k2883r653K6622J2256k5260j4211J0415N904j450n152
$$ plain form
402 7006 -1406 317 3119 -7078 -4394 8226 -5172 -23399 -12279 2301 -2260 -13902 -23160
415 -23160 -18460 -1746 -3980 -20541 -16591 -8477 -17337 -13818 499 -7373 -21935 -15121 -2206 2429
429 2429 -5538 -17446 -10006 7136 2787 -8885 -3089 1907 -576 2759 3845 2478 7315 1385
443 1385 -6747 11868 23661 -1499 -11256 12255 19351 5181 2301 6241 7125 9589 8646 5275
457 5275 6730 5653 3750 7872 8707 4245 2524 -10 3019 12799 4336 -10881 2026 12090 -5210
472 -5210 -5272 10873 -1303 -14567 2709 9417 -5941 -7046 -247 -2876 252 2965 -6410 -7189 5091
487 5091 5870 -5328 -5851 6869 10000 -4313 -5290 15785 13930 -7885 1576 21956 8854 680
501 680 15541 10196 2633 21306 19281 -3445 9248 29087 9563 -1674 17804 18939 1886
$$ packed form
402G006q412J723K802j0197K684J2620j3398j8227J1120J4580m561j1642r258
415b3160M700J6714k234j6561L950Q114q860L519J4317p872j4562O814J2915M635
429B429p967j1908P440J7142m349j1672N796M996k483L335J086j367M837n930
443A385q132J8615J1793k5160r757K3511P096j4170k880L940Q84K464r43l371
457E275J455j077j903M122Q35m462j721k534L029R780q463j5217J2907J0064j7300
472e210o2J6145j2176j3264J7276O708j5358j105O799k629L128K713r375p79J2280
487E091P79j1198n23J2720L131j4313r77K1075j855k1815R461K0380j3102q174
501F80J4861n345p563J8673k025k2726J2693J9839j9524j1237J9478J135j7053
$$ plain form
514 1886 7320 17039 3807 -2909 11786 13497 -8076 -10895 11356 7153 -18150 -11058 4374 -10899
528 -10899 -17983 -2806 -15720 -28864 -2728 -3971 -40372 -26959 7322 -19597 -45691 -13692
540 -13692 -1288 -29533 -29625 -11594 -20757 -23761 -5336 -12117 -36100 -20434 10654 -6455 -35987
553 -35987 -13164 11006 -11204 -17723 6784 -4811 -22306 10824 18591 -24941 -15349 29979 5683
566 5683 -27647 7040 23646 -11170 -11384 12689 205 -6892 12392 -1123 -26801 1849 29846
579 29846 -8645 -38998 -1040 23727 -10927 -23960 -129 -7887 -18724 10125 3872 -41435
591 -41435 -17458 31894 -7366 -45204 4355 22039 -25982 -19375 20047 -3224 -20489 12840
603 12840 8313 -23722 6882 38389 -5425 -31362 19557 44748 2089 -14087 16150 23102
$$ packed form
514A886N434R719j3232o716J4695J711k1573k819K2251m203k5303P092J5432j5273
528a0899p084J5177j2914j3144K6136j243l6401J3413L4281k6919k6094L1999
540a3692J2404k8245r2J8031r163l004J8425o781k3983J5666L1088j7109k9532
553c5987K2823K4170k2210o519K4507j1595j7495L3130P767m3532R592M5328k4296
566E683l3330L4687J6606l4816k14K4073j2484p097J9284j3515k5678K8650K7997
579B9846l8491l0353L7958K4767l4654j3033K3831p758j0837K8849o253m5307
591d1435K3977M9352l9260l7838M9559J7684m8021O607L9422k3271j7265L3329
603A2840m527l2035L0604L1507m3814k5937N0919K5191m2659j6176L0237O952
$$ plain form
615 23102 14605 24763 13020 -9601 22905 52991 9237 -14474 31624 39601 2570 14794
627 14794 31436 4560 12949 40688 3090 -15432 43136 42466 -30551 -14878 53988 24300 -29773
640 -29773 2351 24873 -10857 -383 33629 -15852 -51413 26959 55528 -42748 -60681 38362
652 38362 32731 -50618 -18736 33733 -20582 -35466 28994 6145 -50110 5798 42934 -32941
664 -32941 -45185 39399 34049 -41274 -25047 31928 17623 -8124 3920 -2997 -10244 28888 37008
677 37008 -22480 -30008 33976 38800 -11395 -8598 12065 -1098 11001 26784 -17443 -27120 32658
690 32658 21966 -45092 -13480 41291 -10675 -49110 5224 15779 -28394 -14891 2582 -39306
702 -39306 -30236 33935 1478 -78206 -35364 44558 1566 -60069 -21413 6874 -22052 -6425
$$ packed form
615B3102q497J0158j1743k2621L2506L0086m3754k3711M6098P977l7031J2224
627A4794J6642k6876Q389K7739l7598j8522N8568o70p3017J5673O8866k9688n4073
640b9773L2124K2522l5730J0474L4012m9481l5561P8372K8569r8276j7933R9043
652C8362n631q3349L1882N2469n4315j4884O4460k2849n6255N5908L7136p5875
664c2941j2244Q4584n350p5323J6227N6975j4305k5747J2044o917p247L9132Q120
677C7008n9488p528O3984M824n0195K797K0663j3163J2099J5783m4227r677N9778
690C2658j0692o7058L1612N4771n1966l8435N4334J0555m4173J3503J7473m1888
702c9306R070O4171l2457p9684M2842P9922m2992o1635L8656K8287k8926J5627
$$ plain form
714 -6425 14556 -37571 -42424 36913 24522 -54049 -16757 47640 -5632 -36551 27291 28039 -24893
727 -24893 5420 34407 -13199 -3317 57844 12304 -55510 17006 84270 3763 -51104 20880
739 20880 46902 -7599 4850 34602 -22153 -29302 60052 41645 -65042 -27587 67251 9761
751 9761 -56872 9541 35295 -33938 -27147 27935 -4697 -35843 8369 7164 -43501 -15795 37075
764 37075 -5819 -59287 -16980 29869 2024 -28107 -20780 -13706 409 19789 -9087 -45015
776 -45015 -7888 31507 -2164 -24239 1241 -2466 -12192 17549 10628 -30957 -213 38353 -14753
789 -14753 -36763 34836 38822 -38548 -26517 42394 20299 -24236 3669 13218 -21631 6527
801 6527 49830 -10954 -62041 16208 65419 -15835 -51314 16960 22799 -24272 1431 21844
$$ packed form
714f425K0981n2127m853P9337j2391p8571L7292O4397n3272l0919O3842P48n2932
727b4893L0313K8987m7606R882O1161m5540o7814P2516O7264q0507n4867P1984
739B0880K6022n4501J2449K9752n6755p149Q9354j8407j06687L7455R4838n7490
751I761o6633O6413K5754o9233O791N5082l2632l1146M4212j205n0665K7706N2870
764C7075m2894n3468M2307M6849k7845l0131P327P074J4115J9380k8876l5928
776d5015L7127L9395l3671k2075K5480l707r726K9741o921m1585L0744L8566n3106
789a4753k2010P1599L986p7370J2031O8911k2095m4535K7905R549l4849K8158
801F527M3303o0784n1087P8249M9211q1254l5479O8274N839m7071K5703K0413
$$ plain form
813 21844 -29219 -25201 32597 4556 -42569 2663 28208 -27634 -31972 24103 14842 -29570 -16885
826 -16885 7139 -3117 2786 12242 -21746 -32804 23575 41149 -19948 -36009 15452 24534 -2503
839 -2503 7549 7671 -19072 7353 45341 3555 -27597 22271 35510 -11849 -473 39326 10687
852 10687 -17196 16054 28592 4447 10081 18417 -9226 -4349 41587 29917 -26873 -18765 32049
865 32049 25742 -6539 -161 2432 -11146 13195 31552 -14244 -32624 17435 24852 -17356 -8474
878 -8474 16265 -11357 -18935 17754 11377 -21013 -5774 8991 -14108 -6469 24321 957 -36488
891 -36488 -8560 29919 8044 -21377 -9413 715 -3040 12367 12409 -24527 -23837 24297 21461
904 21461 -21412 -12128 11031 -7934 -6817 21200 1045 -28444 -520 18048 -8795 -7503 14503
$$ packed form
813B1844n1063M018N7798k8041m7125M5232K5545n5842m338N6075r261m4412J2685
826a6885K4024j0256N903R456l3988j1058N6379J7574o1097j6061N1461R082k7037
839b503J0052J22k6743K6425L7988m1786l1152M9868J3239m7359J1376L9799k8639
852A0687k7883L3250J2538k4145N634Q336k7643M877M5936j1670n6790Q108N0814
865C2049o307l2281O378K593j3578K4341J8357m5796j8380N0059P417m2208Q882
878h474K4739k7622p578L6689o377l2390J5239J4765k3099P639L0790k3364l7445
891c6488K7928L8479k1875k9421J1964J0128l755J5407M2l6936O90M8134k836
904B1461m2873R284K3159j8965J117K8017k0155k9489K7924J8568k6843J292K2006
$$ plain form
917 14503 -7842 -26044 8246 24552 -10502 -24428 963 6577 -4682 4639 1943 -26319 -15427
930 -15427 27758 13228 -33409 -18185 15622 -594 -11362 8073 -5781 -27845 701 19986
942 19986 -9255 -18622 2329 -4489 -13471 7911 9328 -19426 -18599 8680 9670 -7991 -8309 -4130
956 -4130 -9645 -20 16302 465 -24780 -8840 17325 6528 -6332 -258 -6272 -9703 14515
969 14515 18222 -13108 -14319 10328 7445 -1738 9270 3293 -14155 -172 21064 8928 -9550
982 -9550 -5343 5056 7422 8766 6540 -5815 -10378 6866 18010 3486 -8162 -1186 711 457
996 457 12965 8796 -15606 -11167 14096 10477 -4538 -2969 -4236 -6597 9034 13392 -7308 -14934
1010 -14934 257 7779 4377 1571 -5535 -10072 -1279 11672 7788 -8355 -11154 2007 7197 2127
$$ packed form
917A4503k2345j8202L4290J6306l5054j3926K5391N614j1259R321k696k8262J0892
930a5427M3185j4530m6637J5224L3807j6216j0768J9435j3854k2064K8546J9285
942A9986k9241r367K0951o818q982K1382J417k8754Q27K7279R90j7661l18M179
956d130n515R625J6322j5837k5245J5940K6165j0797j2860O074o014l431K4218
969A4515L707l1330j211K4647k883r183J1008n977j7448J3983K1236j2136j8478
982i550M207J0399K366J344k226j2355m563J7244J1144j4524j1648O976J897k54
996D57J2508m169k4402M439K5263l619j5015J569j267k361J5631M358k0700p626
1010a4934J5191P522l402k806p106m537Q793J2951l884j6143k799J3161N190n070
$$ plain form
1024 2127 2380 -360 -10030 -2398 14794 7542 -8258 -5351 397 3559 13099 5873 -15080 -9975
1038 -9975 14544 13776 -2806 -6610 -3271 238 7990 8699 -1779 -9529 -3012 8184 8231 -2201 -5663
1053 -5663 -1596 -1008 2874 8941 -582 -12706 -3333 8516 4720 1259 -2260 -10563 -3842 13368
1067 13368 10082 -8092 -12225 -2115 10092 11185 -3851 -12877 -820 9817 4677 -1120 -2657
1080 -2657 -3924 815 7049 5215 -638 -4253 -3763 4089 8118 2878 -1969 -4608 -4817 6759 13911
1095 13911 -493 -12542 -1576 8482 7017 4017 -3828 -9944 2817 15787 5057 -9271 -5941
1108 -5941 4534 9617 5186 -3862 -4079 2414 2831 2419 5364 1475 -5517 -2853 4320 8346 4319
1123 4319 -6708 -8542 3803 9184 2033 -3638 -6973 -5011 9151 10510 -8436 -13349 2101 6834
$$ packed form
1024B127K53k740r670P632J7192p252j5800K907N748L162R540p226k0953N105
1038i975K4519p68j6582l804L339L509P752P09j0478p750O517J1196M7j0432l462
1053e663M067N88L882O067r523j2124R373J1849l796l461l519q303O721J7210
1067A3368l286j8174m133J0110J2207J093j5036r026J2057J0637n140n797j537
1080b657j267M739O234j834n853l615M90P852M029n240m847k639k09J1576P152
1095A3911j4404j2049J0966J0058j465l000p845o116J2761J2970j0730j4328L330
1108e941J0475N083m431r048k17O493M17m12K945l889o992K664P173M026m027
1123D319j1027j834J2345N381p151n671l335J962J4162J359j8946m913J5450M733
$$ plain form
1137 6834 1052 -555 -5870 -9534 1243 9372 -369 -8676 -5087 485 96 -544 820 -445 -7628
1152 -7628 -6537 6254 7309 -5749 -8637 -1712 2218 6277 2438 -11086 -8991 9139 9361 -4203
1166 -4203 -5402 -2951 -1810 6450 8317 -5136 -8314 1968 5083 1511 1382 -142 -3886 -1299 5299
1181 5299 6261 -2033 -6213 657 4288 746 3450 1082 -10331 -3843 15025 6756 -14213 -6939
1195 -6939 6095 1829 399 1972 -7695 -8660 5709 6727 -5909 -6008 -370 -2342 -2443 3034 1332
1210 1332 -7198 -6895 3211 5203 -3390 -5070 -815 -3044 105 9137 -88 -12617 -25 11586
1224 11586 903 -2476 3474 -2624 -3005 11313 7966 -8012 -2459 9601 3378 -1075 5932 3395
1238 3395 -4553 505 9439 5002 -4171 -2133 3203 1603 2587 5250 -4185 -9680 5777 10684 -6866
$$ packed form
1137F834n782j607n315l664J0777Q129r741q307L589N572l89o40J364j265p183
1152g628J091J2791J055j3058k888O925L930M059l839j3524K095J8130K22j3564
1166d203j199K451J141Q260J867j3453l178J0282L115l572j29j524l744K587O598
1181E299R62q294m180O870L631l542K704k368j1413O488J8868q269k0969P274
1195f939J3034m266j430J573r667r65J4369J018j2636r9N638j972j01N477j702
1210A332q530L03J0106J992q593j680M255k229L149R032r225j2529J2592J1611
1224A1586j0683l379N950o098l81J4318l347j5978N553J2060o223m453P007k537
1238C395p948N058Q934m437r173K038N336j600R84K663r435n495J5457M907j7550
$$ plain form
1253 -6866 -8377 4113 -1185 -6181 5868 1384 -13665 -2702 9061 -4597 -8738 4092 -807
1266 -807 -11478 939 9194 -4647 -11214 1437 5551 -3027 -787 4940 -5176 -7881 10743 12016
1280 12016 -11030 -8684 13201 7347 -6678 4058 6700 -6240 2594 13973 -723 -6815 8552
1293 8552 6544 -5531 3997 11171 -2457 -6177 5932 7357 -451 -5 1408 -3379 71 9172
1307 9172 1117 -12317 -1978 11467 -903 -9832 1942 360 -8787 3953 7796 -13901 -10492
1320 -10492 13058 1336 -16803 1876 10257 -11340 -9934 10417 2081 -11337 1204 6390 -7631
1333 -7631 -2682 12932 479 -15640 3416 19607 -2416 -13763 7627 12102 -4829 1681 10615
1346 10615 -5925 -4694 17853 6648 -14901 3693 17051 -4336 -7815 10221 5260 -6399
$$ packed form
1253f866j511J2490n298m996J2049m484j5049J0963J1763j3658m141J2830m899
1266h07j0671J2417Q255j3841o567J2651M114q578K240N727j0116k705J8624J273
1280A2016k3046K346K1885n854j4025J0736K642j2940Q834J1379j4696o092J5367
1293H552k008j2075R528P174j3628l720J2109J425p808M46J413m787L450R101
1307I172q055j3434J0339J3445j2370q929J1774j582r147J2740L843k1697L409
1320a0492K3550j1722j8139J8679Q381k1597J406K0351q336j3418J2541N186j4021
1333g631M949J5614j2453j6119J9056J6191k2023j1347K1390M475j6931O510Q934
1346A0615j6540J231K2547j1205k1549J8594J3358k1387l479J8036m961j1659
$$ plain form
1358 -6399 3039 4865 -6944 175 9415 -4567 -12275 5314 10100 -9704 -12466 5436 3597 -9150
1372 -9150 -2515 1096 -10902 -3625 11359 -6883 -19993 5859 13205 -14107 -12581 11040 1621
1385 1621 -11161 3239 4176 -9485 1641 12003 -5500 -10893 11078 11935 -9106 -5311 12401
1398 12401 6119 -5391 3861 6567 -3941 3164 14553 -3920 -11930 14029 15708 -13149 -6808
1411 -6808 17612 3159 -10993 6664 6553 -10402 3205 14638 -9934 -15050 13541 11569 -16316
1424 -16316 -9834 12603 2749 -12478 -869 5734 -7023 -4032 8875 -4478 -15181 6983 12914
1437 12914 -13851 -12589 13230 5370 -13224 -1328 7247 -3955 -539 7068 -6010 -7164 11191
1450 11191 7652 -9703 -4393 9059 4244 -2730 645 1096 297 4931 3694 -5248 -2690 10016
$$ packed form
1358f399R438J826j1809P119R240j3982p708J7589M786j9804k762J7902j839j2747
1372i150O635L611j1998P277J4984j8242j3110K5852P346k7312J526K3621r419
1385A621j2782J4400R37j3661J1126J0362j7503n393K1971Q57k1041L795J7712
1398A2401o282j1510R252K706j0508P105J1389j8473q010K5959J679k8857O341
1411f808K4420j4453j4152J7657j11j6955J3607J1433k4572n116K8591j972k7885
1424a6316O482K2437r854j5227J1609O603j2757K991J2907j3353j0703K2164N931
1437A2914k6765J262K5819p860j8594J1896Q575j1202L416P607j3078j154J8355
1450A1191l539j7355N310J3452m815o974L375M51p99M634j237q942K558J2706
$$ plain form
1464 10016 4198 -10151 -1350 11376 -1662 -8857 4403 2682 -7668 2800 5223 -13351 -6883
1477 -6883 14846 38 -20642 -2934 11286 -5773 -11321 1024 -2660 -9762 617 2553 -12353
1490 -12353 -10400 7480 1775 -15822 -6257 9378 -3580 -13252 2187 4516 -8535 -1873 5275
1503 5275 -7409 -4242 13169 1211 -15053 3029 15985 -1833 -7450 5857 3830 -655 7763
1516 7763 5920 -7133 150 14858 5241 -8480 1360 12273 806 -5091 6334 5266 -5561
1529 -5561 1006 7452 -3962 -3703 8824 -1730 -13352 3928 11783 -8078 -11321 4509 1719
1542 1719 -5256 1268 -730 -10161 -811 9450 -2072 -11357 -140 7081 -1541 -3763 3039 801
1556 801 -3590 4534 7409 -3401 -1630 10192 2621 -5879 8858 12429 -5667 -3539 12266 6885
$$ packed form
1464A0016n818j4349Q801J2726j3038p195J3260j721j0350J0468K423j8574O468
1477f883K1729j4808k0680J7708J4220j7059n548J2345l684p102J0379J936j4906
1490a2353J953J7880n705j7597R565J5635j2958r672J5439K329j3051O662P148
1503E275j2684L167J7411j1958j6264J8082J2956j7818n617J3307k027m485Q418
1516G763j843j3053P283J4708r617j3721R840J0913j1467n897J1425j068j0827
1529e561O567O446j1414K59J2527j0554j1622J7280P855j9861l243J5830k790
1542A719o975O524j998r431R350J0261j1522r285J1217P221q622k222O802k238
1556H01m391Q124K875j0810J771J1822p571q500J4737L571j8096K128J5805n381
$$ plain form
1570 6885 -1223 5316 3316 -3217 7633 11927 -3773 -6931 7970 8153 -2611 -1264 3312 -2186
1584 -2186 -2662 5241 2226 -8015 -3829 5094 -2064 -7523 2207 1426 -11104 -3858 7606 -4192
1598 -4192 -10708 1376 -1225 -9671 2472 6538 -12165 -11630 8867 5751 -10241 -5595 4352 -1501
1612 -1501 -3860 4799 2189 -7859 -2465 8469 2483 -5910 1827 4806 -4059 804 10555 -777
1626 -777 -9357 4926 9304 -2650 -1094 5327 -3260 -4255 8187 5569 -6288 -4207 2960 2051 454
1641 454 359 -4658 -4802 2363 4168 -3491 -7606 -1467 1412 -3097 -1484 979 -6077 -9025 2995 5229
1657 5229 -5917 -7172 -511 -1610 -289 3033 -4022 -7505 1246 4087 -2056 -700 951 -3924 -1569
1672 -1569 6699 4026 -3635 -3776 2762 5922 3458 -120 -1908 -824 3877 6779 1604 -4194 79
$$ packed form
1570F885q108O539k000o533J0850M294j5700l158J4901J83j0764J347M576n498
1584b186m76P903l015j0241M186Q923p158n459R730p81j2530P246J1464j1798
1598d192o516J2084k601q446J2143M066j8703N35K0497l116j5992M646R947n853
1612a501k359Q659k610j0048N394J0934n986q393P737K979q865M863R751j1332
1626g77q580J4283M378j1954J556O421q587r95J2442k618j1857K081P167r09j597
1641D54r5n017j44P165J805p659m115O139K879m509J613K463p056k948J2020K234
1657E229j1146j255O661j099J321L322p055l483Q751K841o143J356J651m875K355
1672a569Q268k673p661j41O538L160k464l578j788J084M701K902n175n798M273
$$ plain form
1687 79 3883 875 3015 4944 -5590 -6631 7635 7658 -7112 -5827 3822 381 -2738 2051 -323
1702 -323 -6030 -2950 2702 1068 -2497 -3887 -4304 -2396 2412 3999 -4225 -10174 -463 8170 25
1717 25 -6912 -1303 599 -2076 2844 3979 -4498 -4776 3001 4044 1460 -208 -4143 -1886 5801 4465
1733 4465 -2762 -1843 1461 566 906 3934 2054 -2976 -4337 2280 8601 1993 -6994 -3655 4504 5577
1749 5577 1943 -3507 -4959 3110 6878 -333 -3014 1577 497 -867 5450 5110 -3186 -2993 2906
1764 2906 4430 3681 873 -2980 -164 5010 3546 1098 640 -535 -935 3055 6169 2088 -6381 -5350
1780 -5350 6904 9857 -4246 -9575 1306 5480 -184 -1142 -1882 -4240 -654 2277 -1834 -1977 -529
1795 -529 -4751 -4932 3468 3415 -5660 -7853 -667 4226 644 -4644 -4448 -797 -513 863 2988 -2432
$$ packed form
1687G9L804l008K140J929j0534j041J4266K3j4770J285R649l441l119M789k374
1702c23n707L080N652j634l565j390m17J908M808J587q224n949R711Q633q145
1717B5o937N609J902k675M920J135q477k78P777J043k584j668l935K257P687j336
1733D465p227R19L304q95L40L028j880n030j361O617O321o608q987L339Q159J073
1749E577l634n450j452Q069L768p211k681M591j080j364O317l40q296J93N899
1764B906J524p49k808l853K816N174j464k448m58j175m00L990L114m081q469J031
1780e350J2254K953j4103n329J0881M174n664r58p40k358L586K931m111j43J448
1795e29m222j81Q400n3r075k193P186M893l582n288J96L651K84J376K125n420
$$ plain form
1811 -2432 -7297 -1171 6251 3980 -3237 -6892 -2156 7439 4922 -6183 -4955 4567 1530 -3104 1814
1826 1814 2283 -4451 -4060 1525 2760 265 -4492 -7550 -1261 5253 892 -8415 -8385 -97 3376 -2732
1842 -2732 -6546 -3131 -2958 -5671 516 3892 -7330 -11013 848 5442 -2296 -6132 -4011 -1064 3270
1857 3270 1493 -3191 -836 2508 -954 170 8019 5017 -4386 -2884 8450 12140 2601 -4238 1747
1872 1747 10083 8845 3663 1379 2122 6105 8289 4389 2466 5186 2593 108 9214 9950 -3930
1887 -3930 -5982 7908 9376 -1258 -2214 1747 123 -545 2559 2196 -1485 -4643 -2816 2857 4111
1902 4111 -2404 -8399 -4270 5427 5525 -5960 -9139 2136 5675 -2945 -2784 2943 -1396 -4323 3195
1917 3195 5165 696 -1720 -2840 390 8499 5714 -5883 -3997 7605 6697 -2024 -402 3947 605
$$ packed form
1811b432m865O126P422k271p217l655M736R595k517j1105J228R522l037m634M918
1826A814M69o734L91N585J235k495m757l058O289O514m361r307L0Q288L473o108
1842b732l814L415J73k713O187L376j1222l683J1861M594p738l836K121K947M334
1857C270j777m684K355L344l462J124P849l002r403J502J1334L690r539o839N985
1872A747Q336j238n182k284P43L983K184l900j923K720k593k485R106P36j3880
1887c930k052J3890J468j0634r56L961j624o68L104l63l681l158J827N673J254
1902D111o515n995M129R697R8j1485l179J1275L539q620J61N727m339k927P518
1917C195J970m469k416j120L230Q109k785j1597J886J1602r08q721J622M349l342
$$ plain form
1932 605 -1649 4377 6231 -2361 -7256 1681 7590 766 -5293 -4027 -1836 2040 2077 -5917 -7532 195
1948 195 -1435 -8343 -1779 2303 -9670 -13044 611 4224 -7804 -12753 -5887 57 -1021 -6498
1962 -6498 -9255 -5852 -1914 -1996 -4804 -4396 -2318 -4697 -6157 1571 5636 -5651 -11023 3246 9078
1977 9078 -2499 -5546 2792 2327 -309 3845 3740 171 667 2174 3408 7453 4664 -4928 -1994
1992 -1994 11050 9826 -3579 -5692 5236 7707 -373 -2515 3481 2115 -3481 161 3981 378
2006 378 -3137 -3077 -2611 2735 4403 -6529 -10679 3534 6539 -6029 -6803 2340 -909 -5903 1842
2021 1842 4925 -4391 -7601 1168 6605 1458 -4136 -1841 2861 4914 4038 -389 -1399 5664 7297
2036 7297 -856 1050 11069 4830 -5893 4699 15866 4141 -5874 2283 9833 7185 3495
$$ packed form
1932F05k254O026J854q592m895Q937N909o824o059J266K191L876L7p994j615P727
1948A95j630o908O564M082j1973l374J3655L613j2028m949O866N944j078n477
1962f498k757L403L938q2k808M08K078k379j460P728M065j1287n372J4269N832
1977I078j1577l047Q338m65k636M154j05l569M96J507J234M045k789r592K934
1992a994J3044j224j3405k113J0928K471q080k142N996j366n596L642L820l603
2006C78l515O0M66N346J668j0932m150J4213L005j2568p74R143l249m994P745
2021A842L083r316l210Q769N437n147n594K295M702K053q76m427j010P063J633
2036G297q153J906J0019o239j0723J0592J1167j1725j0015Q157P550k648l690
$$ plain form
2049 3495 470 486 5653 6330 964 19 3184 1093 -1703 2463 5511 -2525 -7635 1208 7611 -3058
2065 -3058 -9023 -130 2430 -5520 -4172 1277 -2992 -6438 -3322 -2487 -1158 1083 -6344 -11104 1789
2080 1789 8720 -5819 -13357 -15 7461 -1874 -7177 -185 3476 -1880 -1838 3778 2248 -2481 313
2095 313 3552 2570 3556 2350 -2640 1952 9292 2503 -3132 4884 6813 -2478 654 9950 3359 -6457
2111 -6457 413 8966 4918 -3807 -4493 2437 5791 1544 -5329 -4193 1956 3003 -4033 -6386 1584
2126 1584 2230 -8039 -6294 4811 851 -9957 -4749 2830 -1729 -4170 -1880 -3672 -3246 1870 -367
2141 -367 -4080 -490 200 -3114 820 5810 -1111 -6856 2502 10381 1929 -6690 1181 9809 2621
2156 2621 -3186 2940 5989 1617 818 2244 2343 4944 2901 -4479 345 10459 2615 -8788 -632
$$ packed form
2049C495l025J6N167O77n366r45L165k091k796M166L048q036n110Q843O403j0669
2065c058n965Q893K560p950J348N449m269l446L116Q35J329K241p427m760J2893
2080A789O931j4539p538J3342P476r335n303O992L661n356M2N616j530m729K794
2095C13L239r82R86j206m990M592P340o789n635Q016J929r291L132R296o591r816
2111f457O870Q553m048q725o86O930L354m247o873J136O149J047p036k353P970
2126A584O46j0269J745J1105l960j0808N208P579m559k441K290j792M26N116k237
2141c67l713L590O90l314L934M990o921n745R358P879q452q619P871Q628p188
2156B621n807O126L049m372p99J426R9K601k043p380M824J0114p844j1403Q156
$$ plain form
2171 -632 7936 383 -5267 -382 897 -3480 -2120 632 -2012 -5498 -4224 -1746 -1969 -3338 -5104
2186 -5104 -6333 -2985 891 -4893 -10145 -2163 2900 -7699 -9666 2554 2172 -9740 -6640 3630
2200 3630 1200 -4699 -3729 -1672 1057 3107 -1292 -5152 1266 5785 128 -3096 2641 5289 -102
2215 -102 -519 5812 5104 -2209 244 7505 4209 -1248 2290 4749 2045 2518 3306 573 3312 4129
2231 4129 -2050 -774 7782 2891 -7626 -681 8751 1694 -6677 -1815 4441 1486 -3319 -1993 469
2246 469 -249 -652 -493 -1991 -993 1338 -2297 -3748 2542 2552 -5264 -2681 5897 1121 -5308 1334 5372
2263 5372 -1329 -1871 3542 3307 112 273 1659 3731 4264 490 -1169 3682 7020 1439 -3133 2797
2279 2797 7893 1322 -3625 3353 6642 -674 -2339 4295 2635 -1902 634 1465 -1592 290 2033
$$ packed form
2171f32Q568p553n650M885J279m377J360K752k644l486J274K478k23j369j766
2186e104j229L348L876n784n252P982N063j0599j967J2220l82j1912L100J0270
2200C630k430n899R70K057K729K050m399l860O418M519n657l224N737K648n391
2215a02m17O331p08p313K453P261l296n457L538K459k704M73P88k733K739Q17
2231D129o179J276Q556m891j0517O945R432p057q371M862O256k955m805J326K462
2246D69p18m03J59j498R98K331l635j451O290J0p816K583Q578m776o429O642M038
2263E372o701n42N413k35l195J61J386K072N33l774j659M851L338n581m572N930
2279B797N096o571m947O978L289p316j665O634j660m537K536Q31l057J882J743
$$ plain form
2294 2033 -3058 -2726 3518 -738 -6170 -366 2782 -3895 -6447 463 1711 -5242 -6532 1026 1232
2309 1232 -6093 -5605 945 -164 -4773 -2957 -817 -2213 -1281 -1760 -4231 -1057 2043 -2407 -4350 1786
2325 1786 1844 -3083 -1573 1978 969 -1314 -629 1215 2571 943 -991 1349 3349 1732 -534 648
2341 648 4098 3216 -838 13 5371 3668 -2545 849 6683 1362 -2823 2108 3749 433 447 1414
2357 1414 -220 756 2104 -864 -1433 1725 503 -2673 -1094 2181 -607 -3793 -1566 2293 -469
2372 -469 -4631 -1546 2180 -1131 -3108 -267 420 -1242 -565 -397 -732 1766 413 -3067 1142 5112
2388 5112 435 -3338 2410 4501 1014 154 2662 2684 1276 1693 2939 2459 764 1185 2525 2162 1373
2405 1373 997 -543 126 3114 447 -3179 -50 2526 -2462 -3469 946 -452 -4844 -3364 -485
$$ packed form
2294B033n091L32O244m256n432N804L148o677k552O910J248o953j290P558K06
2309A232p325M88O550j109m609J816K140j396R32m79k471L174L100m450j943O136
2325A786N8m927J510L551j009k283O85J844J356j628j934K340K000j617k266J182
2341F48L450q82m054Q51N358j703o213L394N834n321m185M931J641l316J4R67
2357A414j634R76J348k968n69L158j222l176J579L275k788l186K227L859k762
2372d69m162L085L726l311j977K841O87j662O77J68l35K498j353l480M209L970
2388E112m677l773N748K091l487q60K508K2j408M17J246m80j695M21J340l63p89
2405A373l76j540O69K988k667l626L129K576m988j007M415j398m392J480K879
$$ plain form
2420 -485 -1231 -3332 -4941 -4372 -1092 -1869 -5616 -5236 -2361 -2075 -4476 -4211 -3526 -3005 -3892 -3221 -1611 -2155
2438 -2155 -4168 -2714 9 -1659 -1550 -574 -1640 -1371 1779 321 -1887 1062 1701 -1378 886 4747
2454 4747 712 -2648 2205 5329 1961 -833 393 3069 3069 826 721 1257 1071 908 1582 502 -147
2471 -147 926 -577 -622 1952 985 -3466 -1774 1102 -652 -2078 -561 -1918 -2579 55 142 -2108 -1801
2488 -1801 -1595 -1233 1265 596 -2812 -2516 1512 2392 -5 -1427 625 2629 1428 663 2758 2868 227
2505 227 2127 4741 3279 2091 3149 2336 2866 6478 4410 71 2218 5854 3872 2624 3074 1863
2521 1863 1791 3932 3525 1478 -679 414 2767 2226 -980 -1253 -199 -425 -276 -291 -2208 -2867 -1308
2538 -1308 -2014 -2347 -736 -2389 -5491 -2890 475 -1638 -4016 -3378 -2725 -1036 289 -2353 -4241 -1558
$$ packed form
2420d85p46k101j609N69L280p77l747L80K875K86k401K65O85N21q87O71J610n44
2438b155k013J454K723j668J09R76j066K69L150j458k208K949O39l079K264L861
2454D747m035l360M853L124l368k794J226K676%k243j05N36j86j63O74j080o49
2471a47J073j503m5K574r67m451J692K876j754j426J517j357o61K634Q7k250L07
2488a801K06L62K498o69l408K96M028Q80k397j422K052K004j201p65K095J10k641
2505B27J900K614j462j188J058q13N30L612k068m339K147L636j982j248M50j211
2521A863p2K141m07k047k157J093K353n41l206k73J054k26J49j5j917o59J559
2538a308p06l33J611j653l102K601L365k113k378O38O53J689J325k642j888K683
$$ plain form
2554 -1558 572 -323 -643 -1206 -1613 605 1726 1869 398 -428 782 3087 2897 1399 1832 1975 1059
2571 1059 3142 4248 1150 339 2560 2467 2223 3383 694 -1490 2420 4292 763 -1340 -389 514
2587 514 1214 842 -558 -1968 -1634 -628 419 -510 -2613 -2735 -1372 -1591 -921 -904 -3509 -3391 -293 14
2605 14 -2645 -2185 -2473 -2463 565 1094 -1891 -3150 -673 602 829 341 -1540 -1732 1216 2301 1125
2622 1125 -245 -438 726 2327 1667 1118 967 -764 616 3304 2152 -930 -83 1149 1219 2199 1614
2639 1614 -2376 -1907 2382 1513 -1249 -1616 -1862 -1374 533 103 -2984 -3420 -2560 -964 -845 -2581 -3895
2656 -3895 -3323 -2867 -2290 -1246 -3235 -5616 -3474 -607 -1974 -3064 -3373 -4588 -2850 771 -1073 -4204
2672 -4204 -2982 -789 -452 -77 -597 -2606 -1164 1066 1021 118 -844 -686 439 2414 1969 977 145 -97
$$ packed form
2554a558K130q95l20n63m07K218J121J43j471q26J210K305j90j498M33J43r16
2571A059K083J106l098q11K221r3k44J160k689k184L910J872l529k103R51R03
2587E14P00l72j400j410L34J006J047r29k103j22J363k19O70J7k605J18L098L07
2605A4k659M60k88J0L028N29k985j259K477J275K27m88j881j92K948J085j176
2622A125j370j93J164J601o60n49j51j731J380K688j152l082Q47J232P0R80n85
2639A614l990M69M289q69k762l67k46M88J907m30l087m36Q60J596J19j736j314
2656c895N72M56N77J044j989k381K142K867j367j090l09j215J738L621j844l131
2672d204J222K193L37L75n20k009J442K230m5r03r62J58J125J975m45r92q32k42
$$ plain form
2690 -97 2044 3521 1564 156 564 904 2559 4009 727 -1904 1617 3669 1199 577 704 -1144
2706 -1144 388 3626 1259 -2324 -874 1103 801 87 463 -914 -1532 -392 1358 1056 -2050 -2087 964
2723 964 861 459 1390 -848 -2629 1828 4710 264 -1917 1535 2313 2199 3127 1895 -270 1908 4892
2740 4892 3640 2163 1852 2283 3250 4007 3847 3368 1776 2255 4358 4658 2531 1785 1874 2065 4353 4289
2758 4289 220 -618 2994 3332 1396 1159 -779 -1866 2282 3343 -926 -2292 -72 -118 -211 8 -920
2775 -920 -2460 -2075 -97 221 -1606 -2619 -1769 -1231 -1156 -108 -334 -4110 -2697 1543 657 -2512 -1999
2792 -1999 -1029 -1457 899 1212 -2999 -3121 709 929 -682 -529 -998 -1179 303 691 -203 -1148 -763 -309
2810 -309 469 -174 -186 -1289 -2809 -784 1850 -217 -3892 -2209 -364 -934 -276 -902 -4763 -3519 672
$$ packed form
2690i7K141J477j957j408M08L40J655J450l282k631L521K052k470o22J27j848
2706a144J532L238k367l583J450J977l02p14L76j377o18J140J750l02l106l7L051
2723I64j03m02R31k238j781M457K882m446k181L452P78j14R28j232k165K178K984
2740D892j252j477l11M31R67P57j60m79j592M79K103L00k127p46Q9J91K288o4
2758D289m069q38L612L38j936k37j938j087M148J061m269j366K220m6r3K19r28
2775i20j540L85J978L18j827j013Q50N38P5J048k26l776J413M240q86l169N13
2792a999R70m28K356L13m211j22L830K20j611J53m69j81J482L88q94r45L85M54
2810c09P78o43j2j103j520K025K634k067l675J683J845n70O58o26l861J244M191
$$ plain form
2827 672 -566 -3788 -3149 -2069 -2843 -1497 -873 -3404 -4177 -2225 -1277 -1897 -2530 -3065 -2547 -2185 -1242 204
2845 204 -1972 -4165 -1666 876 -399 -977 -712 -2265 -233 3260 1361 -2432 -250 2219 1362 2062
2861 2062 1393 -722 995 3983 2666 419 970 1799 1625 2162 3027 1769 89 375 2531 2787 628
2878 628 -365 623 204 1038 2698 -240 -3030 453 2735 -288 -1560 -507 -1654 -548 1965 -187
2894 -187 -2960 -1672 529 -6 -266 -1050 -1458 -755 145 793 417 -584 -627 686 1315 1401 803 -360 -847
2913 -847 2932 3555 16 -638 2028 1761 1726 3584 771 -1203 2281 3694 1535 246 1464 840 572
2930 572 2489 1865 -172 -548 1602 1941 545 -245 560 198 -897 1434 1576 -2129 -2232 681 1065
2947 1065 -1051 -421 -1336 -2418 501 1386 -1874 -2664 -405 -310 -938 -419 -1082 -2263 -902 88 -2 -820
$$ packed form
2827F72j238l222O39J080p74J346O24k531p73J952R48o20o33n35N18L62R43J446
2845B04k176k193K499K542j275n78K65j553K032L493j899l793K182K469q57P00
2861B062o69k115J717K988j317k247N51Q29j74N37Q65j258j680K86K156K56k159
2878F28r93R88m19Q34J660k938k790L483K282l023j272J053j147J106K513k152
2894a87k773J288K201n35k60p84m08P03R00O48l76j001m3J313O29Q6n98j163m87
2913h47L779O23l539o54K666k67l5J858k813j974L484J413k159j289J218o24k68
2930E72J917o24k037l76K150L39j396p90Q05l62j095K331J42l705j03K913L84
2947A065k116O30r15j082K919Q85l260p90K259R5o28N19o63j181J361R90r0q18
$$ plain form
2965 -820 -1297 -581 154 297 320 146 -1294 -218 1999 979 -713 562 617 -357 1799 2995 -596 -854
2983 -854 2621 2481 862 1113 761 -61 1656 2396 673 -191 648 1210 1162 327 -31 7 -543 357 1479
3002 1479 -85 -2357 -622 669 -592 -719 -305 -2194 -2038 349 -467 -2084 -1224 -1452 -1826 59 162
3019 162 -2883 -2595 -90 -202 -1133 -1345 -1222 -1094 -425 -2 -90 -776 -1462 282 897 -294 -193 620 -543
3038 -543 89 2378 132 -1401 620 1902 -216 438 1784 -255 -928 1960 1408 -277 -362 157 354
3055 354 1095 54 -728 -825 -178 686 290 -954 -819 -41 -344 -1124 121 -454 -2143 -375 538 -1166
3073 -1166 -1419 -533 -1326 -639 496 -840 -1889 -249 -86 -938 -135 263 -1311 -1111 794 844 -273 -853
3091 -853 -156 918 792 -396 155 512 -122 550 1085 -301 26 1286 -68 28 1790 571 -1202 707
$$ packed form
2965h20m77P16P35J43K3j74j440J076K217j020j692J275N5r74K156J196l591k58
2983h54L475j40j619K51l52q22J717P40j723q64Q39N62m8q35l58L8n50R00J122
3002A479j564k272J735J291j261j27M14j889J56K387q16j617Q60k28l74J885J03
3019A62l045K88K505j12r31k12J23J28O69M23q8o86o86J744O15j191J01Q13j163
3038e43O32K289k246j533K021J282k118O54J346k039o73K888n52j685q5N19J97
3055C54P41j041p82r7O47Q64l96j244J35P78l03p80J245n75j689J768R13j704
3073a166k53Q86p93O87J135j336j049J640J63q52Q03L98j574K00J905N0j117n80
3091h53O97J074j26j188N51L57o34O72N35j386L27J260j354R6J762j219j773J909
$$ plain form
3109 707 1764 17 -416 550 -110 -160 844 95 -834 -158 -243 -84 168 -842 -1170 -383 -152 -293 -764
3128 -764 -1551 -1032 499 -698 -1784 97 -217 -1774 -501 538 -1087 -1066 -382 -883 -736 345 -832
3145 -832 -1343 -285 673 -538 -682 -576 -344 189 91 -191 -60 -316 -72 1005 959 -684 334 1602 144
3164 144 172 1091 -215 534 1373 352 205 1259 896 -414 1139 1340 172 -372 475 435 496 1088 292
3183 292 165 770 386 301 278 -72 494 1019 23 727 1281 -104 64 1715 835 -278 1491 1921 -12
3202 -12 604 1932 1267 393 1410 1894 1249 1061 1128 1198 1680 1211 1141 1415 876 1275 2093 419 509 2136
3222 2136 1094 -291 794 1473 228 359 554 -196 30 361 -281 -725 172 -430 -722 232 -896 -1291
3240 -1291 -147 -549 -1308 -413 -467 -1206 -603 -602 -1083 -460 -407 -915 -821 -513 -1088 -226 -391 -1672 -473 813
$$ packed form
3109G07J057j747m33R66o60n0J004p49r29O76q5J59K52j010l28P87K31j41m71
3128g64p87N19J531j197j086J881l14j557J273J039j625K1O84n01J47J081j177
3145h32n11J058R58j211j44J06K32N33r8k82J31k56K44J077m6j643J018J268j458
3164A44K8R19j306P49Q39j021j47J054l63j310J553K01j168n44Q47m0O1N92p96
3183B92j27O05l84q5k3l50N66N25r96P04N54j385J68J651q80j113J769M30j933
3202a2O16J328o65q74J017M84o45j88O7P0M82m69p0K74n39L99Q18j674R0J627
3222B136j042j385J085O79j245J31J95p50K26L31o42m44Q97o02k92R54j128l95
3240a291J144m02p59Q95n4p39O03Jm81O23N3n08R4L08n75Q62j65j281J199J286
$$ plain form
3260 813 -1089 -1620 45 -312 -1333 -788 -73 -1487 -1252 -290 -707 -1330 -1119 -1169 -1064 -1362 -1495 -643 -1270
3279 -1270 -1790 -1077 -336 -1818 -1578 169 -1695 -2046 -311 -1001 -2491 -1343 -107 -1296 -1420 -845 -994
3296 -994 -606 -676 -1173 -1097 58 -784 -331 113 -800 -1165 -243 -260 -266 135 -556 -612 241 55 -140 191 -176 -821
3318 -821 592 946 -1007 -27 882 -414 -231 987 -343 -785 562 1205 84 165 578 111 455 556
3336 556 990 641 407 416 1257 1132 118 1045 805 556 1332 1820 -113 379 1931 941 721 1577 835 422
3356 422 1809 2039 538 805 1165 741 863 1122 433 133 730 907 927 768 -119 497 658 61 486 369
3376 369 -313 -138 1345 197 -833 216 255 -433 646 334 -1052 -272 905 143 86 570 -273 -370 734
3395 734 910 239 278 361 506 647 1023 380 -185 106 749 1589 -131 -742 662 1084 -88 675 663 -1257
$$ packed form
3260H13j902n31J665l57j021N45P15j414K35R62m17o23K11n0J05k98j33Q52o27
3279a270n20P13P41j482K40J747j864l51J735o90j490J148J236j189j24N75j49
3296i94L88p0m97P6J155q42M53M44r13l65R22j7oM01o91n6Q53j86j95L31l67o45
3318h21J413L54j953R80R09j296J83J218j330m42J347O43j121Q1M13m67L44J01
3336E56M34l49k34RQ41j25j014R27k40k49P76M88j933M92J552r90k20Q56p42m13
3356D22J387K30j501K67L60m24J22K59o89l00N97J77K0j59q87O16J61n97M25j17
3376C69o82J75J483j148j030J049L9o88J079l12j386P80J177p62n7M84q43r7J104
3395G34J76o71L9Q3J45J41L76o43n65K91O43Q40j720o11J404M22j172P63j2j920
$$ plain form
3415 -1257 -317 1615 -135 -1429 71 265 -583 48 -31 -1034 -1084 -385 -105 -535 -1273 -1421 -955 -430 -813
3434 -813 -659 -1250 -2009 -616 325 -1021 -1501 -1212 -1064 -410 -31 -1163 -1329 -151 -400 -692 179 -272 -1193
3453 -1193 311 959 -132 -361 644 448 43 1294 712 70 345 855 1558 1032 254 56 540 748
3471 748 1025 925 -422 -690 909 908 -719 -128 152 -437 35 776 -836 -1622 -405 -549 -1012 -231 -751
3490 -751 -1546 -835 -91 -459 -809 -801 -1239 -511 113 -249 -532 -714 -742 597 436 -964 -400 324 75 583
3510 583 897 -462 7 1730 1123 204 918 628 -122 1232 1940 34 -295 739 254 638 980 -234
3528 -234 -527 -41 641 775 -277 -1358 -584 490 -102 -256 -486 -1169 -1129 612 -195 -1785 -1085 -260 -1118
3547 -1118 -179 187 -1199 -1650 125 95 -724 -638 -730 -1182 121 788 -355 -907 -632 245 776 174 -511
$$ packed form
3415a257R40J932j750j294J500J94q48O31p9j003n0O99K80m30p38j48M66N25l83
3434h13J54n91p59J393R41j346m80K89J48O54L79j132j66J178k49k92Q71m51r21
3453a193J504O48j091k29J005j96m05J251n82o42K75N10P03n26p78j98M84K08
3471G48K77j00j347k68J599jj627N91K80n89M72P41j612p86J217j44m63P81n20
3490g51p95P11P44l68l50Qm38P28O24l62k83j82k8J339j61j400N64P24k49N08
3510E83L14j359M69J723o07r19P14k90p50J354P08j906l29J034m85L84L42j214
3528b34k93M86O82J34j052j081P74J074n92j54k30o83M0J741q07j590P00Q25q58
3547a118R39L66j386m51J775l0q19Q6r2m52J303O67j143n52K75Q77N31o02o85
$$ plain form
3566 -511 -420 -199 155 777 211 -1375 23 978 279 -33 452 -459 -439 1096 216 -699 -260 -268 -435 492
3586 492 361 -1054 -1300 -44 524 58 -551 -1446 -329 342 -582 -143 -819 -1414 158 787 -523 -871
3604 -871 -403 -780 -281 1168 -456 -1840 -169 1043 97 -309 420 -386 -628 779 1348 -76 -425 42
3622 42 497 896 267 -145 327 209 1282 1766 -292 -489 1476 1144 183 993 921 -456 519 2266 961
3641 961 14 375 740 1135 1851 937 159 759 1392 791 772 555 41 270 971 1193 700 -32 -84 1009
3661 1009 1491 142 -272 -258 75 879 828 -208 -474 652 110 153 944 -65 -1238 308 1383 231
3679 231 -823 -378 95 646 695 -32 -451 342 48 1100 602 -331 -441 -99 174 1048 585 -1074 -601
3698 -601 1324 805 -988 -76 8 -430 95 679 -344 -499 -230 -515 -7 21 -725 -1242 -140 548 -768
$$ packed form
3566e11R1K21L54O22n66j586J398R55o99l12M85r11K0J535q80r15M39qj67R27
3586D92j31j415k46J256N68m66o09q95J117O71r24M39o76n95J572O29j310l48
3604h71M68l77M99J449j624j384J671J212r46m06P29q06k42J407N69j424l49M67
3622D2M55L99o29m12M72j18J073M84k058j97J965l32r61Q10p2j377R75J747j305
3641I61r47L61L65L95P16r14p78O00O33o01j9k17n14K29P01K22m93p32n2J093
3661A009M82j349m14J4L33Q04n1j036k66J126n42M3P91j009j173J546J075j152
3679B31j054M45M73N51M9p27m19P93k94J052m98r33j10L42K73Q74m63j659M73
3698f01J925n19j793R12Q4m38N25N84j023j55K69k85N08K8p46n17J102O88j316
$$ plain form
3717 -768 -1549 -1525 -541 -171 -1041 -1009 -1188 -1555 -1819 -116 -218 -2195 -2049 -1248 -873 -473 -1122 -2398 -1648 116
3737 116 -1233 -1861 -802 -1122 -1467 -995 126 -656 -1490 -1423 -231 645 -539 -1636 -710 246 191 -452 -160
3756 -160 -623 147 188 -51 276 268 -1098 -474 1469 1031 -765 -564 326 689 574 -144 -509 488 439 -339
3776 -339 80 769 -335 -1132 332 911 88 -1408 -1082 887 1011 -708 -1165 397 302 -525 329 507
3794 507 -410 -145 469 490 682 466 -351 460 1852 825 -323 319 1630 1512 891 1045 1535 1381 77
3813 77 1013 2656 1426 -403 1163 2576 1637 831 828 958 1693 1421 235 541 1448 471 295 1211 1249
3832 1249 -397 -448 465 1212 762 -674 -607 1218 1121 -876 -466 560 168 -368 -80 -78 226 -214 -1155 174
3852 174 1512 -697 -1800 108 1134 -448 -916 -132 -126 -131 -467 -451 310 -113 -1428 -264 909 215 -1313
$$ packed form
3717g68p81K4R84L70q70L2j79l67k64J703j02j977J46Q01L75M00o49j276P50J764
3737A16j349o28J059l20l45M72J121p82q34O7J192Q76j184j097R26R56n5o43K92
3756a60m63P70M1k39L27qj366O24J943m38j796K01Q90L63j15p18l65R97m9p78
3776c39M19O89j104p97J464N79q23j496L26J969J24j719m57J562r5q27Q54J78
3794E07r17K65O14K1J92k16q17Q11J392j027j148O42J311j18o21J54M90j54j304
3813G7R36J643j230j829J566J413r39q06lJ30P35k72j186L06R07r77j76R16L8
3832A249j646n1R13P47m50j436O7J825r7j997M10J026l92n36K88KL04m40r41J329
3852A74J338k209j103J908J026j582m68P84Onl36J6P61m23j315J164J173o94j528
$$ plain form
3871 -1313 -893 353 962 -434 -1538 9 841 -576 -1020 643 74 -1410 -636 636 -30 -667 -649
3888 -649 -750 378 524 -1208 -1651 748 714 -1345 -1047 411 5 -818 -927 612 638 -1736 -1197 747
3906 747 347 -1841 -1259 -87 -52 -504 -906 -1040 -11 279 -1347 -605 891 -329 -1697 -336 1252
3923 1252 380 -1475 -1033 443 950 -747 -1137 368 1336 -456 -545 682 878 -644 -1057 520 1496
3940 1496 81 -1447 274 2471 367 -967 403 1325 17 -11 324 240 232 120 -277 791 1497 -786
3958 -786 -1246 858 1436 -576 -1334 60 1352 -42 -1265 287 870 -580 -1417 778 1064 -690 -1012
3975 -1012 -299 371 336 -806 -1594 171 858 -931 -1420 660 860 -882 -766 762 713 -667 -1170 791
3993 791 1648 27 -1638 320 1297 85 -355 -403 910 1035 -432 -689 1549 862 -1187 -343 2252
$$ packed form
3871a313M20J246O09j396j104J547Q32j417m44J663n69j484P74J272o66o37J8
3888f49j01J128J46j732m43K399l4k059K98J458m06q23j09J539K6k374N39J944
3906G47m00k188N82J172L5m52m02j34J029K90j626P42J496j220j368J361J588
3923A252q72j855M42J476N07j697l90J505R68j792q9J227J96j522m13J577R76
3940A496j415j528J721K197k104j334J370R22j308k8L35q4qj12l97J068P06k283
3958g86m60K104N78k012p58J394J292j394j223J552N83j450q37K195K86j754l22
3975a012P13O70l5j142p88J765O87j789m89K080K00j742J16J528m9j380n03J961
3993G91Q57j621j665J958R77j212m40m8J313J25j467k57K238o87k049Q44K595
$$ plain form
4010 2252 742 -1380 -102 817 586 -49 -472 -112 1225 389 -1097 120 918 363 -1117 -46 1290
4027 1290 29 -1598 -526 1456 343 -1805 -1066 798 -232 -1655 -489 289 -215 -355 -883 -382
4043 -382 998 -265 -1637 216 1627 -581 -1708 256 1228 -131 -1337 99 693 392 -1236 -202
4059 -202 1312 651 -583 -328 1329 1047 -377 -565 809 1731 -253 -1088 922 1724 -785 -866 1287
4076 1287 798 -357 -128 219 888 329 -745 -705 819 562 -1329 -953 760 261 -1115 -969 779 1139
4094 1139 -1483 -1737 952 1149 -1261 -1362 1149 520 -694 -749 199 316 340 -973 -399 1071 817 -1027
4112 -1027 -286 1873 427 -818 -125 1358 1010 -486 -529 1120 1363 -625 -618 953 1283 -68 -713 281
4130 281 994 202 -1127 -261 1544 -239 -1661 255 1448 -326 -881 -103 590 227 -737 -954 215
$$ packed form
4010B252j510k122J278R19k31o35m23L60J337q36j486J217P98n55j480J071J336
4027A290j261j627J072J982j113k148P39J864j030j423J166P78n04j40n28N01
4043c82J380j263j372J853J411k208j127J964R72j359j206J436N94l01j628J034
4059b02J514o61j234K55J657k82j424j88J374R22j984q35K010Q02k509q1K153
4076A287m89j155K29L47O69n59j074M0J524k57j891L76J713m99j376J46J748L60
4094A139k622k54K689J97k410j01K511o29j214n5R48J17K4j313N74J470k54j844
4112a027P41K159j446j245O93J483l48j496m3J649K43j988PJ571L30j351o45R94
4130B81P13p92j329Q66J805j783j422J916J193j774n55P78O93l63r64k17J169
$$ plain form
4147 215 905 -937 -1309 801 764 -983 -1392 345 800 -341 -1356 22 1203 -215 -1521 141 1109
4164 1109 -379 -1052 12 934 142 -368 -654 684 869 -935 -1230 980 819 -1173 -772 1067 812
4181 812 -162 -589 358 749 -78 -852 167 1034 -434 -979 -34 653 -150 -1110 -623 408 849 -1239 -984
4200 -984 913 342 -1243 -1079 655 11 -870 -687 -425 87 -47 -1347 -215 1054 -500 -1289 24
4217 24 1009 -175 -939 -174 724 144 -1084 -196 1239 386 -1100 105 961 332 -359 -108 377 959 867
4236 867 -1005 383 1815 335 -1030 870 1161 -611 -635 724 1110 81 -779 -140 1059 413 -841
4253 -841 -531 823 481 -556 -665 85 643 -437 -987 52 772 -896 -1657 960 871 -691 -650 192
4271 192 491 143 -241 -294 404 605 -281 -59 1262 572 -543 -258 1239 1082 -57 -461 945 1535 41
$$ packed form
4147B15O90j842l72K110l7j747m09J737M55j141j015J378J181j418j306J662R68
4164A109j488o73J064R22p92n10k86J338J85j804k95K210j61j992M01J839k55
4181H12r74m27R47L91q27p74J019Q67j468n45R45O87q03r60M87J031M41k088K55
4200i84J897n71j585J64J734o44q81J83K62N12j34j300J132J269j554p89J313
4217B4R85j184p64P65Q98n80j228Q88J435q53j486J205Q56o29o91K51M85N82r2
4236H67j872J388J432j480j365J900K91j772k4J359L86j029q60O39J199o46j254
4253h41L10J354l42j037j09P50N58j080n50J039P20j668p61K617q9j562M1Q42
4271A92K99l48l84n3O98K01q86K22J321o90j115K85J497j57j139m04J406N90j494
$$ plain form
4290 41 -120 1004 687 -406 362 1035 590 128 -236 -213 958 742 -996 -732 1481 167 -1227 -490
4308 -490 395 259 -443 -708 232 -43 -953 -898 672 301 -1287 -769 37 406 -419 -629 -735 249 52 -1022
4328 -1022 -628 710 -632 -943 103 539 -349 -444 -439 477 583 -283 -716 347 927 -255 -390 371 80
4347 80 -139 -165 352 806 171 -882 412 1093 269 -800 225 687 -37 -169 -354 -440 545 -410 -758 326
4367 326 167 -1009 -742 443 354 -1083 -614 -18 49 -202 -822 -300 114 -288 -428 274 275 -547 -75 -172 510
4388 510 281 -543 -965 557 1157 -755 -666 1052 514 -236 54 602 212 -18 260 887 800 -233 -205 678
4408 678 642 93 -197 199 217 681 295 -199 461 558 -331 -291 773 389 -623 -104 762 160 -377 -851 -51
4429 -51 239 -383 -548 -268 -42 -519 -341 259 -376 -360 -507 -293 427 -26 -1090 -840 757 394 -686 -235
$$ packed form
4290D1j61J124l17j093P68O73m45m62l64K3J171k16j738K64K213j314j394P37
4308d90Q85j36p02k65R40k75r10N5J570l71j588N18Q06L69q25k10j06R84j97j074
4328a022L94J338j342l11J046M36q88r5NR16J06q66m33J063N80j182j35P61k91
4347H0k19k6N17M54o35j053J294O81q24j069J025M62p24j32j85q6R85r55l48J084
4367C26j59j176K67J185q9j437M69N96O7k51o20N22M14m02j40P02Jq22M72r7O82
4388E10k29q24m22J522O00j912Q9J718n38p50K90N48l90k30K78O27q7j033K8Q83
4408F78l6n49k90L96J8M64l86m94O60R7q89M0J064l84j012N19Q66o02n37m74Q00
4429e1K90o22j65K80K26m77J78O00o35J6j47K14P20m53j064K50J597l63j080M51
$$ plain form
4449 -235 -52 -271 114 -107 12 353 -141 -431 618 785 -232 -292 443 721 436 -34 -417 329 690 70
4469 70 -34 435 131 -284 388 324 -237 -169 -467 -216 608 -67 -964 -42 284 -611 -812 295 24 -691 -140
4490 -140 509 155 -652 -543 -94 237 -98 -293 -212 -231 115 89 -197 -707 445 69 -403 62 610 -825
4510 -825 -540 942 344 -518 -163 73 1 606 341 27 50 -150 148 426 279 -56 -55 42 585 159 7
4531 7 -526 501 739 -72 -180 421 -154 -384 257 -160 -374 394 195 -319 85 16 -968 -629 777 179
4551 179 -602 -48 -47 -159 -421 -295 -187 -655 -212 0 239 -854 -449 -30 -101 -62 299 -540 -710 574 339
$$ packed form
4449b35J83k19L85k21J19L41m94k90J049J67j017o0P35K78k85m70l83P46L61o20
4469G0j04M69l04m15O72o4n61O8k98K51Q24o75q97R22L26q95k01J107k71p15N51
4490a40O49l54q07J09M49L31l35j95Q1j9L46k6k86n10J152l76m72M65N48j435
4510h25K85J482n98q62L55K36p2O05k65l14K3k00K98K78j47l35JR7N43m26j52
4531Gn33J027K38q11j08O01n75k30O41m17k14P68j99n14M04o9r84L39J406n98
4551A79p81N54Jj12k62J26J08m68M43K12K39j093M05M19p1L9L61q39j70J284k35
$$ [...]
8191A18
##END NTUPLES=NMR FID
##END=
