##TITLE=1H_ANY-785
 CD3CN, 8 sc, 
 12.3.2019
##JCAMPDX= 6.0         $$ Bruker NMR JCAMP-DX V2.0
##DATA TYPE= NMR FID
##DATA CLASS= NTUPLES
##ORIGIN= UXNMR, Bruker Analytische Messtechnik GmbH
##OWNER= root
$$ XWIN-NMR		Version 3.5
$$ Tue Mar 12 16:26:12 2019 Russian Standard Time (UT+4h)  she@DPX200
##.OBSERVE FREQUENCY= 200.1316
##.OBSERVE NUCLEUS= ^1H
##.DELAY= (6, 6)
##.ACQUISITION MODE= SIMULTANEOUS
##.ACQUISITION SCHEME= undefined
##.AVERAGES= 8
##.DIGITISER RES= 18
##SPECTROMETER/DATA SYSTEM= spect
##.PULSE SEQUENCE= zg30
##.SOLVENT NAME= CDCl3
##.SHIFT REFERENCE= (INTERNAL, CDCl3, 0, 15.7039)
##AUDIT TRAIL= $$ (NUMBER, WHEN, WHO, WHERE, WHAT)
$$ ##TITLE= Audit trail, XWIN-NMR		Version 3.5
$$ ##JCAMPDX= 5.01
$$ ##ORIGIN= Bruker BioSpin GmbH
$$ ##OWNER= she
$$ F:/spectra/data/she/nmr/H-F/1/audita.txt
$$ ##AUDIT TRAIL=  $$ (NUMBER, WHEN, WHO, WHERE, WHAT)
(   1,<2019-03-12 16:25:03.23 +0400>,<she>,<DPX200>,
      <created by zg, POWCHK disabled, PULCHK disabled
       configuration hash MD5:
       00 E9 B6 7A A2 85 ED C7 34 08 36 98 17 FE 4E 26
       data hash MD5: 16K
       4F 6D 6C 68 01 14 9E C0 EB 09 07 34 91 91 74 B2>)
$$ ##END=
$$ 
$$ hash MD5
$$ A9 19 15 02 9B 5E 47 34 22 38 BD E0 2D 67 90 CE
##$RELAX= 
##$RELAX= 
##$RELAX= 
##$RELAX= 
##$RELAX= 
##$RELAX= 
$$ Bruker specific parameters
$$ --------------------------
##$DU= <F:/spectra>
##$EXPNO= 1
##$NAME= <H-F>
##$PROCNO= 1
##$TYPE= <nmr>
##$USER= <she>
##$AMP= (0..31)
100 100 100 100 100 100 100 100 100 100 100 100 100 100 100 100 100 100 
100 100 100 100 100 100 100 100 100 100 100 100 100 100 
##$AQSEQ= 0
##$AQ_mod= 1
##$AUNM= <au_zg>
##$AUTOPOS= <>
##$BF1= 200.13
##$BF2= 200.13
##$BF3= 200.13
##$BF4= 200.13
##$BF5= 200.13
##$BF6= 200.13
##$BF7= 200.13
##$BF8= 200.13
##$BYTORDA= 1
##$CFDGTYP= 0
##$CFRGTYP= 5
##$CHEMSTR= <none>
##$CNST= (0..31)
1 1 145 1 1 1 1 1 1 1 1 1 1 1 1 1 1 1 1 1 1 1 1 1 1 1 1 1 1 1 1 1 
##$CPDPRG= <>
##$CPDPRG1= <>
##$CPDPRG2= <>
##$CPDPRG3= <>
##$CPDPRG4= <mlev>
##$CPDPRG5= <mlev>
##$CPDPRG6= <mlev>
##$CPDPRG7= <mlev>
##$CPDPRG8= <mlev>
##$CPDPRGB= <>
##$CPDPRGT= <>
##$D= (0..31)
0 1.2 0 0 0 0 0 0 0 0 0 0.03 0 0 0 0 0 0 0 0 0 0 0 0 0 0 0 0 0 0 0 0 
##$DATE= 1552393502
##$DBL= (0..7)
120 120 120 120 120 120 120 120 
##$DBP= (0..7)
150 150 150 150 150 150 150 150 
##$DBP07= 0
##$DBPNAM0= <>
##$DBPNAM1= <>
##$DBPNAM2= <>
##$DBPNAM3= <>
##$DBPNAM4= <>
##$DBPNAM5= <>
##$DBPNAM6= <>
##$DBPNAM7= <>
##$DBPOAL= (0..7)
0.5 0.5 0.5 0.5 0.5 0.5 0.5 0.5 
##$DBPOFFS= (0..7)
0 0 0 0 0 0 0 0 
##$DE= 6
##$DECBNUC= <off>
##$DECIM= 24
##$DECNUC= <off>
##$DECSTAT= 4
##$DIGMOD= 1
##$DIGTYP= 9
##$DL= (0..7)
0 120 120 120 120 120 120 120 
##$DP= (0..7)
150 150 150 150 150 150 150 150 
##$DP07= 0
##$DPNAME0= <>
##$DPNAME1= <>
##$DPNAME2= <>
##$DPNAME3= <>
##$DPNAME4= <>
##$DPNAME5= <>
##$DPNAME6= <>
##$DPNAME7= <>
##$DPOAL= (0..7)
0.5 0.5 0.5 0.5 0.5 0.5 0.5 0.5 
##$DPOFFS= (0..7)
0 0 0 0 0 0 0 0 
##$DQDMODE= 0
##$DR= 18
##$DS= 0
##$DSLIST= <SSSSSSSSSSSSSSS>
##$DSPFIRM= 0
$$ [...]
##$SUBNAM2= <"">
##$SUBNAM3= <"">
##$SUBNAM4= <"">
##$SUBNAM5= <"">
##$SUBNAM6= <"">
##$SUBNAM7= <"">
##$SUBNAM8= <"">
##$SUBNAM9= <"">
##$SW= 24.9336934301222
##$SWIBOX= (0..15)
0 0 2 0 0 0 0 0 0 0 0 0 0 0 0 0 
##$SW_h= 4990.01996007984
##$TD= 16384
##$TD0= 1
##$TE= 0
##$TE2= 300
##$TE3= 300
##$TEG= 300
##$TL= (0..7)
0 120 120 120 120 120 120 120 
##$TP= (0..7)
150 150 150 150 150 150 150 150 
##$TP07= 0
##$TPNAME0= <>
##$TPNAME1= <>
##$TPNAME2= <>
##$TPNAME3= <>
##$TPNAME4= <>
##$TPNAME5= <>
##$TPNAME6= <>
##$TPNAME7= <>
##$TPOAL= (0..7)
0.5 0.5 0.5 0.5 0.5 0.5 0.5 0.5 
##$TPOFFS= (0..7)
0 0 0 0 0 0 0 0 
##$TUNHIN= 0
##$TUNHOUT= 0
##$TUNXOUT= 0
##$USERA1= <user>
##$USERA2= <user>
##$USERA3= <user>
##$USERA4= <user>
##$USERA5= <user>
##$V9= 5
##$VALIST= <valist>
##$VCLIST= <CCCCCCCCCCCCCCC>
##$VD= 0
##$VDLIST= <DDDDDDDDDDDDDDD>
##$VPLIST= <PPPPPPPPPPPPPPP>
##$VTLIST= <TTTTTTTTTTTTTTT>
##$WBST= 1024
##$WBSW= 4
##$XGAIN= (0..3)
0 0 0 0 
##$XL= 0
##$YL= 0
##$YMAX_a= 734280
##$YMIN_a= -904279
##$ZGOPTNS= <>
##$ZL1= 120
##$ZL2= 120
##$ZL3= 120
##$ZL4= 120
##$ABSF1= 10
##$ABSF2= 0
##$ABSG= 5
##$ABSL= 3
##$ALPHA= 0
##$AQORDER= 0
##$ASSFAC= 0
##$ASSFACI= 0
##$ASSFACX= 0
##$ASSWID= 0
##$AUNMP= <proc_1d>
##$AZFE= 0.1
##$AZFW= 0.1
##$BCFW= 1
##$BC_mod= 2
##$BYTORDP= 1
##$COROFFS= 0
##$CY= 11.3945322036743
##$DATMOD= 1
##$DC= 2
##$DFILT= <>
##$DTYPP= 0
##$F1P= 18.9103706918063
##$F2P= -1.10871071338519
##$FCOR= 0.5
##$FTSIZE= 0
##$FT_mod= 4
##$GAMMA= 1
##$GB= 0.15
##$INTBC= 1
##$INTSCL= 1
##$ISEN= 128
##$LB= 0.24
##$LEV0= 0
##$LPBIN= 0
##$MAXI= 10000
##$MC2= 0
##$MEAN= 0
##$ME_mod= 0
##$MI= 1.114404
##$NCOEF= 0
##$NC_proc= 0
##$NLEV= 6
##$NOISF1= 3.799351
##$NOISF2= 2.8
##$NSP= 1
##$NTH_PI= 0
##$NZP= 0
##$OFFSET= 15.70392
##$PC= 1
##$PHC0= -8855.505
##$PHC1= 9.80025
##$PH_mod= 1
##$PKNL= yes
##$PPARMOD= 0
##$PSCAL= 0
##$PSIGN= 0
##$REVERSE= no
##$SF= 200.130013532006
##$SI= 16384
##$SIGF1= 3
##$SIGF2= 2
##$SINO= 400
##$SIOLD= 16384
##$SREGLST= <1H.CDCl3>
##$SSB= 0
##$STSI= 0
##$STSR= 0
##$SW_p= 3612.71676300578
##$SYMM= 0
##$S_DEV= 0
##$TDeff= 0
##$TDoff= 0
##$TI= <>
##$TILT= no
##$TM1= 0
##$TM2= 0
##$TOPLEV= 0
##$USERP1= <user>
##$USERP2= <user>
##$USERP3= <user>
##$USERP4= <user>
##$USERP5= <user>
##$WDW= 1
##$XDIM= 8192
##$YMAX_p= 0
##$YMIN_p= 0
$$ End of Bruker specific parameters
$$ ---------------------------------
##NTUPLES= NMR FID
##VAR_NAME=  TIME,          FID/REAL,        FID/IMAG
##SYMBOL=    X,             R,               I
##VAR_TYPE=  INDEPENDENT,   DEPENDENT,       DEPENDENT
##VAR_FORM=  AFFN,          ASDF,            ASDF
##VAR_DIM=   8192,          8192,            8192
##UNITS=     SECONDS,       ARBITRARY UNITS, ARBITRARY UNITS
##FACTOR=    0.0002004,     1,               1
##FIRST=     0,             0,               0
##LAST=      1.6414764,     0,               0
##MIN=       0,             -904279,         0
##MAX=       1.6414764,     734280,          0
$$ Real data points
##PAGE= N=1
##DATA TABLE= (X++(R..R)), XYDATA
$$ [...]
2666c138J230M787k043l718L030K947m566j478O064l60p200K908O640n116m593
2681d606O269J398n499J758L135l554j45L456j785k659K914J245k358q43J775
2696E01P4j067N15P80j640m07L495p90n087K749N753n487m049O933J345p375K230
2713a527N831n355k869O592J54o696K319N907l546n282L960M462m286l495M903
2728A072K154n427J66M843l168k994N520K26o434K651N625m529l262M717M29l268
2744a679K047J009l155J067L246k495l233L257L209l659l068M409K214m802l96
2759b029N007k708l969O037J583q359J726Q971n387p250P131M334o849j489N700
2774B449j087l839K877K221m184j343N322P59o593N27O600j779n782M016K539
$$ y = [-3138, -1908, 2879, 836, -2882, 148, 3095, -1471, -2949, 3115, 2755, -4445, -1537, 5103, -13, -4606, 1663, 3061, -2438, -680, 2455, -1099, -1244, 2212, 427, -2232, 682, 1927, -431, -1274, 501, 575, -492, 23, 803, -837, -1244, 2251, 1461, -3626, -877, 4876, -611, -4660, 2273, 3618, -3757, -1527, 4304, -1051, -3920, 2672, 2826, -3870, -1551, 4356, 810, -4472, -512, 3950, -336, -3831, 1072, 3226, -2201, -2035, 2808, -360, -3354, 2166, 2392, -4042, -1391, 4234, -295, -3557, 1160, 1589, -1679, 368, 1377, -1778, -711, 2535, 40, -3193, 64, 3273, -386, -3454, 955, 3169, -1633, -2029, 2978, 270, -3699, 2338, 3921, -4438, -2712, 6259, 872, -6378, 753, 5087, -1762, -3251, 2449, 1362, -2477, 400, 2621, -1563, -2906, 2416, 3175, -3418, -2891, 3709, 1930, -3852, 164, 2703]
2789B703m556P85M441m666k313O871p77o734L318N091m989k404M965J18m481J829
2805g99L839l489k971M552K571o290r60P264j069p450L895O059o566k878P953
2820C661r95p540M145N576n803k908N940L25m455J452K869k834j430L137R48l587
2836a499m43L923q03l387K295J652l742J518L958m877k770P673K76q517K762P203
2852E222n369m109O564K85o410K918N706n226n075O592M556q083l416R422J543
2867E120r718J179Q473m162o185P355K093q820K213Q201n018o688O547L949n463
2882i24k117L880M35j836O05O24j682K23K575q63l221J715K972k598j396L179
2898A571j505k669M805L04o658K909O840n887n097P631J911p718J387O615m265
$$ y = [2703, -1853, -1068, 3373, -1293, -3606, 3265, 2488, -4246, -928, 4163, -826, -3230, 1735, 1853, -2628, -799, 3040, -449, -3420, 1132, 3703, -2587, -3547, 3717, 2648, -4802, -907, 5152, -1414, -4292, 3661, 2666, -4874, -729, 4847, -956, -3864, 2076, 2401, -2054, -602, 2267, -567, -1997, 1140, 2088, -1499, -1942, 1981, 1178, -2209, 86, 1738, -2004, -486, 3472, -1405, -4175, 3498, 3774, -4743, -1981, 5222, -147, -4256, 2308, 2593, -3817, -899, 4807, -419, -5494, 1098, 5654, -2429, -5845, 3577, 5120, -4598, -3419, 5054, 892, -5293, 2062, 4155, -4665, -2452, 5749, 731, -5957, 590, 4539, -924, -3041, 839, 1274, -562, 43, 667, -1015, -792, 1783, 920, -2301, -586, 2386, -212, -1608, 1571, 66, -2603, 2202, 2506, -4152, -1243, 5597, -290, -5387, 2244, 4155, -3563, -2176, 4439, 174]
2913A74n041O159M060p857k818R154J352r795P13R290l359p714O432M278q570
2928c542K72Q971m315p722O778N198p205k452O236j21l814J359J475k091l15K993
2944A705m16l949J068M617k168l715K681J737k402J173J429m768J384O552m325
2959F03o397O522M554p194j415O101j404m365L771K397n653o89O968m49p851J055
2975c446Q538k555p648M201N401n741j819P111l183o331P068M237r110j871R153
2990D005n98p196J963M371k127j975K324J95k936J512L463l012l530M130K792
3005C381m520j097M198j820k304M670j030n493L783N128o014l149O407N25n021
3020b356J494K925k742r13L859q01m714J746N279k804n334L996M796n602k595
$$ y = [174, -4867, 1292, 5352, -2505, -5323, 3831, 5183, -4612, -3899, 5391, 2032, -5682, 750, 5028, -3542, -3270, 5701, 1386, -6336, 442, 5640, -1565, -4017, 2219, 2098, -1716, -357, 1118, -973, -1288, 1705, 1289, -2660, -1592, 3025, 857, -2858, -177, 1560, -842, 331, 1760, -3008, -1624, 4928, 603, -5794, 728, 5282, -1912, -3327, 2774, 1370, -2995, 776, 3173, -2480, -3169, 3799, 3350, -4501, -3446, 5092, 2537, -5111, -910, 4491, -1250, -3069, 4042, 859, -5472, 1596, 5833, -3277, -5148, 4005, 3407, -3789, -1826, 2545, 418, -1557, 767, 962, -1974, -462, 3001, -11, -3541, 589, 3381, -1139, -2236, 1962, 142, -2162, 2508, 1478, -4015, -232, 4896, -1118, -4267, 2140, 2665, -2356, -862, 2063, -679, -1592, 2267, 1466, -3248, -1502, 3777, 973, -4361, -365, 4431, -1171, -3766]
3035c766O610j148n937M741M166p331j708Q508j047p377K615N015l163k422L244
3050A000k32k710K131K427l103k936M405K672n303j594N548o59m542L180K051
3065B335m914J088N582m134m090N219K332n265PL655j503j393K576q38l165J745
3081g63M116k624m670L106M959l914l883M332K098m645J518L158m481j013O490
3096C784j586p123L980N409m393l216M291L75l051J658J916l023j568M450J304
3111C207o026n98O424K16o511J460N032l493j780M070j224m015M381K345n879
3126b391l38N257q89l918J625K051j761l82J666p43j687J315K238k165k428L029
3142D79J910l541l3L120k361j445M337j103n024L497M292n094k664N434K97m646
$$ y = [-3766, 2844, 1696, -4241, 500, 4666, -2665, -4373, 4135, 3088, -4289, -1674, 3341, 178, -2244, 1000, 768, -1942, 189, 2616, -487, -3423, 982, 3654, -1649, -3243, 2305, 1646, -2896, 284, 2335, -2579, -1491, 4091, -43, -4133, 1086, 3418, -1847, -1840, 1815, 312, -1081, 1495, 657, -2508, -763, 3353, 729, -3941, -835, 4124, 210, -3673, 659, 2757, -1888, -370, 2788, -1693, -2706, 3784, 2198, -4925, -945, 4464, 71, -3145, 1146, 1521, -1530, 128, 2044, -979, -2547, 1903, 3207, -2819, -3417, 3007, 3223, -3288, -1828, 3204, -289, -2069, 2001, 777, -3238, 1143, 3488, -2391, -2729, 2528, 1639, -2279, -654, 1397, -364, -746, 920, 177, -1510, -195, 2043, -122, -2550, 479, 2389, -1152, -1185, 1935, -426, -1871, 2466, 1363, -3661, -164, 4128, -966, -3630, 1804, 2101, -2545]
3158b545J869L025k900j803L822P65m328m50N191j31n390J372M480k561l096M353
3174A673j04m691L295L761n385k127N808N97m967N07K994o65j154M86m78m94J724
3191G80M25j839q77K021J314k651o64K653q89j520K457l01l680K972L803n338
3207a334k994O505R75n629P80M040k091k079K835L25l218O29L952j604m383K122
3223a169M871l276m238M443K668m852k91M182k055l058M025J060m374P64L156
3238A856j311j581Q74K19l2N07n45p63P89R60m28j461K19J691p17j604K008M29
3256A110k798J424L257l857k360N097R14n915J405M957l057k967M101P35m019
3271a973P15L969j744m114K122M360k801m193L598L750m579j765M516o65l547
$$ y = [-2545, -676, 2349, -551, -2354, 1468, 2233, -2095, -2545, 2646, 2515, -2875, -1503, 2977, 416, -2680, 1673, 1569, -3122, 173, 3934, -1451, -3578, 2230, 2827, -2140, -1633, 1361, 696, -458, 28, -450, -944, 780, 1205, -634, -1511, 510, 1824, -827, -1491, 1162, 273, -1247, 1210, 909, -2771, 201, 4004, -1334, -4328, 2177, 3152, -2477, -1697, 2343, 252, -1827, 1008, 1333, -1885, -1256, 2696, 1092, -3291, -1169, 3702, 426, -3812, 631, 3299, -1553, -1844, 2338, 283, -2775, 1250, 2310, -2064, -1300, 1856, 545, -1036, -162, 57, 25, 532, -13, -776, 13, 973, 545, -916, -697, 994, 277, -1327, 681, 1110, -1688, -264, 2993, -864, -3224, 1873, 2787, -3128, -1723, 3234, 177, -2790, 1311, 2046, -1973, -1258, 2711, 967, -3147, -1025, 3335, 534, -3659, -61, 3689, -890, -2655, 1861, 1196, -2351]
3286b351K709K002m052k66M012j076k929J599J124o81o3n10l01R83N87j094k51
3303e58L90J035o54j153Q31R63j483K46J851j995j837M296M93n537J182N314k938
3320D46m090M318J771m173K92L864j854l015K421K809k958k618L420K225l995
3335a137j347M420k92l956K098K581l609l40L707j370l211K732J681k666Q1J219
3351E91o08l80Q51n36m80O73M46n97q03R52R14j363m81J795k94k488K414J583
3369B189l973J4M331j567m043L348K498m005o99L911j160k971K174J755k206j189
3385a593K310J242l185o55L599o24l184J761K686l088j049L715j085l099K671
3400D22J493l079J04K772j885r11J713Q2j799R24J323j361r76J398R91j557j045
$$ y = [-2351, 358, 2360, -1692, -1958, 2054, 978, -1951, -352, 772, 91, 28, -482, -783, 200, 787, -307, -558, -168, 867, 213, -940, -109, 854, -629, -383, 1468, -527, -2364, 1932, 2425, -3112, -1930, 3384, 446, -3644, 674, 2445, -1728, -1436, 2428, 574, -2441, -20, 2789, -169, -2787, 633, 2858, -1137, -2484, 1936, 1644, -2312, -214, 2367, -1242, -1582, 2125, 755, -2456, 276, 1957, -709, -628, 591, -17, -397, 454, -82, -562, 111, 557, -40, -843, 109, 1023, -340, -821, 974, 680, -1808, 606, 2189, -1784, -1770, 2561, 994, -3049, 299, 2797, -1208, -1907, 2004, 844, -2127, 47, 1802, -404, -1593, 717, 1959, -1226, -1881, 1718, 1094, -2090, -329, 2357, -731, -1780, 1935, 850, -2249, 422, 1915, -1164, -1060, 1712, -173, -1084, 629, 711, -1088, -164, 1159, -202, -1178, 220, 1211, -346, -1391]
3417a391K298N4k633J347K501k991j411M084l74m106K032L251l731r24L664n89
3433A081l123J905J958k002j458K196N39k081j76K463n12k467J236K129k082j119
3449a513K818m98k734K377J771l552k60L635j375k591K581P07k695O61K208j631
3465i1j367J787J125k087p79K325L65k751N68K843j839k277L165R81l763Q18L433
3482B456k707k056L686L40l904J620K543k247j304K415Q4j843K34J668j055j296
3498a366J466J343k266j032L422k39l232J770K337l239p19L807j682k898L135
3513F07J835m151O9L813j239l187K090K044k157j131J955N46k431M83K735j650
3529B31k621K924J921l851o79M179j284k960K606J384l142L77K827j954j709K681
$$ y = [-1391, 907, 961, -1672, -325, 2176, -815, -2226, 1858, 1484, -2622, -590, 2661, -1070, -1994, 1670, 1081, -2042, -137, 1821, -181, -1639, 557, 1096, -985, -1161, 1302, 790, -1677, -441, 1688, -394, -1513, 1305, 807, -1927, 450, 2221, -1331, -1591, 2044, 669, -1922, 659, 1366, -1329, -668, 1540, -91, -1458, 329, 1454, -633, -1412, 913, 1278, -1473, -905, 1938, 99, -2178, 987, 1968, -1795, -977, 2456, -251, -2307, 1379, 1719, -2185, -565, 1978, -269, -1573, 842, 926, -917, -683, 985, -70, -1366, 100, 1443, -823, -1855, 1567, 1328, -1904, -134, 2203, -1036, -1755, 2052, 370, -2528, 607, 2442, -1709, -1640, 2173, 934, -2253, -163, 1881, -276, -1407, 548, 1094, -1337, -854, 1881, 231, -2390, 534, 2455, -1396, -2075, 2104, 820, -2140, 466, 1850, -1292, -915, 1912, -42, -1751, 930]
3545I30K49k086M10J494q84j007J168M08j182p9J750p22k294K168J809l382q17
3562b067M313j179l979L262K701m511p87M291p74l914K511K510k909j482L187
3577A173J77k819K97K947j208k886K368K484l372j514M214k34l870J868K531l154
3593i98m07L129j282k290K126J137k024j51J335n44l97O20j90r54R25J324j375
3610a6j832J982J917k751j395L709j62l552J714K585l298r08M620j514m281L020
3626a62L539m018k018L760O52l035L17K398p42k621K165K020l217j415M144L73
3642B140m570J069M016k321k170K604L8k101J854O94k386L27K493j595j672J837
3658B57R55j631l24J474m13j125O61J394j711r96K444M40l241J062K896k591j558
$$ y = [930, 1179, -907, -497, 997, 113, -894, 274, 682, -500, -579, 1171, 449, -1845, 323, 2132, -1250, -2067, 2246, 1067, -2912, 350, 3051, -1460, -2247, 2044, 1270, -2644, -133, 2377, -532, -2014, 1173, 1350, -1469, -1172, 1775, 567, -2319, 49, 2533, -839, -2353, 1861, 1627, -2243, -375, 2156, -998, -1405, 1724, 442, -1848, 278, 1415, -609, -760, 575, 31, -366, 254, 64, -890, 35, 1359, -16, -1848, 134, 2051, -700, -2095, 1614, 1452, -2100, -386, 2199, -1099, -2007, 2613, 1099, -3182, -162, 3377, -641, -2659, 1101, 1753, -1282, -965, 1433, 691, -1930, 235, 2255, -962, -2377, 1767, 2140, -2430, -1361, 2655, 334, -1836, 768, 806, -1295, 559, 1253, -1133, -806, 1687, 92, -1580, 257, 1212, -419, -743, 731, 318, -807, -146, 1248, -463, -1459, 985, 1425, -1816, -754, 2142, -449, -2007]
3675b007L930m84m244K431L440l663k157L965J117l961L39K918q24k520J456K290
3691B026k073j987K681R77l160K08L082j432j952K451j29k408K088J515l256l43
3707a712L572p55k687J193J748j319o42R24j21o92Q07L67j419n01K252L31k813
3724a467M70K951j571k405L295M48l855J165L900k972k970L715J921l753o68K828
3740A032k0j745J35J092o25l40J175n25j495J198K340k548j879L322P36l376P83
3757g40K678k139j428K639K26k877J218J964j613q94J280K1q11Q11K96j481J86
3774f64J657J9k537K64L492j326l495K289L033l412j286L058n4k676J787J338
3790A487k282m4J881r57j201J412J53j511O39J575q44k089J563K190k057k252
$$ y = [-2007, 1923, 1439, -2805, -374, 3066, -597, -2754, 1211, 2328, -1633, -1294, 1624, 800, -1720, -264, 2026, -47, -2034, 647, 1624, -1536, -1328, 1754, 322, -1630, 821, 692, -1716, 372, 1887, -1369, -1712, 1860, 1105, -1582, -389, 1359, 40, -602, 322, 201, -491, 316, 683, -736, -1237, 1015, 1346, -1467, -997, 1954, 383, -2022, 1273, 1721, -2134, -969, 2931, -41, -3011, 704, 2625, -1128, -1796, 1032, 1012, -733, -598, 494, -131, -471, 704, 179, -1316, -118, 2222, -326, -2205, 1117, 1853, -1523, -740, 1938, -201, -1629, 1010, 1236, -1641, -423, 1541, -72, -966, 314, 335, -476, 335, 631, -850, -664, 993, 1012, -1525, -1261, 2231, 905, -2590, -301, 2732, -680, -1966, 1092, 1038, -1638, 149, 1487, -795, -839, 1042, 85, -1116, 296, 449, -1062, -423, 1152, 308, -1781, -218, 1972, -85, -2337]
3806b337L034J520l195o44K970p80j983K018O3j808J057J660k442l28K559p75
3822E89k129J385J766j912j172K087J203k714j139L537N08l727M23L271j195k247
3838a466J440P76j343J011M79k226N45K634j523k393K268J565k104p80J793K87
3854I63j701n0J828m60j764Q45J967j664j432J902Mj119J386l87k018K081J816
3871B197l275j361L990L25l678K71L180o41k273O21J504k46j513P27R65j352p9
3888f38J424p25r14J566j59j948J477J567l075k96L473n23l476J346K932j486
3904E45k158J244J256q33n21J08N58l18L12ko53K82J246j132j392K278P14l181
3922a647L25L723j774l237K701K275k716j590K334Q32j358n78P06K60P2R0o50
$$ y = [-2337, 697, 2217, -978, -1622, 1348, 568, -1415, 603, 666, -1142, -85, 1575, -867, -1195, 1364, 589, -1540, -155, 1611, -301, -1473, 614, 1817, -897, -2036, 1501, 2009, -1718, -1295, 1976, 781, -1466, -26, 750, -593, 418, 897, -1329, -784, 1850, 327, -2066, 202, 1767, -337, -1117, 676, 963, -738, -788, 1040, 580, -1184, -339, 1628, -36, -1468, 434, 438, -681, 705, 318, -1700, 381, 2197, -1078, -2439, 1551, 1876, -1802, -1531, 1649, 1008, -1265, -644, 860, 614, -899, -172, 793, -559, -638, 786, 61, -853, 713, 554, -1394, 83, 1650, -1425, -1721, 1752, 1229, -2247, -901, 2031, 545, -1613, -369, 887, 54, -467, -359, 199, -119, 193, 191, -462, -180, 1066, -66, -1458, 820, 1534, -1647, -1322, 2401, 627, -2610, 91, 2366, -350, -1940, 394, 1226, -132, -710, -4, 256, 328, 418, -232]
3939b32l10J071N46j742q90K556P37l516M46L401j575k722K507J604k617k95J937
3956I06l40j116L27L86L5L34o42q87J117J202j040j767J057K429j447k870K067
3973b49K942k870j879L023P49k898M56J761j330l86J187o36p10J572j38j608Q46
3990a68J372j180j449J126J768j189k509K430K238l174j754L395R88k901j13J974
4006H54p28m43N79o62J92J313r24j549J700J056j942q00J995M58j744q47K265
4023G73Q44k644m61K803k67k168P90J098q55L79J27j750J002K266k124j893K851
4040G71J241l158q83L154L61k817K95K108J26k584M76K330q05j999J380R97j486
4057d93M34L63j135J033J262k076j197L255L27l381J05L238o16k346N08J905n77
$$ y = [-232, -542, 529, 1075, -667, -1557, 999, 1736, -1780, -1334, 2067, 492, -2230, 277, 1881, -736, -1031, 906, 566, -550, -223, 163, 198, 532, -110, -997, 120, 1322, 282, -1485, -428, 2001, 554, -2316, -249, 2693, -177, -2056, 967, 1716, -1182, -726, 1035, -295, -681, 506, -130, -840, 732, 594, -1014, -168, 1204, 24, -1425, -299, 1469, 280, -2229, 201, 2439, -735, -2489, 906, 1894, -1007, -1120, 854, 126, -317, 262, -400, -208, 1105, 181, -1368, 332, 1388, -554, -1354, 641, 1099, -645, -1492, 773, 1617, -1027, -1488, 1315, 1048, -1120, -330, 768, -87, 292, 419, -1331, -329, 1937, -187, -2080, 771, 2012, -1146, -2029, 1125, 1486, -1331, -1036, 1072, 1198, -1386, -910, 1420, 615, -1384, -4, 993, -493, -59, 304, -831, 202, 1464, -612, -1809, 1446, 1773, -1608, -1503, 1735, 1119, -1227, -719, 1186, 609]
4074F09j444J90J390j84j206P18Q7l61M67m2j153J121J222k364o55L531o95l614
4092b383J739L094k067k484K084J587j433j247P55J227n49p12j14P17jK90q46
4109c43n75J669L14k339k7L126j092k896J997K260k645j010K292J81j306N1K45
4126i8J60K61j22p03K08J021k97j365J13K281n38k775J008L252k113k718K801
4143C76J969l217q44K885j28j893P10M29l91J46l3n77P14Q11p92j111R36J215
4161A205j002j688J213K123j736k024K494J131k354k24J838q31o72Q71l36l64
4177c56J264m92j739J490J323j773j264K050J308k517j140K385J457k809r38L068
4193A317K40l072O57K122j125j069J525o04n07J309p21j182J193J356j750q33
$$ y = [609, -835, -645, 745, 561, -645, 73, 160, -201, 266, 224, -929, 192, 1414, -950, -1605, 1926, 1231, -2383, -644, 2450, 383, -2101, -17, 1570, 137, -1110, -355, 872, 323, -389, -503, 214, 213, 503, -343, -918, 751, 1065, -1274, -1301, 1825, 733, -2163, -166, 2094, -551, -1561, 731, 912, -394, -343, -98, 62, 323, 201, -502, -294, 727, 430, -935, -822, 1459, 921, -1854, -846, 2406, 293, -2425, 376, 2345, -872, -1716, 1169, 1041, -852, -142, 287, -104, 42, 9, -568, 146, 957, 165, -946, -10, 1205, 203, -1485, -272, 1851, 115, -1909, 585, 1716, -638, -862, 976, 145, -527, 344, 8, -356, 908, 416, -1323, 167, 1490, -283, -1547, 503, 1811, -706, -1846, 539, 1996, -813, -1751, 1317, 1557, -1515, -858, 1264, 139, -930, 595, -9, -516, 793, 72, -1110, 83, 1439, -311, -1144]
4209a144J578O93j791m69J909M25j775l75J698N7j634L54J117n27j97L18r04O27
4227d0J476j999j315K928O47l394L69L160r35k660J151K264j229j559J041J173
4243A078r43j044Q86N85j037M64P78j402R1K064j443j699K339O56k775M75K496
4260A569q36k304J115J673j072r17M21R65j86q32p2J061j84l63l52j76J057K15
4278G82j630m95K818m76k712J398K288k079j379J994K57j455K71P04m07J59K95
4295C33k36l87O22r6p63%J221J07k153M81K593j051k919K164K001k687q46K506
4313H90jj686L95R52p98M06Qm75J5R53m54r41M77R73j78j432O12J742j280j878
4333a700J994J169k297l38K121m09j428J040K35r14O30K48j159P33R75r29q63
$$ y = [-1144, 434, 1127, -664, -1133, 776, 1201, -574, -949, 749, 806, -828, -474, 643, 116, -81, 237, -667, -40, 1436, -563, -1878, 1050, 1697, -1697, -1328, 1832, 897, -1763, -612, 1652, 423, -1136, -95, 1078, 135, -909, -23, 562, -475, -11, 767, -635, -544, 1520, 77, -1622, 717, 1373, -1402, -927, 1569, 733, -1571, -456, 1217, 145, -772, -351, 614, 428, -404, -476, 585, 401, 38, -314, -490, 567, 782, -848, -1343, 1475, 999, -1713, -315, 1973, -106, -1485, 509, 766, -689, -418, 286, -121, 38, 333, 97, -290, 332, 236, -527, -527, 694, 801, -1352, -871, 1722, 671, -2248, -84, 1917, -770, -1616, 890, 889, -797, -402, 550, -248, 158, 166, -309, -294, 659, 205, -736, -259, 714, 536, -896, -284, 1458, 178, -1700, 294, 1463, -834, -1172, 949, 540, -888, 152, 387, -527, 103, 351, -808, -75, 900, -29, -892]
4350h92J062M74r69o15J123J069j745o01J817M49k111J79J631p05j051J449m56
4367A08n61J026j84j590J128J411j541j062J593R23j744n78J658L56j545k34J498
4384F62j42j621P46J494j388p46J629k26j245R94L95j354P21J108j700l07J888
4401I08K3j674K46J296j44r94j84J111J72j369K38R12m57k94N83n99j38R56l59
4420B33j259J441N90j841j24K221r68j528J423P87j082m95Q28O4m71k99O27J80
4438C27n88K68O23j100r4J339n99j494J494J210k187m28K386o17j932J480R36
4455A024j252m90P69K69m46m13M36M55l61k33K98k04n5P26o52o92J179N10j820
4474i52N31J451j067j024J492M3j189M48J000r24j59P73j46p29L78K90l32j44
$$ y = [-892, 170, 644, -325, -940, 183, 1252, -493, -1094, 723, 1172, -939, -760, 871, 166, -885, 564, 108, -453, 573, 389, -1201, -73, 1338, -203, -1265, 328, 1251, -493, -1071, 587, 943, -602, -836, 662, 520, -1101, -355, 1139, -249, -995, 634, 408, -837, 157, 552, -802, -81, 1027, -673, -980, 908, 931, -743, -497, 799, 655, -339, -523, 588, 760, -609, -371, 541, 84, -210, 373, -226, -364, 592, 233, -1026, 415, 1005, -836, -960, 1261, 293, -1235, 188, 975, -107, -602, 226, 290, -181, -480, 147, 327, -261, 7, 630, -470, -564, 775, 176, -1318, 176, 1386, -801, -1229, 1157, 540, -1392, 88, 1024, -228, -718, 51, 320, -126, -539, -103, 352, -9, -242, 56, -148, -203, 523, -129, -821, 358, 868, -952, -421, 1030, -37, -1061, 431, 474, -715, -267, 733, -191, -350, 423, 277, -452, -74, 216, -116, -260]
4492b60K74M20r22k52J571k04k073R36K053j747j226K004L20j501M90Q26r98k50
4510e39Q55j36n49M46K26j90l13J13M51l21n06O25J75r47O24R74j382k97J241
4529E50k06j055Q30M79r36J00Q12r32k05J433n37r46M51Q46p02n95N12P62o57
4548Dq92J110M19j520K67J603o87j454J563O28j730K74J097p06p59J354j21j223
4566g73N36Q56o07m72L59M97l61o26O70L72q92J36R27n15p90J241j54j037N67
4585f6P78r63k33J169p11p34J449k27j231N31R45n58p52M95P50o08n90N47O78
4604F69j154j89J324m24j334J255J087j997J9J608r26r31J307N08j544L36J142
4621G56o92o89N55M67l19n04M19N23n80l77P70k16o10O57K51q61K22R73j092k27
$$ y = [-260, 14, 434, -488, -740, 831, 627, -1446, -510, 1543, -204, -1430, 574, 894, -607, -117, 709, -289, -539, 316, 180, -369, 77, 303, 113, -200, -87, 364, 43, -463, 162, 337, -610, 14, 988, -394, -691, 550, 344, -711, 119, 598, -338, -238, 574, -358, -563, 870, 333, -613, -162, 684, -18, -613, -101, 661, 4, -888, 222, 641, -879, -612, 991, 304, -1150, 413, 1041, -689, -415, 682, -24, -783, 571, 450, -773, -237, 619, 12, -460, -101, 396, 35, -591, 79, 451, -441, -305, 622, 107, -683, 558, 404, -633, -66, 712, -251, -484, 685, -26, -760, 689, 462, -769, -238, 707, 149, -603, -108, 642, 34, -556, -9, 669, -485, -674, 650, 226, -1108, 147, 1234, -763, -744, 864, -62, -993, 314, 822, -722, -386, 756, 64, -625, -70, 397, 78, -426, -7, 516, -64, -441, 329, 113, -497, 160, 411, -450, -228, 745, -347, -574]
4641e74J166o2j290R15N44j235O3R38k41q12N11M51l12m46P23K41j023j21J106
4660E42j78j380J086Q68j290p69J889k56j369R09Q51j154k82J037k98o74O69L30
4678E31o31l01N27J92l80q2L85k58m95P12J57j089M15J123r10o34J207J9j376
4697h88Q24J115j407l12J343k31j154O59P37q49m31O73M03n48m03P51J95j053
4715e76N46R06j170o13J771j74j550O61R06j010l97J094k96q40R10M65j021J10
4733b78P20j38n48j15N69j14k80Q6N45p09K8P20o58n71J065K76j387L71J352j010
4753g6p20J152K35j257M81Q72r82m29Q71J83q16J80O15q2o75K24P25l73p23R59
4773C64J35j153K16J580j423o11J741p50j021J024M64j100K13P46m94k28L60L45
$$ y = [-574, 592, 530, -760, 155, 699, -536, -473, 465, 224, -588, -77, 374, 62, -384, 339, 580, -443, -564, 542, 364, -1016, 70, 938, -352, -1121, 768, 512, -857, 52, 903, -251, -533, 504, 206, -468, 201, 531, -100, -401, 126, 318, -62, -144, 241, -17, -512, 200, 357, -732, -317, 806, -104, -738, 469, 488, -888, -64, 1051, -356, -668, 675, 444, -710, -51, 686, -163, -594, 79, 482, -66, -469, 282, 477, -576, -30, 876, -294, -907, 864, 690, -860, -199, 707, -303, -700, 394, 98, -742, 168, 633, -388, -278, 442, 304, -244, -359, 210, 96, -184, -98, 447, -262, -234, 486, -172, -743, 322, 598, -789, -418, 934, -76, -796, 356, 591, -666, -185, 687, -295, -724, 147, 330, -486, -306, 309, 227, -448, -224, 501, 128, -595, 364, 499, -654, -438, 1142, -281, -892, 849, 99, -922, 102, 566, -534, -321, 425, -69, -297, 63, 408]
4791D08p63K03M99k5m62j24O48q0q02P67M17r84k13J331o91q87J082L44j497O45
4811a84Q25o85m97O86P7n43J73M23k25j99J26J67k2n03N32M84r90K8J145q76m40
4832d98Q70j10q09N99P26j192j97J472r02p67Q84L98p62j89P43p9m89J93N60l82
4852F9n62O84L72j049j79J473n60j231R49P45q94n13J372n28q47R03J89p60M67
4871A00M22o38j6J95J74j04l12L14L0k85r9N61m44m26Q36J14j161O72Q60j274
4891d81J03R55m97q96R75M29j028j7Q88k91q30O29M11m40l28L65N80q01j19Q75
4911D82j02j055M55J009j151k95J232l76j011R28L92r62J72O34m43j88L99K2l01
4930a59K0L73j49k40n2M22k70l03P40j45p76N53O00p92k10J117n17r23Q89M58
$$ y = [408, -355, -152, 347, 322, -140, -264, 384, 304, -498, 269, 686, -298, -511, 820, 129, -758, 324, 668, -829, -184, 641, -44, -541, 145, 222, -321, -148, 275, 50, -149, -23, 144, 122, -381, 151, 635, -355, -327, 818, -58, -498, 372, 262, -547, 52, 778, -414, -611, 861, -41, -808, 76, 474, -288, -477, 266, 187, -302, -109, 451, 69, -493, 191, 563, -486, -665, 808, 248, -983, -34, 711, -183, -696, 676, 148, -699, 204, 393, -367, 100, 522, -116, -132, 63, 237, 133, -179, 135, 165, -120, -219, 342, -102, -528, 308, 422, -739, -67, 793, -481, -378, 577, 80, -816, 159, 588, -440, -457, 431, 140, -690, -61, 350, -90, -418, -53, 527, -274, -393, 482, 380, -675, -220, 789, -362, -657, 575, 199, -812, 116, 508, -454, -282, 352, -91, -279, 120, 142, -159, -139, 234, 85, -155, -207, 215, -55, -358, 382, 237, -539, 14, 614, -178, -388, 729, 212, -711, 178, 636]
4950F36j207J35J105m58o80M85M05p14mN29K85p98L0M93L28j052K96Q74q21o46
4970g79J114J9j141R86K70o59p0R56o15o04O31K24m72JK99j03L5l38K84M0l18
4991b40L11J39l88n0O05m75l03O90J87j111L97Q19q73k76Q57J13r81O49L87p49
5011b92J61K31P2l32n3M35k07l97N03N9m65q3Q09q2r78M43R58r88l11J051k14
5032C20q23O56L32o96j00O61j08m30K62R2k28j82K27K93n21j23O64j38n95L29
5052a08O05j004K38Q39n35o23O86K86q75L70M63m68k19O28k16k88K53O8J64m21
5072a57m2N59k71m83N06L77o08k53J023r23k27Q22r4o88N97N00p61k24P77m29
5092Am52N90L26n10k14L03K89m75k71N33M09r10M1Q12l63o34P99J8p49O97N7o87
$$ y = [636, -571, -436, 669, 211, -469, 16, 421, -293, -297, 232, 517, -281, -251, 242, 570, -482, -186, 688, -133, -779, 335, 354, -787, 199, 469, -190, -260, 696, 81, -523, 108, 332, -140, -139, 160, 57, 92, -246, 38, 78, -240, 71, 210, -178, -228, 377, -98, -401, 289, 476, -635, -238, 581, -292, -568, 289, 402, -579, 70, 457, -292, -131, 100, 172, -160, -213, 222, 15, -382, 121, 180, -285, -368, 441, 359, -619, -176, 782, -206, -517, 534, 320, -503, 153, 485, -211, -311, 350, 242, -188, 74, 166, -62, -244, -17, 276, -245, -368, 296, 158, -437, -108, 497, -507, -269, 570, 35, -588, 98, 384, -491, -121, 342, -126, -345, 283, 67, -221, 32, 100, 264, -157, -199, 360, 89, -394, 112, 489, -119, -372, 651, -272, -499, 323, 229, -459, 138, 638, -123, -347, 430, 1, -451, 139, 465, -45, -259, 44, 333, -142, -413, 120, 529, -381, -340, 472, 109, -525, 274, 292, -457, 240, 297, -390]
5114c90L09N00n94p7L11K17m94J30K97j79l53L12K6K72n67J20N76n70k08O87k78
5135D7n79Q13J08p80K85O03o31j10O36j22q25M38L98p5k97Q7L61j79l53J67L77
5156C69o70o3P07k83n17O12K13q75M86M94o38k72J063k89q69O52J5r4j06Q4P6
5177I5j85j02K44O1k93R3M74m32k06N32Rp79N05O01q95k34R08k47o66O54L07q37
5199c93J49M44r6l85K54M6k8n9J6M20m12r8M10J85r02N94L76q79n7R78n69o47
5221f53O82M28o60P7L68j51l01K67o8o2r5J1J85r0o4J52O9m70L70N49p93M5O81
5244D77m87l11P01%r97O56L93p60K36M98k25m05J75J57j46k47N74n4n63J17N60
5265C49nq50M66O06o41l61P63M3j022M95R66j179q5Q45r9p12N78J76n49L4J98
$$ y = [-390, -81, 419, -175, -252, 59, 276, -218, -88, 209, 30, -323, -11, 15, 287, -280, -160, 416, -154, -362, 325, 47, -532, 281, 389, -391, -106, 497, -134, -244, 392, 270, -555, -117, 281, 206, -91, -4, 357, 178, -175, -8, 369, -301, -364, 343, 60, -457, 155, 368, -507, -21, 473, -165, -437, 626, 337, -532, 120, 135, 41, -65, 19, 95, -90, -192, 52, 113, -180, -87, 387, -45, -251, 281, 290, -489, 16, 617, -278, -512, 396, 149, -517, 137, 444, -393, -244, 200, 104, -281, -27, 19, -9, -68, -52, 368, -44, -142, 268, 453, -449, 145, 521, -358, -415, 563, -6, -653, 29, 457, -203, -126, 242, 91, -210, 57, -11, -73, -168, -157, 28, -62, -126, 26, 95, -375, -5, 544, -249, -204, 477, -10, -321, 380, 380, -617, 39, 432, -328, -92, 406, 181, -224, -49, 108, -38, -285, 289, 235, -328, -211, 349, 344, -506, -40, 566, -75, -436, 327, 370, -652, -157, 809, -370, -455, 390, 291, -421, 157, 333, -216, -182, 16]
5286A6J13k80N3L92j65m46K82L22l73k06N47j77n69N44M36r71L85M39m63m45P64
5307A98p5n90L44P15o25k39O08r3o04J36L42J38o93K48P64o62n02R09J23j140
5327f98P87N91r01l41R65n2q92M42N20p42q5O24K0m29m7L46j17l76K71K43l98
5348b69k28O61J04p90L86N26m45j04O49n66m52P87K04r75L87O01n65l91P07n0
5368A77k99R4J41mm73L35L17k91m32N37K23p57L67P96p04o26J125j02j125P66
5388F5M15n91l28P65n0n30L7M90l45j35L59J44l79j42M02j91l87J89Q09o89l71
5409d63Q22k7q41N93L23p46J49P82o27n39O75J67n12l5N20l20o8L02j04k20k31
5430d00N60J32n81J52Q50p58m08Q41Q2j008M24O18p33j69Q49k51o65L96O16n00
$$ y = [16, 129, -151, -98, 294, 129, -317, -35, 287, -86, -292, 255, 78, -491, 53, 489, -482, -97, 342, -121, -566, 198, 123, -467, -123, 592, -33, -272, 336, 243, -361, -225, 117, 255, -438, -190, 574, -88, -590, 319, 442, -698, 89, 680, -221, -562, 403, 351, -541, -99, 421, -321, -406, 218, 238, -191, -238, 108, -9, -385, -114, 129, -269, -497, 164, 268, -522, -136, 390, -55, -159, 490, -76, -528, 259, 463, -512, -125, 476, -89, -480, 227, 177, -122, -28, 113, 109, -364, -29, 288, -3, -435, 102, 325, -432, -65, 731, 27, -599, 526, 424, -701, 65, 480, -111, -439, 326, 276, -254, -217, 273, -72, -207, 152, 296, -83, -225, 177, -14, -401, -212, 597, -92, -463, 359, 332, -509, 84, 407, -339, -190, 592, -35, -574, 101, 268, -244, -279, 241, -79, -147, 155, 51, -169, -400, 160, 292, -289, -137, 713, -45, -453, 388, 470, -538, -114, 504, -229, -398, 451, 200, -465, -69, 547, 47]
5450D7n92P76j23l72R2J26J31l03j79P64l02l69P64k01q16O63L66p26p1Q80l93
5471A62p81P58P8m81K90L10l98j73L80o6lk42L95j51k49N6K94r0l42N81Mp51L10
5494a09O11n84l78R25k22p74M57M84n05k12O65k06m45K67O6j92j03K89L88m72
5514e0k82L19L64p14L16N83o52j18N43k20n62O16L88p39r0N93m77q2L39Q9k79
5535a15L44k13p7l6r6K26Q0l22J79K00j82j29P30o86j84O28j45p77O28M17q15
5556c45J0O64j80l87K88O2j08l62L59N3j77JK35rn25J87O19m20n30P67J99q26
5578d25O71K55o45q8O30l70l03N36j52l92J96n4n2J54J07j94K2J95j07K18l51
5599a49J56J46j71m33O10O2n42J46M76n68p5Q57k67p15M64K36n73L49J88R2n29
$$ y = [47, -545, 231, 108, -264, -172, -46, 85, -218, -397, 367, 65, -304, 460, 259, -557, 106, 472, -254, -325, 555, 162, -619, 139, 217, -264, 26, 336, -62, -235, 145, 79, 76, -166, 229, 78, -171, -115, 179, 89, -253, 328, 332, -419, -109, 502, -82, -460, 465, 243, -531, -74, 410, -95, -307, 358, 152, -293, -26, 40, -152, -255, 34, 422, -50, -332, -13, 351, -363, -47, 536, -116, -234, 309, 89, -473, 143, 531, -208, -298, 295, -182, -264, 75, 164, -115, 229, 16, -61, -97, -193, 33, 113, -209, -30, 170, -12, -141, 589, -97, -281, 347, 202, -575, 53, 470, -345, -335, 329, 149, -238, 50, 112, 4, -358, 1, 54, -123, -122, 113, 104, -421, -234, 385, -35, -565, 202, 401, -425, 246, 501, -144, -232, 398, 28, -275, 261, 109, -283, -87, -141, -193, -39, 68, -126, -104, 91, -16, 202, -149, 7, 153, -18, -451, 159, 221, -321, -175, 301, -267, -342, 515, 248, -467, -3, 233, -340, 9, 197, 289, -240]
5620b40K88J66k28k52L02J32o7l35M73O9p27L36M18l77n54P59m0n27N04J04l53
5641a49j92O67k83l13M61n5k68k28L98J12j63q9K80lm50K84M35o00q5K70j31j50
5663b52L92j85k69K82L42n42K64L28k37l48K52Q7j53RpM16l69j48J85K70l73j93
5685b49M28k30k66N65k25l67L26M74r21L87N41p79n7M88p2k19p4M12R6j62l06
5706b10O0L36j95l78P60k89j51M3N2k42J67K40n26J22N56n83o2K77K63k43k06
5727b09J44K09M5k67P0J91k68lJ37J03k34J60M8k67K38J75p80N15K99l91k75N32
5749A72m8m96L69R4j33O7J18n5lj04r6Q7J35L6j60j3p0J90o4m39L74L89n95j16
5773c61P16j78n20K02L15j57j55J67j61K59j26k39J92m5K28j68P3r7J45R9o40
$$ y = [-240, 48, 214, -14, -266, 36, 168, 101, -234, 239, 308, -419, -83, 335, -42, -596, 163, 123, -404, 100, 204, -149, -341, 326, 43, -270, 191, 136, -132, -360, 38, 150, -13, -102, 178, 175, -275, 9, 444, -156, -241, 29, -102, -252, 140, -45, -314, -32, 310, -232, 32, 360, 123, -225, 27, 114, -39, -30, -37, 379, 10, -138, 47, 317, -56, -249, 179, -51, -317, 248, 23, -344, -18, 456, -465, -78, 463, -316, -373, 115, 43, -176, -250, 162, 258, 96, -210, -150, 186, -9, -387, 373, 84, -67, -24, 28, -214, -47, 193, -333, -211, 345, -238, -300, -23, 240, -3, -209, -65, 144, 189, -78, -8, 183, -85, -88, 49, 152, -82, 78, 126, -141, 97, 272, -508, 7, 306, -85, -360, 172, 124, -372, -3, 91, -42, 25, 143, 88, 85, -19, -115, -28, 107, 143, -17, -30, -100, 90, 26, -413, -39, 350, -245, -361, 355, 177, -343, -141, 174, 17, -138, 29, -132, 127, 1, -238, -46, -91, 137, -31, 42, -55, 90, 189, -451]
5794d51M84M15o44q5O66j1q16L40M31l73j28J69J77K7ml23J5M13k43j07j12K25
5816F5R7k01l85N55L51r26j01R67l83p29N94L13k81j74M19j27N6p9l21K3M75m5
5838A63l49J05K75j7o18J61N64j99l40n8Q31k15o64L52L53m50Q1J32k65J10K33
5859A85l25k88P13j85n12L83L16k33k80N2N09j76p15K99P90m49q17R43J74n49
5879a65Q7J03n9R7L1j47j63M71P5q63N49N15n39k95J63M95j89m83Q6O44l27m76
5901c90M27K95l89p8K37j97K20K37m90k22O88n3q35N27O72j017K9L68L02m84l72
5922e25N80N25p30l05O92j1l73L1L3J2O5M07p45N0R53o05o50P76L55p59k31Q32
5944C77K27r39n0L37L79l48k33M10M9k59o1J23lK15j17m20K88N14n44o66J052
$$ y = [-451, 33, 448, -196, -281, 385, 374, -442, -102, 329, -44, -172, -3, 174, 201, 197, -126, -111, 302, 59, -48, -160, 65, 162, -39, -424, 131, 482, -444, -545, 422, 39, -690, -96, 217, -64, -238, 181, 54, 110, 31, -290, -267, 208, 163, -186, -81, 194, 177, -441, -280, 284, 85, -255, -313, 518, 303, -361, -9, 344, -106, -25, 107, -158, -48, 185, -140, -428, 285, 100, -412, -29, 287, 54, -226, -174, 335, 159, -556, -257, 533, 84, -733, 210, 384, -165, -78, 25, -34, 63, 94, -53, -216, 255, 330, -533, 16, 531, -8, -303, -140, 355, 166, -317, -231, 413, 86, -390, 37, 332, -57, -135, 102, -95, 125, 362, -128, -350, 338, 285, -550, -23, 649, -368, -339, 29, 331, -153, -525, 55, 580, -150, -455, 237, 226, -147, -116, -83, -71, -6, 401, -344, -294, 659, 54, -596, 180, 535, -224, -455, 377, 604, -335, -385, -48, 331, -17, -250, 160, 209, -50, -111, 12, 9, 224, 107, -313, -25, 489, -55, -721, 331]
5965C31K40j162K35Q25j63m52N4K27K7j71r9K72l8N6m04J67L0J88m0n30N75L81
5987E49o68m67R65K20j185J71J095n54n89N29K13l12p4N4j19K70o8j87J01L47
6007B91j06l39k02P47K3q24R4Q91j51r75L34P96p43l30M33L30l09Km2ML46j5n81
6030c26J66O81k16n38Q4O20n7j029J12J256o81o14L46Q55q53k05M94r3l1K46l74
6051a57k00O50k41o26L49P71n78l55M49L43j74q18L71P04m41n04M39O21p21k13
6071c31M72j8n6j33q4j67P12k81o62N31O74p43n50Q73K87n24k59M94L91p10k41
6092c25K75O41p76l96N55P8j40L04o79M58O29p41n50P77P03j122l82R65J41o54
6112b39m7M34J95n46N5J37M26n14p8J26P3J3N8l30J37O06q13l24P18N43j222j4
$$ y = [331, 571, -591, -356, 469, 306, -146, -92, 135, 162, -9, -108, 164, 126, 182, -222, -55, -25, 163, 123, -407, 168, 549, -119, -586, 379, 599, -586, -415, 680, 126, -463, 66, 279, -33, -107, -53, -172, 98, 30, -157, -56, 291, 185, -154, -356, 391, 414, -410, -316, 575, 424, -551, -217, 579, -164, -494, -61, 269, -40, -38, -80, -76, 270, 255, -326, -160, 521, 305, -233, -149, 471, 414, -615, -503, 753, 72, -542, -196, 659, -194, -399, 95, 2, -29, 217, -157, -357, 293, 52, -574, -225, 546, -32, -387, 62, 405, 231, -587, -216, 488, 47, -457, -18, 603, -118, -331, 141, 123, 67, -66, -150, -317, 395, 114, -548, -17, 657, -86, -636, 237, 524, 0, -259, 235, 626, -84, -325, -50, 591, -185, -581, -26, 52, -88, 216, -463, -5, 624, -117, -667, 110, 813, -309, -691, 274, 415, -239, -286, 148, 343, -203, -148, -11, 415, -99, -177, -51, 22, 35, 93, -237, -100, 506, -307, -631, 87, 630, -592, -606]
6134f06R20L7o04J04M81p0k52k54K88M61l85l17N1L68p2k98j79M54K02n12l15
6155d98P74L77j155K56P13k81n57K66J65J13R5m80K1N39Mp47L84K77p9l58l1M14
6177B12q8m40j23J039j75r12J83P92l54l31K35K30k30o1k13k7M53J03o59K28P34
6198E96m39l43J40N9J09m32Q7O19j04o48J87O41n94k45J12M82m00K43q4p4M27
6219C39k32r09O80O46l22o83M60L88k65n54L11N46l15n59L64N10n28j33J88J89
6239A21j31M7k20M7K10j35m61N73M35q29o2N46J73k93l11K33L65k69k50k3M47
6260B13j53m04M17j49L42k04k34J46M75n19n47Q09L32q25j04O98j96k51O5K10
6280A21J16p6m96J75M75l97j18J74K03j44K8j90L98m8j55l88M27K51p17m9Q18
$$ y = [-606, 314, 351, -253, -149, 332, 262, 10, -244, 44, 505, 120, -197, -146, 222, 150, -148, -327, 127, 329, -183, -498, 276, 653, -502, -246, 467, 186, -371, -105, 60, 173, 268, -212, -191, 348, 352, -395, -11, 266, 187, -171, -202, 212, 124, -316, -439, 600, 425, -487, -304, 488, 134, -197, 38, 268, 38, -23, -236, -263, 190, 293, -366, -138, 596, 157, -186, -46, 13, 122, -310, -223, 396, 292, -356, -169, 472, -122, -367, -255, 227, -173, 70, -14, -88, 339, 107, -802, -122, 524, 202, -481, -21, 367, 102, -452, -141, 405, 90, -469, -105, 405, -123, -256, -68, 121, -10, 37, -183, -136, 74, -61, -522, 51, 486, -343, -405, 141, 314, 21, -290, -57, 308, 39, -211, -234, 213, 60, -344, 73, -76, 266, 62, -172, -26, 449, -70, -617, 192, 524, -301, -405, 293, 97, -154, -89, 121, 237, 161, -335, -160, 315, -82, -200, -26, 177, 33, 61, -129, 269, 221, 66, -322, 105, 356, -361, -410, 408]
6301D08J2o65J02L19l8j25j26J32L10l06l57K60L11k90r0n1M33J61n08j60M16
6322A48L55q12J30N03j95l97L82l0L5p3j65O3K63j88n34M33L93k98j91MK43K50
6344C19l57l90O91rp76J98N54q7m83M76j24O2N4l01J42K91j65l80K12N75n47j56
6366b01R6K42j85M5j88L11K2n49L33L62k34l63L97J0L4r8j75kL59j28l78J64K71
6389A45l54m8L93Q7j64j61O3J02J78m01l6O05o08K0J86P6jj58P1l38N90p3l45
6412a71n8N54m24k69M23J29k67j69J99L75j50m83K03M59n62L5L37j7k49jK67j74
6434a3J02n5j98JL61k23k44K58K11m19j05K77K04p3j74J24Q2l11Q2K12M8j66O8
6457D9P5k11J96j10r8J0L75m38l6K81K73m88J8M85l45K0j14q1M05l05j25K01K40
$$ y = [408, 420, -245, -143, 176, 138, 13, -113, 19, 329, 23, -334, -74, 237, -53, -143, -194, 239, 400, -108, -268, 148, 503, -309, -179, 324, 129, -268, 114, 84, 119, 46, -119, -56, 207, 19, -515, -82, 311, 13, -178, -174, 69, 319, -38, -428, 263, 254, -522, -324, 230, 143, -340, 136, 12, 74, 128, -173, -31, 260, 95, -285, -73, 502, -45, -201, -105, 137, -48, -3, -191, 120, 142, -407, -74, 288, 54, -309, 88, 98, 132, 34, -141, -143, 216, 88, -290, -126, 145, -209, -257, 136, 223, 59, -102, -39, 63, 241, -160, -196, 409, -199, -179, 7, 83, 82, -76, -5, -343, 247, 174, -171, -229, 325, -99, -368, 55, 184, -83, -252, -53, 322, 172, -311, -108, 351, -211, -176, 161, 144, -105, -106, 161, -13, 89, 34, -164, -163, 198, -25, -269, -11, 200, -219, -324, -47, 157, 84, -90, 34, 116, -195, -113, 99, 147, -19, 49, 124, -87, 109, -1, -99, -89, 286, -152, -188, 93, 366, -122, -104, 381, 36, 56, -58, -139, 266, -39, -164, 37, 277]
6480B77n86L25o1p3K16L3l77K37L86l66l46N78Ko23J99M78l46k07K89Q1N0j68
6502bL0j81K91l88L13r4j97K47q6k19L71J51m32r8N70j01o25L58K94j86N0n5P4
6525H5j19p7J15pJ08j44j82KJ77K23l71N0K16K14n19n0M93j00n28M65M04n18q
6548g1L80k51M0M3M7m10J97J98k44rj0J39j42j35M15P9m22p2N60j41n80M67K00
6571B78l70j79N21l50Q4J8j68J37O3r2j90J59J09Q0j11m2K21l0m06J92M76k59
6593A41l59M43n3n85L99K66j75k10L39m33RL06L7m47J01L65K3j58r1K80k45j95
6615b42K5M65k94l69N07j8k56J11K43j70j73M53l86j66L91L8m08J50L24m16O5
6636a26J35Q3j27j24J27J2j45p3L09j34j40L45j72k46J47N22l97k13O28l18k98
$$ y = [277, -309, 16, -45, -118, 98, 131, -246, -9, 377, 11, -335, 243, 245, -378, -179, 299, -47, -254, 35, 116, 166, -2, 28, -153, 138, -250, 63, -31, -228, 19, -67, -286, 85, 236, -196, -294, 276, 175, -450, -92, 202, 16, 66, 11, 85, -34, -111, 4, -3, 105, -39, -221, -219, -42, 181, -190, -140, 76, 290, -229, -279, 214, 114, -414, 51, 455, -63, -71, 309, 58, 98, 141, 188, -222, -25, 173, -71, -80, -90, 49, -93, -228, 187, 266, -156, -228, 332, 191, -389, 78, 278, -92, -271, 250, -100, -16, 2, -166, -29, 34, -58, -248, -89, 20, 100, -11, -53, 168, 138, -268, -76, 400, 141, -218, 225, 172, -413, -14, 252, 77, -133, 206, -227, -218, 88, 125, -322, -221, 144, 167, 9, -82, 198, -47, -242, -217, 248, -46, -415, 92, 74, -182, -71, 172, 2, -171, 282, -104, -270, 121, 159, -249, -99, 225, -191, -126, 9, 92, -35, -159, -32, -20, -165, -238, 71, -63, -203, 142, -30, -276, -129, 393, -4, -217, 411, 93, -205]
6657b05K15J65l30l7M33m2m14J22J65J24m51K84J41k72J39J61L8o38M50L31m45
6678f6j46M09j64l85L79K00l01L5K51k53j11J94o4j33J52p8L4J20j70jM7o8L8
6701h1N46o45O8L96m86k13N33J05n37N08J7k84j66N88k27k85J21J34k04j6L00
6722A72l7l87O5L51r7k31j21O23n30q8M18M9m91K37L43m13J2K78j87j90L40n5
6744F1k28M4J13Rk7j9OJ33o0J12l9l11J15K10p8k67K67K42o12J88M37m86QM81
6768B99j70l56J46J91j14R3j33J18n5k36K64k2q8n5L40m32Q1L01J77o18N9N00
6790B90l75j58N67k84l02K70L9k47J37J61j43M5J70k03j35K24k13J21j42K68N1
6811A41M5m65J29K04k75n0N55j41o35N82m6j41p7J31K6j79K80p5j19L00j27J05
$$ y = [-205, 10, 175, -155, -192, 241, 199, -215, -93, 72, 196, -255, 29, 170, -102, 37, 198, 236, -402, 48, 379, -66, -212, 197, 33, -352, 27, 227, -74, -39, 212, -41, -152, 42, -22, -155, -3, -81, -47, 73, -97, -98, -51, -119, -81, 465, -180, -112, 284, -202, -415, 118, 223, -314, 194, 211, -73, -239, 349, 122, -163, -42, 92, -112, -128, 172, 135, -252, -187, 164, 67, -164, -285, 338, -192, -280, 138, 187, -304, -67, 276, -137, -125, 153, -34, -224, 116, 61, -167, -123, -10, -1, -28, -47, -41, 92, 32, 144, 105, -206, -91, 119, 41, -226, 41, 283, -329, -141, 296, -190, -182, 299, 129, -227, -81, 110, -4, 89, -44, 74, 19, -217, 47, 25, -63, -118, 222, -210, -129, 172, 349, -269, -210, 290, -85, -243, 324, 40, -262, 8, 47, -200, -63, 98, -45, 0, 170, -33, -168, 56, -157, -36, -178, 90, 141, 186, -279, -150, 54, -221, -271, 284, 143, -492, 90, 44, -97, -174, -43, -17, -196, 84, 9, -110, 190, 63, 168]
6833A68k66R0J60j24k40J32O6k32K11J47N6k08L11k23k91L16K40o86M07L29l81
6854a8k40K18J68l22J45M6l7q5p2L37j11j72K9L99l65O2R2n2k22N25n1l98K57
6877A33J56k40j50N2K66l32L53k22j04K38J6j89r6O7J10j55J82j89K11j10l61
6898c64N68q3n17L49M03o42L59N5nk69J86J55j96j1K73m17K9m2K99k00j58J40
6920h8O1%j15J54l9J9q8J64k51l8L46o5l04J18K11q4J63j22r5J28K3j50oJ72j32
6945a8p7J05p0J58j12l7P8j32j26K93N9m10K76J66J89n79L79L2m45K35J81j69
6967b4P7K0m5j45J82o5lN1j31O6J17j92K9J98k17NK11k93RL73l5n49N52qn14J63
6993a68K39j6p3J95k11q9J13P9o4Q5k14K9L69m13J75J21k00j27K64q8k24L27M7
$$ y = [168, -98, -8, 152, 28, -212, -80, -14, -246, -35, 112, 168, -40, 271, 48, -243, 73, 313, -373, 34, 363, -18, -258, -40, 128, -194, -49, -3, -40, -125, -197, 140, 29, -143, -114, 285, -80, -18, 74, 22, -200, 325, 274, -124, 133, 289, 49, -101, -49, 217, -115, 238, 16, -88, 150, 166, -23, -119, -52, 58, -97, 85, -104, 107, -3, -364, 204, 121, -396, -47, 356, -286, 73, 128, 123, -146, 40, 195, -1, -12, 261, -156, -127, -169, 130, -70, -228, -88, -27, -27, -142, 12, -27, -8, -96, 68, -183, -221, 125, 60, -244, -126, 85, 1, 164, 42, -53, 75, 98, -52, -58, 114, -18, -95, 10, -60, 98, -14, -51, 27, -105, -231, 62, 121, -289, -13, 153, 342, -237, 142, 174, -271, -36, 145, -24, 53, 73, 28, -117, 65, 0, -3, 48, -83, -17, 100, -92, -63, 135, -82, -77, 134, -159, -150, 223, 188, -361, 191, 183, -331, -168, 71, 55, -18, 177, -34, -123, -10, 69, 5, 90, -124, -95, 274, -139, 36, 157, -43, -170, 94, 6, -218, 109, 156]
7016A56m83L00J62k59nL87j50l05K47Q8o0Mj32q3L00r2k38K32j05l5K83j94R5
7039A13p5J52m48%M58k50r6K9K40l24J94K20j91K07j32j80N6k0J0l3M9k40M28
7062A67j36j67K31P4m41K23L74l14k06M00k89k2J75O3j67J2m3o4J22P0j5o1R9
7085H5q1K04k60j7R5J61n24K29L16j43k67L53m8k42L29j79J61k42K7RM6m2L2k52
7109b50J42m5K16m9p8Q3j44p7K24J15j59j59L76Jl83J68J68m98L08L86k87Nn8
7132El1J23J57l28J00j67J64j13K08l50K28J33j41j84L92k65j20N09j56k33o2
7153a31K53k75J43J33l98N0K89J07m84K03P3K8K5k60L51Q5n7l05L17j0k49J66
7175E4J17m75K76L38m73m6L79j3l88M33j40j2n1J45j26j09J01j8J02p3q0K41l8
$$ y = [156, -327, -27, 135, -124, -129, 258, 108, -197, 50, 138, 78, 82, -50, -133, 167, 75, -163, 69, -36, -71, 212, 18, 113, 38, 190, -258, -258, 200, -50, -146, -117, 123, -201, -7, 213, 22, 229, 97, -83, -27, -47, -37, -70, -21, -261, 167, 31, -136, 95, 169, -272, -49, 325, 11, -195, 205, -84, -106, 69, 132, -35, -23, -66, -130, -8, 62, 47, -14, 85, 4, 208, -52, -69, 26, 187, -337, -108, 208, 65, -202, 151, 103, -139, 190, 11, 172, -70, -43, -34, 12, -30, 2, -250, -108, -153, 63, 14, -64, 19, -125, -202, 22, 137, -22, -181, 195, 196, -187, -19, 149, -349, -41, 345, 58, 63, 5, -26, 97, 254, -74, 26, -141, 23, -90, 118, -232, -4, 129, -12, -196, 196, -69, -189, 320, 164, -69, -131, 122, -153, -10, 123, -275, -225, 64, 171, -313, -110, -37, -9, 16, -244, 107, 192, 135, -170, 147, 137, -112, 54, 171, -304, -28, 310, -163, -209, 170, 157, -231, 202, 62, 50, -1, 144, 18, -91, 10, -8, 94, 21, -59, 182, 144]
7198A44l26K11L58m28M4J87k62l82N22j65L4K43K1m32K58J75l57J73R8j35M7K3
7220E1j72J81j65L7K24L0o57O42l8m31J75K73k25j64M65k33k39K32K09j48j69
7241a22Q5J38k06k5J41K25j20j41J67j71j53K33J57l92J48L40l56k2L13n7o31
7262d49M87K40m53N3L70l19j47K83qnj44m4OJ47j89K12n9j03J04K62k87j14K79
7285A22j8m03N74j2l54n3K69j80k5K06k40J35l6Q8L1m3J96k00P6l56M04K2n04
7308c01J76L99k55l92M86j78l00M60K13m13J1J62O2k91M41j47k39J41p4j99Q4
7329a54J54J07L9n00L32N1K4k63L56K40p60M7O23l45j41N10j82m62M01j10j13
7350a46K90o9j23J9J89j78J30j53j16J48P3k45K56J7k74J40J62k89K2J74N9j64
$$ y = [144, -182, 29, 387, -41, 3, 190, -72, -454, 68, -97, -63, 180, 201, -231, 27, 202, -155, 18, 116, -19, 28, 51, -121, 60, -105, -68, 156, 186, -471, 171, 133, -298, -123, 150, -75, -239, 226, -7, -246, -14, 195, 47, -122, -37, 101, -105, -130, 11, 236, 116, -25, 142, -29, -182, 51, 208, -184, -36, 304, -52, -74, 239, 182, -449, 38, 278, -175, -122, 248, -71, -218, 65, 57, 52, -92, -136, -130, 17, -172, 40, -19, -122, -18, 244, -43, -157, 122, 104, -299, 275, 263, -91, -144, 125, -55, -80, 126, -114, 21, -15, 73, 104, 61, 257, 57, 133, -223, 181, 203, -301, -125, 274, 19, -373, 113, -65, -365, 95, 308, -105, -94, 68, 130, -161, 280, 133, -106, 35, -39, -238, -154, 0, 107, 146, -354, -22, 29, 53, -210, 146, 386, -374, -327, 296, -49, -190, 320, 138, -324, 77, -33, -146, 144, 75, -48, -29, 160, -18, 112, -41, -157, -9, 64, -181, 75, 92, -182, -42, 120, -169, -147, 27, 86, -78]
7372g8M37j90m44J60L20k55j39L48m6l52J04J96jj28j03M19k35j25L07M2m01P0
7394i4L31m75j89M43j16k11L69J13k23k1K06J2k53J54p2J20k77K01kK3k10K70
7416I9L4k44P6K58m38J1M34l44j67N88J6m48K8L96l98N0K77k99N4R4J32k53J67
7439A23j42J27j50j50L16o2l11M1K76j12j25L75Ll33OL54m53j5N54k79j98M5P7
7462c3J79k83K09m6q2J93l17L6J04l0J41l7k38K07J52j83j23M47m56J16K71k88
7484f1m4K17j02j49J75J09j62J32k04L0R6j48J04J59j41j55L17j78k47K28j2k49
7506b85K73J20m0j87J57j24p9J88Q3k16O1J24JL0o3n9Q0Q1l34L04lk63L80j85
7530D4k40K33Lk32K09J13j25k06L05j38j21J96J13j94J29P1k12L6o5Q2R4o0j30
$$ y = [-78, 359, 169, -275, -115, 205, -50, -189, 159, 113, -239, -135, 61, 60, -68, -171, 248, 13, -112, 195, 237, -164, -94, 237, -238, -427, 16, -100, -311, 58, 171, -52, -73, 133, 145, -108, 46, -26, 94, -183, 18, 16, 39, -171, 99, 133, -111, -35, 223, -215, -204, 230, -114, -281, 307, 323, -125, -97, 299, -99, -49, 228, -71, -17, 77, 209, -44, 123, -19, 108, -42, -192, 124, 62, -249, -208, 68, -44, -169, 206, 209, -124, -118, 236, -217, -232, 322, 43, -155, -110, -33, 146, -137, 72, 26, -56, 137, -180, -144, -40, -70, 71, 34, -204, 3, 155, -28, -151, 296, -160, -44, 227, -61, -105, 112, 10, -139, 36, 145, -17, 115, -89, -59, 37, -111, -7, 152, 11, -144, 173, -5, -252, -24, -36, -285, -12, 108, 68, -119, 38, -86, -165, 23, 106, -110, -49, 75, 76, 106, 43, -16, 64, 145, -189, 115, 112, -151, 229, 44, -196, 37, 40, -192, 17, 130, 5, -201, 104, -34, -155, 41, 154, -40, 89, 160, -52, -16, -81, 1, 95, 35, -95]
7553i5K02j32j67N8L48k20o6J50p2K8J2k8l05J09L43n69O28j68k57M9K70qq9k03
7577a82L6K64j71K73k82K25j49j19R6R5M1J5j43k75K96j7k69K76L74m70j68N22
7599B68n14J12K45K64l79j11K65l01K72k39K02j28J57l17K34jJ4J90p8j48k1K51
7621B37l94j5M73l98P2J06k09j21L11ll39K92R4j98j6K06k12K26l5P7j95J88k93
7644a46J16J68k76p1L94j34k25L59k27p0J75Jl09N7K88r9J4J30j98K17r3j06J47
7667A12M5j71K0J55j52r8K45J5l28O9J50l74M77j87j52K14J70k64L8J24j32M4
7689B0j25J41j2p5j78K53J85k92r8L01k43J60J02j46J0R5J89l92j03L81k37j18
7711a82L51k72K0J51P3j47p3j44J62K05r2k13K40K6l40L64Q3l50J49J50m94K79
$$ y = [-95, 107, -25, -192, -134, 214, -6, -72, 78, 6, 34, 46, 18, -287, -178, 165, -404, 224, 56, -201, -152, 118, 110, 21, -182, -146, 118, -53, 220, -62, 163, 14, -105, -9, 86, 127, 142, -1, -276, 20, 3, -266, 10, 384, -86, -254, 268, -246, -134, 111, 375, -4, -115, 150, -151, 121, -118, 84, -44, 113, -204, 30, 29, 43, 233, 155, 7, -14, 237, -157, -172, 301, -97, -25, 81, -128, -249, 62, 59, -280, 12, 106, -92, -108, 98, -114, 112, 77, 154, -41, 147, -146, -30, 138, -138, -209, 185, 51, -174, 185, -42, -112, 63, 64, -245, -188, 100, 1, 15, 145, -53, 164, 71, -35, 112, 157, -14, 6, 161, 9, -89, 156, 171, -157, -88, 62, -312, 165, -22, -174, 40, 210, -54, -16, 108, -24, 20, -105, 36, 24, -51, -229, 24, 209, -83, -181, 120, -123, 37, 139, -7, 3, 98, 287, -105, -208, 173, -64, -182, 169, -103, -83, 68, 141, -6, -79, -223, -61, 144, 52, -161, 79, 105, -235, 129, 212, -138, 11, 161, -333, -54]
7733e4L51n02L28mL8l94J22K75j24M1o0J71j32k0j42K00k0k73J70K7m1K06j69
7756fm0K95j0m58J14J77j85j6J62J62l39J5Q7k4Q7j47p0L92j11k62L02J02k94
7779f7J38m4j01R1J48l36L8N74n13j49K85L4k39K37L9k78K56j61QL29j80p2n4
7802a7P1j2j09Rj88L13j56j41J00M32j74m26N01J17n92J21K56J0o4L4j98j3K50
7825A24j88J16j12K09k44N2L0P5J40m24O8M49k79k25L72J00m57J5M53k96P8N9
7847A15k03M3R3j80K7K46k15J8n6J9K53j84k18J46L65j92m02N07r4l89K35J77
7869A11j78O8K6j68J50rk13J39L60l27j61K49n2R5j82j31L64K35m85OK96k1k61
7892h9N7J89j33k31K27k29J49L82n27J37M01l6n41K07J72J46n09j0M59n0m38j15
$$ y = [-54, 297, -205, 123, 119, 157, -237, -115, 160, 36, 77, 17, 188, 56, 36, -106, 94, 74, -199, -29, -2, -43, 163, -6, -46, 249, 239, -219, -105, 72, -113, -129, 33, 195, -144, -129, -42, -66, 21, -126, -196, 196, 85, -177, 125, 227, -67, 71, 27, -74, 17, 165, -171, -133, 441, -72, -221, 64, 98, -141, 96, 135, -143, 113, -48, -40, 289, 109, 37, -17, 54, 42, -67, -58, -246, 67, -89, -230, -130, 302, 128, -298, 203, 320, -272, -151, 105, 115, 51, 85, -113, -126, 124, -64, 52, -60, 149, -95, -43, -13, 62, 202, -222, -154, 295, 16, -209, 163, 263, -194, -179, 274, -22, 56, 115, -88, -45, 48, -132, -105, 141, -74, -56, -112, -93, 160, -24, -242, -96, 269, 77, -325, 182, 88, -301, -66, 111, -67, 1, 27, -141, 9, 0, -213, -74, 286, -41, -202, 47, -5, 90, -92, -223, 141, 376, -109, -103, 193, 172, -89, -32, 157, 24, -207, 20, -209, -60, 322, -205, -68, 333, 297, -244, -37, 135, 281, -228, -238, 221, 171, -267, -382]
7914c82N51J23o33K98K14r9n3r0k62M40M0k81J25K50j88m54J49N86m26J0N2K05
7936A75j32j59N9K30P1p29M78L5m8J82j48j83K91L71q38O3L77k59k65M94K82j54
7958A93m66L39Q2j84j63J83J79Mo62M06M33l86l1P9Nj3J5n63L55N12m29l86O37
7981A39K52l76l00N01k06L3l02K60J46L3k86J80q6N8k2r8P3J44ql89J62O04m06
8004A06l51L80K56m90j50L88J9n6r8O9M2k2l86K89L31j22j28j06J88j37k1j63
8026a62M8N64o00j35K06K86m49j93N60j34j95K9J0L08j04j11q1K57j10k5J19M5
8048A33j07J10k71K28L56m66l79N24J62m93n0O63n17j60L25l8O3k78JJ5M87k81
8070B7j17O5J45q4j39j5L17Q0o33K2N10J58o75n7O73l22q0J71OQ7j81j2j47N67
$$ y = [-382, 169, 292, -341, -43, 171, 72, 19, -71, -333, 107, 147, -134, -9, 241, 53, -401, -252, 334, -92, -82, -30, 175, 43, -116, -57, 173, 244, -485, -7, 28, -20, 162, 14, -169, 122, 493, -345, -282, 95, -164, -429, 65, 347, 193, -273, 66, 148, -36, -199, -16, 163, 167, -495, -89, 344, -42, -73, 6, 11, -2, 13, -550, -195, 317, -112, -498, 139, 391, 15, -285, 216, 10, 43, -259, 1, 147, 180, -106, 74, -12, 46, 24, -74, -1, 143, 135, -254, -92, 512, 106, -245, 135, 391, -99, -249, 139, 158, 102, 4, 73, 115, 93, -293, -4, 327, 205, 77, -29, 159, 22, 1, -162, -114, 450, -150, -285, -79, 207, -242, -435, 125, -9, -204, -175, -165, 143, 39, -72, -153, 104, -6, -31, 88, 133, 26, 136, -135, 93, 449, -17, -396, 128, 290, -203, -253, 410, -107, -267, 58, 20, 83, -195, -194, -179, 308, 27, -90, -25, 120, 36, -103, -118, 199, 279, -354, -332, 178, 336, -339, -396, 277, -45, -125, 46, 52, 139, -42, -54, -201, 366]
8094C66r8p22L95L77l81k85K19K85q1k43K7M21k66j32r5M69M9n20J07J64K6Jl76
8117b93J19L40q4n32K98M43k59k93L35J24J8n33J25J97J78m51J87L60k51k67J5
8138b24L79j19J30m80K07L16j42n08N28K16l74k24L34L67j78n80L75K9J58m05
8158a95N0K18l4j65M7N9l0J79m60K24K54o1l28J66M63o27l1N34J18l79j01PJ36
8181D4J11l88J00K93j08k86k3L27M8k31
$$ y = [366, 268, -454, -59, 318, -63, -348, -129, 156, 75, -168, -141, 280, 14, -118, -213, 256, 305, -215, -108, 56, 82, 83, -293, -174, 166, 82, -450, -152, 291, 32, -261, 74, 198, 216, -317, -192, 5, 183, -268, -81, 279, 28, -239, -224, 155, 36, 166, -314, -107, 209, 67, -441, 87, 303, -71, -295, 39, 406, 228, -352, 23, 52, 210, -195, -145, 73, 39, -126, -79, -20, -50, 129, -331, -107, 147, 86, -242, -76, 387, -240, -271, 263, 381, 2, -99, -92, 44, 155, -233, -133, 160, 52, -234, -257, 70, 118, -113]
8191a13
$$ Imaginary data points
##PAGE= N=2
##DATA TABLE= (X++(I..I)), XYDATA
0@%%%Qj6QqK4l2L4m2N6p2R1j10J31j60J95k29K61l07L63m18M78n50O32p17Q13
28D33r23J042j171J314j472J643j832K040k268K520k795L093l425L795m201M648
44B441n148N717o360P086p924Q907j0075J1478j3205J5408j8314K2322k8224L7782
58B1891n5729J00239l92530n78150J309914L28645j092630j77886Q68903q6324
68B46343n36034L01087K61930n28789k495O71894j54046p69536K49158P61033
78E00545k49993o84137K07160N27959j14621l50029K0213J74085P0596m9925j17117
89f5264j7633J12139J3266l8344L9539q4331j21125K38028J99685l89493k50435
100c63968N22293K54819o19565k07269O75900J05860o85604M1061O46635k17821
$$ y = [0, 0, 0, 0, 8, -8, 0, -8, 16, -16, 18, -24, 32, -40, 51, -59, 72, -88, 107, -122, 139, -168, 195, -223, 255, -295, 337, -380, 433, -490, 552, -619, 695, -777, 866, -966, 1074, -1194, 1326, -1469, 1624, -1801, 1994, -2207, 2441, -2707, 3010, -3350, 3736, -4188, 4719, -5356, 6122, -7083, 8325, -9989, 12333, -15891, 21891, -33838, 66401, -326129, -904279, 405635, 734280, -358350, -536236, 332667, 246343, -289691, 11396, 273326, -255463, -257958, 413936, 259890, -509646, -260488, 500545, 250552, -433585, -226425, 301534, 186913, -163116, -142903, 31182, 101778, 51853, -65264, -82897, 29242, 42508, 4164, 43703, -40628, -161753, 76275, 275960, -113533, -363968, 158325, 413144, -206421, -413690, 262210, 368070, -317534, -276473, 370162, 152341]
110A52341n57003L99280M19681n50250k42219O42304M1137o58412J60835N98614
120D06308l36869m81551M65306L31559n34908j74198N44608L0948m99392Q4525
130a63664M07709j68159k81257K18389J37745k36666k583K22537r9675j81053
140a46677J50189J24935j40434p3778P4110M3792L2796m4265j53661O9816K58833
151A95656j09230l25444J51287L39842j87123l00420K12549K11135k25853q1558
161a19159K28432p4904k18402K35367J93901l72676j49407M59161Q3951m77227
171b10963l893M24395p7622l12037J48533J62699j99488n942K30484j30111k43254
182b17199K25305K37258k71274k10733K68941J63768k23760j00730J45459L1228
$$ y = [152341, -404662, -5382, 414299, -135951, -378170, 264134, 305271, -353141, -192306, 406308, 69439, -412112, 53194, 384753, -150155, -324353, 220255, 251203, -248189, -163664, 244045, 75886, -205371, 13018, 150763, -85903, -88486, 134051, 34376, -146677, 3512, 128447, -11987, -85765, -11655, 32137, 64933, 20668, -132993, -63177, 195656, 86426, -239018, -87731, 252111, 64988, -235432, -22883, 188252, -37601, -119159, 109273, 34369, -184033, 51334, 245235, -127441, -276848, 182313, 266264, -210963, -214856, 209539, 131917, -180120, -31587, 131112, -68376, -74318, 156166, 26055, -217199, 8106, 245364, -25910, -236643, 32298, 196066, -27694, -128424, 17035, 48263]
192D8263m5108L2429o0563p7392J49646R2765k01345p6060K04674L2542j61478
203f1627K4821Q5093q0162N191J23600r1062j49060J56527J53067j92939j32839
214a59390J99707Q6160j81460j5631J42663o8018q6875J48060J9684k07647N1256
225g1491K32745j13392k18571J54304J69695j68001r8408J56909K1979j28663
235f2894M3920R2728q9980n5218J14059J8692j16266J4634R7661m4187n9002O7625
247B1772N590q1023N2511P9268j00215o0397J25023K7160j21325J2019R0935m5802
259E516m4400O8135o773p7271N0163P5607p8179o4197Q9897M1597q7379q485P5234
272C9465l4481n5696Q0639K8548j20352L519J43999l4090j44390N5440J18836
$$ y = [48263, 3155, 35584, -24979, -102371, 47275, 140040, -61305, -137365, 67309, 99851, -61627, -36806, 48287, -31875, -26684, 96916, 5854, -143206, 13321, 166388, -26551, -159390, 40317, 126477, -54983, -70614, 72049, 4031, -82844, 65216, 84900, -122747, -71491, 161254, 47862, -170709, -16405, 153290, -14711, -113119, 43790, 65769, -62894, -18974, 73754, -16226, -71444, 42615, 61307, -54959, -40325, 57336, 13149, -45853, 21772, 27362, -53661, -1150, 78118, -22097, -82494, 42529, 69689, -51636, -39617, 51318, 5516, -38884, 29251, 22478, -54793, -4630, 70977, -7202, -71399, 18498, 60095, -27284, -35769, 39465, 4984, -50712, 29927, 58475, -61877, -58358, 85641, 51551, -92839, -37399, 81437]
283H1437o0912p3465N0627J9729l0976L0133Q916o7175Q575Q9158j8849r6220
295e9022K3183Q9250k4734o8093K7414L3412l2203R135L7417n1631l6986Q2912
307C0054L0204r4317j8938Q3550P528n3897o15J4638k154K3734L732n1435q114
320c6030O5692J5411o7615k2012O1459K3855m9793j8633L3472N936j2337Q946
332H351j0038j9820K8339K1950l6162j3641L0208j856j2457J6052r843k6433L0323
345D973L1250m3191l2420M5674L2517m0731l0007L2681K3483k6842j0314K2080
357I153q283j6628K7995P611m3259M416M8896j5180m3272K1719K8325k2044j0923
370a1474J9163k771j7216Q876J9529r440k6645Q399L6062p442m3580P861M4977
$$ y = [81437, 20525, -52940, -2313, 17416, -13560, 16573, 25489, -41686, -33111, 56047, 37198, -59022, -35839, 53411, 28677, -39416, -12002, 21410, -10793, -1658, 35759, -15872, -52858, 30054, 60258, -34059, -52997, 30553, 38081, -15816, -16431, -1793, -3947, 19787, 23519, -27916, -36030, 29662, 45073, -22542, -44554, 16905, 40760, -9033, -27666, 5806, 11742, -595, 8351, -1687, -21507, 6832, 28782, -7380, -21021, 9187, 7331, -5126, 10926, 1083, -25350, 4973, 36223, -6968, -39388, 6286, 38803, -1928, -31935, 746, 24229, -2613, -12927, 9153, 870, -15758, 12237, 19848, -23411, -18995, 29901, 14721, -28551, -6832, 21493, -551, -11474, 7689, 4918, -12298, -3422, 16107, 6667, -19978, -11579, 24483, 17041, -26539, -18678, 26299]
383B6299o785m0206K658L1966L066k4656o504K1586M413k2530N491K3010j9932
396b124j9960L5116J1253m5366K14M6241r172l9071J4218K7808j5520j7742J7119
409C014J0415k1057n108K8346j190l7527J0449M3692k0670m4169K8986L7939l1747
422A373k8698K9126K0573k2653j7800J7724J9314j7887k1238K2850J9889l0512
434g939j3961L6966M601l8062M385L5203j1331l0814J5059K9234j8745k9927K3942
447a389L0756l3157k6825M3536J5917n1131J262N2175k0980m5154L7979L3442
459C6431m9384k1805N5073J3269n6473q897N6569N508n5993M28N3377r895m5900
472b7692K1098L2482l0070j5561L3458O09l1553P718K6512p412k1478N73K0057
$$ y = [26299, 19514, -20692, -18034, 13932, 16998, -7658, -14162, 7424, 11837, -10693, -5202, 17808, -2124, -22084, 13032, 24285, -21081, -20867, 25374, 16202, -22869, -8651, 19157, 3637, -14105, 3014, 13429, -7628, -12736, 15610, 14420, -23107, -12658, 31034, 10364, -33805, -4819, 33120, 1373, -27325, 1801, 22374, -279, -18079, -355, 18959, 1072, -20166, 2684, 22573, -7939, -21900, 15066, 19667, -18395, -14010, 21193, 9862, -20952, -5893, 23341, 4596, -25331, -1389, 29367, -3790, -30615, 12921, 28838, -22293, -21031, 31144, 10164, -34990, 2989, 36431, -12953, -34758, 20315, 33584, -22889, -31786, 24783, 30291, -25702, -25274, 28103, 18208, -27692, -6594, 25888, -4182, -19743, 13715, 14324, -17229, -9511, 17001, 9589, -11889, -11316, 8741]
485H741P617k1594j2355K3169J1854k2859o668J9005N97j4704N264J2917j1281
498b97j5378J9283K1441l0666k7197M5016K6991n8541j8155O6039J777o5398J8486
511a6599N5883l6965m1674N1017K6892n8949j4859O2658N436o3482L765O0056
523C3179j5210n0695K9060L4336m2527j2652N0822r600n0639K5781M2933l2062
535B726l0215K6804J7572j4291p644m5P3J1823N107j6803r546J6004J1710j1040
549B235r165L646o74O632J7681k0506l8449L7531N5455n3904o2166O5390N4787
562E8493o7517l3625N8046M611m0180K6362J9595n5268j016P7671j1228r2504
574e6560J7911R7244k1790q9531K6330O7244l0189l3110L3288r004l2103M8915
$$ y = [8741, 16358, -5236, -17591, 5578, 17432, -5427, -12095, 6910, 7507, -7197, -1933, 10984, -297, -15675, 3608, 25049, -5617, -32814, 12202, 39193, -19348, -37503, 28536, 30313, -35085, -16599, 39284, 2319, -39355, 11662, 38554, -20395, -35254, 27404, 32840, -30642, -26877, 33179, 17969, -32726, -3666, 30670, -11857, -24509, 26313, 16713, -33926, -8145, 34788, 2726, -27489, -685, 16887, 2596, -5048, -5093, -5020, 6803, 11910, -4893, -14439, 1565, 13275, 2235, -6930, -3284, -3958, 2674, 20355, -151, -38600, -1069, 54386, 482, -61684, 3706, 58493, -9024, -42649, 15397, 20008, -20172, 6190, 25785, -29483, -30499, 47172, 35944, -56560, -38649, 58595, 36805, -52726, -26396, 40848, 10659, -22451, 10837, 1833, -30270, 18645]
586A8645K6312p8703j6534R0051P121q1911j84N8180l342k6173M510o603o110
599a4741L5704P828n7550r887P0063R023p0490k587N7966j0492l2140K6527k651
612F573l9896L9299M3997o8959l6935Q4564K0900q3395L52O6826k1479m0950L9870
625A0767J2193n2924J4066N8907l6186n6845N4267M4725o6920k2375P2078q506
637B3247o5902M2498M8360p1583k1586Q7509r995q5190L9276O5085o0990l3116
649d2387P3674l439p6589L7696P1919o5015o2100Q2801M6820q9443k4839Q2603
661C1701m225o2201L7060L2159o7744L395Q8190l6191r3719N8225Q2284o3411
673E523n8214N1196K6335k6047P455k612l8442K7392O2003m3736p3877N0464P1206
$$ y = [18645, 44957, -33746, -50280, 39771, 46892, -35019, -35203, 22977, 19635, -6538, -2028, -8631, -14741, 20963, 28791, -28759, -38646, 31417, 40440, -30050, -32637, 25329, 14837, -17303, 9224, 6573, -33323, 5976, 49973, -18986, -55921, 28643, 49543, -33852, -33500, 33326, 11847, -29103, 10767, 22960, -29964, -15898, 43009, 6823, -50022, 4245, 48970, -17950, -40325, 31753, 23247, -42655, -157, 48203, -23380, -44966, 42543, 32548, -52642, -13366, 51719, -9271, -42387, 31287, 27848, -48741, -11045, 60874, -4141, -66241, 16560, 63380, -26063, -50902, 31701, 27476, -34725, 2335, 34494, -33250, -29855, 58335, 22144, -71575, -13350, 68934, 5523, -52691, -1495, 24840, -1207, 6248, 3636, -34806, -7414, 54589, 10853, -63024, -12560, 58646]
686E8646m9062n2532L9574J8977k2611K5629q61p2766K9373J10432n6528j29725
698a01454P7531J23617q6787r3697Q2477M5775o6449J1759M3963o9342k2037J19412
710F4768M589j54194P975J68094j8758j57287K8756J23028l8882o9383M6632N403
722A0741m8782N6305M4706j02689l5924J24697K5006j20043j4695R3079O939n3089
734a3749j012Q249k887L3249N805o7092o032Q7230K605r0959O947P6326k1767
747A6913m4546L7740j38m7455M8220M6764r0821l3789J17696J2009j25376J5827
759d6956J12588m3314q5577O7861N0570q5025j4484R2858k1008q8953N4021P2058
771F4639q1534m3616J00571O581j06386L1722R8370o3244p6421P8373M5103p4554
$$ y = [58646, 9584, -42948, -3374, 15603, -7008, 18621, 17760, -55006, -25633, 84799, 28271, -101454, -23923, 99694, 12907, -80790, 1687, 47462, -18987, -7228, 36735, -32607, -54644, 64768, 69357, -84837, -76862, 91232, 72474, -84813, -56057, 66971, 28089, -41294, 5338, 10741, -38041, 18264, 62970, -39719, -75643, 49054, 74060, -45983, -60678, 32401, 39340, -13749, -14761, -6512, -9399, 23850, 29655, -37437, -43469, 43761, 46366, -44593, -37646, 38680, 16913, -27633, 10107, 9969, -37486, 10734, 57498, -33323, -67112, 50584, 62593, -62783, -46956, 65632, 22318, -63259, 4602, 55172, -29853, -44337, 48521, 27513, -61440, -7419, 64639, -16895, -60511, 40060, 46641, -59745, -28023, 70347, 7103, -69318, 9055, 54158, -20396]
783b0396r464N3859k3363k3805M8865p524o4475L3680P0782n1627o7702N8443
795b727N4251n3249l0298L7828k999j2782M0427j8009p3875M9494R5482p5579
807G964r9199Q7620Q4751q2285n5071O0646J4608k8171K9779n102p1057L1867
819b3650J03073m8617j21435N5098J23049n4354j04582M6381O7705l3545j6588
830g465J7651l8457r50Q5095j4323j12778K4862J16959k8501r9142K4218O5043
842C2212j3279k3049R28k0171Q740N7924j3972q3827J5574R3843j6182q7349J8948
855b9660O3427k2125k5507K3177j8919k1315O1669J4687r1567m120J01231q126
867D2852r0832K0650O5413l1525l2238L9556j407m5165L0980M7686n3102m5901
$$ y = [-20396, -29860, 23999, 636, -23169, 25696, 18172, -46303, -12623, 58159, 6532, -61170, -2727, 51524, -1725, -32023, 5805, 2806, -9976, 30451, 12442, -61433, -11939, 83543, 7964, -91235, -3615, 81136, -1149, -56220, 4426, 19034, -9137, 20642, 15540, -55517, -23650, 79423, 30806, -90629, -35531, 87518, 33164, -71418, -25037, 42668, 9123, -7465, 10186, -28271, -29221, 55874, 41551, -71227, -46365, 70594, 42093, -57049, -32831, 32212, 18933, -4116, -3188, -23359, -14619, 43305, 29333, -54494, -38920, 54923, 38741, -48608, -29660, 33767, 11642, -13865, 9312, -9607, -30922, 30747, 45434, -46133, -50253, 50978, 42852, -47980, -27330, 38083, 6558, -25680, 13876, 12469, -32696, -1716, 45970, -7132, -53033]
879e3033O6781L6790p0555j9052O4260m796m9184K9886K7343m9038k736N6589
891C3255j8209n2551L1304L8363l3837j8391K8167l386j9007K3196J0066l7329
903a8359m027M5783k127m5809Q077L7225j4416j9158J9937o871k2432L5211K0737
916C3771n8420j5108O9594N662o5629N250M8690j4783k4339K1929j509k7466K4131
929A773L2900m0985l7388M9895L8504n0835l3090M4710J9525l2167l61J4999j9639
942a2159N133L4972k3504m2322L5224M0798l6598l1743K8016J8247j4155l151
954a242K74j0979R949K3301j5810l2357J8220L6883j8496l4527J7693K3039j5755
967A93l526J2123j8810o806L7187M85m6955N521M6349q886l6901Q545K2683o529
$$ y = [-53033, 13748, 50538, -20017, -39069, 25191, 20395, -28789, 1097, 28440, -20598, -23334, 33255, 15046, -37505, -6201, 32162, -1675, -20066, 8101, 4715, -14292, 8904, 18970, -18359, -22386, 23397, 21270, -24539, -16462, 20763, 6347, -12811, 7126, 255, -22177, 13034, 33771, -24649, -39757, 29837, 35499, -30130, -24880, 23810, 9027, -15312, 6617, 5108, -22358, 1773, 34673, -6312, -43700, 6195, 44699, -6136, -39226, 5484, 25009, -7158, -7519, 7480, -12159, -7026, 27946, 4442, -37880, -2656, 38142, 1544, -30199, -2183, 16064, 1909, -1242, -968, -11947, -1998, 21303, 5493, -26864, -8644, 28239, 9743, -24784, -7091, 15948, 193, -3333, 8790, -10020, -16826, 20361, 20846, -26109, -20588, 25761, 16875, -20026, -11481, 11202, 4673]
981D673o749M770o961o719J7305J1779k3942j6363K6411J7091k4363j2905J7674
994A701M451o263M883p497j2232J8992J5986k4545j4935K1356J0570j1285m934
1007c752j003o00J1143O332j7473j2500J9807J8626j8683k3829J6762K3252j3747
1020D335j6200J1138K380p208J3062K534k5878K307L2807m745l3128L817K7237
1033A2458J012j8186o207Q516Q171R0n178o861k196J2878R950j6991j5463J8468
1047D61J7126j5110j4994O741J0403M027n651j3073K544J6673p95j3767o03O214
1061A96K960K119n089r020N185J3283k045j4284n004J4027J2361j3107j6636J2331
1075b723J5273j1067r124P767P68k399O728l204j1357N933J2876m214j2301l88
$$ y = [4673, -2076, 2694, -4267, -10986, 6319, 18098, -5844, -22207, 4204, 21295, -3068, -15973, 1701, 6152, -111, 4772, -2725, -14957, 4035, 20021, -4524, -19459, 1897, 12467, 1182, -3752, -4755, -5355, 5788, 12120, -5353, -17853, 1954, 20580, 1897, -21932, -5170, 18082, 4335, -11865, -727, 1653, -5555, 7507, 10041, -15837, -13530, 19277, 14532, -18596, -14779, 12458, 13470, -4716, -10923, -2407, 5764, 5854, 676, -6185, -8381, 4497, 14447, -2544, -18007, 461, 17587, 2477, -12517, -5776, 4627, 8654, 3003, -10070, -7526, 9147, 8352, -5415, -6018, 196, 3156, 5275, 186, -8834, -3649, 9634, 7589, -6695, -11699, 2328, 14689, 1582, -15054, -2723, 12550, 1483, -7641, 126, 894, -1505, 5223, 2019, -9338, -3405, 9471, 5257, -7044, -7432]
1089g432J0537N200r695o900R253M660p754N18M125n794P34R356m465j0570N136
1104c091R115j365p282l999O158Q249o846q978P973N944p295j269N142l774j760
1119c078O917k87o629k188N997O423n262j1006N873J2863p862j0216Q601M839
1133D985p389K418L768q159m72J1038k65j1393k275J0949O095j0994r518J2483
1147A271R975j3988o276J3042P77r980N156N179q955j591J0382J034r978l638
1161g590J0302P221j2148r125J4927Q019j6764l600J5018j594j0670O406N163
1174E565q704j229R181l58q693r91J0208J890j3149j451J6093j342j6656N639
1188c997J4061r302q879J0475L841q711j436N815J260m222k568N599L174r339
$$ y = [-7432, 3105, 8305, -1390, -8290, 963, 5623, -2131, -1613, 2512, -3282, -2548, 6808, 2343, -8227, -3091, 6024, 4659, -2623, -6622, -464, 7785, 939, -8039, -66, 5878, -1417, -2686, 2456, -1318, -3078, 3839, 3552, -3077, -5265, 732, 7155, 1893, -9113, -3240, 9623, 1761, -8455, 146, 4985, -2404, 14, 3782, -4377, -4849, 6189, 5924, -5469, -7744, 3205, 9300, -1694, -11212, 1271, 11246, -2742, -9018, 4024, 4801, -5179, -23, 5156, -3799, -5390, 4992, 6026, -3952, -7590, 2712, 9933, -2215, -11340, 3587, 11606, -5158, -8758, 6260, 4666, -6004, 402, 5565, -3139, -4368, 4813, 4455, -4238, -5229, 4979, 6869, -6280, -7731, 8362, 7020, -9636, -3997, 10064, 762, -8117, 2358, 6199, -2512, -3948, 1867, 3127, -1095, -3663, 1936, 5110, -4229]
1202d229k239J3773q97j5776M550J5364p138j3832P531J1498n567j1113M715J0790
1216G430o156r297J0295N772j6277J390K0541j0272k1478J7966J9105k2357j4771
1229a8109K2770J0178j9502o358J5586L057j3392J487J2526p418j1878J4308R628
1242A2883k0346n473K3017J306k1008J499J4728o85p475k123J453O200O10q429
1256c843M73P431l215l357N721j635p570N873R428p936j2341R209J5571j1510
1270B299j8063J6107J7180k2128j2223K7614K860k9642Q737K7366j9192k1052
1282b0137K5534J2736k7785m299K6450k639k4240Q179K2152j3245j9833J7933
1294H06J6548k2161j0946K3287M112k0391K996J2247o999k094P413o557m789J0863
$$ y = [-4229, -6468, 7305, 6408, -9368, -4818, 10546, 3408, -10424, -2893, 8605, 3038, -8075, -3360, 7430, 1274, -8023, 2272, 8044, -8233, -6843, 13698, 3426, -18052, -86, 19019, -3338, -18109, 4661, 14839, -4663, -11021, 4565, 7622, -5770, -4283, 8243, 825, -11053, 3255, 12883, -7463, -12936, 10081, 11387, -9621, -8122, 6606, 5921, -1554, -3677, -2224, 3976, 4586, -3843, -3370, 4061, 846, -2511, 3210, 1575, -5995, -122, 9306, 1370, -10971, -1762, 13809, 2299, -15764, 343, 17523, -4605, -16828, 10786, 13646, -15996, -7259, 20107, 915, -20137, 5397, 18133, -9652, -13951, 12499, 9860, -14380, -6201, 15951, 2706, -17127, 806, 17354, -4807, -15753, 7534, 11646, -8745, -5749, 6498, -501, -2595, 4818, -1739, -6528, 4335]
1308D335P28q974J690K883j584N466m94j4231K641K1907l382k7828K608L1847
1322A7612j861l3167L993L0349j0061k1478J8447O894k6798J1344L2112k8774
1334a388l3075M1488K9508m6231k2882M2910J5843l4829p662K4055j241j3369
1346f873J1175L723k2260N246L1332j2246l5885J6539L4004j6034k5501J0321
1358f459J2677M4l70j1804q978K1074J2952k4626j2207K2048P263j3795ML803
1372A626r097N713J8735j3663k8603K0232L5798k6112l7593L2157L1521l6516
1384e802j7367L6739j161l2905K1155K4084l7228j3048M5974K078m7166O726M2788
1397B4867j2803l4286J7141K3719k0806j2131K4161p51k5289J2598K3054k1614
$$ y = [4335, 5063, -3911, -2221, 662, -922, 4544, 4050, -10181, -7540, 14367, 10985, -16843, -14235, 17612, 15751, -17416, -13423, 16926, 6865, -14613, 3834, 10728, -16070, -4726, 27386, -1388, -34463, 7025, 36533, -9698, -32580, 10330, 26173, -8656, -16318, 7737, 6496, -6873, 4302, 8025, -14235, -8989, 22343, 10097, -25788, -9249, 24755, 8721, -16780, -6459, 6218, 6262, 5892, -5912, -14890, 6184, 19136, -5490, -17697, 4351, 11614, -2181, -2177, 1626, -7471, -1758, 16977, 3314, -25289, -5057, 30741, 4629, -32964, -807, 30714, -5802, -23169, 13570, 12409, -20496, 659, 24743, -12485, -25533, 20441, 22519, -24647, -17921, 24867, 12064, -22222, -5081, 18638, -2168, -14299, 9862, 9111, -16178, -3580, 19474, -2140]
1409b140j5809K4669N697k0619N326J0508j3204J444J6439j2095j4033J7707P009
1422A0899j6988J391J2669j0721n869J9625k31k7834N832L3519j1357l5186J7379
1435f872L0314k3516j8024K7961L41k9371K0376K5462l8090j8001M8877Q941n0496
1448b2098q48M4145n787l1745J0669J6066j4667k49J9596j5141k3615K7373K6443
1461C0142l6158k5012L8075J8704l2546p609J8705m338p45J4769j7271k1075L0299
1474E940K2548l4666k1055L1154J6673k1540r707Q856P14L230J0266j3809k1030
1487b2426K1985K9413k7753l1879L0263K6509k7762j4098J9825k069p523J7621
1499A2106o292k9102J8630L3714k5286l2386K6321K6044k2674j6160J6446M399
$$ y = [-2140, -17949, 6720, 12417, -8202, -2876, 7632, -5572, -4128, 12311, 216, -13817, 3890, 10899, -6089, -4698, 7971, -2750, -8619, 11006, 10775, -17059, -11227, 22292, 10935, -24251, -6872, 23442, -74, -18098, 9863, 10204, -19167, 1209, 26671, -11419, -29420, 19457, 28398, -22098, -22946, 21199, 15412, -16333, -5664, 10402, -4265, -4514, 15082, -59, -23674, 3699, 30142, -6016, -31028, 7047, 25751, -6795, -14404, 4301, -37, -782, 13987, -3284, -24359, 5940, 28488, -6178, -27233, 3921, 20594, -946, -10653, -1797, -1083, 2147, 12413, -1396, -22426, -441, 28972, 1219, -30660, -397, 26112, -1650, -15748, 4077, 2008, -5515, 12106, 5814, -23288, -4658, 29056, 3770, -28616, -2295, 23749, 1075, -15085, 1361, 5760]
1511E760j0400R559M452k3098P55L3862o263l8927J3143L5804j9531k4636K3173
1524C653Q287k3223R004J9502k2859j3226K9939O542l0455n07K6474n403j9490
1537a1762J0620J2159j6460m352K1093l201k3794J1098K1560j6674j4292J7857
1549C852L272j4531R157P293j8907J449K2501p580k1411J0901J5316r784o844
1562e316O132k901k119J3105o74k2927K045L1237l629l5711O525L3922j0536k4654
1576a5501J4493R090j6339R267J5826k6215j3517L7979R991m1532p114L7993N080
1589A9501l0103k078J9249k159p932Q632l280j6035J3220K2566k0909k5180K3830
1602f78K3351k1701j6847J4010Q652l028j606p580l474J5607N329j7488n787J4127
$$ y = [5760, -4640, 4919, 9371, -13727, -12972, 20890, 14627, -24300, -11157, 24647, 5116, -19520, 3653, 11940, -11283, -2279, 17223, -5636, -18862, 11077, 17619, -12836, -13343, 13131, 7728, -11762, -1142, 11017, -5443, -9795, 11298, 8097, -15697, -4599, 16961, 287, -14005, 3852, 7124, -7407, 1750, 9043, -9864, -8415, 14086, 6506, -14905, -4004, 11312, 1528, -5316, 816, -2085, -4204, 8901, 8227, -14700, -12655, 18582, 14953, -20758, -14233, 19689, 9153, -15501, -1008, 8082, -8257, 1010, 16836, -9379, -22896, 15083, 25074, -16458, -23572, 14421, 19501, -10602, -12680, 6569, 4410, -3522, 5110, 1830, -14205, -985, 21581, 672, -24508, -678, 22673, 972, -15875, -1865, 6787, 3759, 2153, -5427, -8901, 6706, 12035, -5453, -11240, 2887]
1616B887M603p167k327k51j887O364Q059j1445j4220J5239J9079j8658j9840K1025
1630A461J4501k1355l065J7866j0023j2722K2858N736l0925L65L3551m482l1287
1643a7521O275K6184p279j8972Q979J1065j2706k143J7314o362k1176J2693K2672
1656A9023j6428j9684J5091J3944q938p822M32K592P742J037j2354l200J1350
1669B785N017o500n942j064O213P481l673j3146o57J7122O446k0084j1283K1949
1683D664J2125k1267q405J8237o09j1897J1639L885k1514L562K8414r281l0865
1696b1312J1109L0370j0000k7661P803K2262n883j5355O731O299q667L293J0811
1709I800j2274j0822J7963R427j9421o783J5621N009q940m126K218L601K147k783
$$ y = [2887, 7490, 323, -2004, -2255, -4142, 2222, 10281, -1164, -15384, -145, 18934, 276, -19564, 1461, 15962, -5393, -8458, 9408, -615, -13337, 9521, 15257, -15668, -15303, 18248, 13766, -17521, -11246, 14938, 7659, -11313, -2334, 8731, -3975, -6118, 11196, 4834, -16342, -3649, 19023, 2595, -17089, -1998, 11946, 3008, -4814, -4382, -1790, 5952, 6989, -5365, -8565, 2785, 7802, 1302, -4640, -5704, 509, 7990, 4317, -8829, -9486, 7636, 14082, -6002, -17285, 4664, 16789, -4478, -12883, 5354, 4745, -7152, 4487, 8372, -13142, -9580, 18834, 9553, -21312, -10203, 20167, 10167, -17494, -9691, 12571, 6688, -8667, -1936, 4363, -4304, -1011, 9800, -2474, -13296, 4667, 14094, -5327, -12110, 3511, 8520, -420, -4546, -2328, 1273, 3420, 637]
1723F37k420R88J49J611L300m563o224N514R110m251j1879J123J4971J923j7597
1738g608k525J8451R2j7295N608J2470j1526n786J5865r23j7738N557J7300p178
1752D764j5443O326J2736m930r131M579M555o295J459Q314q272r727J4687R247
1766A2869j8411p629J7930N805j3550m068P110L431j713l444r37K915N62j137
1780b67J546j582m134M274O281m645q232K370R948J781j2101n311J3461O660j3490
1795c441m647J0891J166n304K543j953n182Q577O102j1990o642J2738O092j0633
1809a683n934Q415N380p248l088O834q13o571N985N803j1059m358J3729K901j2894
1824d601k148R028K631l577m745j169P629L158q617l717P349L370m432l068J467
$$ y = [637, -1783, -795, -646, 965, 4265, -298, -6522, -1008, 8102, 3851, -8028, -6905, 8066, 9989, -7608, -10133, 8318, 8410, -8885, -3277, 9193, -2333, -8119, 7746, 6823, -10915, -5358, 11942, 4764, -10679, -4353, 8383, 3453, -5678, -1099, 3456, -2839, -1380, 6934, -1338, -11065, 3622, 12869, -5542, -13171, 4759, 10564, -2986, -7054, 56, 3487, 1774, -1670, -2607, 308, 870, -267, 1279, -303, -4437, -163, 6118, 1473, -6759, -4389, 5559, 7340, -4761, -10072, 3389, 10049, -3441, -8088, 2803, 3969, -1335, 1208, -745, -5927, 2650, 8752, -3238, -9880, 2858, 8950, -1683, -7617, 798, 6178, -1070, -4158, 2676, 1863, -4708, 1277, 7080, -3979, -8337, 5392, 8293, -4601, -6749, 2279, 4910, 1333, -3412, -4581, 3048, 6206, -2411, -6128, 1221, 4591, 159, -2909, -1442]
1839a442K733N18k324m58J254r66J168J384l378q79M707j557l412M499p75o026
1855d954N986N892j0080m885J2096L170j0933k152Q268K510o363l044M978L029
1869C518m283j327L088o02j744K666p44k368K780m77l672N060K492q970m9J1025
1885F393k786j0779M320Q434k917o277M57M059K159k714k898Q24L017J009k268
1900C3l636K448N795l659o578O069M439p628n33P786l528o838O521M064o627j595
1916c467L985J260l22k040k943L237N658m094p662L909R042k315j1192J693J3112
1931G861k512j4259N000J2704p513q509R017K513q303K778N683o221j773P007
1945C473j558n642L068M034l641k647M265J698n394n68P317j650q956M167R230
$$ y = [-1442, 1291, 1809, -515, -973, 281, -685, 483, 1867, -1511, -2390, 2317, 760, -2652, 1847, 1072, -4954, 1032, 6924, -3156, -8041, 4055, 7225, -3708, -5860, 2408, 4918, -1445, -4489, 489, 3518, -765, -2092, 996, 394, -1350, 1316, 572, -1796, 984, 507, -3165, 1895, 4387, -4583, -4632, 6393, 3607, -7172, -2852, 5582, 2665, -3612, -3155, 904, 3063, 349, -2549, -1725, 1292, 2301, 33, -3603, -1155, 4640, 981, -5597, 472, 4911, -2717, -3250, 4536, 1008, -5830, 691, 4755, -1872, -3467, 518, 1778, 1456, -584, -3527, -290, 5368, 1274, -6388, -2479, 6563, 4248, -6944, -5251, 7861, 5349, -8910, -3910, 8794, 1281, -7228, 1789, 4302, -4001, -1223, 4460, -1761, -3534, 3473, 1915, -3727, -659, 3375, -266, -2913, 1352, 3050, -2344, -2912, 4405, 2755, -6201, -2034, 7196]
1960G196o494p593P314M695n159k573P65K291M854m532r371P619J1685j0242j2152
1975a1697J2240J0239j2103q336J1588N821j0491l304J0405j016j0140O032R201
1988H439j0958o444J4277J811j4800L804J1766q374n957J0966q39j1605O662J0778
2002I526j0060j0345J1716J0628j1825j1381J1454J1321j0229j0342Q130P555
2014F148l938m854j248L564N865l983q455O828P238r822l387J2009k463j2000
2028h498Q122J0045j1625p491J2892N027j2679k365J1541p09j0059M974P550j0043
2042c318l201J4718l033j7979J0783J7923j7291j5361K1964R879k2938m460K0983
2055H669K13j7351K046J3598k812j0237K707P665k532m919J902J447m7K114l412
$$ y = [7196, 702, -6891, 423, 5118, -41, -2614, -1849, 442, 5296, 764, -8607, -988, 10697, 455, -11697, 543, 10782, -1321, -9657, 1931, 7752, -2739, -6043, 4362, 3346, -6794, -762, 8439, -2519, -8963, 5314, 7125, -7675, -3871, 7895, -479, -6436, 4530, 3691, -7914, -1252, 9526, -534, -10879, 837, 11465, -360, -11741, -287, 11034, 805, -9537, -1407, 6148, 2210, -2644, -3892, -328, 5537, 1554, -6901, -73, 7165, -2657, -6044, 5965, 3502, -8498, -376, 9669, -1956, -9447, 3445, 8472, -4207, -6572, 4969, 4260, -5799, -825, 6725, -3318, -6519, 8199, 5166, -12813, -2030, 15893, -1398, -16759, 5205, 15084, -7854, -12314, 8669, 8882, -8469, -6423, 7175, 4363, -5874, -3167, 4498, 1966, -2953, -1051, 396, 349, 2463, -949]
2070i49m139P050L622r059j080R279l338o651Q038J287j0563M508J0160q588p727
2085h150J0655L424j0011J005Q440n908o694J1896M836j8416k541K4486o26k9039
2099a6643M840L0104r297k6667J2598J9764j3644j0607J1806J978q628M913N094
2112E611r438k379J1220J124j1061l56R272o13n880K447J257m986M764O570j0085
2127b533o817J3048M984j1692k652O702K22J168J034j0210j45J7088j376k0941
2141a2120L292K1496n105j9927O981J6932r593j2925J3305P440j7007j059J9737
2154A1447n917j9413J1729J5874j4904r562J4592J605j0752N364N320j0684j05
2167e406J4180l725j5455N282J5800n972j4640O117J1886o495p102O490J272n401
$$ y = [-949, -5088, 1962, 5584, -3475, -4555, 4724, 1386, -5265, 2773, 4060, -6503, -1995, 8165, -423, -8150, 2505, 5929, -4082, -3077, 5363, -545, -7239, 4657, 9493, -8923, -11464, 13022, 12396, -16643, -11803, 18301, 9004, -17663, -5065, 14699, 1055, -9552, 2254, 4232, -4396, 517, 5611, -3827, -6206, 5014, 6138, -4923, -5279, 3993, 3380, -2500, -53, 1204, -3782, 982, 7552, -2533, -9350, 3698, 8682, -3010, -5662, 1040, 1262, 2430, 3464, -6746, -6891, 10197, 8821, -12120, -8828, 12668, 7563, -12364, -5383, 11549, 1956, -10969, 2336, 9776, -7231, -8290, 11447, 5530, -13883, -2154, 13720, -1184, -10746, 3846, 5451, -5301, 63, 5383, -5301, -5406, 8774, 5049, -10406, -5124, 10676, 4704, -9936, -3819, 8067, 1572, -5530, 960, 2232, -3169]
2181c169M079K678o933J337N809n011j336P548n562p821J2384O730j7394m593
2195a1254J9242K927j9011j036J6847j012j3225L606Q445o990k577J0277l909
2208B330j2253J0277J1477j5005p817J6966J649j5256N484J0251j1027m716J4853
2221G213k0j6553K492J6619k971j5445K066J2916j299p956L81J595R76N435l105
2236B344j1331N514J4531q485j3259J0264Q816j1137j450R462n423o854J0517
2249C509M423j3224k710J3431K022j2178j088Q899k49m580K981j364n940Q322
2263B254P868j4705p891J9025N764j9721k216J6259j202j0125L539L633m783J834
2277d67N084n240m707O504L896o132k326N198j002l831N605J804j1239J782J5654
$$ y = [-3169, 910, 3588, -3345, -2008, 3801, -1210, -2546, 5002, -560, -8381, 4003, 10733, -6661, -11254, 7988, 10915, -8096, -9132, 7715, 6703, -6522, -2916, 5529, -1461, -4038, 6239, 2330, -9923, 354, 11831, -3174, -10991, 5975, 7624, -7632, -2148, 8103, -2924, -7640, 7213, 7193, -9360, -6868, 9751, 6780, -8665, -6599, 6317, 5018, -2938, -2557, -962, 14, 5449, 2344, -8987, -3473, 11058, 2573, -10686, -422, 8394, -2743, -4193, 5269, -154, -7008, 3509, 7932, -5292, -8002, 5429, 7451, -4727, -5815, 3084, 2835, -1745, 1236, -128, -6068, 2254, 10122, -4583, -12474, 6551, 12315, -7406, -9622, 6637, 5435, -4690, -1151, 2482, -2301, -467, 4617, -623, -5330, 1174, 5070, -1062, -3388, 1810, 808, -3023, 2582, 4386, -6853, -5071, 10583]
2292A0583n786j7169R087J5685j1200j0653J0646M072q116K298M269o593j431
2305d308R403o12j0479J869R976k797q311M391N217o766n23R105m937j0484R950
2320F94R982j2716p351J1678M345p657j840J585J50M747L71r178p65J1347J528
2335F920j1791j776J0500J745q826L97O216m229k650Q350j345j2239N918J3461
2349A0651r113j1669J0057P454q416j954M476l022j65O988l312r888M923J1821
2363H831n156j2543N178J2019n108j0103N294N851m958o58M278m609k017P697
2377C996p47p835L422M815m683j42M223m640k879P923K150r793j652R838J918
2392E914r127j441P861j56o030K683L081o320J813P988n808q082Q770N963r577
$$ y = [10583, 4797, -12372, -3285, 12400, 1200, -9453, 1193, 5265, -2851, -553, 3716, -2877, -4308, 5095, 4483, -5996, -4127, 5849, 3052, -5259, -868, 4349, -2417, -2940, 6165, 1228, -9256, 694, 10676, -2040, -9391, 2287, 6632, -1025, -2865, -1280, -1130, 3617, 3988, -5190, -5955, 5392, 6920, -4871, -6647, 3853, 5598, -3228, -2831, 3385, -844, -3494, 4856, 3511, -8728, -2810, 10651, 1538, -10131, -74, 7380, -1036, -2990, 1486, -1536, -1701, 5287, 1975, -7913, -2990, 8831, 3675, -8868, -3690, 8329, 3221, -6882, -1588, 4263, -695, -1353, 2925, -1684, -3701, 3996, 3249, -4586, -1164, 3651, -1032, -1174, 3049, -1591, -4470, 3453, 5603, -4190, -5842, 3996, 5914, -3213, -4654, 3207, 3051, -2979, -296, 2785, -3535, -1722, 6266, 458, -7624, 1146, 7109, -2468]
2407b468k144Q114k052m987N345J874p730L20R120j017r672K90R774O23q969q96
2423d475O539P07k191r08k676J460O643k714q727M191P865m910m165L833l46k201
2439b075N051k56p475J227R008j500q789P60Q026n10o064J071L124k930J015N098
2455D781o290o425J1236O038j3976m401J4161K145j1898N25P633j963l557K600
2469F09O83l211P42M510j517n669J700O199j615n798K130L030j447K34j03l152
2485b675J920M658l557l636L982Q49j830J828j352l694M077M289n698m229O161
2500A093L406n671k610N343J325n221M25O350l660p082P502O473j0789m456J2261
2515D689J443j1028R01Q508l079m324L847M68l827J734L756k266m749K583N566
$$ y = [-2468, -4612, 3502, 1450, -3537, 1808, 3682, -4048, -3728, 5392, 4375, -5297, -5007, 4767, 5390, -3579, -4475, 2064, 2771, 580, -328, -3004, -1544, 5099, 2385, -6342, -2151, 5714, 804, -3361, 472, 126, -2075, 2976, 2720, -4755, -3528, 5480, 3980, -4809, -4049, 3977, 3467, -2597, -1526, 1598, -1332, -317, 4781, -1509, -7934, 3302, 9340, -4636, -9037, 5124, 7269, -4629, -4104, 3529, 1566, -1991, 609, 1292, -1919, -1177, 3333, 1816, -3853, -2153, 4046, 2431, -3367, -1237, 1793, 346, 580, 477, -2675, -755, 3903, 346, -3290, 692, 1541, -289, 1539, 187, -3507, 570, 4859, -839, -5068, 1093, 4499, -1172, -3782, 1561, 2886, -2335, -1910, 4440, 780, -6302, 1200, 7673, -3116, -7572, 4689, 6132, -4896, -3995, 4513, 1434, -2890, 957, 1425, -2402, -668, 3088, 822, -3927, -1344, 4222]
2530D222k415n959K605N330k852k874J776K95l00J716j466k353K437R76j649J424
2546I13q61l360L868M525o792m230Q544K995q217k298P088J537n709n57M956j001
2562A401m615L888L703p258j938R795q72j0306L338Q996m913n924N364K209m473
2577a605P98L002k068k773L140K264k874k941K814L805l248l458K972K469j778
2592E19q56p31J08K706o46l672K886K253m250k40N265l208m249N950K224p090
2608c031o93O981p39n976J529N369k160m883L399L975n102k480O746J91q109K961
2624b022P600n652m962O454J904n867R00M312k782k246L015P20k147k11J257O86
2640I59r32r41Q27M43j20M94j442r33L168K44m348J500M261l734k338N641r54
$$ y = [4222, 1807, -4152, -1547, 3783, 931, -1943, -167, 128, -172, 1544, 78, -2275, 162, 1138, -511, 913, 52, -3308, 560, 5085, -1707, -5937, 2607, 5602, -2615, -4913, 2175, 3712, -1997, -2554, 2402, 1401, -3214, 674, 4377, -2881, -4819, 4976, 4104, -6202, -2864, 6132, 1219, -4705, 659, 2868, -1605, -807, 2195, 127, -2646, 494, 2758, -116, -3057, -243, 3562, 314, -3144, -172, 2297, 519, -337, -1068, -960, 1746, 1100, -2572, 314, 2567, -1683, -1923, 3342, 134, -4115, 1835, 4059, -3031, -3724, 3257, 2518, -3458, -1929, 3440, 1280, -3603, -204, 3771, -1331, -3811, 2935, 3126, -4983, -2022, 5578, -74, -5036, 1418, 3322, -2545, -1645, 2667, -115, -2361, 654, 1374, -773, -984, 273, 959, 27, -914, -87, 356, 236, 730, -712, -1645, 1523, 1767, -2581, -1081, 3180, -554, -2892, 2749, 1795]
2657A795o060M419M749o690k441P195N87o599O84N248j397m007K210L324l703
2672f86k261N226P52o790J672P049m193n578N876K764o035M35M379k553j905L507
2688A659q04l247K524J974k671j014K050M31j364J98O07o68o38K451q7m603K035
2705a167N437m066n245O417K816p346N05O608l904m524O351J569o986J321O083
2720C869k739n283L368M749m101l774M507K954n190q64N291k106m008M566J677
2735B916o277J266O571m085m332M773J683l936Q27K312k915M25L114j881l311
2750b850K750L396l370l410L955K852m546j442N360j414m715M413K968p310j4
2765c377Q794l547q265O420N931p433k766O512q9m719K089K911l496j846M771
$$ y = [1795, -4265, 154, 4903, -1787, -4228, 2967, 3554, -3045, -2361, 2887, 1490, -2517, -307, 3017, -686, -2947, 2279, 3031, -3759, -2087, 4962, 769, -4809, 1067, 3831, -2204, -1769, 2610, 57, -1848, 1659, 855, -2392, 132, 2106, -565, -1579, 471, 902, -462, -264, 343, -325, -963, 1488, 1401, -3202, -1167, 4270, 204, -5041, 1376, 4192, -3154, -2649, 3959, 55, -4469, 1882, 3451, -3535, -2214, 3869, 1130, -4153, -785, 3964, -137, -3911, 596, 3550, -1640, -2504, 2787, 681, -3327, 1239, 2916, -3361, -2095, 4476, 391, -3941, 832, 2515, -1421, -594, 1718, -1197, -772, 2342, 461, -2850, -100, 3296, -74, -3484, 471, 3323, -1223, -2665, 2695, 1281, -3434, 979, 3947, -3363, -3377, 5417, 1870, -6395, 25, 5956, -1477, -4243, 2269, 2180, -2539, -450, 2461, -1035, -2881, 1890]
2780A890J067n979L2O682j324o154K952M228m251j307M945k982l599O128O67o890
2796c895K140N920m221l670N125J087m792J272L902k839l232L788K899n407j910
2811c833O907K68p642K350P085n110m933P460J192q141K610O984n408m175N830
2826A444J421n035Q24L498k067k097K640J401l293p66L765j26l797J604K597l145
2842a132k62M312l308l883O630J588q256J124Q197m136n710O186K172o686J361
2857a803O173m319n183O235M348p288l946Q593K561r440k98R420k853p489N951
2872F62M200q415J11Q888l862p811O344N357o212k890M669J130k853L23J063j031
2888c27l10K105m86l072J236L292k023k472L048P1l084L140J541o029J392P179
$$ y = [1890, 2957, -3022, -2990, 3692, 2368, -3786, -834, 3394, -857, -2164, 2781, -201, -3800, 2328, 2995, -3895, -1755, 4165, -56, -3726, 1399, 2486, -2306, -1034, 2868, 29, -3203, 585, 3484, -1923, -3833, 3074, 3342, -4300, -1950, 5135, 25, -4908, 2552, 3744, -4397, -1787, 5197, -211, -4386, 1444, 2865, -2170, -1346, 2152, 85, -2012, 628, 2029, -1264, -2030, 1735, 1609, -2188, -584, 2013, -1132, -1394, 2918, -390, -4273, 2357, 3945, -4311, -3187, 5010, 874, -4836, 1350, 3522, -3164, -1803, 4370, 51, -5132, 1103, 5451, -1837, -5783, 2810, 5371, -4069, -4367, 5053, 2200, -5289, 662, 4862, -3553, -3442, 5446, 1584, -6227, 117, 5474, -738, -3628, 1041, 2171, -682, -359, 704, -327, -637, 1468, 982, -2090, -854, 2438, 415, -2057, 991, 1062, -2022, 1118, 2659, -3370, -1978, 5201]
2904E201m547o266O997L548p863l01P307k863o269N672M728p297l393Q464K247
2919E365r644m15R853k110q949N159O126p806j826R022k359q560N659O719p277
2934a043l896O788J328n108M32K693j589q24K569j20l549R23M366j557m267K230
2950f24L091k846n24K271k962l91N881k670o875N579N585o575l163O815l05n349
2966c062K920L364m780j703O323M89p768P51Q251j902p984L282O970n359l494
2981c702O527j085o597N233N588q785k865R571L64q095J028N966k119k997K410
2996D42N69k443R95K877j944l824L597L404m550j936M719n13l503L239Q31n179
3012c219K356N605n284m033O273J751n700M40L954k158j700L354j74m426J532
$$ y = [5201, 654, -5612, 1385, 4933, -2930, -3231, 4076, 1213, -5056, 616, 5344, -1953, -5346, 3118, 5365, -4279, -4694, 5159, 3049, -5900, -741, 5385, -2421, -4247, 4775, 2416, -6144, -485, 6234, -1043, -4939, 1849, 3177, -1931, -1499, 1194, -395, -1219, 1350, 1230, -2319, -1396, 2970, 1413, -2854, -624, 2467, -379, -903, 1368, -1594, -1985, 3896, 1226, -5649, -70, 5515, -1060, -4223, 2592, 2287, -3062, -142, 3222, -1558, -3261, 3062, 3551, -4217, -3466, 4785, 2883, -5101, -1819, 5151, -208, -3702, 2825, 1740, -4857, 376, 5964, -2821, -5686, 3885, 4249, -3846, -2818, 3148, 1029, -1968, 442, 1011, -1432, -437, 2440, 496, -3328, 269, 3673, -877, -2813, 1906, 1393, -2110, 1129, 1960, -3219, -863, 4742, -542, -4575, 1698, 3449, -2251, -1811, 2143, -15, -1715, 1639, 1465, -2961, -1429]
3027a429M811k183n413L288N525m932l766N912R71o488L131N180o281l016P909
3042C219M13p979K016N983l042l419L327Q05k781J228K519k417k966L810K844
3057C560m820k253N484O06n167J542L631m173o14N673k577n188M879L610n832
3072a639j199M566q24k370K347N7k953J367L418k044m063K673N012l731m617M219
3088B19L048m629l80M183l261k100O078l80p208K890O595m820m138M657J556l654
3104a344O56K439k479j524M079Q65m950r61O077N09o624R01N695k663l561M047
3120A162K70m245L070L239n386j419O090n22m781J407K882j847r08J742m19j842
3136a507J322K238j987k375K336K540l311j243L484r60k428L176N54n008K479
$$ y = [-1429, 3382, 1199, -4214, -926, 4599, -333, -4099, 1813, 2784, -3704, -573, 4607, -1674, -4690, 3219, 3632, -4347, -2331, 3652, 610, -2809, 518, 1323, -1458, -230, 2289, -128, -3094, 716, 3560, -1260, -3513, 1971, 2577, -2590, -1048, 2583, -1590, -2204, 3469, 892, -4296, 583, 4193, -1639, -2838, 1728, 904, -1466, 881, 938, -2015, -648, 2770, 726, -3337, -664, 4348, 617, -4000, 219, 3267, -1362, -1742, 2441, -820, -2920, 3158, 2778, -4430, -1540, 5055, 235, -3903, 754, 2310, -1344, -688, 1751, -728, -2252, 1827, 2692, -2258, -3219, 2858, 3367, -3257, -2356, 3339, 676, -2885, 1162, 1432, -2813, 257, 3496, -1890, -3309, 2781, 2259, -2522, -1115, 1767, -80, -988, 754, 335, -1507, -185, 2053, 66, -2309, 27, 2567, -744, -1987, 1497, 537, -1891, 1285, 1839, -3169, -690]
3151f90M926m634l606N390J625n196O31L943k453k288L569R67m115m75M607K21
3167B422m958M46N019j838l961L337J712m681J906M174m305l080N755J442n799
3182b409K05M330r75k063P81jl76J307p0j355p98K263R38k386j297K689L05k415
3200a327J817M83l052J690M038m370l508O009K160o366m2N130j731l036K425J148
3216A468k873J97L504j294l891J692M669k617m771L969L567m585j689M707j121
3231I32l645L330K005m422K2M069j189k388J043P35j72J54m01q98R15Q27m61j431
3249i75M30J382k72j683J130J098k419O15L117k667l066M822J686n783K43N662
3265C320k601l890L732J867m095j78M175j342l862J894M175k451m083K931L992
$$ y = [-690, 4236, -398, -4004, 1386, 3011, -2185, -1554, 2389, -64, -2352, 1217, 2184, -1931, -2406, 2201, 2422, -2536, -2090, 2929, 1091, -2870, 467, 2179, -2502, -596, 3578, -727, -3807, 1948, 3390, -2409, -2204, 2126, 1151, -912, -131, -132, -508, 799, 729, -626, -1424, 839, 1777, -609, -1906, 783, 1088, -1327, 490, 973, -2079, -389, 3649, -721, -4229, 1780, 3940, -2426, -2468, 2662, 931, -2105, 320, 1468, -1405, -1208, 2296, 1002, -2889, -1197, 3472, 855, -3916, 53, 3620, -965, -2654, 2053, 932, -2713, 617, 2622, -1800, -1778, 2291, 1102, -1286, -243, 492, 320, 474, 73, -825, 90, 917, 456, -975, -545, 837, 565, -1118, 12, 1110, -1309, -694, 2423, -244, -3310, 1512, 3198, -2585, -2342, 3320, 719, -3171, 561, 2428, -1667, -1845, 2330, 988, -2874, -980, 3195, 744, -3339, -408, 3584]
3280C584m003k698M649N25m346K065K720l661j028M251o96l426J527J906j129
3295B40o39K23m15J004M48j256l35P55O82m02j012N81J156j154l54J631j106k202
3313b155L282J463m913J40N607k134m929L659L099m489p44M042j011l106J796
3328c93K994k436k881K979K493l703j638M092P80m383J149L529l342j350L784
3343A674l91l656K032K380k476q04J769r3r27P93l80n43Q34K25n79m18O24P27
3361G91j013o81J696j41j911J150K125l128p91M277r26m253K450L277l811j349
3377b238L986m15l603J918K478k411j441K217J266k819o91L017L09l582J241K990
3393B222k571j802L309O9l395J888K540l208n82K987p96k154J804N82j841N83
$$ y = [3584, -419, -3117, 1532, 2057, -2289, -224, 2496, -1165, -2193, 2058, 1362, -2064, -537, 1369, 240, -399, -176, -591, 413, 861, -395, -730, 25, 707, 305, -707, -126, 1030, -124, -478, 1153, 47, -2155, 1127, 2590, -2323, -2183, 3424, 1290, -3639, 20, 3119, -1370, -2114, 1928, 917, -2189, -393, 2601, 165, -2716, 263, 2756, -947, -2585, 1507, 2287, -2096, -947, 2582, -760, -2110, 1674, 1283, -2373, -341, 2039, -437, -1241, 528, 435, -492, 301, -79, -622, 212, 437, -142, -560, 64, 791, -222, -903, 793, 652, -1259, -109, 2016, -1112, -1903, 2374, 1448, -2805, -355, 2922, -889, -2238, 1748, 1333, -2270, -352, 2126, -285, -1726, 491, 1757, -1062, -1753, 1264, 1573, -2009, -768, 2222, -349, -2151, 1158, 1227, -2168, -280, 2260, -948, -1530, 1457, 661, -1493, 311, 893, -948, -365]
3409c65J593j135j080R54J211j411p70J636O12k565O01K591k084k091L689N12
3425A898m324J400L882l141k162L788L10l457J479K538k270j639K260J047k321
3440g12l26J975J39k538P11K525j866j533K562K94l080J558K489l174r28L714
3456A810p23l258K465J408k621k68K575j198j698J688J052j836r18K358L68k396
3472a192K40K467j123k719K853J560l832K28L968k164k907L778R11l924N64L142
3488A850j675k077K511O47k133Q9J646o22j602J486J371j867j277K906L60l297
3504a684R95K837k776j222L431l86l653K546K558l897r30M246q96l289J828K334
3520B042k180j411J916Q80k187mK433r46k562K048K552l351j426M111l70l818
$$ y = [-365, 1228, 93, -987, -33, 1178, -233, -1003, 633, 1245, -1320, -719, 1872, -212, -2303, 1386, 1898, -2426, -1026, 2856, -285, -2447, 1341, 1651, -1806, -327, 2211, -59, -1698, 562, 1609, -712, -1038, 937, 1076, -1462, -751, 1774, -92, -1625, 937, 1231, -1849, -291, 2198, -976, -1904, 1810, 1087, -2171, 294, 1702, -919, -1187, 1388, 190, -1508, 180, 1232, -604, -1522, 836, 1204, -1192, -952, 1515, 392, -2327, 526, 2086, -1746, -1518, 2450, 286, -2621, 1157, 2068, -1856, -1292, 1850, 175, -1902, 609, 1256, -877, -788, 858, 236, -1366, 120, 1491, -376, -1653, 1253, 1613, -1684, -689, 2148, -628, -1850, 1581, 1195, -2458, 88, 2646, -1251, -2181, 2065, 1169, -2120, -292, 2042, -138, -1549, 367, 1247, -940, -944, 1489, 543, -2019, 29, 2581, -770, -2196, 1915, 1545, -2273]
3536b273J930K215k579o72L051j345k240K613O47k455J97J873p67r90Q53N70j228
3553f00k13J882m39k191J467K091k607j478L780M0m282J992L403l714j804M618
3569A945j78m173J787K867k450j978L055O92k923m2L041r43k785J727K656k861
3585e63j801L675P24l838O41L451k461j663L097m72k685J992J519k165o36K032
3601H47m79q14P21j6r90R07J184j361j532J399K211k283k061L249R69l698Q21
3618i26L404k758k021M223m96m243K317L711l544k676L942J383l519k22K817n84
3634H08k382J513K275k762j809L932O28m470N93M203j678l308K744J195k467P78
3650b07J609k259j70K595j170k073J873J045j811k35J626k25j550P33J641j512
$$ y = [-2273, -343, 1872, -707, -1379, 1672, 327, -1913, 700, 1347, -1108, -911, 962, 195, -795, 58, 628, -600, -813, 1069, 630, -1561, -94, 1997, -610, -2088, 1692, 1732, -2550, -558, 2845, -869, -2673, 1945, 1767, -2406, -619, 2248, -202, -2180, 875, 1567, -1356, -1398, 1643, 700, -2085, -358, 2298, -563, -2364, 1311, 2035, -1803, -1162, 2289, -172, -1835, 1262, 790, -1895, 97, 1616, -549, -1185, 847, 368, -446, 275, 259, -731, 176, 1360, -1, -1533, -134, 2077, -206, -2267, 982, 1951, -1747, -926, 2478, -280, -2301, 1922, 1426, -2817, -500, 3211, -333, -3009, 933, 2316, -1203, -1425, 1392, 808, -1574, -61, 2214, -548, -2357, 1575, 2203, -2267, -1674, 2529, 851, -2457, 287, 1482, -985, -207, 1402, -857, -1027, 1568, 398, -1675, 198, 1243, -568, -803, 823, 598, -952, -219, 1422, -90]
3666i0j488K208Q35k774K64L221k125k332L454P38m137J160L966l033k824L957
3682A000J360l826j57L411p05k900J172K313j659j792K387J378l124j83K794p26
3698G43k363J806J080k549J154J988k805j060L788m61l256J170K390j417j051
3713h43J145M0m70J48N60j098m44J782N34k555l0L151j192k759K491J629l526
3730a437j62M207k154l543L609K414m091r00L346L2k199K77J214o77k52P93j05
3747C72j439R49J715j666j925K658J126k999j81L356j638k299K775O78l254R71
3763h01K553j673j398J591L33j154P93J89j171J73J493N4k474P9L367q37l662
3780b545K020L331k946k274L262O00k971R90J994j917r92K642o81j445J072N79
$$ y = [-90, -1578, 630, 1465, -1309, -1045, 2176, 51, -2281, 1173, 1911, -2226, -1066, 2900, -133, -2957, 1000, 2360, -1466, -1623, 1788, 1083, -1817, -645, 1668, 9, -1783, 604, 1982, -1142, -1325, 1469, 743, -1620, 186, 1266, -1283, -129, 1859, -946, -2006, 1782, 1321, -1935, -765, 1625, 208, -843, 302, 342, -128, 20, 580, -518, -962, 820, 1354, -1201, -1231, 1920, 728, -2031, 460, 2089, -1437, -1599, 2608, 454, -3089, 520, 2934, -1157, -2057, 1289, 1321, -878, -601, 613, -64, -316, 477, 372, -1067, -118, 1597, -69, -1994, 664, 1790, -1209, -1390, 1966, 328, -1971, 804, 1482, -1772, -801, 1752, 79, -1319, 272, 605, -549, 244, 433, -738, -565, 928, 982, -1492, -1413, 1954, 1117, -2545, -525, 2806, -140, -2414, 848, 1448, -1523, -533, 1461, -456, -1448, 1194, 513, -932, 140, 719]
3796G19j275j64J519m68j510Q26K015j566k261K526J902l058j102L061l2k415
3812a283J404J108k068N29J794j931j037K938n24k148R23J920j815j465K248J036
3828A629k474j101L138Q11l457m01L539m64k950J360J553j789M83R13j734M4K557
3845A657j078k505J900K119k597r10J973M07j733j3J656j22j998Q64J847j371
3861I6j554J635R12j788O40M84j518R97J980k767j478L544J041m212l5L796n11
3878A262k802P25K011n30j552P60J074j024o91J341j3j349J072O11j795O24J805
3895A529k138j334L498j69l418J166K784j410k237J414J475p60j100M01O51k75
3911G7k04Q3k35J53R95p13j438J870J151k929l40L679j225l658K397K772k646
$$ y = [719, -556, -720, 799, 331, -1179, -353, 1662, 96, -2165, 361, 2263, -795, -1897, 1164, 1132, -1283, 121, 1229, -839, -310, 1484, -447, -1484, 1454, 930, -1218, -295, 1625, -190, -1655, 593, 1629, -845, -1946, 1192, 2003, -1454, -1855, 1684, 1220, -1730, -370, 1183, -606, -123, 790, -944, -900, 1657, 579, -1926, -26, 2093, -504, -1414, 559, 966, -767, -780, 876, 754, -1244, -380, 1467, 96, -1458, 177, 1089, -699, -59, 425, -1093, -96, 1884, -883, -2361, 1183, 2224, -1988, -2023, 1773, 1262, -1540, -815, 1196, 666, -886, -126, 948, -76, -767, 574, 561, -788, 284, 895, -900, -276, 1529, -609, -1943, 1555, 1386, -2032, -866, 1918, 508, -1729, -315, 1160, 400, -700, -299, 352, 77, -127, -44, -279, -126, 869, 156, -1282, 588, 1739, -1190, -1530, 2149, 924, -2734, -337, 2435, -211]
3928b11j905K603R38j841n18J161K55j78n01n9j5O73L57j046j102K081J134l248
3946a422l3L222q37l051K147J920k408j006K426j2j653L76O55k95K18j61q24P88
3964E0J062j017j490J095J957r56k756J512L250k676k690L222J430k994r0K497
3980A406j295j130J531j97j010R55M47j526N01J543j148j537J300J824j711j883
3996a930J934K402k731k171L336J206l080n62K703m92j205O45n5m68J312m71j747
4013a374J576J193k041p33K118N59k161m53K063Q52k550p44K953K47k748L17K111
4030A185j262k95P20j020K77J993j489k380K662J803l301q85L171M46k928J57
4046a146K520n1k584L04K303p76k134J289J555j502m04R15m76n5J373j540j527
$$ y = [-211, -2116, 487, 1425, -416, -934, 227, 482, 304, -197, -256, -271, 402, 759, -287, -1389, 692, 1826, -1422, -1455, 1767, 930, -2121, 26, 1946, -462, -1468, 958, 946, -707, -331, 324, 29, 247, 86, -738, 50, 1112, 95, -1395, -300, 1657, 701, -2055, -543, 2707, 31, -2659, 563, 1993, -1001, -1091, 1406, 111, -1019, 512, 315, -695, 260, 707, -819, -318, 1225, 77, -1460, -160, 1664, -47, -1930, 4, 2406, -325, -2496, 840, 2046, -1034, -1596, 1107, 615, -590, 55, 0, -468, 844, 373, -1374, 202, 1395, -646, -1379, 739, 1298, -863, -1316, 747, 1599, -951, -1695, 1258, 1505, -1243, -926, 1185, -77, -372, 348, -672, -395, 1598, 109, -2271, 391, 2194, -1107, -1992, 1179, 1625, -1303, -1146, 1374, 1323, -1261, -957, 1346, 570, -1564, -275, 1280, -222, -626, 289, -187, -242, 1131, -409, -1936]
4063a936L083P35l432o9L425n70k904N72K467o83j821N63J242l44r02K47O91n33
4081a69L21Kr29R83J055j860j048L245o4l828J230L430j902k718K067J898j670
4098D3j195J199O49m20p63J95N50m5m4o30o7J062N00j818n16K970m18l338J616
4117d70K719k468j627K563L13j644OP18J27N4l62m31M00P77k33j210Q2J917l40
4136H91k464N67K970j587k947K532K618l208j370K998J98k183M64J140m02k19
4152bll13K14R52q88q14P73J394j067j679J071K050j659j980K127J585k498o11
4170a348K395l78j412Q37j1n67R47jj671J195J590j802j182J817J208k132j407
4187a922K695J020k675j097L027M92k959M5K839q74j687J111N18j049R53P0j502
$$ y = [-1936, 1147, 1882, -1550, -1619, 1806, 1236, -1668, -1096, 1371, 688, -1133, -570, 672, 328, -574, -327, 364, -169, 152, 154, -775, 208, 1263, -597, -1645, 1600, 1536, -2292, -1062, 2368, 466, -2252, -185, 1713, 43, -1152, 47, 696, 276, -487, -292, 258, 213, 169, -461, -528, 534, 1034, -784, -1300, 1670, 1252, -2086, -470, 2249, -219, -1846, 717, 1030, -614, -608, 110, 237, 291, -71, -502, -102, 675, 442, -768, -686, 1231, 891, -1573, -1006, 1964, 377, -2570, -38, 2580, -628, -1998, 1000, 1198, -985, -521, 619, 217, -2, -5, -318, -104, 848, -40, -854, -81, 1313, 246, -1433, -362, 1688, 29, -1951, 176, 1761, -737, -1348, 1047, 669, -743, 94, 83, -484, 463, 462, -1209, -14, 1576, -226, -1408, 409, 1617, -515, -1922, 773, 1793, -882, -1979, 1048, 1540, -1419, -1374, 1465, 591, -1096, 15, 533, -516, 437, 507, -995]
4204i95R41J356j742p98J637P71j855l85J740L47j639m54J863J96j798J06J285
4221E76k62p31M98m49K80J108j176j379K533P83l065m80L690o65l224J430K025
4238A492j122j761R58J509r18j028P09J031j114j70J029j044k02J556p48j572
4254a395J904J109k760k0K567n21k593J293J723j219j128J001O32l03p56J52P07
4271C93p7n18mo2N63N69j452m06K192j0k830P52K781j767j810K167O76j775J8
$$ y = [-995, -54, 1302, -440, -1238, 399, 1170, -685, -1070, 670, 1017, -622, -1076, 787, 983, -815, -709, 576, 314, -417, 81, -368, -88, 1020, -156, -1535, 998, 1781, -1284, -1764, 1926, 1261, -1963, -533, 1492, 370, -1391, -433, 1076, 158, -870, -161, 870, -244, -414, 615, -429, -631, 925, 177, -1395, 509, 1618, -1142, -1162, 1405, 884, -1709, -416, 1307, 88, -1040, -39, 593, 290, -466, -314, 393, 316, -202, -206, -268, 295, 864, -588, -994, 1198, 1188, -1642, -890, 1891, 124, -1686, 481, 1157, -618, -600]
$$ [...]
8191a47
##END NTUPLES=NMR FID
##END=
