##TITLE=1H_ANY-172-1
 DMSO-d6, 8 sc, 
 30.06.2021
##JCAMPDX= 6.0         $$ Bruker NMR JCAMP-DX V2.0
##DATA TYPE= NMR FID
##DATA CLASS= NTUPLES
##ORIGIN= UXNMR, Bruker Analytische Messtechnik GmbH
##OWNER= root
$$ XWIN-NMR		Version 3.5
$$ Wed Jun 30 09:26:41 2021 Russian Standard Time (UT+4h)  she@DPX200
##.OBSERVE FREQUENCY= 200.131506
##.OBSERVE NUCLEUS= ^1H
##.DELAY= (6, 6)
##.ACQUISITION MODE= SIMULTANEOUS
##.ACQUISITION SCHEME= undefined
##.AVERAGES= 8
##.DIGITISER RES= 18
##SPECTROMETER/DATA SYSTEM= spect
##.PULSE SEQUENCE= zg30
##.SOLVENT NAME= DMSO
##.SHIFT REFERENCE= (INTERNAL, DMSO, 0, 15.7039)
##AUDIT TRAIL= $$ (NUMBER, WHEN, WHO, WHERE, WHAT)
$$ ##TITLE= Audit trail, XWIN-NMR		Version 3.5
$$ ##JCAMPDX= 5.01
$$ ##ORIGIN= Bruker BioSpin GmbH
$$ ##OWNER= she
$$ F:/spectra/data/she/nmr/H-F/1/audita.txt
$$ ##AUDIT TRAIL=  $$ (NUMBER, WHEN, WHO, WHERE, WHAT)
(   1,<2021-06-30 09:24:39.79 +0400>,<she>,<DPX200>,
      <created by zg, POWCHK disabled, PULCHK disabled
       configuration hash MD5:
       00 E9 B6 7A A2 85 ED C7 34 08 36 98 17 FE 4E 26
       data hash MD5: 16K
       80 43 71 22 CA 42 87 9A 46 F2 F6 3D EA BF AF BE>)
$$ ##END=
$$ 
$$ hash MD5
$$ 71 72 9D 09 D6 83 44 6A C4 00 A4 94 80 18 E5 DC
##$RELAX= 
##$RELAX= 
##$RELAX= 
##$RELAX= 
##$RELAX= 
##$RELAX= 
$$ Bruker specific parameters
$$ --------------------------
##$DU= <F:/spectra>
##$EXPNO= 1
##$NAME= <H-F>
##$PROCNO= 1
##$TYPE= <nmr>
##$USER= <she>
##$AMP= (0..31)
100 100 100 100 100 100 100 100 100 100 100 100 100 100 100 100 100 100 
100 100 100 100 100 100 100 100 100 100 100 100 100 100 
##$AQSEQ= 0
##$AQ_mod= 1
##$AUNM= <au_zg>
##$AUTOPOS= <>
##$BF1= 200.13
##$BF2= 200.13
##$BF3= 200.13
##$BF4= 200.13
##$BF5= 200.13
##$BF6= 200.13
##$BF7= 200.13
##$BF8= 200.13
##$BYTORDA= 1
##$CFDGTYP= 0
##$CFRGTYP= 5
##$CHEMSTR= <none>
##$CNST= (0..31)
1 1 145 1 1 1 1 1 1 1 1 1 1 1 1 1 1 1 1 1 1 1 1 1 1 1 1 1 1 1 1 1 
##$CPDPRG= <>
##$CPDPRG1= <>
##$CPDPRG2= <>
##$CPDPRG3= <>
##$CPDPRG4= <mlev>
##$CPDPRG5= <mlev>
##$CPDPRG6= <mlev>
##$CPDPRG7= <mlev>
##$CPDPRG8= <mlev>
##$CPDPRGB= <>
##$CPDPRGT= <>
##$D= (0..31)
0 1.2 0 0 0 0 0 0 0 0.06 0 0.03 0 0 0 0 0.0002 0 0 0 0 0 0 0 0 0 0 0 0 
0 0 0 
##$DATE= 1625030679
##$DBL= (0..7)
120 120 120 120 120 120 120 120 
##$DBP= (0..7)
150 150 150 150 150 150 150 150 
##$DBP07= 0
##$DBPNAM0= <>
##$DBPNAM1= <>
##$DBPNAM2= <>
##$DBPNAM3= <>
##$DBPNAM4= <>
##$DBPNAM5= <>
##$DBPNAM6= <>
##$DBPNAM7= <>
##$DBPOAL= (0..7)
0.5 0.5 0.5 0.5 0.5 0.5 0.5 0.5 
##$DBPOFFS= (0..7)
0 0 0 0 0 0 0 0 
##$DE= 6
##$DECBNUC= <off>
##$DECIM= 32
##$DECNUC= <off>
##$DECSTAT= 4
##$DIGMOD= 1
##$DIGTYP= 9
##$DL= (0..7)
0 120 120 120 120 120 120 120 
##$DP= (0..7)
150 150 150 150 150 150 150 150 
##$DP07= 0
##$DPNAME0= <>
##$DPNAME1= <>
##$DPNAME2= <>
##$DPNAME3= <>
##$DPNAME4= <>
##$DPNAME5= <>
##$DPNAME6= <>
##$DPNAME7= <>
##$DPOAL= (0..7)
0.5 0.5 0.5 0.5 0.5 0.5 0.5 0.5 
##$DPOFFS= (0..7)
0 0 0 0 0 0 0 0 
##$DQDMODE= 0
##$DR= 18
##$DS= 0
##$DSLIST= <SSSSSSSSSSSSSSS>
$$ [...]
##$SUBNAM2= <"">
##$SUBNAM3= <"">
##$SUBNAM4= <"">
##$SUBNAM5= <"">
##$SUBNAM6= <"">
##$SUBNAM7= <"">
##$SUBNAM8= <"">
##$SUBNAM9= <"">
##$SW= 20.0188882624521
##$SWIBOX= (0..15)
0 0 2 0 0 0 0 0 0 0 0 0 0 0 0 0 
##$SW_h= 4006.41025641026
##$TD= 16384
##$TD0= 1
##$TE= 0
##$TE2= 300
##$TE3= 300
##$TEG= 300
##$TL= (0..7)
0 120 120 120 120 120 120 120 
##$TP= (0..7)
150 150 150 150 150 150 150 150 
##$TP07= 0
##$TPNAME0= <>
##$TPNAME1= <>
##$TPNAME2= <>
##$TPNAME3= <>
##$TPNAME4= <>
##$TPNAME5= <>
##$TPNAME6= <>
##$TPNAME7= <>
##$TPOAL= (0..7)
0.5 0.5 0.5 0.5 0.5 0.5 0.5 0.5 
##$TPOFFS= (0..7)
0 0 0 0 0 0 0 0 
##$TUNHIN= 0
##$TUNHOUT= 0
##$TUNXOUT= 0
##$USERA1= <user>
##$USERA2= <user>
##$USERA3= <user>
##$USERA4= <user>
##$USERA5= <user>
##$V9= 5
##$VALIST= <valist>
##$VCLIST= <CCCCCCCCCCCCCCC>
##$VD= 0
##$VDLIST= <DDDDDDDDDDDDDDD>
##$VPLIST= <PPPPPPPPPPPPPPP>
##$VTLIST= <TTTTTTTTTTTTTTT>
##$WBST= 1024
##$WBSW= 4
##$XGAIN= (0..3)
0 0 0 0 
##$XL= 0
##$YL= 0
##$YMAX_a= 317935
##$YMIN_a= -375984
##$ZGOPTNS= <>
##$ZL1= 120
##$ZL2= 120
##$ZL3= 120
##$ZL4= 120
##$ABSF1= 10
##$ABSF2= 0
##$ABSG= 5
##$ABSL= 3
##$ALPHA= 0
##$AQORDER= 0
##$ASSFAC= 0
##$ASSFACI= 0
##$ASSFACX= 0
##$ASSWID= 0
##$AUNMP= <proc_1d>
##$AZFE= 0.1
##$AZFW= 0.1
##$BCFW= 1
##$BC_mod= 2
##$BYTORDP= 1
##$COROFFS= 0
##$CY= 11.3945322036743
##$DATMOD= 1
##$DC= 2
##$DFILT= <>
##$DTYPP= 0
##$F1P= 15.9154993809931
##$F2P= -4.1035820241983
##$FCOR= 0.5
##$FTSIZE= 0
##$FT_mod= 4
##$GAMMA= 1
##$GB= 0.15
##$INTBC= 1
##$INTSCL= 1
##$ISEN= 128
##$LB= 0.24
##$LEV0= 0
##$LPBIN= 0
##$MAXI= 10000
##$MC2= 0
##$MEAN= 0
##$ME_mod= 0
##$MI= 1.114404
##$NCOEF= 0
##$NC_proc= 0
##$NLEV= 6
##$NOISF1= 3.799351
##$NOISF2= 2.8
##$NSP= 1
##$NTH_PI= 0
##$NZP= 0
##$OFFSET= 15.70392
##$PC= 1
##$PHC0= -11919.17
##$PHC1= 11.80101
##$PH_mod= 1
##$PKNL= yes
##$PPARMOD= 0
##$PSCAL= 0
##$PSIGN= 0
##$REVERSE= no
##$SF= 200.130013532006
##$SI= 16384
##$SIGF1= 3
##$SIGF2= 2
##$SINO= 400
##$SIOLD= 16384
##$SREGLST= <1H.CDCl3>
##$SSB= 0
##$STSI= 0
##$STSR= 0
##$SW_p= 3612.71676300578
##$SYMM= 0
##$S_DEV= 0
##$TDeff= 0
##$TDoff= 0
##$TI= <>
##$TILT= no
##$TM1= 0
##$TM2= 0
##$TOPLEV= 0
##$USERP1= <user>
##$USERP2= <user>
##$USERP3= <user>
##$USERP4= <user>
##$USERP5= <user>
##$WDW= 1
##$XDIM= 8192
##$YMAX_p= 0
##$YMIN_p= 0
$$ End of Bruker specific parameters
$$ ---------------------------------
##NTUPLES= NMR FID
##VAR_NAME=  TIME,          FID/REAL,        FID/IMAG
##SYMBOL=    X,             R,               I
##VAR_TYPE=  INDEPENDENT,   DEPENDENT,       DEPENDENT
##VAR_FORM=  AFFN,          ASDF,            ASDF
##VAR_DIM=   8192,          8192,            8192
##UNITS=     SECONDS,       ARBITRARY UNITS, ARBITRARY UNITS
##FACTOR=    0.0002496,     1,               1
##FIRST=     0,             0,               0
##LAST=      2.0444736,     0,               0
##MIN=       0,             -375984,         0
##MAX=       2.0444736,     317935,          0
$$ Real data points
##PAGE= N=1
##DATA TABLE= (X++(R..R)), XYDATA
$$ [...]
1830a156M279j510l407k54J620J421L26j384k557R60M046J077n013l041M301M981
1846D689k233n132k84L869J831j493j842q32Q87K339Q47l219k647K933M234j858
1862B089n325p8N289J636l809l065J516K548J124j036k407j475K278L699j048
1877A936m739o91M936K001l793l011K369L339m48k587j252Q85K050J790j640l814
1893b669k2M588K572m133m214K353M448n85l393r49J951J346j64j408j699J58
1909a820L419J226l484l517K567N003q82m761j358L801K467j644k110j57O87J719
1925A156P83j954k506J527L879k79m842r35M486K645l169l538J315K672Q56j121
1941I75j856j156J473K688K16l966j646L678K937k897l780J448L840J36l120j175
$$ plain form
1830 -1156 3123 1613 -1794 -2048 -428 993 1319 -65 -2622 -1662 2384 3461 -1552 -4593 -292 4689
1846 4689 2456 -2676 -2960 909 2740 1247 -595 -1427 -540 1799 2646 -573 -3220 -287 3947 2089
1862 2089 -3236 -3314 1975 3611 -198 -3263 -1747 801 1925 889 -1518 -2993 -715 2984 1936
1877 1936 -2803 -3494 1442 3443 -350 -3361 -992 2347 1899 -688 -1940 -1055 995 2785 1145 -2669
1893 -2669 -2691 1897 4469 336 -3878 -1525 2923 2338 -1055 -2004 -53 1293 1129 -279 -1978 -1820
1909 -1820 1599 2825 -659 -4176 -1609 3394 2512 -2249 -3607 194 2661 1017 -1093 -1250 -563 1156
1925 1156 1939 -15 -2521 -994 2885 2606 -2236 -3171 1315 3960 791 -2747 -1432 1240 2096 975
1941 975 -881 -2037 -564 2124 2340 -1626 -3272 406 3343 446 -3334 -1886 1954 2090 -1030 -2205
1957b205J195J988N11q03k600p16L111K892k308m049P31M700M47l317j998K277
1973a44K191q00j553q92M15J820J241k043l083J228M087P24m461k217L106K925
1989B544j214k826j45J129J496J68j491j630P66K895M52l668j746L436L072k034
2005A204l568L69L017J236j562j585n41R52K238M66l057j744K439L091j659l695
2021b399K54L846R18l215j450J298J775K10p22j729q63K036K603j332l948n5M073
2038A300J533l241k479K237K368o73j803m51P82J259O31p21k811K35L669J234
2054C069l185k942K377L185n92l187m77K009R35l68j187r06M53J720R78k538j942
2071b598J788L472q87l965m11L206J718j851j941j7J274J073N08j862j506J327
$$ plain form
1957 -2205 -1010 978 1489 686 -1914 -2630 481 3373 1065 -2984 -2253 2447 2894 -423 -2421 -144
1973 -144 2047 1247 -306 -1198 -783 1037 2278 235 -2848 -1620 2467 3191 -1270 -3487 -381 2544
1989 2544 1330 -1496 -1641 -512 984 1152 -339 -1969 -1203 1692 2144 -1524 -3270 166 3238 1204
2005 1204 -2364 -1995 1022 2258 696 -889 -1430 -478 1760 2226 -831 -2575 -136 2955 1296 -2399
2021 -2399 -2145 1701 2619 -596 -2046 -748 1027 1237 515 -1214 -2077 -41 2562 1230 -2718 -2773 1300
2038 1300 2833 -408 -2887 -650 1718 1045 -758 -1209 -427 832 1463 742 -2069 -1834 1835 3069
2054 3069 -116 -3058 -681 2504 1912 -1275 -1752 257 1192 824 -363 -1269 -816 904 1882 -656 -2598
2071 -2598 -810 2662 1775 -2190 -2601 605 2323 472 -1469 -1486 -212 861 1369 -493 -1999 -672
2087f72K737l33l522k94L124J588k472k158R74K319K48j231j193n86J565J828
2103A922n13l104p58L124J863k340k552J209K562j92j918q24Q39J445L40p51k027
2120a675k88K988J640k604k731J500L348j30k946r56J996J357o96j042n73L61
2136d51J299R19j600k289J226L099K5l653j036K876K030j661k168J20J467P71
2152I74J4j000j520N84K261L98k823j313K695K155j917k678P61K789K35j587j160
2169a132K08R34J488k62j962j288K130K273j385k763M56K645N90k374j128J154
2185d16J417R5r89j163l41J914J339j303k688N71K844O08k565j381J712J677n63
2202G68j436l57N84J041N17j013j706M73K715M61k796j524K037K369r91k136l24
$$ plain form
2087 -672 2065 1732 -1790 -2084 1040 2628 156 -2002 -1028 1291 1539 308 -885 -1471 94 1922
2103 1922 1409 -1695 -2453 671 2534 194 -2358 -1149 1413 1221 -697 -1521 -682 763 1103 352 -1675
2120 -1675 -1963 1025 2665 61 -2670 -1170 2178 2048 -898 -1854 142 1499 803 -239 -812 -451
2136 -451 848 1767 167 -2122 -896 2203 2228 -1425 -2461 415 2445 784 -1384 -1264 203 974
2152 974 988 -12 -1532 -948 1313 1711 -1112 -2425 270 2425 508 -2170 -1409 1380 1615 28 -1132
2169 -1132 -924 10 1498 1236 -726 -2014 116 2389 1004 -1759 -1303 1342 1932 -442 -1570 -416
2185 -416 1001 1096 107 -1056 -1397 517 1856 553 -2135 -1564 1280 1888 -677 -2058 -346 1331 768
2202 768 -668 -1025 -441 600 1117 104 -1602 -1129 1586 2047 -749 -2273 -236 2133 1142 -994 -1318
2219a318J579O98k65o72j090N44J562L91k055j386J867K274j192k482j25K561
2235H91P90j730j331L65J091P58L7j360j273J288K394o33k808O6K385J085k201
2252a86j522J259J486J7j057o21n7Q57J124n63k190l02K558J420k213k062J319
2269g33K130k52j972k62P68J082r4q42r00N1J765R09k003j672J239K648m85k486
2287a109l95J615R75n53r40m23N89J068L71j240j331J060J938m71k378l71K302
2304G07J007j264j629L53J212N39l61r93j030J186J675l57k096o61K125J179j411
2321A81j775P70J816Lj146p76J55J086Q56m89j732m91J969J662j711k034P52K411
2339A507k02j876m35J036O20op11p92R2J361J015j557j823O81K573L8k455r04
$$ plain form
2219 -1318 261 959 694 22 -1068 -524 1038 1429 -626 -2012 -145 2129 937 -1545 -1670 891
2235 891 1681 -49 -1380 -1015 76 834 871 -489 -1762 -474 1920 1287 -1521 -1455 930 2015 -186
2252 -186 -1708 -449 1037 1054 -3 -624 -681 176 1300 737 -1453 -1755 803 2223 10 -2052 -733
2269 -733 1397 1145 -827 -1089 -321 761 667 -175 -1075 -1024 741 1650 -353 -2025 -786 1862 1377 -1109
2287 -1109 -1504 111 1086 533 -407 -830 -241 827 1198 -42 -1373 -313 1625 1154 -1224 -1595 707
2304 707 1714 450 -1179 -826 386 925 564 -429 -1459 -273 1402 1045 -1051 -1712 413 1592 181
2321 181 -1594 -824 992 995 -151 -927 -772 314 1170 681 -1051 -1542 427 2089 378 -1656 -904 1507
2339 1507 1305 -571 -1006 30 650 644 -67 -859 -767 594 1609 52 -1771 -1090 1483 1521 -934 -1838
2357a838J772J319p66j376J49M06Q44Q6o35r41L53J991j20k025j093J971J833
2374A930j340j636P8J616M96p49q43o2K77J070K20j630p79J331J614j153j639
2391a199lJ996L34j526p67M84J081M29o27r34m40J058J595r31k004K60K132M61
2409A399j516j133J041J033j96p65n85L42Q22Q79r72j830N27J988N13j981j215
2426a649J576J404o49j350r4R23N23J6n46j166K92J437N16j791j264J627J739
2443A544p43k078R5J522P21q52p57j99N42Q36K52j284q81J043J749o49k124K51
2461a012J863N21j533r82P28J178r2m92n84l78P46J182n41j699k68J991P13j545
2479b04j364J195J222l39j048l67N51O09K98l36j083N6J595N44j450j303R19J950
$$ plain form
2357 -1838 -66 1253 487 -889 -740 -334 510 596 -39 -980 -627 1364 1244 -781 -1874 97 1930
2374 1930 590 -1046 -968 648 1144 395 -448 -510 -233 837 1057 -573 -1352 -21 1593 440 -1199
2391 -1199 -1202 794 1128 -398 -1165 -681 400 829 202 -732 -1172 -114 1481 550 -1454 -1194 938 1399
2409 1399 -117 -1250 -209 824 628 -137 -722 -380 442 1321 349 -1481 -954 1034 1547 -434 -1649
2426 -1649 -73 1331 682 -668 -762 161 684 700 154 -1012 -720 717 1233 -558 -1822 -195 1544
2443 1544 801 -1277 -1182 340 1061 209 -548 -747 -205 631 883 -401 -1282 -239 1510 861 -1263 -1012
2461 -1012 851 1372 -161 -1143 -415 763 671 179 -405 -783 -37 1145 604 -1095 -1363 628 1341 -204
2479 -204 -1568 -373 849 510 -538 -905 -354 255 553 217 -866 -810 785 1329 -121 -1424 -505 1445
2497A445l77j509m06R62O15l12n93m66J07J244J26j187p94Q03J683m70j731n18
2515a378J519J091r70r40m2N43P65J28r79q60P18J294k16j650l38J684R22j204
2533H7j074M91J162J49o28m89k52O49P81k7j710k03J475R03j096j402P11J425
2551I52m1j143m60N85P24j01m12q83l62J215J096j110j525O61J748P5j674l49
2569a004R42P23k97n98j40P1N92L78o40q85L56J480J50j766n46J250J006o06j118
2588f52l9Q29L25%n48o66M97J230j50j375o37J438J065r13j522L97J291K55p99
2607B6o31L3M44P51J46j264n41J166J031p80j471L92J321J97r99o00N60P17l8
2626D60l10p72m6R54Q44q35j308L46J101P04j416q54R34R13j66r67j56M21L07
$$ plain form
2497 1445 1068 -441 -847 115 730 418 -175 -641 -534 710 836 -351 -1145 -342 1341 871 -860 -1378
2515 -1378 141 1232 262 -678 -720 -177 588 716 -263 -1123 -405 889 673 -977 -1315 369 1291 87
2533 87 -987 -496 666 815 187 -302 -554 95 876 849 -861 -1064 411 1314 218 -1184 -473 952
2551 952 911 -232 -692 -107 617 516 104 -779 -1141 74 1170 60 -1465 -804 944 1019 -655 -1004
2569 -1004 -62 661 364 -234 -374 -303 289 667 27 -858 -502 978 1128 -638 -1184 66 1072 466 -652
2588 -652 -691 138 463 463 -85 -751 -254 976 826 -549 -1186 252 1317 404 -1118 -721 570 825 26
2607 26 -605 -572 -128 623 769 -495 -1036 130 1161 381 -1090 -698 623 820 -179 -779 -219 498 460
2626 460 150 -622 -668 286 1130 295 -1013 -667 434 1138 -278 -1132 -198 715 549 -418 -574 -153 154
2645A54N35n67r90K25J371J63j128r18Q55J320k96j326k06R92L34k08n27k10J02
2664c25Q21M08j146j029J200J231m91j539N5J214M19o17p46L5O43N92j75p72o02
2683h24N72J101j70j342j72J071Q82j215q97O26Q74N3m46n73q1N86N69k25j128
2702g39n5J272P23j183j068N82J265j83r57j11M84K62J52j99q65L1J089M26j064
2721a38j071O41J514m6j390m93J194M38k07p65j58M08N51J54n91j001M46J372
2739H58k9j514l82J285P55q03p22J48O37K65p0p26n36N32J030j68j154m24J086
2758F8J007q70j197K90J091K53q61l66N5N67M30p1j025j72J013P10o64j055J98
2777e99J181K26q61o13N53O94l62k57k88j03Q00M60n03j202J93J384K29j288n81
$$ plain form
2645 154 689 122 -868 -643 728 891 -237 -1155 -300 1020 724 -602 -808 184 518 310 -217 -427 -325
2664 -325 496 904 -242 -1271 -71 1160 669 -870 -815 399 818 201 -545 -510 133 725 550 -222 -824
2683 -824 -252 849 679 -663 -835 236 1118 -97 -994 -368 506 559 113 -460 -541 45 614 389 -739
2702 -739 -794 478 1201 18 -1050 -468 797 614 -343 -454 30 292 444 245 -620 -589 500 926 -138
2721 -138 -1209 -568 946 900 -490 -983 211 649 442 -323 -481 -73 478 632 41 -960 -514 858
2739 858 829 -685 -1067 218 973 170 -552 -404 233 498 428 -298 -834 -302 728 560 -594 -1018 68
2758 68 1075 205 -992 -702 389 642 -219 -585 -530 37 467 396 -629 -801 212 922 258 -797 -599
2777 -599 582 808 -53 -666 -113 581 219 -38 -326 -429 371 831 328 -874 -681 703 932 -356 -937
2796i37R08O57k20q00K8J67O38L4o12o39M93Q66K08j203o16R37R47l31j028j30
2816f33Q02N58m84l25l92L01O53J24r91n54J076Q18n35j265K99R24L81p70n54
2835e67J02P43J24q5n77n19P86Q41m66j079kJ116N26j088o50N79N39J24m87l83
2855d23J4N92M08k81r30l8J209L95r50q22N39P80n3m79l46L45M51p5m13m67J20
2876d24Q09J84o94o50M19J012j3j233n9P40M25k83l14k23J84M19K58p43o58P33
2896a11O69p5j038j17P20P86o23p90K73M55J71j79l34j53J94Q11j55q89k75Q19
2916A59O76p52q17L37O04L02p44k20K18M59K69l95o17j26O44Q33q53p47L34R60
2936E24q2n59n18O03L83J03m63m44O6N23K73m04n34J07R77J74q76m70M92P65k59
$$ plain form
2796 -937 -29 628 408 -392 -364 -197 441 475 -137 -776 -283 583 791 -412 -1028 -91 856 525 -503 -633
2816 -633 169 727 243 -82 -474 -173 480 604 -387 -941 135 953 418 -847 -548 376 757 -13 -567
2835 -567 -465 278 402 317 -260 -779 7 848 382 -697 -699 417 943 -145 -795 -216 323 447 -40 -423
2855 -423 -409 183 591 310 -620 -658 551 946 -4 -826 -287 493 440 -39 -385 -40 411 336 -77 -544 -424
2876 -424 385 569 -125 -775 -356 656 643 -590 -649 91 516 233 -81 -304 -120 299 557 -186 -844 -111
2896 -111 558 483 -555 -672 48 834 211 -579 -306 149 320 141 -193 -346 -152 659 504 -385 -660 159
2916 159 835 83 -734 -397 207 509 -235 -455 -237 222 491 96 -521 -647 -3 830 -23 -770 -436 524
2936 524 442 -117 -635 -32 351 454 -9 -453 -387 136 409 5 -529 -422 555 729 -147 -617 -125 640 381
2957C81o62j51L41M22o1j96n74J05P97K04q22m82P52O21o02n78K13L15N60m00
2977A83n75R3K72N42r5o51l25N92P78n62q33J76P79K10n75l79J46M76P6l40k11
2998b23l24N87N42l97q29O9R24M27r39m70O85J19N5m50N7k00M46L18k82p15k7
3019f27R51M46r57m92O84N85k34o52j10K08M80r1j96n38J88N24L80m28q15O26
3039f8N23Qj013N7O20K92n74m2q1J03N85R8o42m88M00O64j12p47j33P41L86l09
3061B68p05K47L21J49mn57j45L22M37K4o73r9O53M05n27o84K89M83J36l58k21
3082b39J27J67J85j53m90k0N95K15l06o48K45R87k1p63l45L85L92J4m67j38j0
3103b88N27J85m22o29L86P98Jp54k23L85M69k61m68m9L07M16j4l58m28K59N75
$$ plain form
2957 381 -281 -432 -91 331 270 74 -500 -395 402 606 -216 -698 54 675 73 -505 -292 23 583 183
2977 183 -392 -299 -27 515 420 -231 -556 36 814 252 -581 -405 374 584 9 -370 -224 252 328 -12 -223
2998 -223 -547 40 582 185 -644 -575 349 776 -163 -633 52 171 226 -224 -167 -367 79 397 115 -600 -627
3019 -627 324 770 -187 -679 5 590 356 -296 -406 -198 282 191 -5 -543 -355 169 549 121 -694 -68
3039 -68 455 463 -550 -493 127 419 -155 -197 -278 -175 410 508 -134 -622 -222 442 330 -417 -550 191 577 268
3061 268 -437 -190 131 280 276 -281 -426 -104 333 357 -316 -415 238 643 116 -568 -279 204 340 -18 -239
3082 -239 -112 55 240 87 -403 -423 172 387 81 -567 -322 665 644 -119 -464 -79 313 327 -140 -278 -288
3103 -288 239 424 2 -627 -241 557 558 -196 -419 -34 435 174 -294 -343 -36 380 366 8 -420 -161 414
3124D14P7q67j65N70M82l16m50k5L37J12L1k87l48K35M09K2n95j49N32M47k63
3145B03o06R3N72J7k46m18J75N36j60r2k52j74M69K93j71p28N7P96M2m61m72L60
3167a67M51ll29k20J14K14K48k78m67J62N13J51n63l13K47O42j22m44j41L24K81
3188C00l3m03j32J46K64J34m37j37K67N28j58q14R9M51K39l47k48j1M36O1J47
3209C52m31k03J52O46k28n66j40O52J04m09k53j1N09K4O9m91J90L1L80n2o01M1
3231b35L40L43n12k31J28N63n9l93l08K23J94O9K42n91kK92L57k70n80L05N26
3252D01o0n06j54J06M20Q6k41j60M1K72Jk65l17L33L48J63p29j71L60M63j09o32
3274c50J01L52r9J11j44n02L67N17Ro06k4L68L50l78k95j39N51N8l33j15o8K47
$$ plain form
3124 414 491 -376 -541 29 511 195 -255 -280 57 169 200 -87 -435 -200 209 231 -364 -513 19 466 203
3145 203 -403 -310 262 279 33 -385 -210 326 166 74 -178 -352 117 410 239 -489 -432 364 406 -55 -527 -167
3167 -167 284 281 -48 -268 -154 60 308 30 -437 -275 238 389 -174 -487 -240 402 280 -164 -305 19 300
3188 300 267 -136 -268 -122 142 276 -161 -298 -31 497 339 -475 -376 75 314 -33 -281 -292 144 205 352
3209 352 -79 -282 -130 516 288 -278 -418 234 338 -71 -324 -335 174 198 267 -224 -34 -3 377 325 -276 -235
3231 -235 105 448 -64 -295 -167 396 337 -56 -364 -141 53 122 364 -227 -229 63 420 150 -430 -125 401
3252 401 341 -165 -319 -213 207 293 52 -108 -67 205 206 -59 -376 -43 305 468 -261 -432 -72 391 282 -350
3274 -350 -249 103 4 115 -29 -531 -164 353 362 -244 -268 100 450 72 -223 -362 189 247 -86 -201 -269 -22
3296b2K88j23k75k49N17K61l86k50k9L15L17k28k35j51M11k4k26j02qK63M55l71
3318A48n22J59M94R0m26l08L35M24m0m07k28K84J39L20n92k74J30M45J71m88k06
3339c52L83L71j48k84k45L11J07J40m81o2P4M17O9m14l69L84N20l66k60r7L52
3360E0O0J16m98Q6kL56L0k05l54L66K65J6n20j54M72K32l35k16kM86J17k55j76
3383f5q0J36L84j41n27j0N14K54m37l21K83K80k2k99j44J8M27o0j56k97J8L11
3405F6K33j66n07K82M28l5m99j1Q2L00ok81j7k1L53L1m16j24K47L16m4m48l3Q4
3429a86M62p3m28n3L47J28K6k84j67P0M73q4m99j39M07M40l87k86L3L03J45j06
3451A42l79l0L75J28j15l31k35M06L78k90k02j7K16K93m23m3oK77J23k49j99J22
$$ plain form
3296 -22 266 143 -132 -381 136 397 11 -239 -268 47 364 136 -99 -250 161 137 -89 -191 -199 64 519 148
3318 148 -374 -215 279 369 -57 -365 -30 394 354 -53 -281 3 142 462 -130 -404 -274 171 342 -146 -352
3339 -352 31 402 254 -30 -275 36 143 283 -198 -260 -186 231 300 -114 -483 -99 421 55 -205 -302 50
3360 50 110 226 -272 -186 -188 168 198 -7 -361 5 270 286 -234 -388 84 316 -19 -235 -237 249 366 111 -65
3383 -65 -145 -9 375 234 -293 -303 211 465 28 -293 -10 270 248 -51 -195 -177 250 190 34 -263 -245 66
3405 66 299 133 -374 -92 336 301 -198 -209 -127 173 167 -114 -131 -152 201 232 -184 -308 -61 255 211 -237 -270 -186
3429 -186 276 203 -225 -278 69 197 223 -61 -228 -158 315 231 -268 -407 0 440 53 -233 -200 103 248 142
3451 142 -237 -267 108 236 121 -210 -445 -39 339 49 -153 -170 46 339 -84 -127 -133 144 267 18 -181 -59
3473e9K08J46l47l23K15J46K56m44j08J88K53r2j91L8J9P3K64k53l20J62L18M9
3495A98m17k5J84M38j43l66j54L58J03j45j11j10M5L44j12p1l07K45K76r0k94
3516a54l5L27L56k72l05j54M97p4k02J08l24L61J99j98m25J31L57J00l94n8k6
3537a85L38n3j62J2j11J11M38l33j63k43M53J36l39r2J63J27Q5k22r6n2L18J33
3559B63k15k75l1M78N8l39j68M2L66L3l12j9J74L06l00j31p5Q6R9K63m12q0J87
3582bK57pn25J63J55K12j46l76J04J79L2N5k03j29J36K67j22k03L8J46J25l30
3604a74m6l7L31J55j05r4J13p5J57k97j18j2K87Q4k88q7j9L85P8l42j13K66P3
3627A22M4j42k13j73L43K48mo08L27L31L5l75q4j1M24k19j2k50K34J00M5k06j53
$$ plain form
3473 -59 149 295 -52 -375 -160 -14 242 -202 -310 -122 131 39 -152 -114 -95 -22 242 -11 -331 -169 149 198
3495 198 -219 -244 -60 378 235 -131 -285 73 176 31 -80 -190 -145 199 87 16 -291 -46 230 140 -154
3516 -154 -189 138 494 222 -83 -237 260 186 -16 92 -232 129 328 130 -295 -164 193 293 -101 -159 -185
3537 -185 153 100 -62 -50 -161 -50 388 55 -108 -351 102 238 -101 -193 -30 97 182 -40 -136 -188 130 263
3559 263 48 -227 -258 220 278 -61 -229 -187 179 212 -100 -119 55 361 61 -70 -145 -59 40 303 -109 -189 -2
3582 -2 255 248 -277 -114 41 253 107 -269 -165 14 46 101 -102 -231 -95 172 50 -153 -115 31 156 -174
3604 -174 -220 -257 74 229 124 30 143 68 225 -72 -190 -202 85 169 -119 -206 -225 160 238 -104 -217 49 122
3627 122 166 24 -189 -362 -19 229 225 -383 -56 275 310 -65 -149 -160 264 45 33 -217 17 117 162 -44 -197
3650a97K4M38o6j96l49M31K01L1m52m9L39j17J53j40Ok24M70r6l16L4Q4K81j02
3673A88n21L50J50J01j95j35o1J68rJ28k12j12K78J81j21l19q7M07J1j14k65K24
3695C5K9p2m1J9j02R9J84j25k2j14P2J01P6m59K56K54o2k95k6J82L1J67k60p4
3719a47M8K58K9k14j18O7J48O6k85L1n0K21R1j22j2q0P7R2k46j40P0M38j59l23
3743b60jM99K7m10q2L12p9L4J97m87K01Q4J40J17k67k74K80K24j03k84p4L11J05
3766B10j69j1n4K07j51N7q6j69K25J65l22M4l7k0J80j53n4L0J77p6J0j41L2m2
3790a48M76l55j68J32K14r4k4k73K22K67k16Mo2j48R0K16k87j33J90o8L15l69
3812b19m4K66P7k7k36J56o0K18m0k82k1J4N3L09k67j93J19M89l63j32J12K9k8
$$ plain form
3650 -197 -173 265 199 3 -346 85 286 317 -135 -184 155 38 191 51 57 -167 303 207 -109 -75 9 290 188
3673 188 -333 17 167 268 73 -62 -123 45 36 164 -48 -160 118 299 178 -141 -228 179 190 76 -189 35
3695 35 64 -8 -49 -30 -132 -33 151 26 4 -110 -38 63 139 -320 -64 190 128 -167 -193 -11 20 187 -73 -147
3719 -147 -99 159 188 -26 -144 -77 71 137 -148 -117 -167 54 145 23 11 -69 8 100 -146 -286 -216 222 63 -260
3743 -260 -261 238 265 -145 -227 85 6 40 237 -250 -49 35 175 292 25 -249 31 255 152 -132 -206 105 210
3766 210 41 30 -24 183 32 89 3 -166 59 224 -98 -54 -91 -111 69 -84 -138 -108 69 -7 3 -138 -106 -148
3790 -148 328 -27 -195 -63 151 57 33 -240 -18 249 33 37 -25 -173 -83 133 -154 -287 -97 -165 150 -219
3812 -219 -263 3 80 53 -183 -27 -87 131 91 -191 -212 -198 -145 164 -103 -296 -177 312 -51 -183 -71 -42 -70
3835g0K7n3M6J32R6ll07l0J71J06l2k23k1J61K07k05k87K15P3J95q4l35K36qK09
3860B16r0k65R1J35J28k59o9K48R4p3r7j65K64q0n3n3j87J20J77J02j58k70K43
3883aQ7n7k55J94L5O6k9j04k3q3K63Qk17O1r0K28N0j93j31L51o5j33n1P6MJ50
3909A41L8j47K9j0K33l80k20n4N76L2j36l6j98K63j46k5j02L3K93k33P1n5K8P7
3933G2P9nl25K8L65j89k7j00J10P0j2j40q1J19J71j14L7j33K3J67j07k06K03J14
3957A19j29J75j32j05K3J63k7Nl29K64Q7Mk03PK23J18l00q9O7P0J31Rl09n3J07
3982a04K41r8R9j51k1L12k55k20J05O9K08j79N2q1l9J00k37J28j43K13J54j56
4004cj12j39L02J17k80O2K08pj08k5m7j52J60J79k08l18M19J24K7k7k36p4K04
$$ plain form
3835 -70 -43 -96 -50 82 178 175 -132 -162 9 115 83 -140 -161 0 207 2 -285 -70 3 198 114 -221 15 7 216
3860 216 126 -139 -48 87 215 -44 -113 135 229 156 59 -106 158 78 25 -28 -215 -95 82 184 26 -244 -1
3883 -1 86 29 -226 -32 3 69 40 -64 -87 -170 93 101 -116 -55 -145 83 133 -60 -191 160 95 -38 -89 -13 -9 141
3909 141 179 32 61 51 284 -96 -316 -370 206 238 102 66 -132 131 -15 -40 -142 -109 184 -49 22 -33 -5 72
3933 72 151 146 -179 -151 214 25 -2 -102 8 78 66 -74 -155 -36 135 21 58 -75 -52 115 8 -198 5 119
3957 119 -10 165 33 -72 -49 114 87 92 -237 27 114 118 -85 -78 145 263 -37 -126 -59 11 142 151 -158 -211 -104
3982 -104 137 39 138 -13 -34 278 23 -197 -92 -23 185 6 58 -23 -62 38 -199 -71 -214 -1 153 -3
4004 -3 -115 -254 48 165 -115 -53 155 148 40 15 -32 -184 -24 155 -53 -371 48 172 199 172 -64 -138 66
4027F6kj05rJ94n8Qj3k70J68J70p1k1q7O7J24n2o1j46J58J29k09j06J97J68k03
4052C6N5j7k20J45M9O6j70k1K80j40o9M6j17L09j53M8j23j03J09K22l2k46j48
4075a94K90K83k47j34j22K91p8j10JN5Q0pm3j00j48K27J33r1j33OK70k41N4p0
4099b8j4K3N9R3j68J93O1o8j73k11K17J68m3k50Q6J30j9m4j17j8J45j22J28n1
4123b3m2J89J70k04k30O2O0L30j90k72K8J95R0k48J24k26J61L02j13j04r4K12
4145A77j45Jj33K60j70L1M0j11o7p7J98J28k19j94K50K38j84l57J87J69N0j45
4167g3L3k8J04r5J08nj70P1J31j3j62R8K9R6j65j61K78n4j48N5K4K48j14K2k10
4192a01j51L65m0j4q5j78J46J97k50k2j8N7K06j23J04k54J55M6p6R4j79O9J69
$$ plain form
4027 66 64 -41 -50 144 86 94 81 -189 -21 149 78 57 -30 37 161 109 48 -98 60 189 -20 -126 71 239 36
4052 36 91 74 -146 -1 48 114 -56 -77 203 63 -6 40 -77 232 79 127 4 -99 10 232 200 -46 -194
4075 -194 96 379 132 -2 -124 167 89 -21 -20 35 115 108 65 -35 -183 44 177 86 -47 -41 229 -12 42 -28
4099 -28 -42 -19 40 133 -35 158 219 151 -22 -233 -16 152 109 -141 -55 75 56 12 -105 -123 22 -100 28 -23
4123 -23 -65 124 294 90 -140 -78 -18 312 122 -150 -122 73 163 -85 39 -187 -26 276 163 59 -35 177
4145 177 32 33 -100 160 -10 21 61 -50 -117 -194 4 132 -87 -281 -31 207 23 -334 -147 22 72 -73
4167 -73 -40 -68 36 -59 49 44 -126 -55 76 63 -99 -1 28 124 -41 -202 76 22 -126 -71 -47 201 87 109 -101
4192 -101 -252 113 73 59 -26 -204 -58 139 -111 -133 -151 -94 112 -11 93 -161 -6 40 -36 58 -121 -52 117
4215A17q1j33M4O1J02j99MP4k6J09r9r7J52o5Q9P2k67R7j15J87J54j35j45J64
4239F4K2q6j28M4o2K80j02j44rK48K5j24m7j79L15K2p3k13K2K06j02K0J05r0j42
4264a28J12l3P1j32J28j9p6J3PK00q1j24j02L7P7J48l18K0K46pJ55j79N9q8J21
4289A07j33j37J36J12q7J06p6L5mOj25n2oK00k8q3K7k28L19k41K41r4j4P7j6j39
4315i7k0P3Q9o2N3j28q8J08J00r9j5m7O7J8P5j11J43o6J37n6j65k3N7J56k06J03
4341dJ1J24j75K8j63L17j32M0j54o9J45K0J66k29P5pN1M1k40R7J14p7P4k00K85
4366A38j69J06k67J73k0J6J10P0k22k8J27m4o7j07K65L8r4J23k73LJ40O5j71J03
4390A5Lk9J61j36q5J29M4m6J74l82J38O5j9j16Qk2J80J47k77QN6p5j19J4J57M8
$$ plain form
4215 117 36 -97 -53 8 110 -89 -85 -11 -37 72 -27 -124 28 -37 52 124 -143 -46 -161 26 180 45 -100 64
4239 64 86 0 -128 -84 -146 134 32 -112 -121 127 152 28 -19 -198 117 139 66 -147 -125 81 -21 -1 104 14 -128
4264 -128 -16 -49 22 -110 18 -1 -77 -64 -57 143 62 -62 -164 -127 -50 98 -220 -200 46 39 194 15 74 -14 107
4289 107 -26 -163 -27 85 -2 104 28 63 59 65 -60 -112 -118 82 54 -29 -2 -230 89 -152 89 -5 -19 58 42 -97
4315 -97 -117 -44 45 -17 36 -92 -180 -72 28 -71 -86 -133 -66 -48 27 -84 59 -7 130 74 -91 -114 -57 99 -107 -4
4341 -4 7 131 -44 -16 -179 138 6 46 -108 -177 -32 -12 154 -75 0 -7 44 85 -155 -58 56 -21 53 -147 138
4366 138 -31 75 -192 -19 -39 -23 87 157 -65 -93 34 -10 -77 -184 81 119 25 148 -125 -122 18 83 -88 15
4390 15 18 -11 150 14 -71 58 102 56 230 -152 -14 51 32 -84 -76 -98 82 229 -48 -40 16 -59 -178 -164 -7 41
4416D1N0n8O7k14J30L0J11k77q3K96l4o4q2j82L22J43j44j11J8Q1P0m2j06jp8
4441a17J11pj6k4K16n7j7l7k4n7K11j76J7L9l9m8l4N3R4P8j96O2j63J77q3K11
4467A74m04P3K41o8J15Nk20P8J48j16j06k7J98k1P4j81J27k30K72j43n0rJ60q9
4491AQ1j11L5J8o9O0Qj39J02M1k21O8J18J41o9J76k92R0JN1j58M6q1J89J87q7
4517A86l04J18L6k7k5j42M2K65j22j94L61k77p1K04j13q5K28o5jo3j3m0j7P6r4
4542a37J68O6p6PJj92J00J60R9r3k71K14k4R2j06j28J80J24p6j95k05K39J16P9
4566A42j93J5q8k0J51j21J37R3j2j84J05j12qO8P3n8p5J46j24L38k10k27J75j14
4590a03O7N0K76k28q3L0oM5q5J92mj77j33J80l7j79J03m1J67J08k56R8m6k9K25
$$ plain form
4416 41 91 33 100 -114 16 46 157 -120 -203 93 59 -5 -87 -269 53 196 52 -59 -41 40 110 68 -38 -39 -117
4441 -117 -6 -13 -29 -53 163 106 89 52 28 -29 182 6 23 62 23 -25 -59 -6 88 166 -30 32 -131 46 -37 174
4467 174 -230 -157 84 16 131 136 -84 -6 142 26 -80 -107 91 70 144 -37 90 -140 132 -11 -61 -70 90 1
4491 1 82 -29 6 24 -45 15 23 -116 -14 27 -194 -126 -8 133 64 240 -52 38 39 90 -68 -22 -103 86 273 186
4517 186 -118 0 36 9 -16 -158 -116 149 27 -167 194 -83 -154 50 -63 -148 80 15 14 -49 -62 -102 -119 -43 -137
4542 -137 31 97 21 28 29 -163 -63 97 196 103 -168 46 22 114 8 -120 60 184 108 -87 -292 -53 63 142
4566 142 -51 -36 -124 -144 7 -114 23 116 104 -80 25 -87 -95 -27 46 -12 -87 59 -65 273 63 -164 11 -103
4590 -103 -36 14 290 62 -21 9 3 48 -37 155 151 -26 -159 21 -16 -195 -92 -133 34 142 -114 -16 -62 -91 134
4615A34j59M9J2R0mj72m9l1J63O2k48J84j3n3L7P6j67j8K00mj61j14R3J97j18
4640a4J6K8nN6j38L4o9J51j55J72j13rl7J92j35p1j64L02R2j16O1r2o4R2n6N5
4666A3K4j20J24r1N7r9J84J1J32l63J1J51O6j64n1K63j05%n2N8O3r7o9o5NK7J39
4693E2l2J8j49Q7P2L5j26j3j63K35J19J8j55o2J65j23oo8K5K1jJ24j66K51j01
4718E7j5lj27N0J15q0J21j65l4J99q5j2ll5q4J53q6k19O2K86Q8j87n2M2J15J1
4744A12m6j6r6J69j05o3l7l7K76j75m6J54k7p2OM6j90K20Q3k95L1l0K33k11L28
4769B12j26j93O9P7J72l5%l19J17K9j59M5J66o0j2K2k9L9N1q8P5j05J03r3mQ7
4795D1k3L2O7j04j13J42n3L2P5j87O4O1k0j1K5L7N3p1mJ4k42J91J4lp0pJ95k35
$$ plain form
4615 134 -25 24 36 126 122 -50 -99 -130 33 95 -153 31 18 -35 2 78 -89 -107 93 89 -72 -186 -93 104 -14
4640 -14 2 30 25 81 -57 -23 -92 59 -96 76 -37 -46 -83 109 -26 -97 -261 41 133 17 78 -14 -78 14 -42 13
4666 13 37 -83 41 -50 7 -92 92 103 235 -128 -117 34 100 -64 -115 148 43 43 -9 49 112 15 -54 -119 -114 -87 52
4693 52 20 38 -111 -24 48 83 -43 -56 -219 16 135 153 -2 -64 101 -22 -28 -96 -71 -50 -51 73 -93 158 57
4718 57 42 39 -88 -38 77 -3 118 -47 -81 118 33 21 18 -17 -101 52 -34 -253 -191 95 183 -4 -56 -14 101 112
4744 112 66 50 -46 123 18 -45 -82 -119 157 -18 -64 90 63 -9 -3 43 -147 73 156 -139 -108 -138 95 -116 212
4769 212 86 -107 -38 39 211 176 176 -143 -26 3 -156 -111 55 -5 -17 5 -24 15 66 -22 53 -52 51 -42 -46 41
4795 41 18 50 117 13 -100 42 -11 21 96 -91 -27 34 14 3 28 65 118 47 43 57 -185 6 20 17 -53 -60 135 -100
4823a00J42j25l3J68q0k2k0J5L17l27J25o4J08j06m1p4p6K57j50J04o7j21Q7K73
4847A90l43P9J20JP6k41P5L3j67K96j73K32l11Q2J41q2l5m3J37O8q4j70J71L8
4871I0m5J24k73K04j16J3J1k04L08K9n8j0k60J85J41k77J43m4J17r3L4J08n9j03
4895c5J03j50o4K76j42J69j28k53K70q9K33k34l6o1R0K7m0n4K75k88O1j40K16
4918Fj00K32k11NR1j35J10L1R4k16O0l0K17j85q7M9J9J64m5j59J60rk60J54m4
4943h9J02j47J26m0n0O2j14K41k38J10P5Rj17L20m60K13K8O5j06M0n6j38J65N7
4967E8m2j17K10j08P1k08k3J05k2M1j85K56j9j38J12Pj05J84J11l83K03q8J88
4990A08k83K04K8mj12J07n9J14j90R3M7j00J78j17J41j6j00j60K18j5k8k81L10
$$ plain form
4823 -100 42 -83 -116 52 -28 -50 -70 -55 262 -65 60 -4 104 -2 -43 -117 -193 64 -86 18 -49 -170 -83 190
4847 190 -153 -74 46 47 123 -118 -43 -10 -177 119 -54 178 -133 -51 90 8 -27 -70 67 135 51 -119 52 90
4871 90 45 169 -104 100 -16 -3 8 -196 112 141 83 73 -187 -2 139 -138 5 -39 78 -15 19 127 68 -35
4895 -35 68 -82 -146 130 -12 157 29 -224 46 -43 190 -44 -80 -141 -51 -24 -64 -118 157 -131 -70 -210 6
4918 6 -94 138 -73 -68 23 -112 -2 29 123 -93 -33 -63 154 -31 -118 -69 -50 114 69 -90 70 61 -199 -45 -89
4943 -89 13 -134 -8 -48 -98 -36 -150 91 -147 -37 38 47 -70 250 -210 3 31 96 -10 30 -26 -164 1 58
4967 58 16 -101 109 1 72 -136 -159 -54 -76 -35 -220 36 17 -121 -9 -2 -107 77 188 -195 8 -80 108
4990 108 -175 29 57 53 -59 48 -11 103 -87 6 53 -47 131 14 155 139 39 -121 97 82 54 -227 83
5013H3q6J07j68J9j0l2R6QL3L6k02J5J40j95L18p1r7n9N0j4p6J85k12k4K94j2
5039A26j47r1P3J66j75L55l60NJ59j30j06K1K13m9n9l5K6q6KK25o2q4M7j17K9
5064e4K8O2n4P9M0j58q8J57J5J50j84j79J16R7o8J0l6P4p1P4K1k3j5q2J18j23
5090i4J31r5Q9m2K4j7M0J85l12l2m6r6L74l3p9Q0q9M3k01K61k67J58J49j92l3
5115i4J10j47J28j4j35K63p8Q8j36k6P6J23k40K37n8k48L38p9k05l9K21o8j22
5138a05O5J32Jjo6k1m9J31j00O9k06J96N2K4k5k93K46j15J82L8j64PM8j13J85
5163A18nj00q5J44j49Q9q4K22k07M7l3J12j21N1q4J47j35L5P7L5J22k39J25j07
5187b5l9l4J17j7K6Jn0O2q2P6j0J2o7l0o1J90j25Ql3L6R7m8n6R4n0j3P8j34R7
$$ plain form
5013 83 -3 104 -64 -45 -55 -87 9 17 50 86 -116 -101 39 -156 162 91 -6 -65 -15 -29 -105 80 -132 -156 138 126
5039 126 -21 -112 -39 127 -48 307 -53 -48 111 -19 -125 -104 109 60 1 -34 -8 -94 -92 133 71 -13 34 -83 -54
5064 -54 -26 36 -18 61 101 -57 -145 12 27 177 -7 -186 -70 27 -41 -31 -67 7 -64 10 31 8 -7 -89 29 -94
5090 -94 37 -58 31 -11 13 -4 36 221 -91 -123 -169 -265 109 76 -3 77 -12 31 -170 91 -176 -18 131 -61 -94
5115 -94 16 -131 -3 -17 -152 111 33 121 -15 -41 35 158 -82 155 97 -151 187 108 -97 -136 85 17 -105
5138 -105 -40 92 93 92 26 5 -44 87 -13 56 -150 46 98 122 97 -196 50 -65 117 155 -9 -2 46 -67 118
5163 118 113 13 -72 72 -77 12 -72 150 -57 -10 -43 69 -52 -1 -85 62 -73 -38 39 74 196 -43 82 -25
5187 -25 -64 -98 19 2 28 29 -21 41 -41 35 25 37 -30 -60 -121 69 -56 -48 -81 -45 52 4 -52 42 -8 -21 57 -77 20
5216B0j2j23J62j21J11p9j08K01O0O6k3p7k08J80k7k31J49k7J59j69K60j71k9
5239c7j5Q9J92l86J92l3j5j3LJ31r4l8J95o9p7J80k6j49n3K02Q8k24l5k7j24K0
5265a23J95Mj60M8J00L5m3j29P8P8k9k24R8J35N5n2o5J40m67L63q7k6J43j05k
5290d0j49J18%l1M6J38j09n6Q2j10J23j26jJ58L4J6J3j97J14J23m5k8m1R8M1j18
5316E3l4n8R9n1P0j58K9J00qN8n7j31k1J48M3j41P9K2j5pNj71O5L7J41k11N4k2
5344h2M0M2J67l16R8J04q4m2O2n0O3N6j60J21kp0J38n3Ql5j41J22r3J25r3R4j70
5371a51J48K5J4R8l31J03qJ51l2r3J19Q1n3n8K3J34k97K30J4k00N4n0k8m6k3q8
5397b64K63L6M2N7j01j32J68j28l8J5J09J35j86Q6j63J79J8o7J4k30K86j01O7
$$ plain form
5216 20 8 -115 47 -74 37 -42 -150 51 111 177 154 77 -131 49 22 -209 -60 -87 72 -97 163 -8 -37
5239 -37 -52 37 229 -157 35 2 -13 -26 -23 108 14 -24 171 102 25 205 179 30 -23 179 267 43 8 -19 -143 -123
5265 -123 72 76 -84 -36 64 99 56 -73 5 83 54 -170 -72 63 118 66 1 141 -326 37 -50 -76 67 -38 -40
5290 -40 -189 -71 -71 -102 -56 82 -27 -83 -1 -111 12 -114 -115 43 77 93 106 -91 23 146 101 73 32 130 171 53
5316 53 19 -39 60 9 79 -79 -50 50 42 100 43 -88 -109 39 82 -59 20 42 27 20 25 -146 -81 -44 97 -114 -60 -82
5344 -82 -42 0 167 -149 -51 53 -31 -73 -11 -61 2 58 -102 19 17 -53 85 32 40 5 -136 -14 -107 18 -75 19 -151
5371 -151 -3 22 36 134 -197 -94 -102 49 17 -76 43 124 71 13 36 170 -127 103 117 -83 -29 -79 -107 -153 -176 -264
5397 -264 -1 35 77 134 33 -99 69 -59 -97 -82 27 162 -24 62 -101 78 96 29 43 -187 99 -2 65
5420F5P5k04J68L7k54J65j16J86J4j41J05j17J4Q8k01R7j7j18K60o7q9j11O8J69
5444G6j43j19RJ12M9K1j74R6R9r8J14L9j49J99k84J82j12J04j3j12j6Q8R5p9J21
5469A05k06J21j88K58m2m1J68k84J53m6n3p9R4R2k02K1K01n4j53N4J26m7J57k5
5493A30q7j2m0NL4J1m3j49P8Q3r8J3K8Q6Q2j32m4j91M2K47q4k0O7j9M5m3j7L1
5521Cj88K82K6j08k5Jj00mJ0R3J46n5l3j43J64o1J90k31o1J43J18m0j04m7j6K68
5547B28j78j56J01J86L9j60j2r1J28j08j05P8J20j04J4J2n5P8J20n6k2N6j82%
5571f9J02M4q9n1J21o1R0o2j97J23J85o9o1L2k7J6Ro9k8N1mP9j15J63m6l2j7j19
5599a01J20l0J58r7k62K47j9J18j42p6j24J69J90p4m9o2K47j46jp7M3M5q0J7J1
$$ plain form
5420 65 140 -64 104 141 -113 52 -64 122 136 -5 100 -17 -3 85 -116 -19 -36 -154 106 39 -50 -161 -93 76
5444 76 -67 -186 -177 -65 -16 5 -169 -73 26 -72 42 81 -68 131 -153 29 -83 21 8 -104 -120 -32 63 -16 105
5469 105 -101 20 -168 90 48 7 175 -109 44 -2 -55 -134 -40 52 -150 -129 72 18 -135 -81 45 -2 155 130
5493 130 43 31 -9 -4 30 41 -2 -151 -73 10 -88 -75 -47 39 121 -11 -55 -246 -204 43 -41 -61 6 -13 32 -11 -28 3
5521 3 -185 97 123 15 -10 -9 -109 -113 -103 -10 136 81 48 -95 69 8 198 -33 -94 49 167 127 23 -24 -40 228
5547 228 50 -106 -5 181 220 60 48 -43 85 -23 -128 -50 70 -34 -20 -8 -63 15 135 79 57 113 -69 -69
5571 -69 33 77 -12 -63 58 -3 87 25 -172 -49 136 67 6 38 11 27 36 -33 -61 -10 -14 65 -50 113 67 35 18 -101
5599 -101 19 -11 147 50 -212 35 16 134 -8 -84 -208 -39 151 77 28 -34 213 67 66 -11 32 77 -3 14 25
5624B5J0J4j08J12j27J76m3j63K21K2k23K21m6k00K13j87N2L7j3N9p7O9P6J4L8
5649A72k66J54l4qqnN3j08R0jj6N0l02K74k18K48o2L2j99J21J09j18J0J18j86
5674a00J74J7k10J58r1J53j48J16k37K20j2K3j33P3N7N8l3k7q6J47jj55o3J41
5698D1r6M7J3k03J04R2rN8J0n2j37J28m7j36J7K35j74jK42k60K09j72J29q9J10
5723E9j46J32K4j00%J32j9k5r3o3N9K02L0l31J08J56j56P6l9O4o8O0J1l9p4P8
5749C8n0l9qR6K9K9j79N4J1M4Pr9J1PP0O6j27m9J44K45l82l3L8L27r2j39K6m0
5777Ej87J16O5r6J61J39j25j13pP3j02K00n2j26Q7m2K4p0O7K5n9J43k32K5K6R6
5803D1n0o0OK3J9J52j11j25R8J4J34j67N1j59K99k07j43K06k7J15j26K9N9j89
$$ plain form
5624 25 35 49 -59 53 -74 102 59 -104 117 139 -84 137 91 -109 104 -83 -31 6 -7 52 -25 44 120 134 172
5649 172 -94 60 26 18 10 5 58 -50 40 39 23 73 -229 45 -173 75 13 45 -154 -33 76 -42 -32 86 -100
5674 -100 74 91 -119 39 -52 101 -47 69 -168 52 40 63 -70 3 60 118 85 58 -28 119 118 -37 -100 41
5698 41 -55 -8 5 -198 -94 -2 -11 47 57 5 -132 -4 -51 -187 -170 65 -109 -110 132 -128 81 -91 38 -51 59
5723 59 -87 45 69 -31 -31 101 82 57 -36 -99 -40 162 192 -139 -31 125 -31 45 6 70 2 62 73 34 -40 38
5749 38 -12 -51 -59 37 66 95 -84 -30 -19 25 32 -67 -56 -49 21 87 -40 -89 55 300 -82 -115 -77 250 158 19 45 5
5777 5 -182 -66 -1 -97 64 203 78 -35 -42 31 -71 129 77 -49 38 -4 20 -50 17 42 -17 126 -106 -81 -55 41
5803 41 -9 -69 -63 -40 -21 131 20 -105 -7 7 141 -26 25 -134 165 -42 -185 21 -6 109 -17 12 71 -118
5827a18J8K03k6k5j78J74j89K41j06n8q3N8J12j99O4O9J00oj32m1M3O3J5j65J69
5852CJ21j93NM0N6J20j30r0Q4P5p6q4J77l27K05J13j58q9O6J44q9J56k10R6r4
5877g9J15j13l0J29o7P3j63P1J27K4J98k81p2l6J59j05M3j91J04M5l9R8j95L12
5901A27o2r2N7k22J91R4j14J3O5p7Q5k06K32j9j39J76kj80J44o9Q7L8k56kK37
5926A06K8pj0k33J72m8R0j15l7R1j4N6l7J50j48l24L27n7m2j21K7O1Q7l8J27P2
5952A63k87L1J42q4Q9r8P3O4nL2q8r8J55p3j36J71j27K8J4M2L8j78J6J6J89j87
5978i8L0L8J12rj06j06LJ13K15k19J01j07J68k45Q2R2k19K95j17oJ67l17J12J88
6002A67j14l4k8j6J88jk01J48j21j39J03O1r5J19N0o2j35Q5JP7j37N4k5K3P8K9
$$ plain form
5827 -118 -100 103 77 52 -126 48 -141 100 -6 -64 -147 -89 23 -176 -112 -43 57 51 -81 -122 -79 -16 -1 -166 3
5852 3 124 -69 -64 -24 32 152 22 -68 16 91 15 -69 108 -219 -14 99 -59 -148 -82 62 -27 129 -81 15 -79
5877 -79 36 -77 -107 22 -45 28 -135 -64 63 87 285 4 -68 -104 55 -50 -7 -198 -94 -49 -88 10 -185 127
5901 127 65 -27 30 -192 -1 93 -21 -8 57 -20 65 -141 91 72 -67 109 107 -73 71 2 89 127 -129 -131 106
5926 106 134 127 117 -116 56 8 98 -17 -54 37 23 79 42 192 44 -280 47 -10 -52 -173 -146 -85 2 -36 91 163
5952 163 -124 -93 49 -35 54 -44 29 93 88 120 32 -66 89 16 -120 51 -76 -48 -34 8 46 -132 -116 -100 89 -98
5978 -98 -68 -30 82 73 -33 -139 -136 -23 192 -27 74 -33 135 -110 -28 64 -155 140 23 17 184 -133 -21 167
6002 167 53 19 -9 -25 163 162 -39 109 -12 -151 -48 13 -82 37 87 25 -110 -25 -24 53 -84 -30 -55 -32 46 75
6028G5q4M9J1o7m2k5R6K0j3m5k8K2O8j67J51J10j75J05r4N9j03N5Q6n1r3r8J66
6055a2P0J83m00OK36j75J46k40J30K57k30J04q2P5L6q9L2L9R5p7j34r0O0R9j66
6080a27K34l7j49J46m8r1n1J56kJ13j37m3K4N7r0R0k1j24J54J69j33j65J41qM0
6105I8N0n4k78K00J53j86J26j45M9p9N7K0J07k51Q2j0M1l5m3R0J9j17J9j1J92
6130I4L2j71J21j4o5J42j12K4m5j1j12J22J91j94J08j09j35K53m4n9Rr4J31o0
6154BO9Jj75J37q1j97K88j32R0RN6j08J03j36J85p3J44j08j64J02m8n5N1J74J5
6179A49k32J63k3J5j17O2j14K06k55J64j59J91j04M1j2m1J93j93n5P0r2K9L1j15
6203a98K50N1k4J6kq0O0l0j24J44k7j92J62j12R6K1o3R6j47J50m0L9k40K11l3
$$ plain form
6028 75 -9 40 51 -16 -58 -83 13 33 20 -25 -53 -31 37 -130 21 131 -44 61 -33 26 -77 -22 64 13 -80 -178 -12
6055 -12 58 241 -159 -153 83 -92 54 -186 -56 201 -29 75 -7 68 104 15 47 86 181 104 -30 -120 -60 39 -127
6080 -127 107 70 -79 67 19 -72 -123 33 31 144 7 -36 -12 45 -45 45 24 -100 54 223 90 -75 66 58 98
6105 98 148 94 -184 16 169 -17 109 -36 13 -66 -9 11 118 -133 -51 -61 -20 -55 -98 -8 11 -106 -87 -98 94
6130 94 126 -45 76 62 -3 139 27 51 6 -5 -117 5 196 2 110 1 -134 119 75 16 25 -69 62 2
6154 2 71 72 -103 34 -47 -244 44 -88 2 11 67 -41 62 -74 111 38 182 74 -90 12 -36 -91 -40 134 149
6179 149 -83 80 57 72 -45 17 -97 109 -146 18 -141 50 -54 -13 -25 -66 127 -66 -121 -51 -143 -114 -83 -198
6203 -198 52 103 79 95 93 13 73 43 -81 63 36 -156 6 -106 -10 11 -52 44 -103 47 7 46 -194 17 -16
6228a6j7K1Qm9p6J49k41J07O9j06P9N0k6n0KN7P9j42J02n0K8j31K57O4k0j41o3
6255e6j26P4J42l2KQ0j44N1J8J0j18R7j1M3j32J47k48L13m3l6N3l5o2Q7m5j63
6281a34K36n8m2J02j28O5n9M4qk5L4m9L1l61L32J66k81J48j43J69j7l9n4L7J28
6306I4K0j4l2j04o9QJ76k39J20J25j69K29J1j08k39J65Jl7P5J44j7j53K11k08
6330a0O6o5M7k32J48L2j19J66m5j10J50J1p0q8K09M4q3LN6r0J79n0q6j84M7J82
6356A08O9j95j32K85o2j15K3p7q3J80j26J70p5N0j6J47j39o6n9L3J20p9J31k5
6380F7j21N7j38J9M4kj2R7O1L7l9j7k17J25J94m1j01K0O7M4j0j37k5K2n5K51q1
6407A09j55J94k17j4k8J28N3r3Q3j68J98k00J71q3R3o3j71K10M0k31P7o1J09K09
$$ plain form
6228 -16 -33 -12 -4 -53 -129 20 -221 -114 -45 -151 -72 -22 -48 -98 -96 -39 40 -102 0 -50 -22 -153 104 168 148 7 -56
6255 -56 -182 -108 34 2 4 84 -60 -9 9 19 -99 -2 -13 30 -102 45 -203 110 67 31 84 49 -13 74 29 -134
6281 -134 102 44 2 104 -24 41 -18 26 18 -7 27 -22 9 -352 -20 146 -135 13 -130 39 22 -17 -71 -34 94
6306 94 114 100 68 -36 -105 -97 79 -160 -40 85 -84 145 156 48 -191 -26 -25 -62 13 157 140 -13 198 -10
6330 -10 56 -9 38 -194 -46 -14 -133 33 -12 -122 28 39 -31 -119 90 134 51 54 110 20 199 149 63 -121 -74 108
6356 108 177 -18 -150 135 73 -42 -19 -96 -179 1 -125 45 -30 20 4 151 12 -54 -113 -80 40 -39 92 67
6380 67 -54 3 -135 -116 -72 -74 -86 11 72 109 70 53 -164 -39 155 114 13 33 100 144 134 -3 -28 -6 -61 190 109
6407 109 -46 148 -69 -83 -111 17 70 -23 60 -108 90 -110 61 -22 71 8 -163 47 87 -144 -67 -128 -19 190
6431A90k43K00j69N4M7r8L3L9q2J29j88J7J17oj86L73k60N6J5n9L7j17J70J4P9
6456A62k15R0oj16J23j37M8%J07o7p6J3J43Q4Oj46r7J09j02m1K79k25kJ29k57
6481a94K26j10P2q1O9k5L9J4K0p5j51J25o4K41j21J32o0k2N0r2j24J14J09k64
6505a72Q2K2O1J22N1j74P7j29J10m0o1J00j13J48j46N9k7M9j26Q6l8R7J05k17
6529g4J79n8q9J42j59m1N9k0O7K0j1J81k00n3K9m8J97j53L0j35J46k02J63J4J0
6554fn3M8L6o9P2o9n5J45J02k24J47j7q7o4r5K90k31J25Q5O4k73M5N8L4j27J53
6580C4n2N9j18k7J69j20L2n6K50k05j6m8J15J03j8k66J21j6Lj10J67m0q2K54j55
6605b2O6N4j96J70o1j16m3J92r2J59q4j68J66n4R1P2L1k47L7O2j48O3P2N9n7k2
$$ plain form
6431 190 -53 147 -22 32 79 -19 14 53 -29 100 -88 -71 46 40 -146 227 -33 23 38 -21 16 -101 69 83 162
6456 162 -53 37 31 -85 38 -99 -51 -51 56 -11 -87 -74 69 153 159 13 -84 25 -77 -118 161 -64 -66 63 -194
6481 -194 32 -78 -6 -87 -18 -43 -4 10 30 -45 -196 -71 -135 106 -15 117 57 35 85 -7 -131 -17 92 -172
6505 -172 -90 -68 -7 115 166 -8 69 -60 50 10 -51 49 -64 84 -62 -3 -30 19 -107 -21 -59 38 143 -74
6529 -74 105 47 -42 100 -59 -100 -41 -61 6 26 15 196 -4 -57 -28 -76 121 -32 -2 -137 9 -193 -30 -16 -6
6554 -6 -59 -11 25 -44 28 -41 -96 49 151 -73 74 57 -30 -94 -189 101 -130 -5 80 144 -129 -84 -26 8 -119 34
6580 34 -18 41 -77 -104 65 -55 -23 -79 171 -34 -50 -98 17 120 102 -164 -43 -59 -56 -166 1 -39 -121 133 -22
6605 -22 44 98 -98 72 11 -105 -148 44 -48 111 27 -141 25 -29 62 134 165 -82 -45 17 -131 -68 4 63 6 -16
6631a6R1Qj33R1j16M2q0J20J4k9Kq8K7O1J0QOJ3j05Q4K3R4k38K6O5j30Q3N7O7
6660E7o7O1j20J35p8Q4m3r3J15n3k0p6Q4j9r4M1J76o2r9J36n5K6M6k08K99m9q2
6687D2k4J33j01roL7j78o6L01k59L7K2n7J44P6l1Q0j68J30k30L98l51P8O8j62
6712i6PJ5j98L96k19Q9q7O8m3P4r7j8J77j37J35m8k30R5M2J3P4m1l9L5K2O1kk5
6740B3n1q6O9NK8J25j77k8O2L1J16j93M0J42n4Q5j74j90L73r7O2pmj11j93J96
6766hq7J31j9R0L6j11J7Or1M5j22N4L2q3J06O1M3j55J07q7p1J20Q7o7m3k5O1J9
6794D6k00K22J4k20J78k4M9m5Nj24J55n3Q7q6K02o1j61K6N1j66K49j34j17K7J51
6819G1q5j74J09N6r1N1N5m6P1k3p5j0N5nk7J16j15J60j01J17j68lJ13j09Q6J05
$$ plain form
6631 -16 75 83 -50 41 -75 -33 -113 7 21 -8 -6 -94 -67 -6 4 12 18 31 -74 10 33 127 -111 -85 -20 -150 -67 -10 57
6660 57 -10 51 -69 66 -12 72 29 -64 51 -2 -22 -98 -14 -33 -127 -86 90 28 -71 65 10 36 82 -126 173 124 42
6687 42 18 151 50 41 35 72 -106 -172 129 -130 -93 -71 -128 16 92 61 141 -27 103 -127 271 -80 -2 66 -96
6712 -96 -89 -74 -272 124 -95 -6 -93 -25 -68 6 -91 -109 68 -69 66 18 -212 -117 -75 -62 12 -29 -68 -33 -11 50 48 23
6740 23 -28 -114 -45 -40 -12 113 -64 -92 -30 1 117 -76 -36 106 52 137 -37 -227 146 49 111 104 100 -11 -204 -8
6766 -8 -95 36 17 107 143 32 49 55 -36 9 -113 -59 -27 -110 -4 57 100 -55 52 -35 -106 14 101 34 -9 -34 27 46
6794 46 -154 68 82 -138 40 16 65 20 25 -99 56 3 90 4 206 145 -16 10 61 -105 144 10 -107 -80 71
6819 71 -14 -188 -79 -23 -114 -63 -8 -54 17 -6 -81 -91 -36 -41 -68 48 -67 93 -8 109 -59 -62 51 -58 28 133
6845A33O1p7lj51m0NJ63K1j95K12j07j04p4J41q9m4n4K51n1J11j20R3l0m7P8j70
6871h7Kq1L18k81Q5r0Q0R0J0n0J52m6M5j27j75L2Q7J81k4k25J81l0O1j17L4M5
6897G0j38M1j9l7M1O3q8J73J1j7l0j36K15q3j60J02k29J19J51J7q5P7J8r8l3R4
6923C9j09J20k41K07Rj26K5l3J98j37J1O5R1n9j8J31j98J36m5P5j72J43k37LK42
6948A20p8j10kJ4J2K35k79K07l9j3j1o7l2k6J74q8j01M8M5Q7j15j3p9J56o2Q8
6974G1j35M1J10j52r2O1J0J48m0j07M5N7J46l00L2K25n9Q1k42K86k88J97j69N7
6998a7n7L7J08j41J73j50j35K92O4k60J21k9J4N8j8K6J9Jj49l1J30o8R6k85K20
7023A9k4J1L8j28j6K67j22j39J85k9k7J22j44P1o9j4K5Ok11K55j3L6m4J6n7l3
$$ plain form
6845 133 194 117 114 -37 -77 -72 91 112 -83 129 22 -82 -156 -15 -104 -148 -202 49 -2 109 -11 82 52 5 83 -87
6871 -87 -85 -166 152 -129 -44 -134 -54 36 46 -4 148 102 147 20 -155 -123 -36 145 121 -104 77 47 108 -9 25 70
6897 70 -68 -27 -46 -83 -42 21 -67 106 117 100 70 -66 149 66 -94 8 -221 -102 49 66 -19 58 76 -22 -55 39
6923 39 -70 50 -191 16 25 -101 -76 -109 89 -48 -37 28 119 60 42 173 -25 111 66 141 -31 112 -125 -122 120
6948 120 42 -68 -70 -56 -44 191 -88 119 80 67 56 -11 -43 -69 105 17 -84 -36 9 96 -19 -32 -111 45 -17 71
6974 71 -64 -23 87 -65 -157 -96 -86 62 22 -85 -40 17 163 -137 -105 120 61 142 -100 186 -102 95 -74 -17
6998 -17 -74 -37 71 -70 103 -47 -182 110 174 -86 35 6 20 78 60 86 105 106 -43 -74 56 -12 84 -201 19
7023 19 -5 6 44 -84 -100 167 45 -94 91 62 35 157 13 84 15 1 26 32 -179 76 63 99 55 71 14 -19
7049a9M1n5Q5p5M7r0J42l1k1m1O8o9Q2m6Q0j55J43p4n0Q2k9P8r1LJ15m6q6N7N2
7078I7j37QJ11k6J21l76R6K2P8j9j44J14j1Q0n2L2q9K7j10K34o2Q3j15Om1P3N4
7105E4k0O1R1m0k73J05lP7p2J59k07K8M5O2L3k4n7j31J12j27P5J25j9p0k1K8m7
7132e6J99k44O4o2K53k56K03j00l4K8K9K35j37j5k66J60J33j62PLr2J1J23P8n3
7157D9j8j18J17R2j13j03J47k66K08OJ24j70J1k6Q4P0j71J52j42Q9J7p4j78J24
7181h9K23o8J30k95J69q7L9k03K38k4l7Q1j35OJ3M0L8L9j35P9k1N3o0q5P2r7J35
7208A9M7k7rL9j00r5J83J4jn9p2K31k69O7j03K46j25J5J50p6j01l2J56j43J5P6
7234D6j94J88m4K61l18K36K2k13J28r1O0j98K04N4j62J07k71J54Q0l37M01j57
$$ plain form
7049 -19 22 -33 52 -23 24 -66 76 45 24 -17 51 -18 64 18 98 -57 86 12 -38 44 15 93 2 5 120 74 -12 45 97
7078 97 -40 -32 79 53 174 -202 -106 -84 -6 -25 -169 -55 -66 14 -38 -6 -95 -68 -178 56 -6 77 -38 -32 -73 0 54
7105 54 34 95 186 146 -127 -22 -25 52 -20 139 -68 -40 5 67 100 76 19 -112 0 -127 -52 73 54 -16 -37 -9 -56
7132 -56 143 -101 -37 -99 154 -102 101 1 -33 -5 24 259 122 107 -159 1 134 -28 -21 -18 -110 -99 24 102 49
7157 49 31 -87 30 122 9 -94 53 -213 -5 1 125 -45 -34 -60 24 94 -77 75 -67 22 39 -35 -213 -89
7181 -89 134 66 196 -99 70 -17 22 -181 57 33 -4 77 -58 -52 -39 1 39 78 -57 22 1 54 -6 -91 -19 -116 19
7208 19 66 39 30 69 -31 -126 57 71 70 11 -61 170 -99 -32 -135 111 -14 1 151 75 -26 -58 98 -45 -30 46
7234 46 -148 40 -4 257 -61 175 197 -16 112 21 81 -117 87 141 -21 86 -185 -31 49 -288 113 -44
7256d4r1O6J26n1m8K4QL4r5K6n9n0J53J3N9m4r4J65K2r6j51L6J23j65J54j68J59
7283A2l2j2o3J77o3N9q1j89O0P1Kq0J13l9j2J36Rq3m1K48j45N3L6k36j9L40j31
7310I0p3j6Q9J8j18j5k5P5M5o7J69k89j4P2m1L0Q8M9j31o4Q9J33rN1K6Mkp8K4
7339A10k29J10J34o2L3j15L4qLJ05m4j72Q1n8kJ30o4Q2O6o8j5k20K02jq6R0J02
7366A38r0J3l4j42J49J11q3j51L92k82q0J85j58n1R4K7k4K1k18L04j00J4p1O4
7390B8n2n0P4K62j30j19k7o3k49L05j03J49p5r1K12j8j29J24o3Q2o0j29J55L4
7414F7j72J33J27j70L0L8k8J58k37J22n9p0N9j23J52J15j50m2j7N9L9j22J70p1
7438Hq9J25MJ83j4k77J82n1N6J4j29j39J93n7R1k3j11K3r0J65rr3MP2J16qj18
$$ plain form
7256 -44 -135 -69 57 6 -42 -18 -10 24 -71 -45 -104 -154 -1 12 71 27 -67 98 120 24 -127 -91 32 -133 21 -147 12
7283 12 -20 -32 -95 82 19 78 -3 -192 -132 -61 -59 -139 -26 -65 -77 59 68 -15 -56 192 47 100 136 -100 -119 221 90
7310 90 17 1 90 108 -10 -25 -50 25 70 3 172 -117 -131 -59 -100 -70 18 67 -64 -128 -39 94 85 136 162 166 164 86 110
7339 110 -119 -9 125 63 96 -19 15 7 10 115 71 -101 -20 -78 -80 50 -14 68 134 66 51 -169 33 32 -54 36 138
7366 138 48 61 27 -115 34 145 62 -89 303 21 -59 126 -32 -83 11 38 14 35 -183 121 21 35 -36 28
7390 28 -24 -74 0 262 132 13 -14 -77 -326 -21 -124 25 -50 -141 71 53 -76 48 -15 67 7 -122 33 67
7414 67 -105 28 155 -15 15 53 25 183 -54 68 9 -61 -2 -125 27 142 -8 -50 -67 -8 31 -91 79 8
7438 8 -81 44 48 231 217 -60 122 71 127 141 12 -127 66 9 100 77 -34 -11 -101 64 55 -38 -34 38 154 146 28
7465B8K9n9p7J47j47M4J31o5oJ27r0K3j04R9j77K11j02j9p6j8J34j6j21J8O7l
7491b2J35l8Q5j09J3M7j74n4l6P1R3m0RR4lp7mM3J53j63Oj73K34j61k2J73j58
7518g8K30j68J26n9J07j12M4j70N2n9j1J52J1r3n8%J53R8p0n9q4O1m0N2j22J88
7544I1l0k16j9J65j37J68Nk2J7k36K1K03O8o5P5n1k55K41p1o6L08j39j94O2NL22
7570B50k69k5N2n9OLj65J98j47J02j91K04J05j45J09j03K24q8r0N3J31k38Np6
7594a54N7J21p9n3%Q0J25k35K32K9qp4P8l5rj6o3qj33J68rj58J44k1p0K41k32
7621h2Q6q6J69K4o8j38K54l49O5R9j83J04R0L0j4n2M5Rm0P4J8pl4RQ0r1l5K51
7649B28j85rq4Q1L6j7p5k7J3Q7M5Q7n2k11o5Q9P7Q8l3j7n7J03N0j32Pj50R5K54
$$ plain form
7465 28 57 -2 -79 68 -79 -35 96 31 25 152 62 85 -19 80 -97 114 12 -7 -83 -101 33 17 -104 -86 -19 -22
7491 -22 113 75 160 51 64 111 -63 -117 -153 -82 11 -29 -20 74 71 -6 -10 33 186 23 29 -144 90 -71 -93 80 -78
7518 -78 152 -16 110 51 158 46 90 -80 -28 -87 -98 54 65 -28 -86 -86 67 165 95 36 -48 13 -27 25 -97 91
7544 91 61 -155 -174 -9 -146 22 27 5 22 -214 -193 10 78 13 88 37 -218 23 -48 -114 194 55 -139 -77 -72 250
7570 250 -19 -44 8 -51 -45 -42 -207 -9 -156 -54 -245 -41 64 -81 28 -75 149 61 -29 24 155 -83 -78 -154
7594 -154 -97 24 -55 -108 -108 -28 97 -138 94 123 115 41 119 84 75 59 -4 -12 -145 23 14 -144 0 -21 -91 150 -82
7621 -82 4 -82 87 111 43 -95 159 -190 -125 -26 -209 -105 -15 15 1 -51 -6 3 -37 37 55 48 14 23 103 12 -23 228
7649 228 43 34 -50 31 67 50 -25 -52 -39 48 93 180 128 -83 -148 -59 18 106 73 56 -1 102 152 20 27 -123 -28 226
7677B26k97K0o3J0K40r8Pj44P8R3j03K7o0P2m5k2p1J6J42N9k4r1J3j09J32J39
7703A47j9j54L5k4rJ33O1q7m4N7k45J68Kl9J71j44n4J41L9p2j0j87K53j68J09
7728F0q6M1m7m8O1R5l28K63j09MJ04l8p5r7Q3N7N3r4R8J71r8p4O8J02j64jj9j1
7756b9r3K01j18L6nJ2P7om9p0qp5J96j37J05PM0j49J5Q5O4M2j63j0k1k0J52j36
7784e7p7J23L2L6q3q3K26j62J07j79K64j13J0MQ2l05J38J84Q2k99mJ73j52J13
7808F0j0kj09p9k6j00L55p4n5j7R4J10j05p2j19K12R1j07k56J86q2J22j54J01
7832c6p1J44r4J78j46O2m5L9P0k74K61j38J7qO9J02k43N0J26p8K9J0M7p0JJ3l9
7859b4l3qJ64j20k2O8n3R6j05O1j97K8J18J76j01j9j01K1n0R1R8n3J34j90oJ26
$$ plain form
7677 226 -71 -51 -114 -104 136 38 45 -99 -21 72 -31 -4 -64 8 -37 -59 -130 -114 28 87 63 -28 -15 -124 8 147
7703 147 128 -26 9 -15 -24 109 170 83 39 96 -149 19 21 -18 153 9 -45 96 135 63 53 -134 119 -49 60
7728 60 -26 15 -32 -80 -19 76 -252 11 -98 -94 10 -28 -103 -200 -117 -60 -7 -101 -3 168 70 -4 64 166 2 1 -18 -29
7756 -29 -122 79 -39 -3 -8 4 81 75 26 -44 -52 -127 69 -68 37 44 84 -65 -50 35 99 141 -22 -32 -53 -73 79 -57
7784 -57 -134 -11 21 57 -26 -109 117 -45 62 -117 147 34 44 48 130 -175 -37 147 229 -70 -74 99 -53 60
7808 60 50 48 -61 -140 -166 -266 89 15 -40 -57 37 147 42 -30 -149 63 154 47 -209 -23 -105 17 -137 -36
7832 -36 -107 37 -57 121 -25 37 -8 31 101 -173 88 -50 -33 -41 28 130 -113 -63 63 -15 14 24 71 1 2 15 -24
7859 -24 -57 -65 99 -21 -43 25 -28 68 -37 24 -173 -145 -27 149 48 29 -72 -51 -101 -10 88 35 169 -21 -27 99
7885I9k49J21L4LN2R2j68O2k8P5j08O4p0P8M6k4j23n3K25j19p9K22j60j03J12
7910Aj6J6q1O1ko0L3k4k4J67QJ05o3k30O0J28J9p1J70k08m6j0K42k66O8%J2j14
7938a25J77j7KM7p5K1K9k01J15J54j69J6m4J76m2j25K4K25q1L7Jk11L4M4j68L6
7964a20J22K78l06J89l05K10j48j30J38n9K72j81Q3p6n7K23q0QK07j57k72J46
7986a5P1m4j84M4J91n2j9q9J25N2j4k5j7k4L6M3r6l4l1j7J19K0K2N8j32k3J85
8013A50l4j00N0l9j66K64j2j13kO0n8P8j8j19J8qJ41j17L7k3j28J29n8L3k6j6
8039g7J17j52N4J08p4j2J10m2l2N4j32J02m2m0K66j76o2m2J12N2q0j02m2r6J68
8064f0J47j7r3J54m0p1n4p9P3J23L6j55k01K58k41K16Mj05K28j17qM7j01J5m5
$$ plain form
7885 99 -150 -29 5 8 60 152 -16 46 18 93 -15 49 -21 57 103 79 -44 -97 128 9 -70 152 -8 -111 1
7910 1 -15 1 -80 -19 -21 -81 -48 -72 -96 71 79 184 121 -109 -49 79 98 27 197 -11 -57 -67 175 -91 -23 -23 -11 -125
7938 -125 52 35 37 84 9 30 59 -142 -27 127 -42 -26 -70 106 64 -61 -37 188 107 144 145 -66 -32 12 -156 -120
7964 -120 2 280 -26 163 -142 68 -80 -210 -72 -131 141 -40 43 -33 -90 133 53 61 268 111 -161 -15
7986 -15 56 12 -172 -128 63 11 -8 -97 28 80 66 41 24 0 36 79 -17 -51 -82 -99 20 40 62 120 -12 -35 150
8013 150 116 16 66 27 -139 125 113 0 -2 58 0 78 60 -59 -41 -49 92 -25 12 -11 -139 -10 -68 -35 -61 -77
8039 -77 40 -112 -58 50 -24 -36 74 32 0 54 -78 24 -18 -58 208 32 -30 -72 40 92 12 -90 -132 -228 -60
8064 -60 87 70 -23 131 91 20 -34 -113 -40 83 119 -36 -237 21 -220 -4 0 -105 123 6 -2 45 -56 -41 -86
8089h6J67k5q8k4K7r5K15j87K59j54o9N1P1j30R4K7m8Q7j0q3j85K29lK6j51j57
8115b42K34qK5q8q1J5K03j12P1O1l0Mkm8N9j42L6J90j16J98l86J98R3k80j1K60
8141A01j80M2O0j89J40K1O9j25J52j35J38k16J89j9m1R7k88J09%P6%j00j5knJ77
8167E6j12J59j82o7K32l6o5%m9J99p7j79J60J86k24J96k02q8J77r2J27j37J24
8190A06j5
$$ plain form
8089 -86 81 56 -32 -56 -29 -124 91 -96 163 9 -60 -9 62 -68 26 53 5 92 82 -1 -186 43 40 66 -85 -242
8115 -242 -8 -16 9 -79 -160 -145 58 -54 17 78 48 52 50 2 61 -81 -45 145 29 227 -159 39 132 -148 -159 101
8141 101 -79 -37 23 -166 -26 -5 64 -61 91 -44 94 -122 67 48 7 104 -184 -75 -75 1 1 -99 -114 -116 -121 56
8167 56 -56 103 -79 -146 86 50 -15 -15 -64 135 58 -121 39 225 1 197 -5 -93 84 -8 119 -18 106
8190 106 91
8191I1
$$ Imaginary data points
##PAGE= N=2
##DATA TABLE= (X++(I..I)), XYDATA
0@%%%%%%%%%%%%Qj6J6j6J6k0K8l2M0m8N6o9P7q8J04j20J36j58J83k07K35k66L00
35A59l39L82m26M76n31N90o56P28q07Q93r87J090j201J321j454J604j769J951
53A024k153K377k631K922l256L643m103M656n334O190p313Q852j1097J4697k1391
68a2917L7936j53239k47764L31583K57412j31139k57337N931J36094Q0887o650
79D0797n1330q4929M0635J71010L2173k25530r5019K64995K25133k08962l09183
90b00210P2242L09324P7235j94423j68635P028J12689J17286j0352j80827j31110
101a89753J37002J90318r7929k38997L2917K44934L1019k29097j11644J56280
111g4950J75590j0252j35446j11011K8590J84389J48517j14342k40160J1775K65255
$$ plain form
0 0 0 0 0 0 0 0 0 0 0 0 0 0 8 -8 8 -8 8 -12 16 -16 24 -24 32 -37 40 -48 56 -64 72 -86 97 -110 125 -141 159
35 159 -180 202 -224 252 -279 311 -345 383 -424 469 -518 572 -629 692 -762 842 -927 1024
53 1024 -1129 1248 -1383 1539 -1717 1926 -2177 2479 -2855 3335 -3978 4874 -6223 8474 -12917
68 -12917 25019 -128220 -375984 -44401 213011 81872 -175465 -169534 -33440 47447 40797
79 40797 -10533 -95462 -54827 116183 148356 -77174 -172193 92802 317935 108973 -200210
90 -200210 -127968 181356 258591 64168 -104467 -97439 15250 132536 122184 -58643 -189753
101 -189753 -52751 137567 39638 -199359 -166442 78492 109511 -119586 -231230 -74950
111 -74950 100640 90388 -45058 -156069 -127479 56910 205427 91085 -149075 -137300 127955
122A27955J04770j94165j44356J18111J43471n1540j25161j8772P3168O8538n013
133I7006j16526j28656O3445K17106L1561k57586j70415J74760K28292n8892k04582
144a24487m0067J15634P6782j3060m8948m6781K1895J09460L9947j34082r3770
155a37477J58892J90355j03152k41252J2277K34923R3602j40369j34722J1035
165e5888Q2739P2134Q181j01892j11927N7700J55217k3311j88891l0492J85674
176D9244P0315j75528j28050J13878J55107j8643j18229o4751K3713R5045J01223
187A03324l2210j64826n3729J73378J39085j15271j60275O2792J57410j2656j30462
198c3440k4588R2063N7701k9876p0458n9527K3364J22217O0210j36141j60192
$$ plain form
122 127955 232725 38560 -105796 12315 155786 104246 -20915 -39687 33481 102019 97006
133 97006 -19520 -148176 -84731 132375 163936 -93650 -264065 -89305 138987 80095 -124487
144 -124487 -164554 -48920 27862 14802 -34146 -80927 -59032 50428 90375 -43707 -137477
155 -137477 21415 211770 108618 -132634 -120357 114566 208168 67799 -66923 -55888
165 -55888 26851 98985 107166 5274 -106653 -48953 106264 82953 -105938 -136430 49244
176 49244 119559 -55969 -184019 -70141 84966 66323 -51906 -116657 -92944 2101 103324
187 103324 71114 -93712 -147441 25937 165022 49751 -110524 -47732 109678 97022 -33440
198 -33440 -58028 34035 91736 61860 -8598 -68125 -44761 77456 137666 1525 -158667
209a58667O9578J96625J5453j72760q3963R7805R4149k7867o8013j9217L0064
220b6813N1291J6470o8279o8640P1154J35331k5877j72315m6570J59402J19864
231A45018q3086j36123p798Q8923O5545o610o7691o6714L0249J04404J0789j19890
243d2984m9644J19244Q5270j04156j22488N7420J35329J0876j00097o6278J9337
254e8171P0331O8848j5346j16392o4165J08191J23912o4383j43777J7821J32937
265E9806J4470j11563l9902P8229N6676k8537n4402l3880J0898P8569O5111p4010
277B1465j37077K0162J66648N3691j36919r7478Q0352J01947k4688p0933n306
288b8136L5793K3263M224k9814m9976K0277R7674J7524j27310q2090J06678J31444
$$ plain form
209 -158667 -89089 107536 122989 -49771 -133734 -35929 58220 30353 -37660 -56877 -26813
220 -26813 24478 40948 -27331 -95971 -24817 110514 84637 -87678 -134248 25154 145018
231 145018 61932 -74191 -81989 6934 72479 65869 -1822 -68536 -38287 66117 76906 -42984
243 -42984 -92628 26616 111886 7730 -114758 -57338 77991 88867 -11230 -77508 -58171
254 -58171 12160 81008 65662 -50730 -114895 -6704 117208 52825 -90952 -73131 59806
265 59806 74276 -37287 -77189 1040 57716 29179 -25223 -59103 -48205 30364 95475 21465
277 21465 -115612 -95450 71198 124889 -12030 -109508 -29156 72791 48103 -22830 -28136
288 -28136 7657 30920 35144 5330 -44646 -24369 73305 90829 -36481 -118571 -11893 119551
300A19551m9101j41713k3829R3746N7793k7768n1955l0849J2623N8147K7342o5237
312b1250o0073O2902R2975m3438j16814Q978J26003M6492q8622p8703K6409P4849
324B9708M3470j8457p2044m8238N7684R7092j7154j11599k3598R7948M5594q1588
336a182o5389N0349O9345j5969o3615l3178J8544N6420M3718m5028j02057p975
348i6017J19400O8845r0086j00257M3390R9646J044o7218j7052L8601K7113q41
360B6568k1008l1962P378P0591L2994q5198q4901O3922J23180j3954j24344m1723
372g8457P9593O0637k7048m8488j9270O430L2440K7708l5466n9964K4558Q3679
384D6352p954j03385k4419J04695O5381p2000q6107K1214P4343L1332k0754m3657
$$ plain form
300 119551 70450 -71263 -95092 -1346 56447 28679 -23276 -54125 -41502 16645 43987 -21250
312 -21250 -81323 -18421 74554 31116 -85698 -76720 49283 95775 7153 -71550 -45141 29708
324 29708 73178 54721 -17323 -65561 -7877 89215 72061 -39538 -63136 34812 80406 -1182
336 -1182 -66571 -16222 53123 37154 -26461 -59639 -41095 15325 59043 14015 -88042 -96017
348 -96017 23383 92228 2142 -98115 -54725 44921 45965 -21253 -38305 296 27409 26568
360 26568 5560 -26402 -19024 51567 84561 -637 -85538 -21616 101564 87610 -36734 -78457
372 -78457 1136 61773 34725 -13763 -33033 -26603 5837 33545 -1921 -61885 -37327 46352
384 46352 38398 -64987 -89406 15289 80670 8670 -77437 -56223 18120 49452 28698 -14959
396a4959l4230K5856P4920J6023p9386m8324O8989O8745n0395p8887K7250Q0484
408E6086M09o9159l3679K8724M4188K1592k6902o6852k4601P2466P2650m7149
420B7773r9129M465R1391K6326o5781l7947L7963L8556r995k8138j6048J0279
432b0285M2885K7852m7107o9733K6472J00552K0040r4623n9583N8808P2897j2884
444D5291n3606j8140J7431K5046J5249j9919m1641O275N9853J1204p5005m1124
456f9086P0786P0723m4608q6512R26O8506L3377k4507l9191k3491J5017N1719
468B3659K2281n3702n1383M1619O8391k3494p4694N711P5834J7731o0748l7797
480d6592K9551M3082J3432j9046m3462k4288M4744O6353j7407q5581j8472P6991
$$ plain form
396 -14959 -49189 -23333 51587 67610 -11776 -60100 8889 77634 27239 -51648 -24398 56086
408 56086 56495 -12664 -46343 -17619 26569 48161 21259 -45593 -70194 2272 74922 27773
420 27773 -71356 -66891 24500 50826 -14955 -52902 -14939 23617 13622 -14516 -30564 -20285
432 -20285 22600 50452 3345 -66388 -39916 60636 80676 -13947 -73530 -14722 58175 45291
444 45291 -8315 -26455 -9024 16022 31271 11352 -30289 -24014 35839 47043 -27962 -69086
456 -69086 1700 72423 27815 -58697 -57771 10735 44112 19605 -19586 -43077 -28060 23659
468 23659 45940 -7762 -59145 -17526 50865 27371 -47323 -41612 34222 51953 -8795 -46592
480 -46592 -17041 26041 39473 20427 -23035 -47323 -2579 63774 46367 -39214 -57686 19305
492A9305M2594n4939n0725L0800M4972j1246l5071r492J3719K3873J6953k4916
504E827n3975P44P5003L7580o8585p0474L6487P8275O3n7766k1347K6825K4407
517A3064K678j2892k1253l80L7685K0873m4608m4973M0519P1067j5746p9787j8293
530e2046O2909M3016k5408m2847j3742J6586L2298J5524l2248m3257J6335N5240
542C2360j690o2212j5914N9250L2732m7456m7718K0272M6905J2742k2980l2523
554b6232j4918K9316N1033q66o2947k8988N5739N1450l4334n3809J6374M9306
566C1124j15l7005j2572J8399K0911Q463j6583l8053q438N1549M1019m4095o9195
579e4591J3827P1364J3718n4654l0299K5930K6863l644j5088j1777o70K1730K0022
$$ plain form
492 19305 61899 6960 -43765 -12965 32007 20761 -14310 -23802 -10083 13790 30743 5827
504 5827 -48148 -47404 27599 65179 -3406 -73880 -37393 40882 40945 -16821 -38168 -11343 13064
517 13064 15742 2850 -18403 -18783 18902 39775 -4833 -49806 -9287 61780 46034 -33753 -52046
530 -52046 10863 53879 28471 -14376 -28118 -11532 20766 36290 4042 -39215 -22880 32360
542 32360 30670 -31542 -47456 11794 44526 -2930 -50648 -30376 16529 29271 6291 -26232
554 -26232 -41150 -11834 39199 38333 -24614 -53602 2137 53587 19253 -34556 -18182 31124
566 31124 31009 -5996 -18568 -169 20742 29205 12622 -25431 -33869 17680 58699 14604 -54591
579 -54591 -40764 30600 44318 -10336 -40635 -14705 12158 8514 -6574 -18351 -19021 2709 22731
592B2731k4858m0640J7871O2388N759o6315l1951N1704N1203j8206m4778r983
604b5075K1139K3377R926j7254l1743J933M1583J3446m5275k9064M0883M2205
616D6081l1102n3459P434M8068J5393k7160k9190p323J9367L3772O388m2456l4451
629d8638L2492N1298j3410n3002j229M7640J3634l5096k0496K0146K4647L550
641B1536j4920k3662p361L2766L7517k0702n8182m560N8921K8081m2433l8931
653c1930J8858L2759k198k0367r336L871J2796J1874j3207l1500K649M6154J7012
666C7435m8926m0524L3410N3140p106m5252j4570K3083K1922L592j2089k0279
678a6164k648K8449J9094k7706l1679K4133M4123j2717n0504m673M4960K2746
$$ plain form
592 22731 -2127 -42767 -24896 37492 43251 -23064 -55015 -3311 47892 29686 -15092 -25075
604 -25075 -3936 19441 29367 12113 -19630 -17697 23886 37332 -7943 -37007 3876 46081
616 46081 14979 -38480 -31046 17022 32415 5255 -23935 -31258 -11891 21881 28269 -14187 -48638
629 -48638 -16146 35152 21742 -31260 -32489 15151 28785 -6311 -26807 -6661 17986 21536
641 21536 6616 -17046 -24407 8359 45876 25174 -33008 -37568 21353 49434 7001 -31930
653 -31930 -13072 19687 17489 -2878 -12214 -8343 4453 16327 3120 -28380 -25731 20423 37435
666 37435 -11491 -52015 -18605 34535 27429 -17823 -32393 -9310 12612 16204 4115 -16164
678 -16164 -18812 9637 28731 1025 -30654 -6521 37602 24885 -25619 -30292 14668 37414
690C7414k4981k9506k589J7453K2492O187k7165l1216J4857M4033P47m5843j5423
703c3540L8947K3157k9710k8474J5454K7906J690j7644j6759l183K0187K9089
715B7120o847m4402j5356M3897L6261k7590m2508R863L6932M421k3373r949R729
728a802J1416N156p794k0104l314L0848K1574l0965m1895J6255M9794M592m2717
741h956k2235K1746K3556j253j3995j2501k387J6115J6351j4698k8149R256L8078
754B0928J736m2452j5646L7096L0262j9176l1765j786K0250J7325K918j6464k2959
767a9733N084L4022J0617l3556k2639K7405K9351j9274l2545P268K9575N012k0171
780D16j5940N83J4758J8748j783l1496j9869K8008L6171j4453m1037j472L4881
$$ plain form
690 37414 12433 -17073 -19662 -2209 20283 26470 -695 -31911 -17054 26979 27726 -18117 -33540
703 -33540 5407 28564 -1146 -29620 -14166 13740 15430 -2214 -18973 -22156 -1969 27120
715 27120 20273 -24129 -39485 4412 40673 13083 -29425 -19562 17370 21791 -1582 -11531 -1802
728 -1802 9614 14770 6976 -13128 -16442 14406 35980 5015 -36880 -20625 29169 33761 -8956
741 -8956 -31191 -9445 14111 12858 -1137 -13638 -16025 90 16441 1743 -26406 -17150 20928
754 20928 22664 -19788 -35434 1662 31924 12748 -19017 -20803 -553 16772 19690 3226 -19733
767 -19733 -14649 19373 29990 -3566 -26205 1200 30551 11277 -21268 -14000 15575 20587 416
780 416 -15524 -14941 -183 18565 16782 -14714 -34583 -6575 29596 15143 -25894 -27366 7515
793G515J1917k2906j4696J1623J3625J228p311j1525l114J9671K0993j6369l6198
806b5547L447M3036J5242l4850k7540J7579K7326r47j6916r063J702R450J0830
819A3749o818k1824q86K8681R901l2306k3377K5833L3190j1674l3643n853K1485
832c542J5749j382j3003j4953J193K3158J4534k1144k4274J5885L0488p164l1572
845a6027j304K9403J1586j9469j7499L638J4738J2171r15k0504j8479J5589L1695
858B4623k909l5908j1356K8840J8554j9682k0304Q903J6808K2j0806q131m55J1747
872e4J5593p303k8186n412L2976K1845k4960l0765J0783K9891L389j8655q837
885i695N605Q726N600k792j3832m025J9022J3756k0452k5245J4607L2529k365
$$ plain form
793 7515 19432 -3474 -18170 -6547 7078 8306 995 -10530 -13644 6027 27020 10651 -25547
806 -25547 -22100 20936 36178 1328 -26212 -8633 18693 17746 830 -8233 -6531 2919 13749
819 13749 6931 -14893 -15779 12902 22803 -9503 -32880 -7047 26143 14469 -19174 -25027 -3542
832 -3542 12207 10825 -2178 -17131 -15938 7220 21754 610 -23664 -7779 22709 15545 -16027
845 -16027 -17331 12072 23658 4189 -13310 -9672 5066 17237 16322 -4182 -22661 -7072 24623
858 24623 21714 -14194 -25550 3290 21844 2162 -18142 -9239 7569 7591 -3215 -11346 -11801 -54
872 -54 15539 8236 -19950 -25362 7614 29459 4499 -26266 -15483 14408 17797 -858 -9695
885 -9695 -4090 4636 10236 7444 -6388 -10413 8609 22365 1913 -23332 -8725 23804 21439
898B1439l2356j1759K0444J7512m344j3547r821N02J4203J2679j1986k2204N482
911a3756K6680J745k7567r288K4859J7202j6203j9987L319J6384R466k641j3462
924c249j3256Q148K5354M663k7134j6098K1302K2619j2522k3017M301J9296K327
937A2734j3224p883K648Q646R247l483k0462r303K2343K2485j5370l0481K115
950a9988K8104Q565j8602j2341P495R585K323l779p752l541J1829J3119j1086
963C931k1912N471K9100O023k7213j6442J7648K0601l615j4825p273L135R683
976D312Q634o159j6908r84K0339P168k1254j4446J7476K0003j0909k2416M1J7267
990B164Q594n497j0990q492M402J8047P430j8560j7564J3199K3377m936k2888
$$ plain form
898 21439 -10917 -22676 -2232 15280 10936 -2611 -12432 -11930 2273 14952 2966 -19238 -13756
911 -13756 12924 14669 -12898 -22186 2673 19875 3672 -16315 -12996 3388 12854 10213 -3249
924 -3249 -16505 -8357 16997 21660 -5474 -21572 -270 22349 9827 -13190 -8889 10407 12734
937 12734 -490 -8373 -5725 2921 12168 8685 -11777 -21080 1263 23748 8378 -22103 -19988
950 -19988 8116 16681 -1921 -14262 -6767 2818 5141 1362 -6390 -9931 1898 15017 3931
963 3931 -17981 -12510 16590 22613 -4600 -21042 -3394 17207 13592 -1233 -8506 -5371 4312
976 4312 12946 6787 -10121 -11105 9234 16402 -4852 -19298 -1822 18181 7272 -15144 -15103 2164
990 2164 10758 5261 -5729 -14221 -9819 8228 15658 -2902 -20466 -7267 16110 11174 -11714
1003a1714j084J9723O555j3042r440M977R195N558k562j3223q947J3907K0614
1016B0517o705k7237m554K4369J2805j6324j5824O311J1949M39o469m845j492
1029g060O444R425n071j7812r80K2514J0989k0585j9509J2157K2562l56j6425
1042c707o989N816Q531M973l295j1130l212J4376R947j3830j5985J0717K0948
1055A7160m540k2102m217J6878J0794p124j1374n141L682J1994O872j2145j6620
1068a5883N912K0805P48k0468o818J7252J0327j1881j1916M993J0473L636l833
1081C347q592o514Q459J7028o17k1466q973J9409J6427j1460j7864L812J4339
1094G335J718q374m572J307M559N796k442j2716m492J6152J2869j4028k0913N889
$$ plain form
1003 -11714 -12798 6925 13480 438 -9002 -4025 5170 10728 8166 -5057 -14004 -97 20517
1016 20517 13812 -13425 -17979 6390 19195 2871 -12953 -6642 5307 5746 -723 -5568 -7060
1029 -7060 -616 8809 3738 -14074 -15054 7460 18449 -2136 -21645 -9488 13074 12718 -3707
1042 -3707 -10696 -4880 3651 8624 5329 -5801 -9013 5363 15310 1480 -14505 -3788 17160
1055 17160 12620 -9482 -13699 3179 13973 6849 -4525 -9666 -5984 6010 12882 737 -15883
1068 -15883 -9971 10834 11582 -8886 -15704 1548 11875 -6 -11922 -6929 3544 7180 3347
1081 3347 -5245 -11759 -3300 13728 13111 -8355 -17328 2081 18508 7048 -10816 -7004 7335
1094 7335 9053 679 -3893 -2586 1973 7769 5327 -7389 -11881 4271 17140 3112 -17801 -11912
1108a1912K2027L326j6975r290P139R023J801l820o920l115Q855R858p527j5091
1122a2621M452J9651J438j9551q330J5453J3493o221j2254l195N330Q545M661
1135A0851o916j3471J134J6679N620j6547j0559J2843J3347q689j4493K077J2225
1148D101L439o038p378l546N278J2139J949j5621j1407J3362J7447o063j8105
1161a0443n29J5071M789r110n747L329N446K974j695q140m272J0576J2459p721
1175F987j8819M63J9910P183j4882j2042O589J0225P04n288m726j790M971P415
1189F900l466j2722n9J5534N497j6017j1439J1650J5390l957j3803l491P116P082
1203D215K406m519r139j087J2462P615j0959j2059Q330J4685m075j5138p52J2905
$$ plain form
1108 -11912 10115 13441 -3534 -12824 -5685 3338 5139 1319 -5601 -8716 139 9997 2470 -12621
1122 -12621 -8169 11482 12920 -6631 -14961 492 13985 7764 -4490 -7685 -2355 6190 10851
1135 10851 3935 -9536 -8402 8277 13897 -2650 -13209 -366 12981 4292 -10201 -8124 4101
1148 4101 7540 1502 -5876 -9422 -4144 7995 9944 -5677 -17084 -3722 13725 7662 -10443
1161 -10443 -10972 4099 8888 -222 -5969 -2640 2806 5780 4085 -4055 -8327 2249 14708 6987
1175 6987 -11832 -11369 8541 15724 842 -11200 -4611 5614 6318 1030 -3696 -5486 -515 6900
1189 6900 3434 -9288 -9347 6187 11684 -4333 -15772 -4122 11268 7311 -6492 -9983 -2867 4215
1203 4215 6621 2102 -7037 -8124 4338 11953 994 -11065 -2735 11950 7875 -7263 -8015 4890
1217D890N242p038p658j047M345Q329K183j0711j1107P223J6161j240j7045m995
1231a2468J3737P762q777q337L634O745J368l081n157k693O238J0281k685j5386
1245h819l691J6229J0884j1473j3771M622J2286J559o809m191P98L535M570r77
1259D752q869k879J1097P583j1097j3073O874J5707p27j4107n690P662P431R3
1273D757m647o035j471P930P605o499j1787L613J3974L47j3786m248J1883P952
1287I588o434q678J49N330N705J813o863q923L424J3623K324j3649p958J0644
1301I5J0246o533j0264K070P878J383m422m268j180L913P209n15j1677o083J1650
1316d98J2013p235j4682J272J2979L482p637n036K282M019K598p50n421l148P214
$$ plain form
1217 4890 10132 3094 -4564 -5611 -1266 7063 9246 -1465 -12572 -5349 10812 9572 -7473 -12468
1231 -12468 1269 9031 254 -8083 -4449 2296 3664 583 -4574 -7267 -1029 9252 6567 -8819
1245 -8819 -12510 3719 14603 3130 -10641 -6019 6267 7826 1017 -3174 -2376 1159 5729 4752
1259 4752 -4117 -6996 4101 11684 587 -12486 -5612 10095 9368 -4739 -10429 -2767 4664 4757
1273 4757 110 -5925 -7396 534 8139 1640 -10147 -6534 7440 7787 -5999 -10247 1636 9588
1287 9588 3154 -5524 -5375 -45 5660 7473 610 -8313 -4889 8734 11058 -2591 -10549 95
1301 95 10341 3808 -6456 -4386 3492 4875 453 -3815 -4995 -1082 6127 5612 -6065 -12148 -498
1316 -498 11515 4280 -10402 -9130 3849 7331 -306 -5342 -3060 959 3557 2807 -2614 -5762 1452
1331A452Q194o255j2589K600J4854L319j3110p865P157Q689k38n783m203n05M809
1346E26N971l257r666k67J1155L963j1746p416R294R802m697j0139p17O588M771
1361D165j49m694o301J221J0065M905r970q861O876J1676l110j0945k49Q963L012
1376F604n203m742N00L511M973J0p892o636P364J1455l185j3707k688J1773N806
1391G943p155o814K264M925J280j801l322k341L981O926k685j0626q13J2389O122
1406A0273j0153r626N350R888M42o209l461P40M037L983j312p240j978Q205N640
1421H579q096q728N649J0669k025j0639k525O895N162j294m643m257K99O840N029
1436F915o273r302L358J1008J07j0461k943Q703M888n145n476J175M343L200j22
$$ plain form
1331 1452 9646 3391 -9198 -6598 8256 11575 -1535 -9400 -2243 6446 6208 425 -3778 -4283 526
1346 526 6497 3240 -6426 -6693 4462 8425 -3321 -10737 -1443 8359 3662 -6477 -7194 -606 4165
1361 4165 4016 -678 -6979 -5758 4307 9212 -758 -9619 -2743 8933 5823 -5122 -5371 3592 6604
1376 6604 1401 -3341 -2841 670 5643 5653 -2239 -8875 -1511 9944 6759 -6948 -9636 2137 7943
1391 7943 788 -6026 -3762 1163 2443 642 -2680 -5021 -1040 5886 3201 -7425 -8238 4151 10273
1406 10273 120 -9506 -4156 5732 6174 -35 -3496 -2756 1281 5264 3952 -3288 -5266 2939 8579
1421 8579 483 -8245 -2596 8073 6048 -4591 -7116 -221 4941 3647 -996 -5253 -4954 1886 6915
1436 6915 642 -8660 -5302 5706 5813 -4648 -7591 1112 6000 855 -4621 -3446 897 4097 3975
1451C975n132n351M190J0033P6j1392n038R556Q027n709q177J363O247J034k997
1466G05k554q96K415M539n74q362k948Q960P561p312j0450K632J0291K026o880
1481h47m273K104L697K280q28m607k562N690N856m462q696K518J0376R44r665
1496b475m389O503O461j747n086k873Q00M623M166l645p870L48R235K632q613
1511a930n307O667O571m094o924O13M779K779j073l864l673K136P657K017q522
1526b168o518O771R280l217q686j15O710K574l593l152N39K383K875j27n307l832
1542e583N954P628l839j0325k78R874L760o663n669K197M355R50j155l265j952
1557d011K952N239k205p434k65Q956L483q265o103N258P473p99n655k501J973
$$ plain form
1451 3975 -1157 -6508 -2318 7715 7791 -3601 -8639 917 8944 3235 -4942 -3579 2668 3702 705
1466 705 -1849 -2745 -330 4209 3635 -4727 -7675 1285 8846 1534 -8916 -6284 4007 6033 -847
1481 -847 -5120 -3016 681 2961 2133 -2474 -5036 654 6510 2048 -6648 -4130 6246 7190 -2475
1496 -2475 -6864 -361 6100 4353 -733 -3606 -2806 1817 5983 2338 -5532 -5184 4051 6683 -1930
1511 -1930 -7237 -570 6001 1907 -5017 -4404 375 3154 2081 -1783 -5456 -3320 4337 6354 -2168
1526 -2168 -8686 -1915 7365 4148 -4538 -4653 2057 4631 1038 -2114 -1575 808 3683 3556 -1751 -5583
1542 -5583 371 7999 4160 -6165 -6443 3431 7191 528 -5141 -2944 1411 2361 1206 -2059 -4011
1557 -4011 -1059 4180 1975 -5459 -5724 3232 6715 -1550 -7653 -2395 5078 4279 -1376 -3877 -1904
1572a904L389L018j944n800j336P009M322o295o436M371P611k133p436o44N404
1587A196L176k147l717k257J194N290K593o014o481L611Q742k82q779k301O770
1602E94L748m013l807J197K770J895m86l265l059L443O790j099q687k475Q029
1617A575N924n334o523J367N358J095k483k169j044K028L499m84n729k103O682
1632A659M599n664p410L003P960M28o193l101K562L269J468j327l836j903M807
1647C21M662l639o581K070P586K83o991k559N540L909k222l756j516J890L597
1662B594J848l424n804J281P679J390p093m041N215M967k902n025N17L488J541
1677B231j319k545j966J874N203M78o494m026N859O697l044p448L29N933J735
$$ plain form
1572 -1904 1485 4503 2559 -3241 -4577 2432 6754 459 -5977 -1606 6005 3872 -3564 -4208 1196
1587 1196 4372 2225 -1492 -3749 -2555 2735 5328 -686 -7167 -3556 5186 4904 -3875 -6176 594
1602 594 4342 329 -3478 -2281 489 2384 1898 -1367 -4426 -983 5807 4708 -3979 -6454 1575
1617 1575 7499 2165 -4358 -2991 2367 3462 979 -1190 -2234 -206 3293 2809 -2920 -5023 1659
1632 1659 6258 594 -6816 -3813 4147 4575 -1618 -4719 -2157 1112 2580 1253 -2583 -4486 321
1647 321 4983 1344 -5237 -3167 4419 4702 -2289 -4848 692 4601 2379 -1377 -2893 -1003 2594
1662 2594 4442 1018 -4786 -3505 4174 5564 -1529 -5570 -355 4612 1710 -3315 -2798 690 2231
1677 2231 912 -1633 -3599 -1725 3478 3956 -2538 -6564 -705 5992 2948 -4500 -4171 1762 3497
1692C497k780k471J22K001K047J54l767k541M365N011l303p101P70P652J945n807
1708b06l996K360L760O03j582k920j137K443M244j756n711k39O412K522o460l782
1724e445M235N237j767m247j236K103K823J437k137m260k38N919L006n302n007
1739d879L671N793j569n462m03M109J810j858k472r37J142L601J098m625m304
1754e285L715O221j078p080j414N436L106l175l069M87K085J463n2k420k068K697
1770d31M322j263n900j075O357L275m551m954K164M542N79k285j987r22K219K727
1786B817m44m389j382M843L024m319m825K702N389m18m788j620K476K408P41j755
1802D60l354m71M229L173l399m925J749N875L3n392j353L828K603j831k683j88
$$ plain form
1692 3497 717 -1754 -1632 369 2416 2570 -1197 -3738 627 5638 2335 -4766 -3996 3656 5601 -206
1708 -206 -4202 -1842 1918 2521 939 -1981 -3118 -675 3569 1813 -3898 -4137 2275 4797 -1663 -5445
1724 -5445 -1210 4027 2260 -1987 -3223 -1120 1703 3140 1003 -3257 -3495 2424 5430 128 -4879
1739 -4879 -1208 4585 3016 -2446 -2849 1260 3070 1212 -1260 -2197 -1055 2546 3644 -981 -5285
1754 -5285 -1570 4651 3573 -3507 -4921 515 3621 446 -2623 -2136 -51 1412 1360 -1060 -3128 -431
1770 -431 3891 2628 -3272 -4347 2010 5285 734 -4220 -2056 2486 3065 780 -1207 -2129 90 2817
1786 2817 2373 -2016 -3398 1445 4469 150 -4675 -1973 3416 2998 -1790 -3410 -934 1474 2215 460
1802 460 -2894 -3365 864 4037 638 -4287 -2538 3337 3370 -2022 -3375 453 3056 1225 -1458 -1646
1818a646J329K234J089k906l722J833N675J25n802k671M646L798k564l656L71
1833a867K447J022q14j714j392J375L285K23m886k363M992M348l398n394R65N025
1849A854J135k788j995J88J667J771r9k815j858L398L471k298n057J233N228Q77
1865C912m859k331K431L019J66k147k006j70K406K621j746m258NM792J622m484
1881a027k576K882L427j436l154k94J827J700N83j769l027O50M543J475m328l599
1897d123L214M570j334m137r6K697J225j013j651p52Q12K608M61l543k728L432
1913c58M313j758n375j82M543J822k807k434P00J491J172N5k081j550J733L542
1929B826j237m160m85M580K183l849l350K377L298j17k021j531J21J720K098q26
$$ plain form
1818 -1646 -317 1917 3006 100 -3622 -1789 3886 4011 -1791 -4462 184 3982 1418 -2238 -1867
1833 -1867 580 1602 788 -926 -2318 -943 2342 2565 -2321 -4684 308 4656 1258 -4136 -3171 1854
1849 1854 2989 201 -1794 -1606 61 1832 1733 -1082 -2940 458 3929 1631 -3426 -2193 3035 3912
1865 3912 -947 -3278 -847 2172 2338 191 -1815 -1985 421 3042 1296 -2962 -2957 1835 3457 -1027
1881 -1027 -3603 -721 2706 1270 -1884 -2178 -351 1349 1932 163 -2864 -2214 2329 3804 -524 -4123
1897 -4123 -909 3661 2327 -1810 -1906 791 2016 1003 -648 -1400 -588 2020 2481 -1062 -3790 -358
1913 -358 3955 2197 -3178 -3360 1183 3005 198 -2236 -1536 -45 1127 1182 -899 -2449 -716 2826
1929 2826 1589 -2571 -3056 1524 3707 -142 -3492 -1115 2183 2066 45 -1486 -1365 355 2453 1627
1945A627l471q28L695K555l222l557J963M011p86l607p90K225J578k08j418j824
1961b057J06K817K188k988l643J848M295l1m115j273L064J915j450j914j9J237
1977b0J524L01k226k257J837L839k66m395j708L884K931k293l072K92K348P62
1993A481q81j310r70J118K436k66l601j101L818K442k780l546J466L430M51k440
2009b53j559K87J685J453m10k589j091K818K505k153l190R03L948J6l270j217
2025b117J968K072n59j539j037m1K116J725j860l478O68M089O24l688j911K777
2041a91K287j309k308j18J603J002Pj151j874P97L172M92l515k273L115L371j443
2058A664l528k5K483J299j270j300k23P10J474M02k336j489K315K676j649l605
$$ plain form
1945 1627 -1844 -2672 1023 3578 356 -3201 -1238 2773 1987 -1620 -2410 -185 1393 1185 -233 -2057
1961 -2057 -1951 866 3054 66 -3577 -1729 2566 2535 -1580 -2853 211 2126 676 -1238 -1257 -20
1977 -20 1504 1805 -421 -2678 -841 2998 2732 -1663 -3371 513 3444 1151 -1921 -1629 719 1481
1993 1481 600 -710 -1680 -562 1874 1608 -1993 -3094 724 3166 386 -3160 -1694 1736 2187 -253
2009 -253 -1812 -1525 160 1613 1203 -1386 -2477 341 2846 693 -2497 -1594 2354 2370 -900 -2117
2025 -2117 -149 1923 1364 -175 -1212 -1253 863 2588 728 -2750 -2082 2007 2631 -1057 -2968 -191
2041 -191 2096 787 -1521 -1639 -36 966 973 -178 -2052 -1255 1917 2409 -1106 -3379 -264 3107 1664
2058 1664 -1864 -1889 594 1893 623 -677 -900 -190 1284 1686 -650 -2139 176 2852 1203 -2402
2074b402K34L589J193k523k041P05J685R13n84j622q90J435K277r17l068j00L532
2091A416R54k857k002J835K376j99j834q33K43J599J064r69k534j49L124J412
2107B646k700k317J868K702q04k470k25J416Q87k53r23j277K36K381J040k668
2123d61k502K040L499q66l382l54K387J192j303j233M2P63Q42L82j493j635J547
2140e35K911o78l492l89L291J608k350k162P31K033K33n86j036q11J020J703j75
2157A316k623p55K719J685k472k305J338K716j45k107r19R24J113N27n08j904
2173a400k95K009J896j760k569Q43K793K25k349j230J793J410m05j216o94L07
2189f42J569Q03j799j926J085K720J62l057r88K174J553j067j580n6J006Q44r2
$$ plain form
2074 -2402 -2168 1421 2614 91 -1950 -1245 440 1353 769 -853 -1743 -308 1969 1052 -2016 -2116 1416
2091 1416 2370 -487 -2489 -654 1722 1523 -311 -1144 -901 698 1762 793 -1741 -1890 1234 2646
2107 2646 -54 -2371 -503 2199 1395 -1075 -1300 116 1003 750 -173 -1450 -1214 1167 2207 -461
2123 -461 -2963 -923 2576 1710 -1672 -2026 361 1553 250 -983 -941 -178 664 1046 -447 -2082 -535
2140 -535 2376 1698 -1794 -2183 1108 2716 366 -1796 -1065 968 1201 615 -421 -1232 -212 1491 1316
2157 1316 -1307 -2062 657 2342 -130 -2435 -1097 1619 1474 -633 -1552 -628 485 1012 504 -1400
2173 -1400 -1695 314 2210 450 -2119 -1276 1517 1742 -607 -1837 -44 1366 961 -255 -949 -642
2189 -642 927 1730 -69 -1995 -910 1810 1972 -1085 -2073 101 1654 587 -993 -1049 -43 801 709
2206G09j003j300J034K102j42k686q93K357K258j793k531O23J827P94j168p79
2222e91l68R24J274m8j987r33K026J928j578k673R84K552L04k171j151R92J020
2239E04M58o87j016n58J281J997j208k734L87K731N87k469j214J642J688n22j637
2256g70k48O95Q41P20r87j616J04K520Q71k503j779J777K134o08k165p3J375N72
2274H60n51o93n24M17J399L60k108j256J917K185r35k572j13K064R18j176j069
2291h77J38P38P07j59j080j037J441J785q14k537J78K455Q99k034j408R08J614
2308I17K36p85r97m87J328J323p13k099j50K167Q76j770j655J436J648l46j546
2325f17m28O77R50K60n89j504L8J828J258j962k124J670K076m79k120LJ180J150
$$ plain form
2206 709 -294 -1594 -560 1542 1400 -1286 -2179 178 2436 643 -1888 -1265 562 1356 188 -591
2222 -591 -959 -35 1239 1191 -796 -1729 297 2225 647 -2026 -1042 1510 1814 -357 -1508 -516 504
2239 504 962 275 -741 -1299 -18 1979 771 -1963 -1576 1155 1742 -727 -1941 -299 1389 867 -770
2256 -770 -1018 -323 518 1238 251 -1365 -1261 1259 2130 -373 -2152 -375 1759 1151 -1014 -1087 288 860
2274 860 309 -384 -908 -491 908 1268 -840 -2096 -179 2006 1071 -1501 -1614 450 1368 192 -877
2291 -877 -739 -1 706 547 -533 -1570 -129 1656 842 -1695 -1517 938 1837 -197 -1605 -697 917
2308 917 1153 368 -629 -1116 212 1535 822 -1277 -1427 740 1616 -154 -1809 -373 1275 929 -617
2325 -617 -1045 -368 582 842 253 -1251 -1213 615 1873 -89 -2213 -543 1533 1054 -1066 -1063 117 1267
2343A267p80r11k12K15J174O09j588j354R43K339l07k556l83K120Q66j055j343
2360i56K38R19L31p1q20n86N18J608k17k108m80K115J346j718j720P00J894N8
2378A051j185o97K58O97Q90m04j266o08J672J419j401j911O44K027o6j578p34
2395a192J207O74P1o98r41q2J373R46j124j883O87K011J05j871q06J369J099m27
2413E18j071J6L16P88L06j163r60N99J845J22k064q19J840J221j209j227L25J083
2431D66L39l73o45m60L63J240J75k043m31J619J330j168j853L83J862L09j397
2448b84n51L43N48N79k40r14o38J105J421q61j788L33J929K30j691n96R45R94
2466H64j40q43n90K09R14R11q53j514K95J808M70j842j193J234J374n46j107k30
$$ plain form
2343 1267 487 -424 -636 -421 753 1362 -226 -1580 -637 1702 1395 -1161 -1544 576 1442 387 -956
2360 -956 -718 201 532 461 -359 -945 -427 1181 964 -1144 -1624 491 1837 119 -1601 -901 993 1051
2378 1051 -134 -831 -573 124 1014 610 -656 -1264 408 1827 426 -1485 -841 1186 1120 -458 -1192
2395 -1192 15 689 760 62 -879 -961 412 1358 234 -1649 -962 1049 1154 -717 -1523 -154 945 518
2413 518 -553 -537 -221 567 873 -290 -1250 -651 1194 1316 -748 -1567 273 1494 285 -942 -617 466
2431 466 805 432 -213 -673 -310 930 1105 -938 -1369 250 1580 412 -1441 -1058 804 1113 -284
2448 -284 -835 -492 56 635 395 -519 -1157 -52 1369 508 -1280 -947 982 1212 -479 -1075 -130 864
2466 864 724 -119 -709 -500 414 1325 472 -1042 -747 1061 1531 -311 -1504 -270 1104 558 -549 -779
2484g79P30M13J34n27r94N08J385K29j560j197J608J598p64j972N0J448O41o28
2502C23p92j05L89R74Q0j184q72J148J438o35j868lJ812N30j260r41M62P94N83
2521H73m79p36m82Q63J080o11j436j35J688N82j612q85Q89J185j32q53o31M34
2539c98P35O03n49j245q6J529O29j198j314J029J365k13j441j79R35N06k67n11
2557g0o48L74Q51O57j131j406P39J837l40j750k21J317Q14r78p23M2P91L58j09
2576D04n66j008P54J426l13j379o17J599R36r77j252M45J023K91n30o46k35O28
2594a7P32k66r35m51J305J005j255j233L74J519J68j234n30M26P07M13n40p09
2612e21m99J185Q08j004j107L46J567R8j292l62P32P52k80o53l89K45Q36M08q99
$$ plain form
2484 -779 -49 364 498 -29 -1023 -515 870 1099 -461 -1658 -50 1548 784 -1188 -1138 310 951 323
2502 323 -469 -574 -185 789 869 -315 -1187 -39 1399 764 -1104 -1107 705 1235 -25 -966 -504 290 873
2521 873 394 -342 -824 39 1119 508 -928 -1063 625 1207 -405 -1290 -401 784 652 -201 -832 -398
2539 -398 337 940 391 -854 -940 589 1218 20 -1294 -265 1100 887 -554 -733 202 708 441 -70
2557 -70 -718 -344 507 1164 33 -1373 -634 1203 863 -887 -1108 209 1023 45 -678 -636 155 513 404
2576 404 -162 -1170 -416 1010 697 -682 -1299 300 1236 259 -993 -548 475 766 236 -410 -645 -17
2594 -17 715 449 -486 -937 368 1373 118 -1115 -741 778 946 -288 -818 -392 315 728 188 -521
2612 -521 -1020 165 973 -31 -1138 -792 775 873 -419 -781 -49 703 423 -230 -619 -374 462 870 -29
2631b9j019O06J343O2j437n64J048Q72n62j010K61M85K24M5n15n11K20J328j36
2650G11j321n78J090J221r85j096K64R10M87o61l92j47M04N43Q1r85o26J232J006
2669A158o20j494L04J408K51j116o26L91P45J90m24n51j81N72R49o85j269J28
2687h70J603K66j309n30P00R02k56q07k80J93O47L91l80j022J02J148N14j374
2705c62q25J118J184n04j056k22P42N91k61n35n25J71J116K17j005r79R28J215
2723A008m08j345k10J043O28n12p95J21L55N09K09q86m34N40R92j70j457k23J300
2742B65P57j083q70O03Q74l7m40m01rK86O35j94j013k34J281N49p47j090M20J155
2762G07r4p44m25N14L70N1j75q38n4R89N18p66j042N28J322j57j094k48O06O96
$$ plain form
2631 -29 -1048 -442 901 963 -474 -1038 10 882 320 -690 -429 56 280 325 -190 -701 -481 847 711
2650 711 -610 -1188 -98 1123 138 -958 -694 216 703 42 -350 -497 -93 450 531 -454 -1080 152 1158
2669 1158 538 -956 -652 756 1007 -109 -735 -344 401 591 167 -384 -565 7 956 271 -998 -870
2687 -870 733 999 -310 -840 -140 762 506 -301 -581 -388 259 650 270 -752 -650 498 1012 -362
2705 -362 -1187 -69 1115 611 -445 -667 75 666 405 -130 -655 -484 632 849 -156 -1135 -207 1008
2723 1008 600 -745 -955 88 716 204 -591 -470 -115 394 603 -283 -717 -177 815 645 -812 -1035 265
2742 265 1022 -61 -931 -328 546 509 69 -332 -341 -55 580 386 -627 -861 420 969 222 -868 -448 707
2762 707 613 -131 -556 -42 328 379 204 -634 -688 301 819 53 -989 -461 861 704 -390 -638 -32 664
2782F64k02n58l79P6O67K49m78q77M18J278nj269o07J194Q47p41p37K1L82M25
2802C68K9p44j14K16P64K48j300k81R84N86n62r47J51R60J39l36o55M8L32O80
2822E66j92p49m86Q64R24p18j111L47J014K44r06m92N77M44J83l72n27J03N48
2841B61N45o68q96J85J316O4j143m16O69N65q5o87q7J35N92P8m06o88O0J131L92
2862I17j201o59Q00J040n65r18J68L97N21l40l55k02M40N39j01o09p11Q57R78
2881I96n48j169K29P69M01o53n13M1N00M56j50n08n05N85P75l42j028J1R75N90
2901I12q71p79N19N26J67n66l37J05M05M23l06p73j98J074M50o87p27M45Q25j75
2921D32o83l79L91M67J23m17m27J6Q01M02p71p55L45R40p0q04k51O27N71m00l77
$$ plain form
2782 664 462 -96 -475 -399 268 517 39 -838 -420 858 853 -416 -1023 171 1018 277 -460 -439 -57 368
2802 368 397 -347 -461 -245 519 767 -533 -814 170 756 194 -753 -602 358 497 161 -494 -446 -114 566
2822 566 374 -375 -861 3 927 209 -902 -555 459 703 -203 -695 -118 326 509 137 -390 -287 261
2841 261 806 138 -758 -573 743 807 -336 -752 -83 482 397 -290 -377 -242 350 428 22 -666 -606 525 917
2862 917 -284 -943 -143 897 332 -586 -418 -21 500 160 -195 -397 43 582 481 -128 -839 18 996
2881 996 448 -721 -492 277 678 25 -488 -447 53 509 359 -149 -654 -69 706 364 -664 -653 322 912
2901 912 41 -738 -219 307 474 -92 -429 -324 81 504 198 -575 -773 301 751 64 -663 -218 607 432
2921 432 -251 -630 -239 228 351 -66 -493 -477 324 726 -45 -800 -455 485 415 -389 -640 -13 558 158 -219
2942b19o8J50M48J48m65p96N68R45r2j033m09J120L52n30l58n1M56K37j58n84
2962c39j19M58N24n6r41k00Q19N92o21r68M53P77J37n04l81J80L89L11l50n87
2982d26o5O74M74m94q93K68Q47O3n15l38K51N26J16m21l69M3N22M07p67m46J47
3003c96Q28K71r95n26P96O10l80k72j6k89N93K19m20n93K02Q95J26q10m95M65
3023a87P78j41p77k63O61M17k94l13m47N00L87J85p48m52O41N79l40q12K4P71
3043A69L15n59k79R0K14L36j16k11n74N43N99l54n81l1P72N6m52m41L09M71O6
3064C42l11l39q2M48L60j34o14j98O21N67p64n80O05M86p7o63j80M88L70j24k32
3085a1l99O2O83R3m96n20K67P84j9p13k31N26M79k90l76k83M06J98K27l85n44
$$ plain form
2942 -219 -287 -137 311 459 -6 -802 -234 711 619 -414 -823 297 649 119 -239 -290 166 403 245 -339
2962 -339 -458 0 524 468 -473 -673 146 738 117 -851 -398 379 516 12 -369 -189 200 511 161 -426
2982 -426 -491 183 657 163 -730 -462 385 448 -67 -405 -154 372 488 67 -302 -259 263 670 -97 -543 -396
3003 -396 432 703 -292 -818 -22 588 208 -64 -80 -369 224 443 23 -570 -368 527 653 -157 -652 -187
3023 -187 591 450 -327 -590 71 488 194 -119 -566 -66 321 506 -242 -694 -53 526 186 -626 -602 169
3043 169 484 -75 -354 -264 -50 286 170 -41 -615 -72 527 173 -408 -439 333 389 -63 -504 -195 276 342
3064 342 31 -308 -390 58 418 284 -330 -528 93 660 -104 -684 -79 407 330 -333 -513 -25 345 221 -11
3085 -11 -410 -348 335 428 -68 -588 -321 463 444 -269 -500 26 505 215 -161 -444 -38 160 387 2 -542
3106e42M97N15Q2r06k58Q92J39k11n47M4M77J40j01l14k80M01M10K4p27m57P89
3127F7N36o66l49M9O93k00j84j21k18M09K33j62m65r3M82M98m56o57J46P73O7
3148C82n03k92L76L73o7m09q1Q6L35K11l60n70K16Q03q6n42l56M47M58j80m69
3169b28K7J18L56N1m73K0j7O34n5p00k75M10M58k14m03p2N11J35p8k09j26J86
3191E6K98j17n84qK01N95k42o60J31M31J58r9l93N0L11J30l25o0k40L28N47k64
3213B44o95P6P14Q2k94n64J97M30j5k44j19J6M64K7k99l81J17M39J55l45m97M62
3235c0L75K4o32j8K17J08O0n2l37J05N17m1n04j87L57L77Rp11J01K64K98j92k21
3258a13L8J33K19p9k38j67J55O13l06o86QK81M36k84l49K52R5K09k93L8k59L90
$$ plain form
3106 -542 -45 470 552 -354 -612 280 419 208 -339 -295 182 322 221 -93 -373 28 438 462 -265 -722 67
3127 67 603 -63 -412 -363 330 130 -54 -175 -393 16 249 87 -378 -471 11 509 53 -604 -458 315 382
3148 382 -121 -413 -37 336 269 -140 -221 -135 200 411 51 -519 -303 500 414 -128 -484 -37 421 241 -228
3169 -228 -201 -83 273 324 -149 -129 -146 488 433 -267 -542 -132 326 112 -291 -363 148 283 205 -4 -130 56
3191 56 354 237 -347 -355 -154 441 199 -461 -330 101 259 160 -233 -183 128 258 -67 -127 -367 -39 508 244
3213 244 -451 -375 339 421 127 -437 -240 190 175 -69 -188 -172 292 319 20 -361 -244 195 350 5 -492 -30
3235 -30 345 369 -263 -281 -64 44 104 52 -285 -180 337 296 -208 -395 -38 339 348 -363 -262 2 300 108 -113
3258 -113 -75 58 277 198 -40 -207 -52 561 255 -431 -423 -142 294 10 -339 -87 8 217 -76 -38 -297 93
3280I3K84j74m39l5L88K36k81m55L04K40J41m07N6l20M71O9j92q8j25K55M09l34
3302I6n86L47K52K88l47l78K05K12J41k12l4j67L52J08k72k89K11N78l10k78k51
3323c34L06L63j92k47JJ02K52n3k53j99J38M40j07l81k52M94J87q6k25k44N68
3344B78K6k23k67j49L04L90k31k19j20K61L60k97m10J47M01J43l55k13K17J05
3364A48K13k55j96j54L57J91k22n20L19J31L01l68k19L19J36j33r5J0k77K72L06
3385B64j33m74K38J01M33m13m44M92O3J46m19o5J81L39k12j56k34M5M86J03n72
3406b31k42M38M37k76k00j10K33P3j7j40r0NK07J64m22l0k9M39M9m13k79O21M0
3429B27j89l56J88K47l0J01l41J28K9L48j79m48N1L93J98n83O8P2J68K41l65n9
$$ plain form
3280 93 377 203 -236 -271 117 353 72 -383 -79 161 302 -105 -49 -369 102 171 -21 -109 -234 21 430 96
3302 96 -490 -143 109 397 50 -328 -123 89 230 18 -16 -183 169 277 5 -284 -73 505 195 -83 -334
3323 -334 -28 335 143 -104 -103 -1 251 198 -55 -254 -116 324 217 -164 -416 78 265 179 -46 -290 278
3344 278 304 81 -186 -335 -31 359 128 -91 -211 50 410 113 -297 -150 251 394 39 -174 43 148
3364 148 361 106 -90 -244 113 304 82 -438 -119 12 313 -55 -274 45 181 48 -47 -37 -314 -42 264
3385 264 131 -343 -105 -4 429 16 -428 64 127 273 -146 -211 -30 309 97 -59 -293 -248 238 341 -231
3406 -231 -473 -35 402 126 -74 -184 49 122 105 -35 -125 -120 87 251 -171 -201 -230 209 258 -155 -434 187 227
3429 227 38 -318 -130 117 87 188 -153 -25 4 352 173 -275 -224 169 367 -216 -148 -76 92 333 -32 -91
3451i1j18J64J71m7k0k43K09J66k12l64J98M72p7m30N3J96lj02q0J78k62L22L4
3474A14r8j91l6N17r8l25q4K42J34o7j44q1L5L96j82r6k93K63J64K7l17k23L75
3497C2L03p2n13K04Q3M7N1k81q4K72J16j6k53j32K03K89j48l59O0K73O1j36k14
3520b14K05K06j38N6l50P5K63L3j20j88QK26K6j98j59L03J25j26j03k76L53m0
3542c3J72o4l26R1M86l1m12j98J48N20k20l24J67P0j5R1k21l9j71N31q0k15q7
3565a60P6L06k49j52J36J28o3J1j52K8M2J57P9j95j58J05J64Q3l26j66K56K26
3587A76l2k44j02K35J02p2k08O6l9L73j67j25k68L35J68m6l17J13L70j87m7j33
3609d9j71L88pk76p1k5K40K15l29q3J13J91L9l95L7J87J68k76L3j4o8K59K12l96
$$ plain form
3451 -91 -209 -45 126 79 59 -184 25 191 -21 -385 -187 285 208 -222 -169 27 24 -78 -158 20 -242 80 114
3474 114 16 -175 -211 306 208 -117 -201 41 175 108 -36 -117 -82 314 132 36 -257 6 170 197 -120 -343 32
3497 32 335 263 -250 -46 37 84 135 -146 -230 42 158 142 -111 -243 -40 249 101 -258 -198 75 136 0 -214
3520 -214 -9 197 59 115 -235 -160 103 136 16 -172 -164 62 88 -110 -269 34 159 33 -70 -346 7 -33
3542 -33 139 75 -251 -160 326 295 -117 -315 -167 353 133 -191 -24 46 31 122 -99 -138 -309 222 142 -73 -160
3565 -160 -84 222 -27 -179 -43 85 22 33 -119 -91 -49 108 187 -8 -166 -61 103 186 -140 -306 -50 176
3587 176 144 -100 -202 33 135 63 -145 -79 -118 255 88 -37 -305 30 198 152 -165 -52 318 131 84 -49
3609 -49 -220 168 161 -115 -186 -211 29 244 -85 -168 -55 136 175 -220 -183 4 172 -104 -71 -85 -153 106 318 -78
3633g8j92K90P2K40n82o5Q8N03k47q9l9J68k8K0K3l55K09K22n9k39J4R5L08j13
3657A66l65J14P9J14j39j01P2K07o4j40j06L7J62K36k52l20K30P6J71p5l36J1
3679b23K47N1k5N5k80J84K60l81l5J21J64J43m14j8L36R4n6l06j42J2K01J24P
3702A19l85P2L42K45n06j44K14K31j8j38r3R6R4j10j09M2Q0Q3J27k33j64J00L81
3725C26j74l78L4J05J93Lk89p5J92K01m3k07K9J74J62j17m09L41K3J11k24p8m
3748a04K48l1r2j8l5J26J97j91k60Q0J21J46k11j47R4J74J67j19l09l8J61J75
3770A34k4k56K5M37o6m17N0Q3J22l7j8n3J4J57lk82j29K70O4J32k64nQ1P7o7j81
3796a56j00K66J80k58M8KK2L8J84l88m4J05J53j21j2K8R5J48j95r5j31L73j05
$$ plain form
3633 -78 -270 20 92 332 -250 -315 -227 276 29 -60 -99 69 41 61 84 -271 -62 160 101 -138 -124 -29 279 166
3657 166 -199 -85 -6 108 -31 -132 -60 147 83 -57 -163 -126 36 272 20 -300 -70 6 177 102 -234 -223
3679 -223 24 75 50 105 -175 9 269 -112 -147 -26 138 281 -133 -151 185 279 223 -83 -225 -213 -12 112 119
3702 119 -266 -194 148 393 -113 -257 -43 188 170 32 -61 35 129 19 -90 -48 32 115 242 9 -155 -55 326
3725 326 152 -226 -192 -87 106 109 -180 -255 -63 138 95 -112 -83 91 253 136 -273 68 91 202 -22 -100 -104
3748 -104 144 113 21 3 -32 94 291 100 -160 -80 41 187 -24 -171 -77 97 264 145 -164 -202 -41 134
3770 134 110 -146 -121 316 250 -167 -117 -34 88 51 33 -20 -6 151 148 -134 -263 7 71 203 -61 -66 15 92 25 -156
3796 -156 -256 10 190 -68 -20 -18 4 42 226 -162 -206 -101 52 -69 -81 -53 42 190 -5 -100 -231 142 37
3819C7r5L3pK3J23j94J4j04K87J72l46j03J40L59j70k29J2n2Q2J17j73l0L5n7
3843a26L14j20k03M1J25K02l08j4jJ11J87k33j17K8L76q6p1l51P3P5K25l44O0
3866a57K41J42j98k67R8J66N5Rk70j5K07L3O4p9j39O4K71j25j60o4J81J48j47
3889E8j54P9m9J99j11m2p0J03Q2m3l31M1K40P9j2k69J50J26o4m9N5j75K20J26
3913A89o8k76J11K11K0r8k21J4J90p8o2j16J80J32Mj13r4mP0K20k49r3Q1K29k66
3938h7r8J94J57kj69N3j3k2R5O5k37r7O9L07r4j79j47K51rM2j37R0pO0Qk08J05
3965a0l1K23p5k10j02K61j2j87Q9oJ91j8n8M6k41K22J51k40j88o4L03J14p4k35
3989a51J34Q7J71q4l24J15R8J59k40P1j85L33n8o6j86n8M54r2l05j12N7K54jj44
$$ plain form
3819 37 -58 -25 -32 -9 114 -80 -66 -170 117 289 -57 -160 -20 339 169 -60 -48 -100 -18 99 -74 -104 -69 -126
3843 -126 188 68 -135 -94 31 233 -75 -89 -90 21 208 -25 -142 -114 262 176 105 -246 -173 -98 127 -217 -157
3866 -157 84 226 28 -239 -141 25 80 89 -181 -196 11 44 108 29 -110 -46 225 100 -60 -124 57 205 58
3889 58 -96 -17 -66 133 22 -20 -90 13 95 52 -279 -238 2 81 69 -200 -50 76 12 -37 18 -157 63 189
3913 189 121 -155 -44 167 187 89 -132 -118 72 -6 -68 -184 -4 128 132 19 -75 -79 -9 211 -38 -131 -50 179 -87
3938 -87 -185 9 166 164 -5 48 35 13 108 173 -64 -161 -92 215 121 -58 -205 46 37 79 -58 32 25 85 93 -115 -10
3965 -10 -41 182 107 -103 -205 56 44 -143 -54 -60 131 113 55 101 -140 82 233 -7 -195 -259 44 158 84 -151
3989 -151 -17 70 241 157 -167 -52 46 205 -35 36 -149 184 126 60 -126 -184 270 178 -127 -239 -182 72 71 -73
4013g3P3p9J05qo7P3P4K22l0l30l3J32R5k19n9R5J37j0l5j00J04j00K00j9k77
4038a29p2J34K04r4j0j41J92q0K4k8j45K11J16r3o9r5L5R7Qj53J32k0Q8p3o6N5
4064B8k2J26j11jj06J01J39j66l9j00K93L1j87J3p4L8P8q4L4K0O2K0j38k67O8
4089b44L71P4l31PJ38K85l20p5O9O8J51l61kJ43l2J9Nn3L3J43LO6l13N6L06r7
4115A09j32j4r4P8K27j28n9N5P2J37k7k57jK01m6r9j64q0M21nj65L7j43K44j59
4140Hk1r9L9R8o6J44j16l0J43j89n3J90P1N9j64Lk91J01K06O5j27k63L60P1J13
4165B52k64j55K66P7l3K8j07k06J72o2%o6K07J80k87r6J06j09J02l3LR6Kj06P5
4190D2p7j33L03J08j26j20N3Pr2q1Q7lN2K39k49p1j8J28O0q7j37K60j17oJ81m18
$$ plain form
4013 -73 0 -79 26 18 -49 24 98 320 290 -40 -73 59 154 -65 -124 -29 108 98 63 -37 67 -33 167 148 -129
4038 -129 -201 -67 137 43 33 -108 84 4 28 0 -145 66 182 89 20 -75 -40 57 65 -88 44 24 112 39 -27 28
4064 28 6 132 21 20 -86 15 154 -12 -51 -151 142 173 -14 -1 -75 -37 41 -43 -9 11 73 93 -45 -312 -244
4089 -244 127 201 -130 -123 15 300 -20 -95 -26 42 193 -168 -170 -27 -59 -40 -35 -88 -55 88 91 157 -156 -100 206 109
4115 109 -23 -37 -131 -53 174 46 -13 42 114 251 224 -33 -34 167 121 22 -142 -222 199 194 29 66 -77 167 8
4140 8 -13 -112 -73 25 -41 103 -13 -43 100 -89 -142 48 119 178 14 17 -274 -173 33 98 -29 -292 68 139 252
4165 252 -12 -167 99 176 143 171 64 -142 30 -32 -32 -98 109 289 2 -94 12 -97 5 -28 -25 71 73 -33 42
4190 42 -35 -168 135 243 117 -3 50 57 -35 -116 -29 -32 20 259 10 -61 -79 49 109 22 -115 145 28 22 203 -215
4216b15K75j32L48k23k1p8J73k09J22j21j4K68K03k83q4NM5M7j90j02K09P0m5
4239D8k8q6J68j15k7P3j25j9J73K27l18k04J14K93l7n9m4K6J5j26L6j79J72N3
4263C1m5o3l07K91L36k16j11p2K52p1m5Q3q7J3j71J58j09J8J47j19j6J57j13J56
4287I7rM2j91k08J89J82Q9k23k4MP8pJ5k16L29J7k14r7K5K34K7J0j75o1J16l0
4313aj7j42J38J35r3K0l40K15J56j10R6k67J53J0rJ44j77QL9O5j11k3L05j92J93
4338A95j00j63J94o4q1l8J23o7R1l9p2mP1J01j46p2J60j08J92k01P4j29K19P0
4362B06j39koO4j37Q8k74K30j34Q6lj35k3K55M3kp0o6J47p1LL2k31L22j99N5l0
4389Ik2PL3l8n3LN6J5j63O6J34j32J03O7r2m3J60Q6r6j26j1N0J79k03j71K65j9
$$ plain form
4216 -215 60 -72 276 53 32 -46 127 -82 40 -81 -95 173 376 93 9 14 59 106 -84 -186 23 93 48
4239 48 20 -66 102 -13 -40 33 -92 -111 62 289 -29 -233 -119 174 137 78 34 60 75 -51 -15 -194 -22 31
4263 31 -14 -77 -384 -93 243 27 -84 -156 96 25 -20 63 -24 -11 -182 -24 -133 -115 32 -87 -103 54 -59 97
4287 97 88 130 -61 -269 -80 102 191 -32 -56 -52 26 19 34 -182 147 164 -50 -147 -122 112 139 149 -26 -87 29 -1
4313 -1 -18 -160 -22 113 20 40 -300 -85 71 -39 57 -210 -57 -47 -56 88 -89 -81 -42 23 -88 -111 194 2 195
4338 195 95 -68 126 62 -19 -57 66 -1 90 51 -21 -25 46 147 1 -71 89 -19 173 -28 46 -83 136 206
4362 206 67 65 59 123 -14 74 -200 30 -104 -18 -21 -156 -179 76 119 117 47 -19 128 57 60 92 -139 183 -16 39 9
4389 9 -13 -6 27 -11 -64 -61 -5 10 -153 -87 47 -85 18 85 -7 -50 110 196 100 -26 -37 13 192 -11 -182 83 64
4416F4O6q7%q0N2r3Q8j78J39k22J92kN1L0Q3J23j39n6j0k6O4P9j84r3L06j19j01
4443e3O4N0p1o1K25k34O0K54j64l4n4J51r1Nj61O7R3o0J40k66Q9J48j84M0kN9
4469A0J57j74o1j01J70K7n7j23J72P8o4K0j01j31K31Q6k14J12M5j94K68k56M4
4492e6j55K2K02J25k21O5N2K93m83n6K24o2J07L3j12k01J92%K5o4O2J58R7j27
4516A20j95L4Q4O6m0p1j53K72j96J0j03r9M04l1k0k72J54kL59l05j38J19J01k5
4540G3l8o9Mj20J64j25J71k39K27r9J9mo7O9L0l7J55o7O5q5M1k44K6K89l47J36
4566g2J26n0P0p4NM0L8Mk28K94j74q2O5J8o0J13j03L16k33p7k01J77J54j29K0
4591d3p2J21j13K31m0k76L88j07J0p2j28J36P4o7j46Q0M8j0P8j27J94j86J05Q4
$$ plain form
4416 64 130 43 43 -37 15 -78 10 -168 -29 -251 -59 -61 -10 20 103 226 87 31 21 -5 59 138 -46 -139 167 48 -53
4443 -53 11 61 -10 -71 154 -80 -20 234 70 36 -18 133 42 47 -114 -47 46 -14 126 -140 -51 97 -87 -47 -49 10
4469 10 167 -7 -68 -169 1 28 -29 -152 20 98 34 54 -47 -178 53 139 -75 37 82 -112 156 -100 -56
4492 -56 -211 -189 13 138 -83 -18 34 327 -156 -212 12 -50 57 90 -22 -223 -31 -31 -6 -70 -8 150 247 120
4516 120 -75 -41 43 109 69 -2 -155 117 -79 -69 -172 -271 133 102 82 -190 -36 -38 321 16 -122 -3 98 73
4540 73 35 -34 -30 -150 14 -111 60 -179 48 -51 -32 -36 -103 -34 -4 -41 114 47 112 27 68 -176 -150 139 -208 -72
4566 -72 54 4 74 0 5 45 83 87 -141 153 -21 -103 -38 -20 -80 33 -70 246 13 -64 -265 -88 66 -63 -43
4591 -43 -115 6 -107 124 84 -192 196 89 99 27 -101 35 109 42 -104 -24 24 14 92 -35 159 -27 78 162
4615A62r9m9J42N8m26J29L7J93n7n6q7J2J40K2j92k7J68M9lm9k60K54mm8j5r4
4641a00J07J30j56k4K1k1KN1k9j91K17O9jk23N3J90p6N9l15L95o9j03J15j80J02
4666B3j08J7K3J55k34Q4L1p6j9J06J56Lj23j16J63J8q6J41l49p4K50l5k7j6J84
4691I1q8o1pQ1j19J46O9q3q5k5J43o6p6J04j35K47o1j34P4Q6J3n4j96J40k4J55
4717A35k76K42q6j7M6L8l42K08L6J73k23MK7J93Ll53L05k20R7K1J55k59j16K14
4741EK1j15l7J09J15j02j12M5k8J18n7K15k76J36J19nk23j67k7L07l6m1J7M4K0
4766D5R8j25J23j03k8Kl6J43j8ml0r9k1J00R0q7n0j4K0k1J61k71K7J5J58m7rn1
4794c2Q7N5J22j80N8j07J64j90P5l21K68J94j71K0j44J3J99m7k99L72j77o4M6
$$ plain form
4615 162 63 14 156 214 -212 -83 -46 147 90 34 -53 -41 99 121 -71 -98 70 119 116 67 -193 61 57 9 -6 -100
4641 -100 7 137 -19 -43 -22 -43 -41 10 -19 -210 7 76 75 -148 -95 95 19 78 -237 158 89 -14 101 -79 23
4666 23 -85 -68 -45 110 -124 -40 -9 -85 -104 2 158 161 38 -78 85 103 17 158 -191 -265 -15 -50 -77 -93 91
4691 91 3 -58 -65 16 -103 43 112 29 -56 -81 62 -4 -80 24 -111 136 75 -59 15 101 114 60 -136 4 -20 135
4717 135 -141 101 15 -2 44 82 -260 -52 -16 157 -66 -62 -35 158 161 -192 113 -107 -10 11 166 -93 -209 5
4741 5 26 -89 -126 -17 98 -4 -116 -71 -99 19 -38 177 -99 37 156 151 -72 -239 -266 41 5 -36 -19 25 45
4766 45 143 18 141 38 10 12 -24 119 101 97 67 -32 -53 47 137 50 0 -14 6 -15 146 -125 -98 -83 75 28 19 -32
4794 -32 55 110 232 52 110 3 167 -23 52 -269 -1 193 22 42 -102 -89 110 63 -236 136 -41 -105 -59
4817e9P5oj39Ro3J30M4M9K43l29q2N7J88L0r0k51J77l6o6K72k43O9J12k23J90
4842E8m5M2l8O6j98J49j76L05j06p9r5J41p3R3q8q2J44j44K13j41k4J27J3j5o2
4867a5P5j49J19k0J3l7P2P5l3R3l36K09KO1Mj71PJ10j49J66j7q8q5J04m8J63k36
4894a11J62J29k44J83j53J21j15J25k42K9K4J78j42l2J2K9k8m9K27n9k9j14J87
4917H8j12Q4nq2J4N1l3J00q1km3R3N4k90J10P3J4n0n3N6Q1J64j58j42K37j27m4
4944cJ45k96J62J18j91O2J04j25K11k53k3l5K0K10k4j82K32j2j01j38J60j78K06
4967F9o2j79Q6k7R6k26J50K4J06k9N6O0j06l5J45j46L0j40q8J65o2L5l5J90l8
4992C9J20K7j52K9j03n7J12r3j8K64j30o7m7M1j1l7%J22n4q1J81r2j16o1J54J9
$$ plain form
4817 -59 16 10 -129 -120 -183 -53 -9 40 283 -46 -128 -71 117 147 57 -194 -17 -53 -119 153 -90 -21 91 -132 58
4842 58 13 55 17 83 -115 34 -142 163 57 -22 -117 24 -49 44 -44 -126 18 -126 87 -54 -78 49 62 47 -15
4867 -15 60 -89 30 10 23 -14 58 133 100 193 -143 66 68 129 133 -38 -31 79 -70 96 79 -9 -94 10 -38 125 -111
4894 -111 51 180 -64 119 -34 87 -28 97 -145 -116 -92 86 -56 -88 -76 -47 -75 -124 103 44 15 -99 88
4917 88 -24 60 55 -27 -13 38 5 105 24 22 -21 72 126 -164 -54 19 33 -17 -70 -14 67 231 73 -69 168 41 -3
4944 -3 142 -154 8 126 -65 -3 101 -24 187 -66 -89 -124 -104 106 82 -100 132 120 19 -119 41 -137 69
4967 69 7 -172 -86 -113 -17 -243 -93 -69 37 8 64 124 18 -17 128 -18 12 -128 -216 -51 -113 -78 -113 77 39
4992 39 159 186 34 63 -40 -97 15 -78 -96 168 38 -29 -76 -35 -46 -83 -83 39 -15 -96 85 -7 -123 -184 -30 -11
5018a1J16j44K7Q9%j28O8J13q1J45j87j60J66%j53L37j23J4q1J0j20J2J04J4J0
5043C7q4J03j40j7J36j00N6J14J1j09o6N2k33K82k1j07N4R6l2Kj59r3p4K98l4
5068b8O8k6Q4q6j47J95l2l3m4J21j43J84j99K43j87n4RK15j60M5n3J9j5J84j82
5093b2nJ4J27j42J31m9M6M6k46P6j35J70j0j0J09k08M1J09J07j29k01Q3J36n3
$$ plain form
5018 -11 105 -39 -12 77 77 -51 17 130 49 194 7 -153 13 13 -140 197 74 88 7 17 -103 -91 13 27 37
5043 37 -47 56 -84 -101 35 -65 -9 105 116 7 -59 -7 -240 42 21 -86 -32 64 32 34 -125 -218 -292 6 -28
5068 -28 40 14 98 12 -135 60 28 -5 -49 72 -71 113 -86 157 -30 -84 -75 140 -20 25 -28 -9 -24 160 -22
5093 -22 -27 -13 114 -28 103 54 100 146 -100 -24 -159 11 1 -9 100 -108 -67 42 149 20 -181 -98 38 -15
$$ [...]
8191h4
##END NTUPLES=NMR FID
##END=
