##TITLE=1H_ANY-168k
 DMFA-d7, 8 sc, 
 2.7.2019
##JCAMPDX= 6.0         $$ Bruker NMR JCAMP-DX V2.0
##DATA TYPE= NMR FID
##DATA CLASS= NTUPLES
##ORIGIN= UXNMR, Bruker Analytische Messtechnik GmbH
##OWNER= root
$$ XWIN-NMR		Version 3.5
$$ Tue Jul  2 14:11:36 2019 Russian Standard Time (UT+4h)  she@DPX200
##.OBSERVE FREQUENCY= 200.13155
##.OBSERVE NUCLEUS= ^1H
##.DELAY= (6, 6)
##.ACQUISITION MODE= SIMULTANEOUS
##.ACQUISITION SCHEME= undefined
##.AVERAGES= 8
##.DIGITISER RES= 18
##SPECTROMETER/DATA SYSTEM= spect
##.PULSE SEQUENCE= zg30
##.SOLVENT NAME= CDCl3
##.SHIFT REFERENCE= (INTERNAL, CDCl3, 0, 15.7039)
##AUDIT TRAIL= $$ (NUMBER, WHEN, WHO, WHERE, WHAT)
$$ ##TITLE= Audit trail, XWIN-NMR		Version 3.5
$$ ##JCAMPDX= 5.01
$$ ##ORIGIN= Bruker BioSpin GmbH
$$ ##OWNER= she
$$ F:/spectra/data/she/nmr/H-F/1/audita.txt
$$ ##AUDIT TRAIL=  $$ (NUMBER, WHEN, WHO, WHERE, WHAT)
(   1,<2019-07-02 14:10:23.54 +0400>,<she>,<DPX200>,
      <created by zg, POWCHK disabled, PULCHK disabled
       configuration hash MD5:
       00 E9 B6 7A A2 85 ED C7 34 08 36 98 17 FE 4E 26
       data hash MD5: 16K
       61 8E 77 51 C9 E4 EC 9D 1A 3E 7B D7 9F C2 29 84>)
$$ ##END=
$$ 
$$ hash MD5
$$ 4B B9 FE 97 E7 31 52 26 15 18 C3 D5 59 7A 48 0D
##$RELAX= 
##$RELAX= 
##$RELAX= 
##$RELAX= 
##$RELAX= 
##$RELAX= 
$$ Bruker specific parameters
$$ --------------------------
##$DU= <F:/spectra>
##$EXPNO= 1
##$NAME= <H-F>
##$PROCNO= 1
##$TYPE= <nmr>
##$USER= <she>
##$AMP= (0..31)
100 100 100 100 100 100 100 100 100 100 100 100 100 100 100 100 100 100 
100 100 100 100 100 100 100 100 100 100 100 100 100 100 
##$AQSEQ= 0
##$AQ_mod= 1
##$AUNM= <au_zg>
##$AUTOPOS= <>
##$BF1= 200.13
##$BF2= 200.13
##$BF3= 200.13
##$BF4= 200.13
##$BF5= 200.13
##$BF6= 200.13
##$BF7= 200.13
##$BF8= 200.13
##$BYTORDA= 1
##$CFDGTYP= 0
##$CFRGTYP= 5
##$CHEMSTR= <none>
##$CNST= (0..31)
1 1 145 1 1 1 1 1 1 1 1 1 1 1 1 1 1 1 1 1 1 1 1 1 1 1 1 1 1 1 1 1 
##$CPDPRG= <>
##$CPDPRG1= <>
##$CPDPRG2= <>
##$CPDPRG3= <>
##$CPDPRG4= <mlev>
##$CPDPRG5= <mlev>
##$CPDPRG6= <mlev>
##$CPDPRG7= <mlev>
##$CPDPRG8= <mlev>
##$CPDPRGB= <>
##$CPDPRGT= <>
##$D= (0..31)
0 1.2 0 0 0 0 0 0 0 0 0 0.03 0 0 0 0 0 0 0 0 0 0 0 0 0 0 0 0 0 0 0 0 
##$DATE= 1562062222
##$DBL= (0..7)
120 120 120 120 120 120 120 120 
##$DBP= (0..7)
150 150 150 150 150 150 150 150 
##$DBP07= 0
##$DBPNAM0= <>
##$DBPNAM1= <>
##$DBPNAM2= <>
##$DBPNAM3= <>
##$DBPNAM4= <>
##$DBPNAM5= <>
##$DBPNAM6= <>
##$DBPNAM7= <>
##$DBPOAL= (0..7)
0.5 0.5 0.5 0.5 0.5 0.5 0.5 0.5 
##$DBPOFFS= (0..7)
0 0 0 0 0 0 0 0 
##$DE= 6
##$DECBNUC= <off>
##$DECIM= 24
##$DECNUC= <off>
##$DECSTAT= 4
##$DIGMOD= 1
##$DIGTYP= 9
##$DL= (0..7)
0 120 120 120 120 120 120 120 
##$DP= (0..7)
150 150 150 150 150 150 150 150 
##$DP07= 0
##$DPNAME0= <>
##$DPNAME1= <>
##$DPNAME2= <>
##$DPNAME3= <>
##$DPNAME4= <>
##$DPNAME5= <>
##$DPNAME6= <>
##$DPNAME7= <>
##$DPOAL= (0..7)
0.5 0.5 0.5 0.5 0.5 0.5 0.5 0.5 
##$DPOFFS= (0..7)
0 0 0 0 0 0 0 0 
##$DQDMODE= 0
##$DR= 18
##$DS= 0
##$DSLIST= <SSSSSSSSSSSSSSS>
##$DSPFIRM= 0
$$ [...]
##$SUBNAM2= <"">
##$SUBNAM3= <"">
##$SUBNAM4= <"">
##$SUBNAM5= <"">
##$SUBNAM6= <"">
##$SUBNAM7= <"">
##$SUBNAM8= <"">
##$SUBNAM9= <"">
##$SW= 24.9336996594482
##$SWIBOX= (0..15)
0 0 2 0 0 0 0 0 0 0 0 0 0 0 0 0 
##$SW_h= 4990.01996007984
##$TD= 16384
##$TD0= 1
##$TE= 0
##$TE2= 300
##$TE3= 300
##$TEG= 300
##$TL= (0..7)
0 120 120 120 120 120 120 120 
##$TP= (0..7)
150 150 150 150 150 150 150 150 
##$TP07= 0
##$TPNAME0= <>
##$TPNAME1= <>
##$TPNAME2= <>
##$TPNAME3= <>
##$TPNAME4= <>
##$TPNAME5= <>
##$TPNAME6= <>
##$TPNAME7= <>
##$TPOAL= (0..7)
0.5 0.5 0.5 0.5 0.5 0.5 0.5 0.5 
##$TPOFFS= (0..7)
0 0 0 0 0 0 0 0 
##$TUNHIN= 0
##$TUNHOUT= 0
##$TUNXOUT= 0
##$USERA1= <user>
##$USERA2= <user>
##$USERA3= <user>
##$USERA4= <user>
##$USERA5= <user>
##$V9= 5
##$VALIST= <valist>
##$VCLIST= <CCCCCCCCCCCCCCC>
##$VD= 0
##$VDLIST= <DDDDDDDDDDDDDDD>
##$VPLIST= <PPPPPPPPPPPPPPP>
##$VTLIST= <TTTTTTTTTTTTTTT>
##$WBST= 1024
##$WBSW= 4
##$XGAIN= (0..3)
0 0 0 0 
##$XL= 0
##$YL= 0
##$YMAX_a= 536818
##$YMIN_a= -557105
##$ZGOPTNS= <>
##$ZL1= 120
##$ZL2= 120
##$ZL3= 120
##$ZL4= 120
##$ABSF1= 10
##$ABSF2= 0
##$ABSG= 5
##$ABSL= 3
##$ALPHA= 0
##$AQORDER= 0
##$ASSFAC= 0
##$ASSFACI= 0
##$ASSFACX= 0
##$ASSWID= 0
##$AUNMP= <proc_1d>
##$AZFE= 0.1
##$AZFW= 0.1
##$BCFW= 1
##$BC_mod= 2
##$BYTORDP= 1
##$COROFFS= 0
##$CY= 11.3945322036743
##$DATMOD= 1
##$DC= 2
##$DFILT= <>
##$DTYPP= 0
##$F1P= 18.9103706918063
##$F2P= -1.10871071338519
##$FCOR= 0.5
##$FTSIZE= 0
##$FT_mod= 4
##$GAMMA= 1
##$GB= 0.15
##$INTBC= 1
##$INTSCL= 1
##$ISEN= 128
##$LB= 0.24
##$LEV0= 0
##$LPBIN= 0
##$MAXI= 10000
##$MC2= 0
##$MEAN= 0
##$ME_mod= 0
##$MI= 1.114404
##$NCOEF= 0
##$NC_proc= 0
##$NLEV= 6
##$NOISF1= 3.799351
##$NOISF2= 2.8
##$NSP= 1
##$NTH_PI= 0
##$NZP= 0
##$OFFSET= 15.70392
##$PC= 1
##$PHC0= -8657.991
##$PHC1= 8.200971
##$PH_mod= 1
##$PKNL= yes
##$PPARMOD= 0
##$PSCAL= 0
##$PSIGN= 0
##$REVERSE= no
##$SF= 200.130013532006
##$SI= 16384
##$SIGF1= 3
##$SIGF2= 2
##$SINO= 400
##$SIOLD= 16384
##$SREGLST= <1H.CDCl3>
##$SSB= 0
##$STSI= 0
##$STSR= 0
##$SW_p= 3612.71676300578
##$SYMM= 0
##$S_DEV= 0
##$TDeff= 0
##$TDoff= 0
##$TI= <>
##$TILT= no
##$TM1= 0
##$TM2= 0
##$TOPLEV= 0
##$USERP1= <user>
##$USERP2= <user>
##$USERP3= <user>
##$USERP4= <user>
##$USERP5= <user>
##$WDW= 1
##$XDIM= 8192
##$YMAX_p= 0
##$YMIN_p= 0
$$ End of Bruker specific parameters
$$ ---------------------------------
##NTUPLES= NMR FID
##VAR_NAME=  TIME,          FID/REAL,        FID/IMAG
##SYMBOL=    X,             R,               I
##VAR_TYPE=  INDEPENDENT,   DEPENDENT,       DEPENDENT
##VAR_FORM=  AFFN,          ASDF,            ASDF
##VAR_DIM=   8192,          8192,            8192
##UNITS=     SECONDS,       ARBITRARY UNITS, ARBITRARY UNITS
##FACTOR=    0.0002004,     1,               1
##FIRST=     0,             0,               0
##LAST=      1.6414764,     0,               0
##MIN=       0,             -557105,         0
##MAX=       1.6414764,     536818,          0
$$ Real data points
##PAGE= N=1
##DATA TABLE= (X++(R..R)), XYDATA
$$ [...]
3588a5420P084J3970R355l152j2837j1982j234J0420J3491N616p203j3839r100
$$ -15420 -8336 5634 14989 11837 -1000 -12982 -14216 -3796 9695 15311 8108 -5731 -14831
3601a4831L087J2786J1886J228j0442j3357n501P023J3891Q985l027j2809j1902
$$ -14831 -11744 1042 12928 14156 3714 -9643 -15144 -8121 5770 14755 11728 -1081 -12983
3614a2983j056J0563J3181N492p319j3572q980L159J2660J1723J126j0511j3122
$$ -12983 -14039 -3476 9705 15197 7878 -5694 -14674 -11515 1145 12868 13994 3483 -9639
3627i639n288P187J3639Q747l404j2471j1507q91J0188J3128N134p251j3403q731
$$ -9639 -14927 -7740 5899 14646 11242 -1229 -12736 -13627 -3439 9689 14823 7572 -5831 -14562
3641a4562L119J2559J1377J102j0392j2946n152P128J3296Q639l359j2296j1209
$$ -14562 -11443 1116 12493 13595 3203 -9743 -14895 -7767 5529 14168 10809 -1487 -12696
3654a2696j108J0186J2971N044p145j3024q683L197J2360J1314Q15j0053j2868
$$ -12696 -13804 -3618 9353 14397 7252 -5772 -14455 -11258 1102 12416 13231 3178 -9690
3667i690m970P117J3202Q511l401j2062j1085r30J0071J2655M896o902j3109q350
$$ -9690 -14660 -7543 5659 14170 10769 -1293 -12378 -13308 -3237 9418 14314 7412 -5697 -14047
3681a4047L179J2017J1170Q73j0064j2558m893O938J2956Q332l120j2148j1029
$$ -14047 -10868 1149 12319 13192 3128 -9430 -14323 -7385 5571 13903 10783 -1365 -12394
3694a2394p10J0004J2496M695o950j2936q120L314J1920J0807O73j0040j2353
$$ -12394 -13104 -3100 9396 14091 7141 -5795 -13915 -10601 1319 12126 12799 2759 -9594
3707i594m722P100J2838P950l304j1854j0687p05R799J2393M594o913j2627q133
$$ -9594 -14316 -7216 5622 13572 10268 -1586 -12273 -12978 -3179 9214 13808 6895 -5732 -13865
3721a3865L457J1792J0718N90r799j2296m421O998J2560P779l231j1764j0402
$$ -13865 -10408 1384 12102 12692 2893 -9403 -13824 -6826 5734 13513 10282 -1482 -11884
3734a1884p14R896J2142M317o914j2479p710L335J1626J0429P67r809j2077m325
$$ -11884 -12598 -2702 9440 13757 6843 -5636 -13346 -10011 1615 12044 12811 3002 -9075 -13400
3748a3400O799J2426P724l304j1592j0335n22R608J1854M425o851j2317p695L317
$$ -13400 -6601 5825 13549 10245 -1347 -11682 -12204 -2596 9258 13683 6832 -5485 -13180 -9863
3762i863J1491J0421K44r650j1890m165O887J2276P550l406j1560r993l42R514
$$ -9863 1628 12049 12293 2643 -9247 -13412 -6525 5751 13301 9895 -1665 -11658 -12000 -2486
3776b486J1673M197o649j2116p502L289J1280J0007O90r588j1842m111O854J1995
$$ -2486 9187 13384 6735 -5381 -12883 -9594 1686 11693 12383 2795 -9047 -13158 -6304 5691
3790E691P504l198j1452j0009l05R410J1433M217o642j1912p438L188J1188R933
$$ 5691 13195 9997 -1455 -11464 -11769 -2359 9074 13291 6649 -5263 -12701 -9513 1675 11608
3804A1608M03r410j1445m137O805J1841P175l308j1200r837k24R212J1444L913
$$ 11608 12011 2601 -8844 -12981 -6176 5665 12840 9532 -1668 -11505 -11729 -2517 8927 12840
3818A2840o564j1937p095L256J0969R871M59r482j1279l959O626J1755P152l352
$$ 12840 6276 -5661 -12756 -9500 1469 11340 11799 2317 -8962 -12921 -6295 5460 12612 9260
3832I260j1064r458l60R272J1108L860o433j1683p047L299J0831R579M87r369
$$ 9260 -1804 -11262 -11622 -2350 8758 12618 6185 -5498 -12545 -9246 1585 11164 11651 2282
3846B282j0910l900O584J1623P024l484j0873r376k48R104J0992L815o575j1282
$$ 2282 -8628 -12528 -5944 5679 12703 9219 -1654 -11030 -11278 -2174 8818 12633 6058 -5224
3860e224p045L307J0769R284L65r055j1016l690O400J1454O920l407j0768r215
$$ -5224 -12269 -8962 1807 11091 11456 2401 -8615 -12305 -5905 5549 12469 9062 -1706 -10921
3874a0921j75Q804J0754L731o445j1281o834L194J0667R254L01r013j0765l721
$$ -10921 -11096 -2292 8462 12193 5748 -5533 -12367 -9173 1494 10748 11049 2036 -8729 -12450
3888a2450O408J1255O796l321j0486r185k24Q984J0767L662o570j0960o815L245
$$ -12450 -6042 5213 12009 8688 -1798 -10983 -11207 -2223 8544 12206 5636 -5324 -12139 -8894
3902h894J0474R088M15q971j0505l717O507J1094O720l432j0482q918j99Q798
$$ -8894 1580 10668 11083 2112 -8393 -12110 -5603 5491 12211 8779 -1703 -10621 -10820 -2022
3916b022J0537L468o356j0907o562L252J0227Q886K14q618j0578l454O344J0796
$$ -2022 8515 11983 5627 -5280 -11842 -8590 1637 10523 10737 2119 -8459 -11913 -5569 5227
3930E227O462l289j0288q988J75Q578J0321L465o384j0613o451L182J0123Q953
$$ 5227 11689 8400 -1888 -10876 -10701 -2123 8198 11663 5279 -5334 -11785 -8603 1520 10473
3944A0473lq476j0239l626O309J0624O484l066j0150q838L8Q377J0198L559o082
$$ 10473 10470 1994 -8245 -11871 -5562 5062 11546 8480 -1670 -10508 -10470 -2093 8105 11664 5582
3959E582j0511o453K958R925Q851J15q232j0079l663O015J0658O516l119r982
$$ 5582 -4929 -11382 -8424 1501 10352 10467 2235 -7844 -11507 -5492 5166 11682 8563 -1419
3973a419q731k43Q484J0053L364n925j0440o295K889R816Q509M37q425r823l610
$$ -1419 -10150 -10393 -1909 8144 11508 5583 -4857 -11152 -8263 1553 10062 10499 2074 -7749 -11359
3988a1359N755J0431O478k898r954q550k03Q039J0056L399n882j0107o420K847
$$ -11359 -5604 4827 11305 8407 -1547 -10097 -10300 -2261 7795 11194 5312 -4795 -11215 -8368
4002h368R791Q398L07q004r892l505N827J0242O279k897r658q392l21Q138R796
$$ -8368 1423 9821 10128 2124 -7768 -11273 -5446 4796 11075 8178 -1480 -9872 -10193 -2055 7741
4017G741L566n787j0158o278K861R532Q322M67p954r639l599N635R968O476k965
$$ 7741 11307 5520 -4638 -10916 -8055 1477 9799 10266 2312 -7327 -10926 -5291 4677 11153 8188
4032H188r261q507m51P978R578L563n686r884o281K669R393Q234M28p910r440
$$ 8188 -1073 -9580 -10031 -2053 7525 11088 5402 -4482 -10763 -8094 1299 9533 9961 2051 -7389
4047g389l486N438R873O262k811r316q229n16Q011R509L301n428r803o118K653
$$ -7389 -10875 -5437 4436 10698 7887 -1429 -9658 -10174 -2163 7346 10647 5219 -4584 -10702 -8049
4062h049R172Q333L03p783r376l346N314R991O055k884r116q050l36P851R249
$$ -8049 1123 9456 9759 1976 -7400 -10746 -5432 4559 10614 7730 -1386 -9436 -9772 -1921 7328
4077G328L359n474r626n992K632R065Q086L82p482r432l241N064R786N987k539
$$ 7328 10687 5213 -4413 -10405 -7773 1292 9378 9760 2278 -7154 -10395 -5331 4455 10442 7903
4092G903q977q152l60P460R256L418n091r643o107K649Q667Q006N40p357r208
$$ 7903 -1074 -9226 -9586 -2126 7130 10548 5457 -4186 -10293 -7644 1023 9029 9569 2212 -6996
4107f996l448N157R423O064k562q787p963m52P422R122L356n256r435n833K597
$$ -6996 -10444 -5287 4136 10200 7638 -1149 -9112 -9564 -2142 6980 10336 5080 -4355 -10188 -7591
4122g591Q685P833N26p267r013l438N148R391N861k402q765p801m65P317Q918
$$ -7591 1094 8927 9453 2186 -6827 -10265 -5117 4274 10135 7733 -1032 -8833 -9298 -1981 6937
4137F937L275n113r318n643K523Q610P641M63p396q795l169N173R058N690k403
$$ 6937 10212 5099 -4219 -9862 -7339 1271 8912 9375 1979 -6816 -9985 -4812 4246 9936 7533
4152G533q750p594m32P414Q664L301n206r116n677K358Q657P590L52p132q927
$$ 7533 -1217 -8811 -9243 -1829 6835 10136 4930 -4186 -9863 -7505 1152 8742 9094 1962 -6965
4167f965l060N105Q998N607k535q410p467m14P111Q690L132n057q944n515K435
$$ -6965 -10025 -4920 4078 9685 7150 -1260 -8727 -9141 -2030 6660 9792 4735 -4209 -9724 -7289
4182g289Q438P626K53p112q748l049N206Q959N434k541q252p370l54P073Q442
$$ -7289 1149 8775 9028 1916 -6832 -9881 -4675 4284 9718 7177 -1075 -8445 -8799 -1726 6716
4197F716K977m926q854n391K402Q453P184L48o986q609k893M908Q868N313k471
$$ 6716 9693 4767 -4087 -9478 -7076 1377 8561 8909 1923 -6686 -9579 -4671 4197 9510 7039
4212G039q236p253j95O877Q461K834m765q810n317K233Q191P339K62o821q274
$$ 7039 -1197 -8450 -8645 -1768 6693 9527 4762 -4048 -9365 -7132 1059 8398 8660 1839 -6435
4227f435l121M897Q593N400k394p946p298m46O844Q242L203m937q667n185K251
$$ -6435 -9556 -4659 3934 9334 6940 -1006 -8304 -8750 -1906 6336 9539 4602 -4065 -9250 -6999
4242f999Q194P131K37o807q272k938M937Q494N140k207q086p074j75O700Q200
$$ -6999 1195 8326 8563 1756 -6516 -9454 -4517 3977 9117 6910 -1176 -8250 -8425 -1725 6475
4257F475K908m887q460n140K302P995O907K29o550q126k860M677Q502N080k302
$$ 6475 9383 4496 -3964 -9104 -6802 1193 8100 8329 1779 -6347 -9207 -4530 3972 9052 6750
4272F750p848o892m05O525Q165K921m809q365n107K283P847O975L44o598q021
$$ 6750 -1098 -7990 -8395 -1870 6295 9216 4407 -3958 -9065 -6782 1065 8040 8384 1786 -6235
4287f235k911M705Q210N283k361p702o883l71O526P868K952m709q229n081K264
$$ -6235 -9146 -4441 3769 9052 6691 -1011 -7894 -8265 -1739 6129 9081 4372 -3857 -8938 -6674
4302f674P788O768K66o419q029k673M676Q157M947k173p695o799k89O466P718
$$ -6674 1114 7882 8148 1729 -6300 -8973 -4297 3860 8807 6634 -1061 -7860 -8149 -1683 6035
4317F035K777m486q131m976K300P550O598M25o273p944k847M568Q118N045k182
$$ 6035 8812 4326 -3805 -8781 -6481 1069 7667 8092 1819 -6125 -8972 -4404 3714 8759 6577
4332F577p453o793m27O231P789K848m441p945m894K063P430O708L52o174p615
$$ 6577 -876 -7669 -8096 -1865 5924 8772 4331 -3614 -8508 -6445 985 7693 8045 1871 -5744
4347e744l027M445Q055N031k320p513o538k34O258P558K738m496p785n023K380
$$ -5744 -8771 -4326 3729 8760 6440 -1073 -7611 -7845 -1587 5971 8709 4213 -3572 -8595 -6215
4362f215P344O480K79o207p514k787M376P977M808k221p459o415l40O293P327
$$ -6215 1129 7609 7888 1681 -5833 -8620 -4244 3733 8541 6320 -1139 -7554 -7894 -1601 5726
4377E726K709m326p735m776K154P344O483J10o055p468k680M453P647M796k111
$$ 5726 8435 4109 -3626 -8402 -6248 1096 7579 7689 1634 -5834 -8514 -4061 3586 8382 6271
4392F271p270o487j19O119P316K574m290p569m814K288P108O403K33o166p434
$$ 6271 -999 -7486 -7605 -1486 5830 8404 4114 -3455 -8269 -5981 1127 7530 7763 1597 -5837
4407e837k514M335P660M651k183p242o234k28O068P281K459m310p445m707K144
$$ -5837 -8351 -4016 3644 8295 6112 -1130 -7364 -7592 -1524 5757 8216 3906 -3539 -8246 -6102
4422f102P062O336J87o058p132k705M299P609M559k101p106o232o8N744P283K471
$$ -6102 960 7296 7483 1425 -5707 -8412 -4113 3496 8055 5954 -1152 -7384 -7452 -1708 5575 8046
4438H046m103p438m684K162O974O074N16o114p096k393M240P267M587j986p124
$$ 8046 3943 -3495 -8179 -6017 957 7031 7547 1433 -5663 -8056 -3816 3451 8038 6052 -1072
4453a072o040k33N998P171K278m190p374m412K038P034N955J74n913o871k434
$$ -1072 -7112 -7345 -1347 5824 8102 3912 -3462 -7874 -5836 1198 7153 7327 1414 -5457 -7891
4468g891M048P404M153j886o795o190j84N878P024K356m242p191m465K257O668
$$ -7891 -3843 3561 7714 5828 -967 -7157 -7341 -1463 5561 7917 3675 -3516 -7981 -5724 944
4483I44N967L00n836o958k424M017P324M467k131o769n943j66N727O856K382l994
$$ 944 6911 7211 1375 -5583 -8007 -3990 3334 7801 5670 -1099 -7042 -7208 -1481 5375 7757 3763
4499C763p192m247J950O915N809q3n420o872k260L975P030M363j863o676n902
$$ 3763 -3429 -7676 -5726 1189 6998 6915 1495 -5377 -7637 -3662 3368 7731 5868 -808 -6710
4514f710l23N679O753K352l722p241m368J904O679N867K71n616o783k381L853
$$ -6710 -7033 -1354 5399 7751 4029 -3212 -7580 -5676 1003 6870 7141 1525 -5258 -7639 -3786
4529c786O927M352j873o442n845l57N489O693K463m004p166m113J896O747N620
$$ -3786 3141 7493 5620 -822 -6667 -7024 -1535 5158 7621 3617 -3549 -7662 -5766 981 6601
4544F601J84n616o517k197L815O848M140j927o245n800k14N419O575K428l772
$$ 6601 6785 1169 -5348 -7545 -3730 3118 7258 5331 -914 -6714 -6928 -1509 5066 7494 3722
4559C722o849m314J951O404N681K27n331o623k214L864O796M106j838o384n488
$$ 3722 -3127 -7441 -5490 914 6595 6822 1491 -5132 -7346 -3482 3314 7420 5582 -802 -6290
4574f290m00N339O517K373l794o971m186K072O411N541K51n456o480k205L815
$$ -6290 -6690 -1351 5166 7539 3745 -3226 -7412 -5340 1071 6612 6863 1407 -5073 -7278 -3463
4589c463O607M116j886o403n458k75N286O381K313l728o703m232K080O218N499
$$ -3463 3144 7260 5374 -1029 -6487 -6762 -1476 4905 7218 3490 -3213 -7445 -5365 853 6352
4604F352P7n269o394k074L740O632L949j783o105n425l73N329O378K178l596o831
$$ 6352 6429 1160 -5234 -7308 -3568 3064 7013 5230 -875 -6300 -6673 -1344 5034 7212 3616 -3215
4620c215l968K011O451N290R5n328o177k172L739O495L906j730o149n290k32M983
$$ -3215 -7183 -5172 1279 6569 6664 1336 -4841 -7013 -3274 3221 7127 5397 -752 -6042 -6274 -1291
4636a291O312K324l641o715m194K045O176N376N0n197o104k109L706O358L726
$$ -1291 5021 7345 3704 -3011 -7205 -5160 1016 6392 6442 1245 -4859 -6968 -3262 3096 6822
4651F822j801n798n324m00M794O394K314l447o590m015J697O134N355K75n128
$$ 6822 5021 -777 -6101 -6501 -1707 4687 7001 3554 -3036 -7051 -5354 780 6135 6410 1282
4666A282o207j964L553O225L789j628n827n120m49M820O148K359l290o369m126
$$ 1282 -4925 -6889 -3336 2889 6678 5050 -777 -5897 -6346 -1526 4622 6981 3691 -2678 -6804
4681f804J642O108N295J96m835o137k235L525O223L932j611n794n113m95M682
$$ -6804 -5162 946 6241 6437 1602 -4535 -6770 -3245 2978 6910 5299 -495 -5608 -6103 -1421
4696a421O012K337l187o288m339J656O033N367J92n006o133k034L501O200L692
$$ -1421 4591 6928 3741 -2547 -6886 -5230 803 6170 6362 1356 -4777 -6811 -3310 2890 6582
4711F582j662n788m968l37M611N948K320l259o237l919J492N906N238K30n021
$$ 6582 4920 -868 -5836 -6173 -1562 4386 6706 3447 -2790 -6709 -5217 689 5927 6157 1136
4726A136o000j860L441O121L673j639n648m956l47M791N845K153l192o252l884
$$ 1136 -4864 -6724 -3283 2838 6511 4872 -776 -5732 -6079 -1288 4557 6710 3518 -2734 -6618
4741f618J614N873N194Q8m901n825j949L437O091L589j673n623m927k62M593N725
$$ -6618 -5004 869 6063 6151 1250 -4575 -6524 -3087 3004 6593 4920 -703 -5630 -5892 -1299 4426
4757D426K145l354o053l661J393N844N078R8m853n850j839L477N902L539j685
$$ 4426 6571 3217 -2836 -6497 -5104 740 5818 5916 1063 -4787 -6626 -3149 2753 6292 4607
4772D607n582m736m39M671N660K254l226o087l956J688N920N107Q6m787n866j828
$$ 4607 -975 -5711 -6150 -1479 4181 6435 3209 -2878 -6834 -5146 774 5881 5967 1180 -4686 -6514
4788f514L376N945L403j712n330m595m41M413N784K135k853o137l841J319N776
$$ -6514 -3138 2807 6210 4498 -832 -5427 -5868 -1455 4329 6464 3611 -2526 -6367 -5048 728
4803G28N324K20n064n754j924L594N860L252j707n394m530k19M104N663K080k864
$$ 728 6052 6272 1208 -4546 -6470 -2876 2984 6236 4529 -865 -5395 -5614 -1510 4153 6233 3369
4819C369n832l819J228N603N209K35m888n884j778L642N927L132j727n446m367
$$ 3369 -2463 -6282 -5054 549 5758 5993 1105 -4779 -6557 -2915 3012 6144 4417 -1029 -5396
4834e396k72M453N132K037k780n678l748J410N386N134J82m613n760j857L530
$$ -5396 -5668 -1215 3917 5954 3174 -2504 -6252 -4842 544 5678 5860 1247 -4513 -6370 -2840
4849b840N793L206j762n286m414K5M264N115K041k870n498l694J327N262M927
$$ -2840 2953 6159 4397 -889 -5303 -5278 -1014 4101 6142 3272 -2226 -5920 -4593 669 5596
4864E596L91m724n588j914L355N739L358j780n316m504j31M370N299J837k915
$$ 5596 5987 1263 -4325 -6239 -2884 2855 6213 4433 -883 -5387 -5518 -1148 4151 5988 3073
4879C073n523l493J189N330M818K92m564n658j771L353N716L151j689n235m309
$$ 3073 -2450 -5943 -4754 576 5394 5686 1122 -4536 -6307 -2954 2762 5913 4224 -1011 -5320
4894e320j26M280N087J989k866n606l465J386N314M764L08m638n411j772L319
$$ -5320 -5446 -1166 3921 5910 3044 -2562 -6027 -4641 673 5437 5745 1107 -4304 -6076 -2757
4909b757N581L164j668n121m247j39L963N287J805k638n472l704J363N216M976
$$ -2757 2824 5988 4320 -801 -5048 -5187 -1224 4063 5868 3230 -2242 -5946 -4583 633 5609
4924E609Q0m631n464j636L448N456L046j810n025m134m8M044M798J945k534n417
$$ 5609 5689 1058 -4406 -6042 -2594 2862 5908 4098 -927 -5061 -5109 -1065 3733 5678 3144 -2273
4940b273l668J154N214M923L88m462n613j908L406N793K966j987n108m000K05
$$ -2273 -5941 -4787 427 5350 5738 1276 -4337 -6245 -2839 2954 5920 3933 -1175 -5175 -4970
4955d970M034M700J666k510n101l606J295M984M755M45m308n664j909L459N782
$$ -4970 -936 3764 5430 2920 -2181 -5787 -4492 492 5247 5692 1384 -4280 -6189 -2730 3052
4970C052L042j920n220m020K54M158M537J619k682m969l150J036M703M620O43
$$ 3052 6094 4174 -1046 -5066 -4812 -654 3883 5502 2820 -2149 -5299 -4263 440 5060 5703
4985E703m272n543j974L208N723L121j795n225m237K54M262M632J439k642m780
$$ 5703 1431 -4112 -6086 -2878 2845 5966 4171 -1054 -5291 -5037 -775 3857 5296 2654 -2126
5000b126l201R86M574M651O74m304n198k054L034N591L300j655n350m049J79M068
$$ -2126 -5327 -4341 233 4884 5558 1254 -3944 -5998 -2964 2627 5927 4272 -1078 -5127 -4948 -880
5016h80M701J665k795n014l048J164M764M298N66m090n195j969K996N534L146
$$ -880 3821 5486 2691 -2323 -5371 -4207 557 4855 5421 1331 -3864 -5833 -2837 2697 5843
5031E843j748m964m060K8M054M655J519k530m925l246J132M794M377L50m121n034
$$ 5843 4095 -869 -4929 -4901 -847 3808 5327 2797 -2128 -5374 -4242 552 4929 5279 1158 -3876
5047c876j874L071N278K994j639m921m089L18L955M550J461k570m812l239J143
$$ -3876 -5750 -2679 2599 5593 3954 -967 -5056 -4738 -783 3767 5228 2658 -2154 -5393 -4250
5062d250M671M403L94m025n215j853L176N389L030j987m755l835L65L886M311
$$ -4250 421 4824 5218 1193 -4022 -5875 -2699 2690 5720 3733 -1022 -4857 -4492 -606 3705
5077C705J381k412m669l027R39M427M364N82m026n114j926L110N463K986j937
$$ 3705 5086 2674 -1995 -5022 -4083 344 4708 5290 1264 -3850 -5776 -2666 2797 5783 3846
5092C846n122l730O20L894M265J215k712m305k841J072M091M222N09l678n066
$$ 3846 -1276 -5006 -4386 -492 3773 4988 2276 -2029 -4870 -3798 293 4515 5024 1346 -3720
5107c720k061K815N482L223j790n187l888O02M095M261R51k590m430k545J127
$$ -3720 -5781 -2966 2516 5739 3949 -1238 -5126 -4524 -429 3832 4783 2193 -2237 -4782 -3655
5122c655L968M057N00l461n028j950K599N393L186j608n100m016N22M113M342
$$ -3655 313 4370 4870 1409 -3619 -5569 -2970 2423 5609 4001 -1099 -5115 -4593 -480 3862
5137C862J170k888m350k478J112M214L728L34l494m556j930K362N292L164j459
$$ 3862 5032 2144 -2206 -4684 -3572 642 4370 4704 1210 -3346 -5276 -2914 2378 5542 4083
5152D083m857m149J96M113M434J196k924m503k490J355M157L753K23l489m572
$$ 4083 -774 -4923 -4727 -614 3820 5016 2092 -2411 -4901 -3546 611 4364 4587 1098 -3474
5167c474j862K602M935L145j434m913l904%M259M459J113k835m411k493J285M109
$$ -3474 -5336 -2734 2201 5346 3912 -1001 -4905 -4905 -646 3813 4926 2091 -2320 -4813 -3528 581
5183E81L729L56l600m533j783K618M900L172j575m716l789J51L851M320J135k668
$$ 581 4310 4666 1066 -3467 -5250 -2632 2268 5440 3865 -851 -4640 -4489 -638 3682 4817 2149
5199B149m430k334J110M090L810L80l602m632j776K696M893K890j571m732l642
$$ 2149 -2281 -4615 -3505 585 4395 4775 1173 -3459 -5235 -2539 2354 5244 3673 -1059 -4701
5214d701K83M045M167Q84k691m236k275J015M030L549M04l246m589j970K665N036
$$ -4701 -4418 -373 3794 4678 1987 -2249 -4524 -3509 521 4070 4474 1228 -3361 -5331 -2666 2370
5230B370K883j453m943l859N27M117M211P81k935m061k203J374L746L247M78l147
$$ 2370 5253 3800 -1143 -5002 -4475 -358 3853 4634 1699 -2362 -4565 -3191 555 3802 4280 1133
5246A133m352j853K399M817L089j432m933l807L73M279M351O26l110m097j925
$$ 1133 -3219 -5072 -2673 2144 5233 3801 -1132 -4939 -4566 -287 4064 4690 1580 -2517 -4442
5261d442J534L789L118J52l121m081j714K190M639L144j382m615m080L20M131
$$ -4442 -2908 881 3999 4151 1030 -3051 -4765 -2575 2064 5208 3826 -789 -4869 -4549 -418
5276d18M332R91l150m336k043J778L822L062j90l075l811j568K147M600K733j208
$$ -418 3914 4905 1755 -2581 -4624 -2846 976 4038 3848 773 -3038 -4606 -2459 2141 4874 3666
5292C666m346l979J55M085M361R13l029m410k167J801M171K992j94l510l613j334
$$ 3666 -680 -4659 -4504 -419 3942 4855 1826 -2584 -4751 -2950 1221 4213 4019 509 -3104 -4438
5308d438K323M299K587j295m240l721J56L826M263R93k868m363k115J559M095
$$ -4438 -2115 2184 4771 3476 -764 -4485 -4329 -503 3760 4753 1885 -2478 -4593 -3034 1061
5323A061L175j37l521l996j124K550M130K702j587m166l423J45L802M026R91k679
$$ 1061 4236 4099 578 -3418 -4542 -1992 2138 4840 3253 -913 -4336 -4191 -389 3637 4628 1949
5339A949m348k082J499L837L212r4l241m067j236K505M276K594j487m385l282
$$ 1949 -2399 -4481 -2982 855 4067 3973 732 -3335 -4571 -2066 2210 4804 3317 -1068 -4350
5354d350K48L773L921J068k889m181k092J551L837L097r6l194l763j461K451M318
$$ -4350 -4102 -329 3592 4660 1771 -2410 -4502 -2951 886 3983 3887 693 -3070 -4531 -2080 2238
5370B238K547j371m293l574K59L895M122O37k828m159j767J592L597K965k19k952
$$ 2238 4785 3414 -879 -4453 -4194 -299 3823 4460 1632 -2527 -4294 -2702 895 3860 3641 689
5386F89l691j372K266M067K666j087m243l740R8L876M385O83l031m207j868J791
$$ 689 -3002 -4374 -2108 1959 4625 3538 -705 -4445 -4347 -471 3914 4597 1566 -2641 -4509 -2718
5402b718L943K739o15k895l554j026K133L821K443q75m147l564O5L680M243Q67
$$ -2718 1225 3964 3349 454 -3100 -4126 -1993 1828 4271 3396 -751 -4315 -4250 -570 3673 4540
5418D540k875m293j974J872L905K716k86l410l274r23K082L730K464j079l855
$$ 4540 1665 -2628 -4602 -2730 1175 3891 3605 195 -3079 -4002 -1920 1810 4274 3195 -660
5433f60l400j26L458M214J138k810m319k122J758M062K907l30l523l473q18K293
$$ -660 -4060 -4186 -728 3486 4624 1814 -2505 -4627 -2869 1193 4100 3770 247 -3226 -4044 -1751
5449a751L805K042j141l812l262R7L390L938J228k796m066k041J426L924L051
$$ -1751 2054 4096 2955 -857 -4119 -4022 -632 3306 4534 1738 -2328 -4369 -2943 981 4032
5464D032m12l340l492q44K245M071J984j465l720k944J02L286L867Q40k520m041
$$ 4032 3620 280 -3212 -4056 -1811 2260 4244 2779 -941 -3885 -3783 -497 3370 4210 1690 -2351
5480b351j859J348L872K861k38l173l690r81K364M064K066j245m005k958K63L293
$$ -2351 -4210 -2862 1010 3871 3633 460 -3230 -4211 -1847 2217 4283 3038 -967 -3925 -3662 -369
5496c69L767R36k615l973j893J522L564K865j50l118l481j091K216L797K233j125
$$ -369 3398 4334 1719 -2254 -4147 -2625 939 3804 3654 536 -2945 -4036 -1820 1977 4210 3085
5512C085l709l279L2L494L605J075k554m026j870J382L880K646m22l034l217q38
$$ 3085 -624 -3903 -3871 -377 3228 4303 1749 -2277 -4147 -2765 1115 3761 3339 305 -2912 -3750
5528c750J960L595K265j128l511l277j25L297L941J079k532m150j928J726L724
$$ -3750 -1790 1805 4070 2942 -569 -3846 -3971 -674 3267 4346 1814 -2336 -4264 -2538 1186
5543A186K713n51k987l340o89K023L502K180j205l386k948j46K862L891J220k416
$$ 1186 3899 3348 361 -2979 -3668 -1645 1857 4037 2832 -554 -3502 -3648 -786 3105 4325 1909
5559A909m049k124J488L899K842n24l245l271p75K400L487J792j083l431k955
$$ 1909 -2140 -4264 -2776 1123 3965 3441 196 -3075 -3850 -1450 2037 3829 2746 -685 -3640
5574c640Q0K907L575J178k203l968k091J366L587L024k01l339l399p26K300L645
$$ -3640 -3560 -653 2922 4100 1897 -2071 -4162 -2796 791 3815 3614 275 -3124 -3850 -1550 2095
5590B095J808j298l384k882J59K946L310J144k162l691k085J130L723K853j52
$$ 2095 3903 2605 -779 -3661 -3502 -556 2754 3898 1736 -1955 -4040 -2910 813 3666 3514
5605C514l089l410r62K273L577K098j312l506k804K23K874L444J096k236l683
$$ 3514 425 -2985 -3947 -1674 1903 4001 2689 -817 -3621 -3398 -524 2920 4016 1780 -1903
5620a903j995J225L343K832m3l030l253j086K160L620K011j175l540k789J16L095
$$ -1903 -3898 -2673 670 3502 3459 429 -2824 -3910 -1750 1870 3881 2706 -834 -3623 -3507 -412
5636d12L347R88k298l631j922J159L522K682q5k893l262j002K054L472K172j048
$$ -412 2935 3923 1625 -2006 -3928 -2769 753 3435 3350 457 -2805 -3807 -1753 1719 3891 2843
5652B843l390k991O7K878L455J089k072l931j929J405L443K677k44k808l192q75
$$ 2843 -547 -3538 -3471 -593 2862 3951 1879 -2052 -3981 -2576 867 3544 3300 492 -2700 -3575
5668c575K019L267K025j077l153k989l5K830L371J267k141l633j968R97L561K768
$$ -3575 -1556 1711 3736 2659 -494 -3483 -3518 -688 2683 3950 1809 -1824 -3792 -2795 766 3534
5684C534q8k998l278q00K138L218J916j005l210k540k32K585L267J347j982l734
$$ 3534 3446 448 -2830 -3630 -1492 1726 3642 2637 -573 -3113 -3345 -760 2507 3854 1872 -1862
5700a862k095J260L338K913j97k886l301q75K189L276J928j141l101k668j18K854
$$ -1862 -3957 -2697 641 3554 3357 471 -2830 -3705 -1516 1760 3688 2547 -554 -3222 -3340 -486
5716d86L103J066k030l344k092J149L196K811M6k881l268j031K156L386J993j225
$$ -486 2617 3683 1653 -1691 -3783 -2634 562 3373 3419 538 -2730 -3761 -1605 1781 3774 2549
5732B549l192k702J11K713L228Q80j908l376j981J193L178K613N0k726l235j074
$$ 2549 -643 -3345 -3234 -521 2707 3587 1679 -1697 -3678 -2485 693 3306 3356 630 -2605 -3679
5748c679K076L406J935j218l173k611r5K732L271R32k022l334j901J232L118K522
$$ -3679 -1603 1803 3738 2520 -653 -3264 -3359 -627 2644 3576 1554 -1780 -3681 -2449 669 3191
5764C191mk701l155r26J996L226J875r40l265k575o8K769L223Q56j881l364j897
$$ 3191 3187 486 -2669 -3595 -1599 1627 3502 2562 -703 -3278 -3346 -577 2646 3502 1621 -1743 -3640
5781c640J263K989K573k1k737k986r06J957L125J916r94l085k672n5K687L017
$$ -3640 -2377 612 3185 3164 427 -2559 -3465 -1508 1617 3533 2539 -546 -3218 -3273 -586 2431
5797B431J188k071l244j944J131L141K558J00k820k926j002J897L111J891j038
$$ 2431 3619 1548 -1696 -3640 -2509 632 3190 3290 470 -2456 -3458 -1561 1550 3441 2403
5812B403k840k706NK646L067R52j897l258j882J007L210K511j54k668l037q65
$$ 2403 -437 -3143 -3138 -492 2575 3527 1630 -1628 -3510 -2503 707 3218 3064 396 -2641 -3506
5828c506K008L170J848j101k982k568N3K599L093Q55j862l318j788R96L163K560
$$ -3506 -1498 1672 3520 2419 -563 -3131 -3078 -479 2614 3469 1607 -1711 -3499 -2503 660 3220
5844C220o3k540l207p84J771L419J632j047k960k549M3K702K833R94j928l066
$$ 3220 3157 617 -2590 -3374 -1603 1816 3448 2401 -559 -3108 -3065 -363 2470 3464 1536 -1530
5860a530j839J022K901K811l14k507l081p81J844L100J818r38l198k341J32K377
$$ -1530 -3369 -2347 554 3365 3051 544 -2537 -3318 -1474 1626 3444 2506 -692 -3033 -2901 -524
5876e24L041R03j902l054j653Q32K968K427J54k778k778j081J915L029J874r01
$$ -524 2517 3420 1518 -1536 -3189 -2357 611 3038 3192 414 -2364 -3445 -1530 1499 3373 2472
5892B472l030k453j17K680K914R20j908l080j802J018K966K467l4k568k930p83
$$ 2472 -558 -3011 -3128 -448 2466 3386 1478 -1602 -3404 -2386 580 3047 3013 445 -2485 -3268
5908c268J768K989J848r28k936k514J67K240L015R97j848l098j807Q78L121K279
$$ -3268 -1500 1489 3337 2409 -527 -3041 -2874 -634 2381 3378 1530 -1568 -3375 -2497 624 2903
5924B903J05k430l052q57J723L148J764r67k865k434j5K455K865R74j833l039
$$ 2903 3008 578 -2474 -3331 -1608 1540 3304 2337 -528 -2962 -2977 -522 2343 3317 1484 -1555
5940a555j573O28L066K541j58k413k885r98J753L070J738r82k672k486N6K260
$$ -1555 -3128 -2500 566 3107 2949 536 -2349 -3347 -1594 1476 3214 2232 -440 -2926 -2870 -610
5956f10K789R67j679k870j928R22K841K483m9k400k813r29J751K986J866j025
$$ -610 2179 3146 1467 -1403 -3331 -2409 432 2915 2866 466 -2347 -3276 -1525 1461 3327 2302
5972B302k697k481p7K420K901P72j649k912j711Q16K807K486m1k450k833r20J661
$$ 2302 -395 -2876 -2953 -533 2368 3140 1491 -1421 -3132 -2316 491 2977 2936 486 -2347 -3267 -1606
5989a606L092J752j001k770k436R0K334K946P74j708k998j536Q60K732K285J50
$$ -1606 1486 3238 2237 -533 -2969 -2879 -545 2401 3175 1467 -1531 -3067 -2207 525 2810 2960
6005B960k461k762r15J544L133J669q24k848k323j26K464K757Q95j626k989j688
$$ 2960 499 -2263 -3178 -1634 1499 3168 2344 -504 -2827 -2953 -489 2268 3163 1537 -1452 -3140
6021c140P95K784K398M7k281k744j005J650K880J785q10k846k181k03K343K750
$$ -3140 -2345 439 2837 2884 603 -2141 -3146 -1496 1384 3169 2359 -487 -2668 -2871 -528 2222
6037B222Q93j655k769j696O49K833K232L5k188k600j023J688K825J661q72k542
$$ 2222 3115 1460 -1309 -3005 -2356 477 2709 2744 556 -2044 -3067 -1379 1446 3107 2235 -307
6053c07k501J9K313K711Q24j617k844j692P93K782K323n7k231k700q67J471K882
$$ -307 -2808 -2789 -476 2235 3059 1442 -1402 -3094 -2301 481 2804 2747 516 -2184 -3051 -1580 1302
6070A302J652p62k743k295J6K364K610R70j683k828j690R91K426K313K04k358
$$ 1302 2954 2192 -551 -2846 -2830 -466 2144 3114 1431 -1397 -3087 -2096 330 2643 2847 489
6086D89k566r66J515K924J690q64k851k137k9K167K771Q21j617k651j696P83K778
$$ 489 -2077 -3043 -1528 1396 3086 2222 -629 -2766 -2795 -628 2143 2964 1347 -1304 -3000 -2217 561
6103E61K165J7k188k656r37J549K784J685q03k613k322j0K224K713Q19j692k747
$$ 561 2726 2743 555 -2101 -3038 -1489 1295 2980 2177 -436 -2758 -2768 -544 2169 2988 1296 -1451
6120a451j560Q05K658K224J1k158k682q86J529K743J576p07k445k387j4K157K637
$$ -1451 -3011 -2206 452 2676 2687 529 -2153 -3039 -1510 1233 2809 2102 -343 -2730 -2744 -587 2050
6137B050R33j623k741j423O05K616K225kk138k613q76J646K732J678r11k506k302
$$ 2050 2983 1360 -1381 -2804 -2199 417 2642 2640 502 -2111 -2987 -1341 1391 3069 2158 -348 -2650
6154b650P0J901K816Q70j598k614j655O57K672K236l5j991k728q34J526K668J496
$$ -2650 -2580 -679 2137 3007 1409 -1205 -2860 -2203 469 2705 2670 679 -2049 -2883 -1357 1311 2807
6171B807o16k533k292p1K195K741P63j640k676j557P65K559K201o9k056k478r02
$$ 2807 2191 -342 -2634 -2705 -510 2231 2994 1354 -1322 -2879 -2114 445 2646 2577 521 -1957 -2859
6188b859J458K633J687p37k594k212L5K114K577P10j325k713j543P25K558J988
$$ -2859 -1401 1232 2919 2182 -412 -2624 -2589 -475 2102 2812 1487 -1226 -2769 -2044 514 2502
6204B502Q9k015k457r48J468K602J652p63k483k124o9K128K353R07j469k538j622
$$ 2502 2591 576 -1881 -2829 -1361 1241 2893 2130 -353 -2477 -2546 -418 1935 2842 1373 -1165 -2787
6221b787O46K628J970K11k126k649o90J464K580J431n97k456k199l7K066K519
$$ -2787 -2141 487 2457 2668 542 -2107 -2797 -1333 1247 2678 2081 -375 -2574 -2611 -545 1974
6237A974Q02j470k547j549P70K334K152K4j994k533p57J348K534J615o60k335
$$ 1974 2776 1306 -1241 -2790 -2020 314 2466 2490 496 -2037 -2794 -1446 1088 2703 2043 -292
6253b92k237L4J916K595P53j407k525j548P37K275K115J52k035k443r22J421K613
$$ -292 -2529 -2495 -579 2016 2769 1362 -1163 -2711 -1974 301 2416 2568 533 -1910 -2832 -1411 1202
6270A202J605p85k351k196J2K008K437Q27j502k407j596O47K406K258n6k069k347
$$ 1202 2807 2022 -329 -2525 -2513 -505 1932 2759 1257 -1150 -2746 -2099 307 2565 2509 440 -1907
6287a907p48J204K677J460p45k257k061j14K004K348R14j510k505j407P60K313
$$ -1907 -2655 -1451 1226 2686 1941 -316 -2377 -2491 -487 1861 2775 1265 -1240 -2647 -1887 426
6303D26J966L9j902k430q76J495K503J582p17k371k221K2J974K359R42j592k391
$$ 426 2392 2431 529 -1901 -2777 -1282 1221 2803 2086 -285 -2506 -2484 -510 1849 2791 1199 -1192
6320a192j439O82K395J855J16j846k370q37J418K458J337n60k400j972j62J998
$$ -1192 -2631 -1949 446 2301 2417 571 -1799 -2636 -1218 1240 2577 2017 -383 -2355 -2517 -519
6336e19K342Q96j401k501j302N93K342K027m4j963k413o60J413K399J447n51k498
$$ -519 1823 2719 1318 -1183 -2485 -1892 450 2477 2433 470 -1943 -2603 -1190 1209 2656 2105 -393
6353c93j941j24K028K374O13j245k525j453P44K218J979P3j845k489q18J580K401
$$ -393 -2334 -2458 -430 1944 2557 1312 -1213 -2666 -1922 296 2275 2348 503 -1986 -2804 -1224 1177
6370A177J489p69k377j997J3J998K239Q57j427k472j379Q35K140J988J14j832
$$ 1177 2666 1897 -480 -2477 -2464 -466 1773 2630 1203 -1269 -2648 -1813 327 2315 2429 597
6386E97k425p76J313K437J451p03k292k018P3J888K433O15j500k280j321N53K263
$$ 597 -1828 -2604 -1291 1146 2597 1894 -398 -2416 -2343 -455 1978 2593 1093 -1187 -2508 -1955 308
6403C08K000M2j944k202q46J295K412J436o99k189j940o0J888K286Q31j421k279
$$ 308 2308 2350 406 -1796 -2642 -1347 1065 2501 1802 -387 -2327 -2387 -499 1787 2618 1197 -1082
6420a082j525O51K282J818J51j923k086r24J402K243J517o98k195j965r2J987
$$ -1082 -2607 -1956 326 2144 2295 372 -1714 -2638 -1236 1007 2524 1826 -369 -2334 -2426 -439
6436d39K180Q98j305k488j379O17K238J877J44j806k268q29J319K270J476m96
$$ -439 1741 2639 1334 -1154 -2533 -1916 322 2199 2343 537 -1731 -2560 -1241 1029 2505 2009
6452B009k343j937j59J850K325Q16j292k190j653P14K216J870P5j767k393q12
$$ 2009 -334 -2271 -2430 -580 1745 2561 1269 -921 -2574 -1860 356 2226 2301 534 -1859 -2671
6468b671J291K387J506o09k241k011JJ895K126Q44j370k183j448O33K120J972
$$ -2671 -1380 1007 2513 1904 -337 -2348 -2347 -452 1674 2518 1148 -1035 -2483 -1850 270 2242
6484B242P6j730k307q48J307K344J337n70k079j995J4J749K380P19j376k437j242
$$ 2242 2318 588 -1719 -2567 -1260 1084 2421 1851 -228 -2223 -2209 -460 1920 2639 1263 -1174 -2416
6501b416O70K164J762L6j609k172r73J198K450J360o47k146j880k3J756K254P37
$$ -2416 -1746 418 2180 2216 607 -1565 -2538 -1340 1110 2470 1823 -323 -2203 -2226 -470 1784 2521
6518B521j334k292j387P20K159J747J11j800k265p22J253K382J356n65k068j893
$$ 2521 1187 -1105 -2492 -1772 387 2134 2245 445 -1820 -2542 -1289 1093 2449 1884 -184 -2077
6534b077k32J889K142Q50j315k240j402N35K203J836R4j858k128p17J296K217
$$ -2077 -2309 -420 1722 2572 1257 -983 -2385 -1850 353 2189 2283 425 -1703 -2420 -1124 1093
6550A093J375o42k031k041Q6J631K200R48j344k186j565N83K288J838N7j847k182
$$ 1093 2468 1826 -205 -2246 -2160 -529 1671 2619 1275 -911 -2476 -1893 395 2233 2290 443 -1739
6567a739p33J143K286J430m85k213j836r3J817J997Q10j120k397j227N98K159
$$ -1739 -2472 -1329 957 2387 1902 -311 -2147 -2240 -423 1574 2384 1264 -1133 -2360 -1762 397
6583C97J725J22j722k214o99J111K240J428n67k156j890j6J725K180O61j059k116
$$ 397 2122 2244 522 -1692 -2391 -1280 960 2388 1821 -335 -2225 -2241 -516 1664 2325 1266 -850
6600h50j465N55K028J922J1j672k135q09J298K150J244n13k043j852q2J621K264
$$ -850 -2315 -1760 268 2190 2201 529 -1606 -2415 -1117 1033 2277 1764 -279 -2131 -2213 -592 1672
6617A672P08j189k113j418N57K077J750J66j671k162q76J316K209J254m54k076
$$ 1672 2380 1191 -922 -2340 -1783 294 2044 2210 539 -1623 -2499 -1183 1026 2280 1826 -250
6633b50k012O0J623K202Q58j145k175j582O13K038J689L16j699k112p90J080K218
$$ -250 -2262 -2202 -579 1623 2481 1336 -839 -2421 -1808 230 1919 2235 536 -1576 -2366 -1286 932
6650I32J360o48j693j846l19J719J989R13j111k257j249M67K012J773K7j493k126
$$ 932 2292 1644 -49 -1895 -2214 -495 1494 2407 1296 -961 -2210 -1743 269 2042 2069 576 -1550
6667a550p53J317J988J168m52j882j831k8J540K007P46j178k095j424P54J990
$$ -1550 -2303 -986 1002 2170 1718 -164 -1995 -2023 -483 1524 2270 1092 -1003 -2427 -1673 317
6683C17J694K57j641k191p10J176K211J167m00k096j858q3J673J991R15j280k054
$$ 317 2011 2268 627 -1564 -2274 -1098 1113 2280 1880 -216 -2074 -2157 -484 1507 2422 1142 -912
6700i12j356N90J923J806J71j770j976q01J094K112J430n52k059j661r8J565J992
$$ -912 -2268 -1678 245 2051 2222 452 -1524 -2325 -1231 881 2311 1759 -300 -1961 -2059 -494 1498
6717A498Q29j193k031j421O23J787J803J42j498k019p20R16K160J378n16k016
$$ 1498 2327 1134 -897 -2318 -1695 92 1895 2037 539 -1480 -2200 -1284 876 2254 1738 -278
6733b78j679j60J609J952Q17j175k026j341M61J974J834R4j579j894p81J009J969
$$ -278 -1957 -2117 -508 1444 2261 1086 -940 -2281 -1820 154 1988 2082 503 -1391 -2172 -1163 806
6750H06J361n59j723j750k35J540J926R09j014k157j293M59K006J627N1j532j968
$$ 806 2167 1608 -115 -1865 -2100 -560 1366 2275 1261 -896 -2189 -1730 276 1903 1954 422 -1546
6767a546n72R47J933J391o28j846j577j82J586J993P62j055k142j284N26J875
$$ -1546 -2118 -1171 762 2153 1525 -321 -1898 -2080 -494 1499 2261 1206 -936 -2220 -1694 181
6783A81J687J86j457k116p26R87K158J146l94k063j542j45J635J845P39j137j950
$$ 181 1868 2054 597 -1519 -2245 -1258 900 2046 1652 -411 -1953 -2098 -463 1382 2121 984 -966
6800i66j270O14J819J682Q5j428k040p03J091K002J232n26j812j617j16J445J983
$$ -966 -2236 -1622 197 1879 1964 536 -1504 -2207 -1116 886 2118 1592 -220 -1837 -1953 -508 1475
6817A475P23j137j880j291M11J910J645K30j356k053q36J038J852J444m60j832
$$ 1475 2198 1061 -819 -2110 -1699 211 1856 2086 730 -1323 -2159 -1121 731 2175 1715 -117
6833a17j700j81J458J833Q66r82j991j240L49J874J695P4j446j841p63Q94J993
$$ -117 -1817 -1998 -540 1293 2159 1177 -814 -2054 -1705 169 1864 1938 492 -1349 -2112 -1218 775
6850G75J342n17j737j680j62J420J997O38r89j889j262M34J812J577K06j373j968
$$ 775 2117 1600 -137 -1817 -1979 -559 1438 2076 1087 -802 -2064 -1630 182 1759 1965 592 -1376
6867a376r14J160J954J260m32j713j722l34J614J944N84p78j966j370L49J905
$$ -1376 -2290 -1130 824 2084 1652 -61 -1783 -2117 -503 1441 2025 1247 -719 -2089 -1740 165
6883A65J552K93j419j880p49P97K079J251l43j869j689q7J321K011N08q11j859
$$ 165 1717 2010 591 -1289 -2038 -1241 838 2089 1746 -123 -1812 -1899 -578 1433 1941 1130 -729
6900g29j353M51J687J689J11j411j751q16R75J946J237m55j690j629k45J617J606
$$ -729 -2082 -1631 56 1745 1856 445 -1306 -2122 -1147 799 2036 1581 -109 -1738 -1983 -366 1240
6917A240Q50j035j784j281N41J691J528K51j595j746o07Q14J896J392m89j750
$$ 1240 2090 1055 -729 -2010 -1469 222 1750 2001 406 -1340 -1947 -1133 763 2155 1666 -84
6933h4j738j27J424K046M87r02j911j231O34J649J576J19j494j775p11J013J794
$$ -84 -1822 -1949 -525 1521 2008 1106 -805 -2036 -1402 247 1823 1942 448 -1327 -2038 -1025 769
6950G69J148k87j849j625K9J324J874P55j103j774j231N23J592J600L9j252j914
$$ 769 1917 1630 -219 -1844 -1815 -491 1383 2138 1035 -739 -1970 -1447 145 1745 1784 532 -1382
6967a382o51J056J820J164m45j578j733l6J365J789P45r86j877j233N11J677J665
$$ -1382 -2033 -977 843 2007 1562 -16 -1749 -1785 -420 1369 2114 1128 -749 -1982 -1471 206 1871
6984A871J9j472j664p23J079J770J138l76j740j716j6J356J761Q04j016j905j089
$$ 1871 1890 418 -1246 -1969 -890 880 2018 1642 -98 -1814 -1830 -474 1287 2091 1075 -830 -1919
7001a919M02J681J479K01j290j814q18J030J766J251n65j567j560l3J228J799
$$ -1919 -1517 164 1643 1844 554 -1260 -2078 -1048 718 1969 1404 -163 -1723 -1756 -528 1271
7017A271P05r86j819j103N01J597J502J06j370j624p05Q71J807J183m09j667j605
$$ 1271 1976 990 -829 -1932 -1431 166 1668 1774 404 -1220 -1925 -1054 753 1936 1527 -140 -1745
7034a745j07J510J567P44q60j821j117L00J742J480R5j358j568p55R13J911J082
$$ -1745 -1852 -342 1225 1969 1109 -712 -1829 -1529 213 1693 1788 430 -1138 -1893 -980 931 2013
7051B013n30j573j662j8J358J798M39p44j824j210N44J569J515J25j467j714o45
$$ 2013 1483 -90 -1752 -1770 -412 1386 1825 1081 -743 -1953 -1409 160 1675 1800 333 -1381 -2026
7068b026R48J762J147m38j699j278j88J326J612R16j103j727j204M06J703J490
$$ -2026 -1078 684 1831 1393 -306 -1584 -1772 -446 1166 2082 979 -748 -1952 -1546 157 1647
7084A647P2j460j496q16J076J664J160l87j722j368j83J222J795P67r83j722j204
$$ 1647 1719 259 -1237 -2053 -977 687 1847 1460 -262 -1630 -1813 -591 1204 1971 988 -734 -1938
7101a938N08J479J471K46j318j733n49R11J646J208m74j657j430r7J394J496O73
$$ -1938 -1430 49 1520 1766 448 -1285 -1834 -923 723 1931 1457 -200 -1630 -1727 -333 1163 1836
7118A836q93j603j144K20J679J511J27j200j665q29J008J643J147m41j705j320
$$ 1836 943 -660 -1804 -1584 95 1606 1733 533 -1132 -1961 -953 690 1837 1396 -309 -1629
7134a629r0J286J576O76p92j679j147K85J597J543J71j315j760n53Q33J759J133
$$ -1629 -1719 -433 1143 1819 1027 -652 -1799 -1514 83 1626 1797 482 -1278 -1831 -998 761 1894
7151A894n10j621j274j73J250J656N86r06j512j155M36J407J494J18j188j734
$$ 1894 1384 -237 -1511 -1684 -434 1222 1808 902 -610 -1765 -1329 78 1572 1690 502 -1232
7167a232n41P24J850R18l98j426j514j7J304J584L92p06j515j243L93J537J357
$$ -1232 -1773 -1049 801 1719 1321 -105 -1619 -1636 -332 1252 1644 938 -577 -1820 -1427 110 1467
7184A467K52j187j717o60Q91J731R55k15j644j461o5J188J599N87p08j830q94
$$ 1467 1719 532 -1185 -1845 -954 777 1732 1517 -127 -1588 -1653 -465 1134 1721 1013 -817 -1711
7201a711K60J566J449K05j403j500n56P61J739J039m77j612j218n3J143J590N33
$$ -1711 -1451 115 1564 1769 366 -1134 -1690 -929 810 1849 1372 -240 -1458 -1511 -368 1222 1755
7218A755p81j452j368N68J403J366K17j205j687n59Q50J591R97m48j461j211j60
$$ 1755 974 -478 -1846 -1278 125 1491 1708 503 -1184 -1743 -893 698 1695 1247 -214 -1425 -1585
7235a585J194J546N63p67j612j077K51J583J447M7j022j756m50P04J680R69l47
$$ -1585 -391 1155 1718 951 -661 -1738 -1487 96 1543 1590 568 -1188 -1638 -934 746 1715 1368
7252A368j647j200qJ192J554M75q40j614q58K91J371J401J16j165j647n83Q81
$$ 1368 -279 -1479 -1487 -295 1259 1734 894 -720 -1578 -1287 84 1485 1601 436 -1211 -1794 -913
7269i13J743Q65n15j399j157k25J269J561M32q78j331j123L30J495J344k2j043
$$ -913 830 1695 1180 -219 -1376 -1601 -332 1229 1661 783 -548 -1671 -1341 154 1498 1476 433
7286D33j440o62Q49J530J048o02j449j222o0J082J575M74p03j488j050L77J257
$$ 433 -1007 -1669 -820 710 1758 1156 -293 -1515 -1575 -493 1082 1556 853 -635 -1685 -1308 -51
7303e1J425L04j208j569o39Q67J634R93m42j481j236l2J008J522N29p82j596r67
$$ -51 1374 1678 470 -1099 -1738 -871 763 1756 1314 -167 -1403 -1435 -427 1095 1624 842 -754 -1721
7321a721M43J401J324J14j137j546o37R13J479J065n19j299j296L6J166J219N72
$$ -1721 -1278 123 1447 1561 424 -1122 -1759 -846 633 1698 1179 -120 -1416 -1380 -214 1005 1577
7338A577p53j469p90K82J200J305K20j151j488o29P96J576J047m76j479j245J2
$$ 1577 824 -645 -1435 -1153 47 1352 1572 421 -1067 -1696 -900 676 1723 1247 -232 -1477 -1465
7355a465J305J132N37o72j484q54K97J237J309K68j313j355n67Q89J441R93n11
$$ -1465 -160 972 1509 837 -647 -1501 -1204 33 1342 1610 297 -1058 -1625 -736 705 1698 1187
7372A187j373j151o9J144J304N77q39j402q62K74J274J338K05j206j339p19Q35
$$ 1187 -186 -1337 -1406 -262 1042 1619 780 -622 -1484 -1210 64 1402 1607 401 -938 -1657 -822
7389h22J448J089n24j452j236R6J114J300N47r38j218q80L97J138J396j4j096
$$ -822 626 1715 1191 -261 -1497 -1401 -287 1013 1560 622 -596 -1476 -1079 59 1455 1441 345
7406C45j496n72Q49J611R02n08j352j228Q6J105J230N51q15j324q22L31J118J236
$$ 345 -1151 -1723 -874 737 1639 1131 -221 -1449 -1363 -258 972 1523 708 -616 -1438 -1107 11 1247
7424A247K63j083j358p50Q16J577R38l21j624j132J5J066J400L65n76j465q68
$$ 1247 1510 427 -931 -1681 -865 712 1650 1329 -295 -1427 -1412 -346 1054 1419 843 -622 -1490
7441a490L14J207J287J86j144j379p20R42J418R86l23j549j169j5J223J166O91
$$ -1490 -1176 31 1318 1504 360 -1019 -1739 -797 621 1607 1284 -265 -1434 -1449 -226 940 1631
7458A631r10j323q91L99J147J238J72j182j327n78O86J442J042n35j242j212m
$$ 1631 721 -602 -1493 -1094 53 1291 1463 281 -1046 -1624 -938 504 1546 1011 -231 -1443 -1447
7475a447J200J351K93p38j360p95L64J177J247Q1r17j461n63O52J646P13k32j376
$$ -1447 -247 1104 1397 659 -701 -1496 -1132 45 1292 1373 456 -1005 -1568 -916 730 1443 1211 -165
7493a65j217L6J047J318L67n87j261r37L15J099J089K42r80j357n00M99J464J041
$$ -165 -1382 -1346 -299 1019 1386 799 -462 -1399 -1084 15 1104 1346 366 -991 -1491 -992 472 1513
7511A513l39j272j264o7J134J309M36q51j218p40K62J091J142K53r61j432o10
$$ 1513 1174 -98 -1362 -1429 -295 1014 1450 599 -619 -1359 -1097 -6 1136 1389 428 -1004 -1614
7528a614P52J508Q91l59j466j101q0J240J299M57q72j249o68K39J074J000K82
$$ -1614 -862 646 1537 1178 -288 -1389 -1469 -229 1070 1527 655 -594 -1262 -1023 51 1051 1333
7545A333q47j379n51M66J412J206m00j474j206o0J405J069M16q21j180p25L19
$$ 1333 486 -893 -1444 -978 434 1640 1240 -234 -1440 -1500 -95 974 1390 569 -611 -1336 -1017
7562a017J124J006K32j082r59p57O16J270J131k57j489j166J6R09J507M59q65
$$ -1017 107 1113 1345 263 -696 -1453 -837 433 1564 1307 -182 -1348 -1332 -423 1084 1543 678
7579F78j396n87L02J059J088J54r00j325m03M62J265R22k48j224j265j1J102J432
$$ 678 -718 -1305 -1003 56 1144 1298 398 -927 -1330 -868 397 1319 1071 -153 -1418 -1429 -327 1105
7597A105L84p59j472n13K03J315Q81Q8j003j099n37N22J267R17q3j263j229j51
$$ 1105 1489 730 -742 -1255 -1052 263 1144 1232 229 -870 -1407 -885 382 1299 1216 -47 -1276 -1427
7615a427J204J257N12r52j224p31L93J134R88J6o71j228p45N60J532P39k74j155
$$ -1427 -223 1034 1546 594 -630 -1361 -968 166 1154 1170 499 -729 -1474 -914 618 1357 1083 -72
7633g2j246l5R66J428L82q19j260o99M20J108R12K04q66j323m85N69J315R69l38
$$ -72 -1318 -1353 -387 1041 1423 604 -656 -1355 -935 173 1085 1289 423 -900 -1385 -816 499 1468 1130
7652A130j265j171L5J227J202K37q46j312m78M13R41R86J03p47j140p65N52J305
$$ 1130 -135 -1306 -1271 -44 1158 1395 549 -763 -1241 -828 113 1099 1202 455 -685 -1450 -898 407
7670D07R95k09j298j084p7R76J509K11q43j361n16L15J147P90J51p33j107n08
$$ 407 1402 1193 -105 -1189 -1266 -290 1219 1430 587 -774 -1290 -975 172 962 1113 380 -727 -1235
7688a235M06J225J065k09j294j270n9J066J346M42q37j334n87L76J020R95L1q46
$$ -1235 -829 396 1461 1252 -42 -1312 -1371 -305 1041 1483 646 -688 -1275 -899 121 1116 1147 301
7706C01j103m36M82J021R37M9j201j287k45J165J350M23q06j346o84M59J096Q59
$$ 301 -802 -1238 -756 265 1202 1251 50 -1237 -1482 -317 1033 1456 650 -696 -1380 -921 175 1034
7724A034Op12j037m12L97J165P47k0j055j205k89J009J325O05q89j292p06M99
$$ 1034 1040 328 -709 -1121 -724 441 1188 1168 113 -1092 -1381 -372 953 1558 669 -623 -1329 -830
7742h30J094R03j20p66j032k96L30J224O79k23r47j099k69R22J359M68p62j228
$$ -830 264 1167 1047 281 -751 -1047 -717 507 1186 963 16 -1083 -1352 -430 929 1397 635 -593
7760e93o98K93J199Q97Qq06j114m14N56J063P75j18j054j184o6Q82J225N98p87
$$ -593 -1291 -998 201 1098 1106 300 -814 -1228 -672 391 1166 1048 -6 -1190 -1256 -374 851 1449 662
7779F62j093p45K41J093J044m7p69r85o20N56J094Q14r3j087j229j9P45J384M94
$$ 662 -431 -1176 -935 158 1202 1155 386 -599 -1219 -663 431 1245 1152 65 -1164 -1183 -438 946 1440
7798A440q42j097p85M54J011Q61P0p97j037l48L82R87Q95j23j016j100k48Q38
$$ 1440 598 -499 -1284 -830 181 1042 1112 315 -722 -1070 -688 299 1194 1071 55 -1045 -1293 -455
7816d55J538M01p98j420n56L83J183P47Q0p08j058m41M21R80Q02o5q75j104l35
$$ -455 1083 1484 686 -734 -1290 -907 276 1023 1103 395 -663 -1104 -683 297 1099 1034 159 -945 -1280
7835a280P08J368O99q14j254q38N08J252P11M3q56r61k34K20R29Q86q6q57j108
$$ -1280 -572 796 1495 681 -573 -1411 -903 349 1060 1103 247 -714 -948 -728 201 1087 1001 144 -964
7854i64k88P71J165O45n12j231r43M70J106R59j48p74j080m03O82P91P25M0q77
$$ -964 -1252 -481 684 1329 817 -414 -1357 -887 219 1178 1030 256 -824 -1227 -545 246 971 1011 134
7873A34j002k52O26J261N42o08j227o58L00J135P24j8p42q69m82N39J047O41p1
$$ 134 -868 -1120 -494 767 1309 701 -526 -1184 -884 251 975 957 215 -654 -1136 -597 450 1091 1020
7892A020j001r21k26P25J145M70m53j246q74K97J110R59J51q85r93n27M46J189
$$ 1020 19 -902 -1128 -403 742 1212 759 -487 -1361 -1064 46 1005 1156 271 -722 -1249 -803 386
7910C86O04o1r88q78j78O36J198N30n99j155p34K98J028Q92J51p20j150l66M92
$$ 386 990 929 -59 -937 -1115 -479 719 1249 650 -505 -1239 -941 87 979 1130 410 -740 -1106 -614
7929f14R06P84j64q42j036k50Q10J060N19n06r78q40J02J210R53j89o63r62l76
$$ -614 292 1076 912 70 -966 -1216 -406 654 1173 667 -311 -1151 -1049 161 1114 925 262 -700 -1076
7948a076L56J074P04j51q48r04k44O23J102N69n98j070o31Q9J147R03l3o90j102
$$ -1076 -720 354 1058 907 59 -845 -1089 -466 636 1205 607 -463 -1094 -1005 142 1045 1012 322 -780
7967g80k88M85Q50Q35k49q09r23l04P83J009N55l98j094q90K36J121Q63Q8q49
$$ -780 -1068 -583 267 1102 853 44 -879 -1183 -400 609 1164 766 -328 -1218 -982 139 1002 1090 241
7986B41q51m45N69Q32O50k0q37r21k71M97J065O27l44j171q58J82J074R63J70
$$ 241 -610 -1055 -486 346 996 976 139 -782 -1053 -556 509 1136 792 -379 -1237 -1055 19 982 1152
8005A152r20r13m21M39J090N01k21p34r02n7N07J199M68m43j013q86K52R16Q62
$$ 1152 232 -681 -1102 -663 427 928 707 -27 -929 -986 -479 720 1188 745 -268 -1154 -902 14 876
8024H76K42q61r50l78M94R86O53k96o84q76m00P60R35O20m23j033p04J71R38R05
$$ 876 1118 257 -693 -1071 -577 409 1062 766 82 -794 -1194 -434 501 1121 698 -335 -1039 -868 70 975
8044I75J40q14j042k83M25J017N62j56q61q14n1N33J017M32l95q61q49K5R06R60
$$ 975 1115 301 -741 -1024 -599 418 980 824 -37 -851 -902 -369 648 1080 685 -176 -1025 -1000 -94 866
8064H66L44q53j032l60K80J152O02k86p53q22j61N43J131L21k67j103p40K60Q48
$$ 866 1210 357 -675 -1035 -755 397 999 713 -40 -862 -1023 -480 651 972 705 -398 -1138 -878 -30
8083c0Q69J38o69r39m09L75R66P86k55p32r86j00N85R56O34n76r30p58K06Q73
$$ -30 839 977 308 -631 -1040 -665 301 1087 832 100 -886 -986 -401 555 1189 613 -317 -1075 -869 4
8103DR89rn96j040l63M84R02N49o8q11q70j79N76J094L91m18r46q00J26J021P74
$$ 4 993 984 388 -652 -1015 -531 371 920 852 41 -829 -1008 -432 662 1053 635 -311 -1111 -985 36 810
8124H10J67o94j022j93L21Q99O74k80p05p69k42O35J078K46k81r93o59Q5R41Q95
$$ 810 977 283 -739 -932 -611 288 962 682 -23 -792 -1034 -399 679 925 644 -349 -1008 -923 18 913
8144I13k9n20j050l56M64Q45P19l06p55o23k99O23R07N37m40q98o82J37P52Q72
$$ 913 884 364 -686 -1042 -578 267 986 680 -75 -698 -997 -374 533 1070 630 -268 -950 -813 -61 811
8164H11J44p34q79l99P35O45O74k80q52o65l5O47Q23L36l68r69n45K13O79Q99
$$ 811 955 221 -658 -1057 -322 323 997 717 -135 -800 -835 -188 635 971 603 -366 -911 -698 -19 880
8184H80K40q67r13l37M28R55O24
$$ 880 1120 253 -660 -997 -569 386 1010
8191A010
$$ 1010
$$ Imaginary data points
##PAGE= N=2
##DATA TABLE= (X++(I..I)), XYDATA
0@%%%%%%Qq%qQqJ6j6K1k9L2l8M6m8N7p0P7r2J05j14J37j55J69j96K19k43K77l07
$$ 0 0 0 0 0 0 0 8 0 0 -8 0 -8 8 -8 13 -16 16 -22 24 -24 33 -37 40 -52 53 -61 76 -79 90 -106 113 -130 147 -160
34a60L41l83M22m68N21n74O39p08P79q66R60j063J189j326J480j670J893k162
$$ -160 181 -202 220 -248 273 -301 338 -370 409 -457 503 -560 629 -697 783 -887 1006 -1156
52a156K502k934L511m329N559p630J1745k2962J09805M37226j1068m33489m84709
$$ -1156 1346 -1588 1923 -2406 3153 -4477 7268 -15694 94111 531337 520269 86780 -397929
65c97929j33206K97592M87268K79749j45691m54883l84912j0680L66295M45367
$$ -397929 -531135 -233543 253725 533474 387783 -67100 -452012 -462692 -96397 348970
75C48970J78215k41526m80805l32012J11540M71686M29391J5710m03846m76153
$$ 348970 527185 285659 -195146 -527158 -415618 56068 485459 501169 97323 -378830
85c78830j55028K80928M78403K82213j41247m43950l78437j1191L54322M30316
$$ -378830 -533858 -252930 225473 507686 366439 -77511 -455948 -467139 -112817 317499
95C17499J67371k30829m54224l12472R7569M38889M11955L3806l70826m60404
$$ 317499 484870 254041 -200183 -512655 -415086 23803 435758 469564 98738 -361666
105c61666j66948K60944M70450K89616j29248m34426l74034q472L54897M25091
$$ -361666 -528614 -267670 202780 492396 363148 -71278 -445312 -453784 -98887 326204
115C26204J54946k36682m37740k82017J09378M15784L79004K6520l46726m28672
$$ 326204 481150 244468 -193272 -475289 -365911 49873 428877 455397 108671 -320001
125c20001j55894K42528M38839K75140j12745m07476l65559k2598L36567M16282
$$ -320001 -475895 -233367 205472 480612 367867 -39609 -405168 -427766 -91199 325083
135C25083J54508k32414m28827k74179J06937M00829L59915J8279l35696m06868
$$ 325083 479591 247177 -181650 -455829 -348892 51937 411852 430131 94435 -312433
145c12433j44917K27547M08863K57725j01566l80033l50706l4015L13216M02979
$$ -312433 -457350 -229803 179060 436785 335219 -44814 -395520 -429535 -116319 286660
155B86660J59207k18492m17217k70523J01984L91585L52488J7002l29079l92528
$$ 286660 445867 227375 -189842 -460365 -358381 33204 385692 402694 73615 -318913
165c18913j29711K29133L90986K36859j00923l54393l23868l0059K93205L80386
$$ -318913 -448624 -219491 171495 408354 307431 -46962 -370830 -400889 -107684 272702
175B72702J56159j99719l95182k64508R2058L78830L48302K0576l23148l86652
$$ 272702 428861 229142 -166040 -430548 -338490 40340 388642 409218 86070 -300582
185c00582j24584K31356L83875K22166j09809l44719l01722j9830K76852L52013
$$ -300582 -425166 -193810 190065 412231 302422 -42297 -344019 -363849 -86997 265016
195B65016J43917j83551l68213k54420P3982L50869L36845L3035l03326l79687
$$ 265016 408933 225382 -142831 -397251 -323269 27600 364445 397480 94154 -285533
205b85533j32499K19061L75378K18665j08303l37243k90755j3625K68559L32618
$$ -285533 -418032 -198971 176407 395072 286769 -50474 -341229 -354854 -86295 246323
215B46323J30616j75065l42481k37011O5332L24680L20245M2986k78507l64684
$$ 246323 376939 201874 -140607 -377618 -312286 12394 332639 375625 97118 -267566
225b67566j38831K02936L68130K23452j01179l34073k88116q013K71710L26041
$$ -267566 -406397 -203461 164669 388121 286942 -47131 -335247 -343260 -71550 254491
235B54491J17311j80870l30391k15800P3952L09346K95854L5006k62016l41266
$$ 254491 371802 190932 -139459 -355259 -281307 28039 323893 358899 96883 -244383
245b44383j32530J86949L47317K17466r0813l20492k83488j3366K63285L18245
$$ -244383 -376913 -189964 157353 374819 284006 -36486 -319974 -333340 -70055 248190
255B48190J12563j79957l22313k05284P6725K97833K76968K6399k49220l19615
$$ 248190 360753 180796 -141517 -346801 -270076 27757 304725 331124 81904 -237711
265b37711j24250J73143L25654K08402p9675l01384k74001k0929K48502L11218
$$ -237711 -361961 -188818 136836 345238 265563 -35821 -309822 -330751 -82249 228969
275B28969J17950j70890l17052k02686P7662K94975K69345K0967k44334l04922
$$ 228969 346919 176029 -141023 -343709 -266047 28928 298273 319240 74906 -230016
285b30016j12346J70877L10332J94871p7487k83680k57199k0459K33107K95745
$$ -230016 -342362 -171485 138847 333718 256231 -27449 -284648 -305107 -72000 223745
295B23745J16876j58810l04494j99579P1637K85622K62835J9942k39459k97221
$$ 223745 340621 181811 -122683 -322262 -250625 34997 297832 317774 78315 -218906
305b18906j07142J68776K99957J82243q1083k73065k41558j6851K18865K77188
$$ -218906 -326048 -157272 142685 324928 243845 -29220 -270778 -287629 -68764 208424
315B08424J10696j47500k88494j94199O1828K69979K55438K5657k28560k91626
$$ 208424 319120 171620 -116874 -311073 -249245 20734 276172 301829 73269 -218357
325b18357j09167J63080K94014J78100q0789k66237k31585j2371K11961K63649
$$ -218357 -327524 -164444 129570 307670 226881 -39356 -270941 -283312 -71351 192298
335A92298J04015j39429k70843j83793N4488K53101K46563L4048k12535k82425
$$ 192298 296313 156884 -113959 -297752 -243264 9837 256400 290448 77913 -204512
345b04512j13209J53185K88413J79719p5399k61356k28224j0701K10477K57262
$$ -204512 -317721 -164536 123877 303596 228197 -33159 -261383 -272084 -61607 195655
355A95655R6687j38806k60172j71818N5011K39806K32230L2974j98681k68671
$$ 195655 292342 153536 -106636 -278454 -223443 16363 248593 281567 82886 -185785
365a85785j12969J40582K76075J78367o7926k54064k26571j2936K06559K52524
$$ -185785 -298754 -158172 117903 296270 228344 -25720 -252291 -265227 -58668 193856
375A93856R1685j39912k54662j63090N8830K32738K18433K5675j91718k53810
$$ 193856 285541 145629 -109033 -272123 -213293 19445 237878 263553 71835 -181975
385a81975j05371J32623K61679J71932o1278k42821k21328j6819J99471K48302
$$ -181975 -287346 -154723 106956 278888 217610 -25211 -246539 -263358 -63887 184415
395A84415R3036j35938k51297j60204N9725K29847K12285K2020j86951k43246
$$ 184415 277451 141513 -109784 -269988 -210263 19584 231869 253889 66938 -176308
405a76308r9282J27788K49651J65223n6332k30608k13391k0468J88318K41139
$$ -176308 -275590 -147802 101849 267072 210740 -19868 -233259 -253727 -65409 175730
415A75730R4987j28301k45196j59916N6422K25173K08561K0484j84281k37101
$$ 175730 270717 142416 -102780 -262696 -206274 18899 227460 247944 63663 -173438
425a73438r4222J25951K41474J57016n6244k21355k03925k0427J79158K31291
$$ -173438 -267660 -141709 99765 256781 200537 -20818 -224743 -245170 -66012 165279
435A65279R4216j20533k36291j58183N0622K17935K05885K3866j78931k33733
$$ 165279 259495 138962 -97329 -255512 -204890 13045 218930 242796 63865 -169868
445a69868r3897J23880K37665J53296n6306k16409j96502j7266J74199K22504
$$ -169868 -263765 -139885 97780 251076 194770 -21639 -218141 -235407 -61208 161296
455A61296R0103j15364k26459j52593M6941K09405K00912K5881j72361k28248
$$ 161296 251399 136035 -90424 -243017 -196076 13329 214241 240122 67761 -160487
465a60487r3758J20088K33214J51055n5715k13136j92660j4667J71800K15996
$$ -160487 -254245 -134157 99057 250112 194397 -18739 -211399 -226066 -54266 161730
475A61730Q4195j14212k18578j45750M5715K00925J92647K5565j65173k21174
$$ 161730 245925 131713 -86865 -232615 -186900 14025 206672 232237 67064 -154110
485a54110r2852J14269K26352J48823n3126k09042j90009j4522J69953K11916
$$ -154110 -246962 -132693 93659 242482 189356 -19686 -209695 -224217 -54264 157652
495A57652P9957j14856k14074j38832M8189J95444J84019K1960j59876k11823
$$ 157652 237609 122753 -91321 -230153 -181964 13480 197499 219459 59583 -152240
505a52240q8875J09537K18337J45551m9533k03194j86376j5103J67060K08842
$$ -152240 -241115 -131578 86759 232310 182777 -20417 -206793 -221896 -54836 154006
515A54006P8979j13786k10511j34928M9887J92608J78022J9021j55789k03703
$$ 154006 232985 119199 -91312 -226240 -176353 16255 194277 213298 57509 -146194
525a46194q4874J05688K09887J40906m5296j94277j81595j8631J59270K04444
$$ -146194 -231068 -125380 84507 225413 180117 -14160 -195755 -214386 -55116 149328
535A49328Q0857j08381k06681j34521M7134J88564J75079J8759j52288j98553
$$ 149328 230185 121804 -84877 -219398 -172264 16300 191379 210138 57850 -140703
545a40703q2424J02051K02853J36244m2549j86679j76079k0586J51260J98220
$$ -140703 -223127 -121076 81777 218021 175472 -11207 -187286 -207872 -56612 141608
555A41608Q1345j01973k00878j34098M2651J83431J72741K0187j48399j94740
$$ 141608 222953 120980 -79898 -213996 -171345 12086 184827 205014 56615 -138125
565a38125q1129R9407J97053J32581m0835j80303j70699k1304J44778J91775Q0877
$$ -138125 -219254 -119847 77206 209787 168952 -11351 -182050 -203354 -58576 133199 214076
576B14076r5767j93537j32383L7232J75841J70170K4431j41880j91107q2801R3745
$$ 214076 118309 -75228 -207611 -170379 5462 175632 200063 58183 -132924 -215725 -121980
587a21980J92872J31917l7371j74837j67665k2715J39665J86447Q0244r0723j86669
$$ -121980 70892 202809 165438 -9399 -177064 -199779 -60114 126333 206577 115854 -70815
598g0815j29605L3348J69073J66482K6628j35220j86331q3122Q9462J87872J30775
$$ -70815 -200420 -167072 2001 168483 195111 59891 -126440 -209562 -120100 67772 198547
609A98547l4581j70618j64438k2898J36474J82094P8293q8505j81417j25581L2316
$$ 198547 163966 -6652 -171090 -193988 -57514 124580 202873 114368 -67049 -192630 -160314
620a60314J63659J61299K6736j30277j80318q2068Q4528J82293J28981l1204j65559
$$ -160314 3345 164644 191380 61103 -119215 -201283 -116755 65538 194519 163315 -2244
631b244j61788k4063J32510J78483P7413q6214j77633j22818L1952J59556J56090
$$ -2244 -164032 -188095 -55585 122898 200311 114097 -63536 -186354 -154402 5154 161244
642A61244K5334j25887j74307q0115Q0515J75258J26021k8007j59306j58597k6748
$$ 161244 186578 60691 -113616 -193731 -113216 62042 188063 160056 750 -157847 -184595
653a84595J26610J74606P8351q1454j73183j22426K7974J54298J53764K7730j20655
$$ -184595 -57985 116621 194972 113518 -59665 -182091 -154117 181 153945 181675 61020
664F1020j70221q0473P5314J69457J24363k3769j52264j55284l0186J19819J70671
$$ 61020 -109201 -189674 -114360 55097 179460 155691 3427 -151857 -182043 -62224 108447
675A08447Q0168p6123j69004j22131K5237J50618J51520K8050j17795j66412p8265
$$ 108447 188615 112492 -56512 -178643 -153406 -2788 148732 176782 58987 -107425 -185690
686a85690P4023J65392J20590k3721j47972j50287k8653J16536J65368P8039p3601
$$ -185690 -111667 53725 174315 150594 2622 -147665 -176318 -59782 105586 183625 110024
697A10024j64142j18991K3863J46948J48428K7682j14987j62994p6250P2307J61460
$$ 110024 -54118 -173109 -149246 -2298 146130 173812 58825 -104169 -180419 -108112 53348
708E3348J17412k2815j44169j46415k8110J13028J60971P6134p0897j59223j16283
$$ 53348 170760 147945 3776 -142639 -170749 -57721 103250 179384 108487 -50736 -167019
719a67019K2235J42137J44870K8234j11010j59150p5792O9972J57630J15333k2391
$$ -167019 -144784 -2647 142223 170457 59447 -99703 -175495 -105523 52107 167440 145049
730A45049j40990j43390k7367J10409J56646P4071o9282j54975j13474K0974J37967
$$ 145049 4059 -139331 -166698 -56289 100357 174428 105146 -49829 -163303 -142329 -4362
741d362J41219K8276j07821j55276p4878O7036J53672J13399k0376j37162j40998
$$ -4362 136857 165133 57312 -97964 -172842 -105806 47866 161265 140889 3727 -137271
752a37271k8045J07414J53430P3132o7060j51463j10994K0460J34499J37587K7884
$$ -137271 -165316 -57902 95528 168660 101600 -49863 -160857 -140397 -5898 131689 159573
763A59573j04749j50927p2934O5008J49313J10574j9027j33244j36863k8090J03610
$$ 159573 54824 -96103 -169037 -104029 45284 155858 136831 3587 -133276 -161366 -57756
774e7756J49861P2776o4163j47908j08935J9076J31111J34671K8038j01325j47066
$$ -57756 92105 164881 100718 -47190 -156125 -137049 -5938 128733 156771 55446 -91620
785i1620p1742O2772J45283J08352j7824j29316j33636k7929J01062J46368P0911
$$ -91620 -163362 -100590 44693 153045 135221 5905 -127731 -155660 -54598 91770 162681
796A62681o3238j44317j06090J9470J28673J31048K5959j00303j43332o8374O2868
$$ 162681 99443 -44874 -150964 -131494 -2821 128227 154186 53883 -89449 -157823 -94955
807i4955J41973J03867j9613j26567j29198k5442R9257J41734O7605o2381j40636
$$ -94955 47018 150885 131272 4705 -124493 -149935 -50678 91056 158661 96280 -44356
818d4356j02920J9343J25452J27857K4849r8282j40139o6708O1290J38644J01361
$$ -44356 -147276 -127933 -2481 125376 150225 51943 -88196 -154904 -93614 45030 146391
829A46391j8954j23632j26111k5289R6409J38298O6401o0023j37030j00885J8024
$$ 146391 127437 3805 -122306 -147595 -51186 87112 153513 93490 -43540 -144425 -126401
840a26401J21875J25213K5320r5391j37052o5758N9353J35290R9386j8063j20243
$$ -126401 -4526 120687 146007 50616 -86436 -152194 -92841 42449 141835 123772 3529
851C529j23367k4921R3893J35029O4977n8742j33525r8368J7968J19086J21973
$$ 3529 -119838 -144759 -50866 84163 149140 90398 -43127 -141495 -123527 -4441 117532
862A17532K4350r3037j33410o3936N7994J32189R7198j7565j17931j20648k3544
$$ 117532 141882 48845 -84565 -148501 -90507 41682 138880 121315 3384 -117264 -140808
873a40808R2093J31713O3255n7314j30395r5944J7675J16306J19235K3477r1001
$$ -140808 -48715 82998 146253 88939 -41456 -137400 -119725 -3419 115816 139293 48292
884D8292j29938o2319N6824J28710R4588j7277j14468j17351k3526Q9505J28393
$$ 48292 -81646 -143965 -87141 41569 136157 118880 4412 -112939 -136465 -46960 81433
895H1433O1955n5692j27035r3933J6790J13299J16283K3178q8315j27105o1322
$$ 81433 143388 87696 -39339 -133272 -116482 -3183 113100 136278 47963 -79142 -140464
906a40464N4970J25593R2720j6777j11952j14985k3056Q7210J25726O0484n4334
$$ -140464 -85494 40099 132819 116042 4090 -110895 -133951 -46741 78985 139469 85135
917H5135j24513r2034J6313J10986J14175K2870q6766j24741o0060N4012J23037
$$ 85135 -39378 -131412 -115099 -4113 110062 132932 46166 -78575 -138635 -84623 38414
928C8414R0660j6218j09449j12431k3047Q5169J22877N9648n2757j21400r0119
$$ 38414 129074 112856 3407 -109024 -132071 -46902 75975 135623 82866 -38534 -128653
939a28653J5301J07925J11453K3552q3914j21946n9612N1961J20218Q9585j4651
$$ -128653 -113352 -5427 106026 129578 45664 -76282 -135894 -83933 36285 125870 111219
950A11219j06396j10252k3589Q2283J20120N9653m9979j18366q9202J3614J04977
$$ 111219 4823 -105429 -129018 -46735 73385 133038 83059 -35307 -124509 -110895 -5918
961e918J09826K4302q1077j19295n9568M9359J17487Q8709j3137j03631j08659
$$ -5918 103908 128210 47133 -72162 -131730 -82371 35116 123825 110688 7057 -101602
972a01602k4438P9711J17728N9443m7921j15633q8111J1886J01701J07850K5180
$$ -101602 -126040 -46329 71399 130842 82921 -32712 -120823 -108937 -7236 100614 125794
983A25794p7878j16818n9694M6635J14386Q7724j1218j00628j07231k5307P7194
$$ 125794 47916 -68902 -128596 -81961 32425 120149 108931 8303 -98928 -124235 -47041
994d7041J15796N8936m6536j13417q6652J1224R9920J05463K4750p6541j14466
$$ -47041 68755 127691 81155 -32262 -118914 -107690 -7770 97693 122443 45902 -68564
1005f8564n8195M6043J11918Q5717j1287r8438j04840k4646P5696J13156N7679
$$ -68564 -126759 -80716 31202 116919 105632 7194 -97646 -122292 -46596 66560 124239
1016A24239m5567j10666q4766J1122R7505J03431K4072p4963j11992n6675M5335
$$ 124239 78672 -31994 -116760 -105638 -8133 95298 119370 44407 -67585 -124260 -78925
1027g8925J09571Q3469j1231r6333j02022k3859P4072J10773N6416m4384j08496
$$ -78925 30646 114115 102884 6551 -95471 -119330 -45258 65515 121931 77547 -30949
1038c0949q2983J0680R5754J01570K3929p3519j09851n5726M4585J07615Q1914
$$ -30949 -113932 -103252 -7498 94072 118001 44482 -65369 -121095 -76510 31105 113019
1049A13019j1057r4746j00154k2995P3083J08472N4651m4044j06248q0817J0978
$$ 113019 101962 7216 -92938 -115933 -42850 65622 120273 76229 -30019 -110836 -99858
1060i9858R3797R9231K2564p2264j07156n3991M3479J04829Q0111j0746r2550
$$ -99858 -6061 93170 115734 43470 -63686 -117677 -74198 30631 110742 99996 7446
1071G446r7976k2791P1292J06052N3524m2813j03898p9141J0546R1353R6922K2484
$$ 7446 -90530 -113321 -42029 64023 117547 74734 -29164 -108305 -97759 -6406 90516 113000
1083A13000p0629j05058n3151M2472J03128P8409j1046r0995r6051k1775P0031
$$ 113000 42371 -62687 -115838 -73366 29762 108171 97125 6130 -89921 -111696 -41665
1094d1665J03940N2176m2541j01763p7378J0752Q9733R4972K1613o9135j02976
$$ -41665 62275 114451 71910 -29853 -107231 -96479 -6746 88226 109839 40704 -62272
1105f2272n1679M1634J00667P6599j0169q8813r3897k1848O8120J01723N1732
$$ -62272 -113951 -72317 28350 104949 94780 5967 -87930 -109778 -41658 60065 111797
1116A11797m0691r9486p6218R583Q7642R3159K2320o6957j00560n1571L9847R8339
$$ 111797 71106 -28380 -104598 -95015 -7373 85786 108106 41149 -59411 -110982 -71135 27204
1128B7204P5616q867q6139r2311k2531O6016R9810N1513l8961r7450p5446Q674
$$ 27204 102820 93953 7814 -84497 -107028 -41012 58798 110311 71350 -26100 -101546 -92872
1140i2872Q5697R1429K2390o5235r8674n0920L8587R6210P4531q493q4525r0671
$$ -92872 -7175 84254 106644 41409 -57265 -108185 -69598 26612 101143 92650 8125 -82546
1152h2546k2044O4687R7855N0398l8553r5634p3748Q913Q3941Q9798K1355o4226
$$ -82546 -104590 -39903 57952 108350 69797 -25837 -99585 -90672 -6731 83067 104422 40196
1164D0196r6894m9609L8296R4493P2567q828q3129q8730k1425O3473R6047M9089
$$ 40196 -56698 -106307 -68011 26482 99049 90221 7092 -81638 -103063 -39590 56457 105546
1176A05546l7912r3800p2370R010Q2417Q7958K0868o3282r4979m8577L7885R2600
$$ 105546 67634 -26166 -98536 -89526 -7109 80849 101717 38435 -56544 -105121 -67236 25364
1188B5364P1157q652q0896q6953k1412O1674R3970M8976l6293r1605p1484P504
$$ 25364 96521 87869 6973 -79980 -101392 -39718 54252 103228 66935 -24670 -96154 -88650
1200h8650Q0386Q6791K1740o1273r3144m8357L5814R0363P0516p051p8401q5548
$$ -88650 -8264 78527 100267 38994 -54150 -102507 -66693 23670 94186 87135 8734 -76814
1212g6814k2306N9425R2174M9081l4403q9339p1051O128P8238Q5691K2537n9127
$$ -76814 -99120 -39695 52479 101560 67157 -22182 -93233 -87105 -8867 76824 99361 40234
1224D0234r1535m8715L4126Q8529O9888o107p6509q4426k2397N7677R0159M8666
$$ 40234 -51301 -100016 -65890 22639 92527 86420 9911 -74515 -96912 -39235 50924 99590
1236I9590l3103q7559o9882N546P6533Q4054K2109n7731q9946m7690L3362Q6657
$$ 99590 66487 -21072 -90954 -85408 -8875 75179 97288 39557 -50389 -98079 -64717 21940
1248B1940O8635n891p5248q2617k2250N6185Q8244M7958l1865q5370o8908M517
$$ 21940 90575 84684 9436 -73181 -95431 -39246 48998 96956 65091 -20279 -89187 -84670
1260h4670P4015Q2441K2988n5702q8141m7824L1743Q4793O7993n115p3461q1373
$$ -84670 -10655 71786 94774 39072 -49069 -96893 -65150 19643 87636 82521 9060 -72313
1272g2313k2007N5114Q6637M7232l1612q4032o7059N081P3051Q0693K1747n4963
$$ -72313 -94320 -39206 47431 94663 63051 -20981 -88040 -82959 -9908 70785 92532 37569
1284C7569q6104m6464L1741Q3150O6298n093p1868p9761k1723N4029Q5154M6416
$$ 37569 -48535 -94999 -63258 19892 86190 81097 9229 -70532 -92255 -38226 46928 93344
1296I3344l0733q2296o5974M681P1205P9323K2081n3657q4356m5877L0448Q1378
$$ 93344 62611 -19685 -85659 -80978 -9773 69550 91631 37974 -46382 -92259 -61811 19567
1308A9567O5253m251p0117p8070k2121N2223Q3344M6143k9342q0314o5611L932
$$ 19567 84820 80569 10452 -67618 -89739 -37516 45828 91971 62629 -17685 -83296 -79364
1320g9364O9634P8105K2034n2216q2971m5470K9416P9557O4302l737o8383p6824
$$ -79364 -9730 68375 90409 38193 -44778 -90248 -60832 18725 83027 79290 10907 -65917
1332f5917k2195N0454Q1760M5572k7744p8750o4621K511O7959P7005K2371n0663
$$ -65917 -88112 -37658 44102 89674 61930 -16820 -81441 -78930 -10971 66034 88405 37742
1344C7742q1632m5330K8545P8157O3190l600o6846p5219k1932M9388P9992M4978
$$ 37742 -43890 -89220 -60675 17482 80672 77072 10226 -64993 -86925 -37537 42455 87433
1356H7433k7320p6866o3442K583O6326P5519K2358m9407q0137m4734K7627P6914
$$ 87433 60113 -16753 -80195 -77612 -11286 64233 86591 37184 -42953 -87687 -60060 16854
1368A6854O2495l223o5837p4209k1547M8503P8439M4179k6343p5160o2227J963
$$ 16854 79349 76126 10289 -63920 -85467 -36964 41475 85654 59311 -15849 -78076 -76113
1380g6113O4532P4259K2439m7910p8926m4210K6773P5418O1799l114o4503p3162
$$ -76113 -11581 62678 85117 37207 -41719 -85929 -59156 16262 78061 74947 10444 -62718
1392f2718k1039M7760P7348M3098k6373p3958o0857K470O3654P2475K1725m6994
$$ -62718 -83757 -35997 41351 84449 58076 -15882 -76739 -74269 -10615 61860 83585 36591
1404C6591p7081m3431K5846P3744O0887k242o3438p1991k1562M6554P6042M3047
$$ 36591 -40490 -83921 -58075 15669 76556 74314 10876 -61115 -82677 -36123 39919 82966
1416H2966k5134p2522o0465J570O2198P1481K1756m5839p5590m3046K4952P2061
$$ 82966 57832 -14690 -75155 -73585 -11387 60094 81850 36011 -39579 -82625 -57673 14388
1428A4388N9924j658o1980p0795k1619M5215P4985M2580k4840p1398n9383J579
$$ 14388 74312 72654 10674 -60121 -81740 -36525 38460 81040 56200 -15198 -74581 -73002
1440g3002O1104P0292K1537m5113p4184m2251K4424P0768N8827j566o0344o9580
$$ -73002 -11898 58394 79931 34818 -39366 -81617 -57193 13575 72402 70836 10492 -59088
1452e9088k1383M4278P3413M2089k3764p0353n8414J314O0229O9421K1140m4372
$$ -59088 -80471 -36193 37220 79309 55545 -14808 -73222 -71908 -11679 57742 78882 34510
1464C4510p3143m1504K4510P0012N7527j874n9808o8082k0265M4066P2036M0871
$$ 34510 -38633 -80137 -55627 14385 71912 70038 10230 -57852 -78117 -34051 37985 78856
1476G8856k3949o8938n7115J924N9534O7932K0160m4179p1975m0194K4834O9117
$$ 78856 54907 -14031 -71146 -69222 -9688 58244 78404 34225 -37750 -77944 -53110 16007
1488A6007N6292l068n9439o6811j9165M4288P0667L9261k4647o8056n5360K547
$$ 16007 72299 69231 9792 -57019 -76184 -31896 38771 78032 53385 -14671 -70031 -67484
1500f7484N8661O6279J9136m3717p0570l9179K4686O7720N5234l221n8712o5710
$$ -67484 -8823 57456 76592 32875 -37695 -76874 -52188 15532 70766 67545 8833 -56877
1512e6877j8325M3742O9533L8142k4587o6671n4178K736N7587O4922J8852m2679
$$ -56877 -75202 -31460 38073 76215 51628 -15043 -69221 -66485 -8898 56024 74876 32197
1524C2197o9109l8741K3894O6491N4356k641n7185o4650j8640M2386O8605L8268
$$ 32197 -36912 -75653 -51759 14732 69088 66447 9262 -55388 -74028 -31642 36963 75231
1536G5231k3594o5759n3679K648N6429O3855J8766m1842o7725l8141K3113O5096
$$ 75231 51637 -14122 -67801 -65153 -8724 55131 73897 32055 -35670 -73811 -50698 14398
1548A4398N3442k139n5933o3522j8968M1193O7241L8178k2602o4480n3231J793
$$ 14398 67840 65701 9768 -53754 -72722 -31529 35712 73890 51288 -13192 -66423 -64630
1560f4630N5294O2933J9094m0434o6810l7867K2019O3770N2655j295n4615o2615
$$ -64630 -9336 53597 72691 32257 -34553 -72420 -50401 13369 66024 64729 10114 -52501
1572e2501j9042M0190O6002L7670k1821o3347n2312J663N4010O2041J8750l9693
$$ -52501 -71543 -31353 34649 72319 50498 -12849 -65161 -63498 -9488 52553 71303 31610
1584C1610o5608l7290K1673O2623N1972j678n3441o1314j8878L9244O4795L7223
$$ 31610 -33998 -71288 -49615 13008 64980 63302 9861 -51453 -70331 -31087 33708 70931
1596G0931k1234o1865n1823J028N2934O1102J8980l8985o4534l6996K1094O1546
$$ 70931 49697 -12168 -63991 -62963 -10029 51073 70053 31068 -33466 -70462 -49368 12178
1608A2178N0994j413n2693o0440j8396L8545O3785L6297k0974o1084n0704J470
$$ 12178 63172 61759 9066 -51374 -69770 -31225 32560 68857 47883 -13201 -63905 -62435
1620f2435N2036N9914J8398l8220o3136l6340K0434O0485N0425q77n1377n9646
$$ -62435 -10399 49515 67913 29693 -33443 -69783 -49349 11136 61561 60684 9307 -50339
1632e0339j8478L7584O2615L6509j9847n9844n0353Q48N0749N9228J8911l6763
$$ -50339 -68817 -31233 31382 67891 48044 -11800 -62153 -61305 -10556 48672 67583 30820
1644C0820o2120l6294J9465N9217N0150j66n0228n8752j9023L6603O1660L6357
$$ 30820 -31300 -67594 -48129 11088 61238 61072 10844 -47908 -66931 -30328 31332 67689
1656F7689j9261n8605m9729J26M9737N8412J8920l6339o1374l5729J9027N8084
$$ 67689 48428 -10177 -59906 -59780 -10043 48369 67289 30950 -30424 -66153 -47126 10958
1668A0958M9129j40m9308n7824j8668L5606O0435L5704j8618n7640m9213K09M8783
$$ 10958 60087 59947 10639 -47185 -65853 -30247 30188 65892 47274 -10366 -59579 -59370 -10587
1681a0587N7419J8710l5689o0280l5263J8888N7285M8234l10m8646n6674j8207
$$ -10587 46832 65542 29853 -30427 -65690 -46802 10483 58717 58407 9761 -46913 -65120
1693f5120L5204N9634L4799j8541n6640m8070L51M8378N6373J8008l5190n9321
$$ -65120 -29916 29718 64517 45976 -10664 -58734 -58383 -10005 46368 64376 29186 -30135
1705c0135l4365J8922N6326M7356n82m7923n5600j7568L5027N8544L4047j8852
$$ -30135 -64500 -45578 10748 58104 57522 9599 -46001 -63569 -28542 30002 64049 45197
1717D5197n5809m6732P04M7634N4973J7192l4681n8077l3561J8588N5451M6406
$$ 45197 -10612 -57344 -56640 -9006 45967 63159 28478 -29599 -63160 -44572 10879 57285
1729E7285q59m7566n4503j6783L4509N7469L3138j8773n4821m5778P89M6879N4072
$$ 57285 56426 8860 -45643 -62426 -27917 29552 62690 43917 -10904 -56682 -55893 -9014 45058
1742D5058J6791l4369n6856l2832J8526N4412M5438r77m6273n3585j6642L3741
$$ 45058 61849 27480 -29376 -62208 -43682 10730 56168 55191 8918 -44667 -61309 -27568
1754b7568N6492L2659j7948n3752m5276M70M5999N3281J6931l3509n6036l2309
$$ -27568 28924 61583 43635 -10117 -55393 -54923 -8924 44357 61288 27779 -28257 -60566
1766f0566J7767N3286M4789o00m5513n2632j6699L3338N5352L2061j7739n3103
$$ -60566 -42799 10487 55276 54676 9163 -43469 -60168 -26830 28522 60583 42844 -10259
1778a0259m4378P28M5363N2217J6014l3329n5157l1432J7909N2683M3637j246
$$ -10259 -54637 -53909 -8546 43671 59685 26356 -28801 -60233 -42324 10359 53996 52750
1790E2750m4910n1400j6083L2947N4365L1178j7832n1836m3313R79M4431N1130
$$ 52750 7840 -43560 -59643 -26696 27669 58847 41015 -10821 -54134 -53155 -8724 42406
1802D2406J6055l2626n4176l0895J7758N1822M3018j188m4277n0727j5275L2564
$$ 42406 58461 25835 -28341 -59236 -41478 10344 53362 52174 7897 -42830 -58105 -25541
1814b5541N3214L0602j7461n0970m2496J019M3707N0332J5570l2017n2999l0549
$$ -25541 27673 58275 40814 -10156 -52652 -51633 -7926 42406 57976 25959 -27040 -57589
1826e7589J7300N0919M2315r86m3668m9867j5282L2023N2382L0154j7462n0239
$$ -57589 -40289 10630 52945 51959 8291 -41576 -56858 -24835 27547 57701 40239 -10000
1838a0000m1608J001M2957M9191J5206l1694n2216k9793J7032M9815M1470j102
$$ -10000 -51608 -50607 -7650 41541 56747 25053 -27163 -56956 -39924 9891 51361 50259
1850E0259m2708m9210j4990L1369N1708K9575j6937m9610m1037J060M2351M8495
$$ 50259 7551 -41659 -56649 -25280 26428 56003 39066 -10544 -51581 -50521 -8170 40325
1862D0325J4779l1021n1262k9144J6783M9072M0780j116m2004m8310j4689L1272
$$ 40325 55104 24083 -27179 -56323 -39540 9532 50312 49196 7192 -41118 -55807 -24535
1874b4535N0921K8879j6931m8669m0164J326M1741M7503J4508l0534n0378k8702
$$ -24535 26386 55265 38334 -10335 -50499 -49173 -7432 40071 54579 24045 -26333 -55035
1886e5035J6887M7957M0023j015m1024m7371j4517L0164M9707K8811j6129m7778
$$ -55035 -38148 9809 49832 48817 7793 -39578 -54095 -23931 25776 54587 38458 -9320
1898i320l9824P55M0694M6858J4746k9591m9488k8666J5793M7017L9813k72m0264
$$ -9320 -49144 -48389 -7695 39163 53909 24318 -25170 -53836 -38043 8974 48787 48515 8251
1911H251m6813j4890K9328M9224K8582j5642m6574l9294R9L9783M6207J4901k8487
$$ 8251 -38562 -53452 -24124 25100 53682 38040 -8534 -47828 -47729 -7946 38261 53162 24675
1924B4675m8544k8653J4944M5915L9558M18l9222m6224j5474K8409M8513K8662
$$ 24675 -23869 -52522 -37578 8337 47895 48313 9091 -37133 -52607 -24198 24315 52977
1936E2977j4927m5764l8866l07L8446M5482J5210k7685m7566k8576J4101M5159
$$ 52977 38050 -7714 -46580 -46887 -8441 37041 52251 24566 -23000 -51576 -37475 7684
1948G684L8762Q74l8308m5569j5225K7448M7580K8398j4479m4975l8502k57L7983
$$ 7684 46446 47320 9012 -36557 -51782 -24334 23246 51644 37165 -7810 -46312 -46569 -8586
1961h586M4696J4839k7265m6744k7849J3872M4161L8151O97l7291m4705j5171
$$ -8586 36110 50949 23684 -23060 -50909 -37037 7124 45275 45972 8681 -36024 -51195
1973e1195K7078M6803K7818j3940m4119l7923j25L7341M4016J4498k6891m5871
$$ -51195 -24117 22686 50504 36564 -7555 -45478 -45603 -8262 35754 50252 23361 -22510
1985b2510k7247J3762M3414L7384N91l6594m3779j4758K6488M5961K7260j3731
$$ -22510 -49757 -35995 7419 44803 45394 8800 -34979 -49737 -23249 22712 49972 36241
1997C6241m3346l7200k82L6600M3259J4281k6265m5157k6775J3298M2562L6934
$$ 36241 -7105 -44305 -44587 -7987 35272 49553 23288 -21869 -48644 -35346 7216 44150
2009D4150O19l6024m2983j4725K5823M4859K7016j3248m2296l6482r19L5623M2369
$$ 44150 44769 8745 -34238 -48963 -23140 21719 48735 35487 -6809 -43291 -44210 -8587 33782
2022C3782J4423k5267m4331k6830J2903M1725L6216J233l5210m2470j4793K5404
$$ 33782 48205 22938 -21393 -48223 -35320 6405 42621 43854 8644 -33826 -48619 -23215
2034b3215M4295K6642j2938m1675l5977o40L4875M1682J4167k4820m3217k6360
$$ -23215 21080 47722 34784 -6891 -42868 -43508 -8633 33049 47216 22396 -20821 -47181
2046d7181J2282M0740L5777J546l4298m1894j4853K4664M3597K6487j2591m1065
$$ -47181 -34899 5841 41618 43164 8866 -33028 -47881 -23217 20380 46867 34276 -6789
2058f789l5467n32L4473M0810J3877k4513m2201k5621J1979L9818L4851J634l3480
$$ -6789 -42256 -42788 -8315 32495 46372 21859 -20342 -45963 -33984 5834 40685 42319 8839
2071H839m0980j4783K4208M2964K6127j2226m0580l5050m15L4195M0271J3287
$$ 8839 -32141 -46924 -22716 20248 46375 34149 -6431 -41481 -41896 -7701 32570 45857
2083D5857k4212m1628k4910J2088L9041L4071J194l2595m0045j4210K3374M2011
$$ 45857 21645 -19983 -44893 -32805 6236 40307 41501 8906 -31139 -45349 -21975 20036
2095B0036K5704j2021l9890l4499n97L3841L9755J2975k4412m1033k4247J2244
$$ 20036 45740 33719 -6171 -40670 -41267 -7426 32329 45304 20892 -20141 -44388 -32144
2107c2144L8507L2993J060l2343l8963j3800K3196M0943K5185j1916l9157l3760
$$ -32144 6363 39356 40416 8073 -30890 -44690 -21494 19449 44634 32718 -6439 -40199
2119d0199m49L3067L9162J2845k3925m0485k3913J2197L8017L2829O03l2058l8260
$$ -40199 -40648 -7581 31581 44426 20501 -19984 -43897 -31700 6317 39146 39749 7691 -30569
2132c0569j3406K2992M0317K4561j1776l8323l3096m45L2497L8296J2621k3263
$$ -30569 -43975 -20983 19334 43895 32119 -6204 -39300 -39745 -7248 31048 43669 20406
2144B0406l9852k3504J1837L7422L2442P17l1780l7796j3004K2789L9764K3930
$$ 20406 -19446 -42950 -31113 6309 38751 39468 7688 -30108 -43112 -20323 19441 43371
2156D3371j2184l7444l2366r0L1864L7388J2048k2903l9023k2961J1699L6609
$$ 43371 31187 -6257 -38623 -38713 -6849 30539 42587 19684 -19339 -42300 -30601 6008
2168F008L1774O21l1202l7454j2670K2772L9432K3320j2321l7409l1473M44L1935
$$ 6008 37782 38403 7201 -30253 -42923 -20151 19281 42601 30280 -7129 -38602 -38158 -6223
2181f223L6375J1205k2931l7874k1914J1671L5682L0909M94l0257l6465j2941
$$ -6223 30152 41357 18426 -19448 -41362 -29691 5991 36900 37394 7137 -29328 -42269
2193d2269K2256L8812K3297j1872l7248l1153L78L1626L6209J0795k2799l7210
$$ -42269 -20013 18799 42096 30224 -7024 -38177 -37799 -6173 30036 40831 18032 -19178
2205a9178k1313J1618L4902K9790O22k9198l5693j2815K1044L8092K3318j1377
$$ -19178 -40491 -28873 6029 35819 36441 7243 -28450 -41265 -20221 17871 41189 29812
2217B9812l6431l1354K66L1151L6159J0660k2932l6661k1000J1886L4271K9080
$$ 29812 -6619 -37973 -37707 -6556 29603 40263 17331 -19330 -40330 -28444 5827 34907
2229C4907L14k8680l4426j2335K0479L6866K2989j0502l5586l0904j66L0793L5884
$$ 34907 35221 6541 -27885 -40220 -19741 17125 40114 29612 -5974 -36878 -37044 -6251 29633
2242B9633J0827k2827l6702k0345J2268L4403K8323n13k8623l3661j1260K0449
$$ 29633 40460 17633 -19069 -39414 -27146 7257 35580 35067 6444 -27217 -38477 -18028
2254a8028L5759K2144j0648l4482l0326m5K9938L5125J0673k2219l6484k0235
$$ -18028 17731 39875 29227 -5255 -35581 -35626 -5688 29437 40110 17891 -18593 -38828
2266c8828J2239L4167K7960q89k8748l2933j0966K0539L5194K1101j0774l3997
$$ -38828 -26589 7578 35538 34649 5901 -27032 -37998 -17459 17735 38836 28062 -5935
2278e935k9272P9K9207L4090J0547k1462l5548k0384J1567L3421K7853k95k7927
$$ -5935 -35207 -35128 -5921 28169 38716 17254 -18294 -38678 -27111 6310 34163 33868 5941
2291E941l3041j0945K0129L4867K1126j0493l3606k8535p2K8710L3298J0567k0734
$$ 5941 -27100 -38045 -17916 16951 38077 27584 -6022 -34557 -34629 -5919 27379 37946 17212
2304A7212l4644j9962J0897L2570K7513L18k7357l2564j1174J9377L4897K1133
$$ 17212 -17432 -37394 -26497 6073 33586 33904 6547 -26017 -37191 -17814 17083 38216
2316C8216j0209l3447k8757M47K8702L2698J0080k0929l3881j9214J0953L1384
$$ 38216 28007 -5440 -34197 -33750 -5048 27650 37730 16801 -17080 -36294 -25341 6043
2328F043K6658L48k6158l1877j1647J8470L3914K1580r473l2886k9024l36K8521
$$ 6043 32701 33049 6891 -24986 -36633 -18163 15751 37331 27858 -5028 -34052 -34388 -5867
2341e867L3047R954k1100l3863j8624J1232L0991K5657L08k5440l0521j1745J7451
$$ -5867 27180 37134 16034 -17829 -36453 -25221 5770 31427 31735 6295 -24226 -35971 -18520
2354a8520L2926K1718q055l1989k9248j519K8009L3558J0736k0644l4062j9121
$$ -18520 14406 36124 28069 -3920 -33168 -34687 -6678 26880 37616 16972 -17090 -36211
2366c6211J1203L1094K5467j02k5067k9927j0995J6765L1792K1034p379l0641
$$ -36211 -25008 6086 31553 31451 6384 -23543 -34538 -17773 14019 35053 27674 -2967
2378b967k8978k266K6929L3455J1175k0296l4185j9319J1230L1280K5349p65k5340
$$ -2967 -31945 -34211 -7282 26173 37348 17052 -17133 -36452 -25222 6058 31407 30642 5302
2391E302k9379j0132J7117L0744J9928p416k9789k7824k373K5710L2507J1821
$$ 5302 -24077 -34209 -17092 13652 33580 26164 -3625 -31449 -33822 -8112 24395 36216
2403C6216j9218l3725j9683J0606L1224K5892n76k5553k9534r653J7558L0616
$$ 36216 16998 -16727 -36410 -25804 5420 31312 30736 5183 -24351 -34004 -16446 14170
2415A4170J9346p974k9157k6845j832K5234L1353J1336j8422l2704j9391J0029
$$ 14170 33516 25542 -3615 -30460 -32292 -7058 24295 35631 17209 -15495 -34886 -24857
2427b4857L0628K5470r9k5347k9358j0009J7834L0738J8965q626k9231k6150j285
$$ -24857 5771 31241 31142 5795 -23563 -33572 -15738 15000 33965 25339 -3892 -30042 -31327
2440c1327K5162L0486J0533j8451l1632j8737R581K9391K4891J92k4153k9101
$$ -31327 -6165 24321 34854 16403 -15229 -33966 -24385 5006 29897 30089 5936 -23165
2452b3165j0333J6717L0449J9427p789k9371k6582j134K5135L0350J0261j8597
$$ -23165 -33498 -16781 13668 33095 25306 -4065 -30647 -31781 -6646 23704 33965 15368
2464A5368l1347j7720R922K8749K3948k8k3279k7821j0008J5615K9682J9397o936
$$ 15368 -15979 -33699 -23777 4972 28920 28892 5613 -22208 -32216 -16601 13081 32478 25542
2477B5542k8663k6497k032K5026L0895J0374j8605l1610j7591J0336K8934K3170
$$ 25542 -3121 -29618 -31650 -6624 24271 34645 16040 -15570 -33161 -22825 6109 29279
2489B9279n47k3185k6523r716J5099K7880J8916n773k6863k6509l441K3484L0996
$$ 29279 28732 5547 -20976 -30692 -15593 12287 31203 25430 -1433 -27942 -31383 -7899 23097
2502B3097J1819j8084l1768j8618J0178K9251K3325j151k3315k6323q600J5102
$$ 23097 34916 16832 -14936 -33554 -23376 5875 29200 28049 4734 -21589 -30189 -15087
2514a5087K6828J7850n556k5425k5708l826K2081L0244J2613j6752l1621j9335
$$ -15087 11741 29591 24035 -1390 -27098 -30924 -8843 21401 34014 17262 -14359 -33694
2526c3694R475K9562K3928r84k3872k6366q193J5922K6584J6831o281k4952k3919
$$ -33694 -24219 5343 29271 28287 4415 -21951 -30144 -14222 12362 29193 22912 -2040 -25959
2539b5959l408K0915K8790J2384j5371l0610j9554Q447K8898K4457l00k3937k7104
$$ -25959 -29367 -8452 20338 32722 17351 -13259 -32813 -24366 4532 28989 28689 4752 -22352
2552b2352q187J6377K7065J6343p206k5039k3057k303K0670K7423J1481j4733
$$ -22352 -30539 -14162 12903 29246 22040 -2999 -26056 -28359 -7689 19734 31215 16482
2564A6482k9205j8905P404K7492K4456N54k2893k7211r085J5822K7296J7090p156
$$ 16482 -12723 -31628 -24224 3268 27724 28278 5385 -21826 -30911 -15089 12207 29297 22141
2577B2141k5189k3138k249K1050K7160J0884j4690k8243j8239P246K6442K3583
$$ 22141 -3048 -26186 -28435 -7385 19775 30659 15969 -12274 -30513 -23267 3175 26758
2589B6758J343k1694k6367r821J4626K6982J7445o016k5099k3800k646K1094K7621
$$ 26758 28101 6407 -19960 -29781 -15155 11827 29272 23256 -1843 -25643 -28289 -7195 20426
2602B0426J0969j5349k8565j7513P938K6272K2519M14k1425k5184r214J4196K5704
$$ 20426 31395 16046 -12519 -30032 -22094 4178 26697 27111 5686 -19498 -28712 -14516 11188
2615A1188J7197n649k4305k3449l239K0614K7670J1246j5387k8911j7853Q523
$$ 11188 28385 22736 -1569 -25018 -28257 -7643 20027 31273 15886 -13025 -30878 -22355
2627b2355K7009K2215p02k1855k4457p824J4430K4602J5886n527k2961k2527l581
$$ -22355 4654 26869 26167 4312 -20145 -27969 -13539 11063 26949 21422 -1539 -24066 -27647
2640b7647J9481K7045J1847j4445k8929j8407Q150K7532K2890r66k2776k4849
$$ -27647 -8166 18879 30726 16281 -12648 -31055 -22905 4627 27517 26551 3775 -21074
2652b1074o718J5386K4415J4469o490k2134k1027k882J8258K5624J1805j3141
$$ -21074 -27792 -12406 12009 26478 19988 -2146 -23173 -26055 -7797 17827 29632 16491
2664A6491k8004j8882P117K7159K3370k52k2943k5385o875J6147K4866J4014p506
$$ 16491 -11513 -30395 -23278 3881 27251 26999 4056 -21329 -28204 -12057 12809 26823 19317
2677A9317k2419j9967j828J7993K4243J0985j2336k6176j8621N919K5521K3637
$$ 19317 -3102 -23069 -24897 -6904 17339 28324 15988 -10188 -28809 -22890 2631 26268
2689B6268J082k2172k5993q048J6116K5871J4302q150k2959j9640j150J8551K3518
$$ 26268 27350 5178 -20815 -28863 -12747 13124 27426 19276 -3683 -23323 -24473 -5922 17596
2702A7596R749j2498k5211j7164N649K4297K2661J583k0867k5497q755J5133K5641
$$ 17596 27345 14847 -10364 -27528 -21879 2418 25079 26662 5795 -19702 -28457 -13324 12317
2715A2317J5126p340k3479k0392r54J9095K3727R174j2985k4981j6322O004K3697
$$ 12317 27443 20103 -3376 -23768 -24722 -5627 18100 27274 14289 -10692 -27014 -21010 2687
2728B687K1442J554j9900k4262q841J3796K4781J5319o300k2643k0782j894J8876
$$ 2687 24129 25683 5783 -18479 -27320 -13524 11257 26576 20276 -2367 -23149 -25043 -6167
2741f167K4146R714j3141k5382j6275O525K3730K1059P68j9623k3552q080J3361
$$ -6167 17979 27693 14552 -10830 -27105 -20580 3150 24209 24977 5354 -18198 -26278 -12917
2754a2917K3645J4698n378k1582k0468k578J7631K4119J0637j2502k5568j7029
$$ -12917 10728 25426 20048 -1534 -22002 -24580 -6949 17170 27807 15305 -10263 -27292
2766b7292O206K4136K1580M94k0359k3458p376J3814K3090J3908n891k0746j9292
$$ -27292 -21086 3050 24630 25124 4765 -18693 -26069 -12255 10835 24743 18852 -1894 -21186
2779b1186k580J6502K2893J0891j0929k4841j7668M967K3794K2407J448k0447
$$ -21186 -23766 -7264 15629 26520 15591 -9250 -26918 -21951 1843 24250 25698 5251
2791E251k4239p737J4519K3654J3417o745k0673j8262j800J5979K1624J0348j0155
$$ 5251 -18988 -26725 -12206 11448 24865 18120 -2553 -20815 -22615 -6636 14988 25336 15181
2804A5181k3372j7432L830K2704K2445K549j9750k4598q758J4373K4364J3876
$$ 15181 -8191 -25623 -21793 911 23356 25905 6155 -18443 -27201 -12828 11536 25412
2816B5412p232k1452j8114r09J6558K0963R178j0556k2150j6244L574K1486K1549
$$ 25412 18180 -3272 -21386 -22295 -5737 15226 24404 13848 -8302 -24546 -20972 514 22063
2829B2063L110j8500k4431r272J3527K4478J4747p048k2116j8576m27J7220K1228
$$ 22063 25173 6673 -17758 -27030 -13503 10975 25722 18674 -3442 -22018 -22445 -5225 16003
2842A6003Q361j1377k1919j4979M308K0564K0539K834j7504k3216r630J2522K3692
$$ 16003 24364 12987 -8932 -23911 -19603 961 21500 24334 6830 -16386 -26016 -13494 10198
2855A0198J5294o151k1807j9187j330J7648K1726Q386j1622k2103j4998M715K0695
$$ 10198 25492 19341 -2466 -21653 -22983 -5335 16391 24777 13155 -8948 -23946 -19231 1464
2868A464J9667K473j7037k2315r309J1649K2533J5078m934k0642j9314k430J6611
$$ 1464 21131 23604 6567 -15748 -25057 -13408 9125 24203 19269 -1373 -20687 -23117 -6506
2881f506K2155R135j1106k2471j5505M643K1034J9786K047j7308k1983q565J1725
$$ -6506 15649 24784 13678 -8793 -24298 -19655 1379 21165 23212 5904 -16079 -24644 -12919
2894a2919K1892J4348n002j9661j8740k545J5657K1491R828j0437k2006j6025
$$ -12919 8973 23321 18319 -1342 -20082 -22627 -6970 14521 24349 13912 -8094 -24119
2906b4119M101K0984K0309K262j7424k2310q441J2337K2046J3800n630j9653j7744
$$ -24119 -20018 966 21275 23537 6113 -16197 -24638 -12301 9745 23545 17915 -1738 -19482
2919a9482j890J5313K0291R359r750k1231j5674L422K0249K0248K834j7329k2677
$$ -19482 -21372 -6059 14232 23591 13841 -7390 -23064 -19642 607 20855 23689 6360 -16317
2932a6317q640J2558K2635J3444o342k0099j7393p84J5581J9677Q059r800k0406
$$ -16317 -24957 -12399 10236 23680 17338 -2761 -20154 -20938 -5357 14320 22379 12579 -7827
2945g827j4622L361J9146J9639L351j6490k2465r218J1840K2693J4259o236k0400
$$ -7827 -22449 -19088 58 19697 23048 6558 -15907 -25125 -13285 9408 23667 17431 -2969
2958b969j7556p54J6201J9580P704j0323j9914j3735L596J8596J8632L065j5368
$$ -2969 -20525 -21279 -5078 14502 22206 11883 -8031 -21766 -18170 426 19058 22123 6755
2971F755k1505r417J0898K2290J4361n263k0248j8260r79J6429K0027P566j0888
$$ 6755 -14750 -24167 -13269 9021 23382 18119 -2129 -20389 -21368 -4939 15088 22654 11766
2984A1766k0219j3321M298J8628J7618K501j5124k0673q869J0430K1178J4386
$$ 11766 -8453 -21774 -17476 1152 18770 21271 6147 -14526 -23395 -12965 8213 22599
2996B2599m622j9581j8194j902J6071K0324P911j0730k0321j3552M392J8902J7469
$$ 22599 17977 -1604 -19798 -21700 -5629 14695 22606 11876 -8445 -21997 -17605 1297 18766
3009A8766K133j5092k0112q413J0252K0598J3615m227j8844j7684j915J5114K0057
$$ 18766 20899 5807 -14305 -22718 -12466 8132 21747 17520 -1324 -19008 -20923 -5809 14248
3022A4248Q447j0213k0406j3736M128J9008J7907J969j5484k0180p846J0540K0218
$$ 14248 22695 12482 -7924 -21660 -17532 1476 19383 21352 5868 -14312 -22158 -11618 8600
3035H600J3183m602j8455j7137j895J4920J9326Q112r701j9840j3749L703J8510
$$ 8600 21783 17181 -1274 -18411 -20306 -5386 13940 22052 12351 -7489 -21238 -17535 975
3048I75J8015K305j5550k0238q177J0845K0370J3057n043j8529j6682j407J4750
$$ 975 18990 21295 5745 -14493 -22670 -11825 8545 21602 16559 -1970 -18652 -20059 -5309
3061e309J8718P803r431j9263j3406L266J7930J7660K849j4633k0333q522J0410
$$ -5309 13409 21212 11781 -7482 -20888 -17622 308 17968 20817 6184 -14149 -22671 -12261
3074a2261K0505J3422m880j8677j6662j366J5048J8529P542r694j8806j2975L678
$$ -12261 8244 21666 16786 -1891 -18553 -19919 -4871 13658 21200 11506 -7300 -20275 -16597
3087a6597J7217J7223K795j4137j9615q767R736K0081J3675m314j8537j7090j462
$$ -16597 620 17843 20638 6501 -13114 -21881 -12145 7936 21611 17297 -1240 -18330 -19792
3100a9792J4854J8846P389r794j8778j2809L803J7182J6509K592j3710j9069q579
$$ -19792 -4938 13908 21297 11503 -7275 -20084 -16281 901 17410 20002 6292 -12777 -21356
3113b1356R056J9697J3398l717j8045j7092k011J4682J8835P620r623j9024j2615
$$ -21356 -12300 7397 20795 17078 -967 -18059 -20070 -5388 13447 21067 11444 -7580 -20195
3126b0195L900J7183J6310K339j3854j8428q350R223J8916J3108l363j7510j6971
$$ -20195 -16295 888 17198 19537 5683 -12745 -21095 -11872 7044 20152 16789 -721 -17692
3139a7692k149J4202J8705P937r499j8696j2830L808J7171J6310K276j3892j8318
$$ -17692 -19841 -5639 13066 21003 11504 -7192 -20022 -16214 957 17267 19543 5651 -12667
3152a2667q057R315J8606J2705l726j6877j6418k189J3636J8250Q099r077j8628
$$ -12667 -20724 -11409 7197 19902 16176 -701 -17119 -19308 -5672 12578 20677 11600 -7028
3165g028j2815L671J6917J6358K144j3799j8407p758R559J8417J2437m002j7037
$$ -7028 -19843 -16172 745 17103 19247 5448 -12959 -20717 -11158 7259 19696 15694 -1343
3178a343j5928j684J3876J7656P446r236j8117j2218L808J6699J6019K042j3724
$$ -1343 -17271 -18955 -5079 12577 20023 10787 -7330 -19548 -15740 959 16978 19020 5296
3191E296j8196p413R584J8589J2013m261j6947j5637j342J3842J7590O738r137
$$ 5296 -12900 -20313 -10729 7860 19873 15612 -1335 -16972 -18314 -4472 13118 19856 10719
3204A0719j7796j1832L957J6396J5476J875j3391j7989p241R211J8306J1911m147
$$ 10719 -7077 -18909 -14952 1444 16920 18795 5404 -12585 -19826 -10615 7691 19602 15455
3217A5455j6918j5527j483J4054J7213O801r278j7761j1435L928J6220J5261J472
$$ 15455 -1463 -16990 -18473 -4419 12794 19595 10317 -7444 -18879 -14951 1269 16530 18002
3230A8002j3215j7329p229R202J7711J1939m070j6690j5313j350J3769J7476O443
$$ 18002 4787 -12542 -19771 -10569 7142 19081 15011 -1679 -16992 -18342 -4573 12903 19346
3243A9346r597j7418j1310M313J6066J5045J170j3147j7002o807Q961J7584J1565
$$ 19346 9749 -7669 -18979 -14666 1400 16445 17615 4468 -12534 -19341 -10380 7204 18769
3256A8769l938j6313j5185j280J3440J7459O347r316j7453j1141M312J6028J4607
$$ 18769 14831 -1482 -16667 -17947 -4507 12952 19299 9983 -7470 -18611 -14299 1729 16336
3269A6336J350j3230j6757o547Q703J7286J1392l935j5994j4818j519J3067J6931
$$ 16336 17686 4456 -12301 -18848 -10145 7141 18533 14598 -1396 -16214 -17733 -4666 12265
3282A2265O641r169j7300j1040M018J6109J4596J107j3034j6509o740R227J6891
$$ 12265 18906 9737 -7563 -18603 -14585 1524 16120 17227 4193 -12316 -19056 -9829 7062
3295G062J1080m142j5607j4654j186J2957J6512O498q989j6896j1077M219J5642
$$ 7062 18142 14000 -1607 -16261 -17447 -4490 12022 18520 9531 -7365 -18442 -14223 1419
3308A419J4302J284j2944j6366o346R036J6825J0858m104j5643j4259j107J2874
$$ 1419 15721 17005 4061 -12305 -18651 -9615 7210 18068 13964 -1679 -15938 -17045 -4171
3321d171J6196O364q891j6578j0818L908J5488J4264J147j2746j6179o507Q860
$$ -4171 12025 18389 9498 -7080 -17898 -13990 1498 15762 16909 4163 -12016 -18523 -9663
3334i663J6649J0841m037j5386j4097j259J2611J6199O240q760j6696j0440L966
$$ -9663 6986 17827 13790 -1596 -15693 -16952 -4341 11858 18098 9338 -7358 -17798 -13832
3347a3832J5300J3866J319j2530j6066o173Q676J6437J0617l901j5327j3963j173
$$ -13832 1468 15334 16653 4123 -11943 -18116 -9440 6997 17614 13713 -1614 -15577 -16750
3360a6750J2863J5801O033q518j6429j0405L967J5037J3906J213j2400j5756o334
$$ -16750 -3887 11914 17947 9429 -7000 -17405 -13438 1599 15505 16718 4318 -11438 -17772
3373a7772Q527J6276J0506l850j4897j3924j175J2330J5793O140q639j6136j0347
$$ -17772 -9245 7031 17537 13687 -1210 -15134 -16309 -3979 11814 17954 9315 -6821 -17168
3386a7168L939J5000J3581J075j2226j5497o117Q387J5867J0406l904j4815j3576
$$ -17168 -13229 1771 15352 16427 4201 -11296 -17413 -9026 6841 17247 13343 -1472 -15048
3399a5048j135J2319J5525N963q734j5933j0166M017J4763J3500R93j2305j5303
$$ -15048 -16183 -3864 11661 17624 8890 -7043 -17209 -13192 1571 15071 16064 3759 -11544
3412a1544n762Q426J5767R997l670j4826j3226j205J2051J5328N943q448j5732
$$ -11544 -17306 -8880 6887 16884 13214 -1612 -14838 -16043 -3992 11336 17279 8831 -6901
3425f901r936L784J4612J3207J194j2109j5092n853Q272J5521J0084l754j4423
$$ -6901 -16837 -13053 1559 14766 15960 3851 -11241 -17094 -8822 6699 16783 13029 -1394
3438a394j3163j143J1840J5122N771q082j5593j0068L744J4422J3206J099j1928
$$ -1394 -14557 -15700 -3860 11262 17033 8951 -6642 -16710 -12966 1456 14662 15761 3833
3451C833j5029n756Q081J5446R853l690j4139j3102j037J1432J4979N851q165
$$ 3833 -11196 -16952 -8871 6575 16428 12738 -1401 -14503 -15540 -4108 10871 16722 8557
3464H557j5158r884L593J4133J3024J125j1559j4844n741P932J5185R771l425
$$ 8557 -6601 -16485 -12892 1241 14265 15390 3831 -11013 -16754 -8822 6363 16134 12709
3477A2709j4011j2897j203J1345J4804N830p828j4948j0043L490J3984J2781J309
$$ 12709 -1302 -14199 -15402 -4057 10747 16577 8749 -6199 -16242 -12752 1232 14013 15322
3490A5322j1382j4602n739P694J4953R808l427j3869j2644j259J1290J4367N929
$$ 15322 3940 -10662 -16401 -8707 6246 16054 12627 -1242 -13886 -15145 -3855 10512 16441
3503A6441p652j5016r634L302J3577J2774J351j1091j4635n708P527J4710R788
$$ 16441 8789 -6227 -15861 -12559 1018 13792 15143 4052 -10583 -16291 -8764 5946 15734
3516A5734l377j3458j2624j364J1250J4173N825p630j4636r687L252J3576J2487
$$ 15734 12357 -1101 -13725 -15089 -3839 10334 16159 8529 -6107 -15794 -12542 1034 13521
3529A3521J324j0952j4152n844P571J4209R842l259j3290j2444j345J0766J4196
$$ 13521 14845 3893 -10259 -16103 -8532 5677 15519 12260 -1030 -13474 -14819 -4053 10143
3542A0143N681p301j4270r699L270J3239J2461J322j0922j4051n616P310J4384
$$ 10143 15824 8523 -5747 -15446 -12176 1063 13524 14846 3924 -10127 -15743 -8433 5951
$$ [...]
8191B46
##END NTUPLES=NMR FID
##END=
