##TITLE=1H_ANY-168-1
 CDCl3,8 sc, 
 11.4.2019
##JCAMPDX= 6.0         $$ Bruker NMR JCAMP-DX V2.0
##DATA TYPE= NMR FID
##DATA CLASS= NTUPLES
##ORIGIN= UXNMR, Bruker Analytische Messtechnik GmbH
##OWNER= root
$$ XWIN-NMR		Version 3.5
$$ Thu Apr 11 15:39:15 2019 Russian Standard Time (UT+4h)  she@DPX200
##.OBSERVE FREQUENCY= 200.1315
##.OBSERVE NUCLEUS= ^1H
##.DELAY= (6, 6)
##.ACQUISITION MODE= SIMULTANEOUS
##.ACQUISITION SCHEME= undefined
##.AVERAGES= 8
##.DIGITISER RES= 18
##SPECTROMETER/DATA SYSTEM= spect
##.PULSE SEQUENCE= zg30
##.SOLVENT NAME= CDCl3
##.SHIFT REFERENCE= (INTERNAL, CDCl3, 0, 15.7039)
##AUDIT TRAIL= $$ (NUMBER, WHEN, WHO, WHERE, WHAT)
$$ ##TITLE= Audit trail, XWIN-NMR		Version 3.5
$$ ##JCAMPDX= 5.01
$$ ##ORIGIN= Bruker BioSpin GmbH
$$ ##OWNER= she
$$ F:/spectra/data/she/nmr/H-F/1/audita.txt
$$ ##AUDIT TRAIL=  $$ (NUMBER, WHEN, WHO, WHERE, WHAT)
(   1,<2019-04-11 15:37:55.89 +0400>,<she>,<DPX200>,
      <created by zg, POWCHK disabled, PULCHK disabled
       configuration hash MD5:
       00 E9 B6 7A A2 85 ED C7 34 08 36 98 17 FE 4E 26
       data hash MD5: 16K
       3A 0F CD 11 4E C4 06 D5 B1 1C AA AD 6F C2 4E DA>)
$$ ##END=
$$ 
$$ hash MD5
$$ AC BD F4 CC 50 C5 32 91 26 04 BE 31 D9 2E 91 E6
##$RELAX= 
##$RELAX= 
##$RELAX= 
##$RELAX= 
##$RELAX= 
##$RELAX= 
$$ Bruker specific parameters
$$ --------------------------
##$DU= <F:/spectra>
##$EXPNO= 1
##$NAME= <H-F>
##$PROCNO= 1
##$TYPE= <nmr>
##$USER= <she>
##$AMP= (0..31)
100 100 100 100 100 100 100 100 100 100 100 100 100 100 100 100 100 100 
100 100 100 100 100 100 100 100 100 100 100 100 100 100 
##$AQSEQ= 0
##$AQ_mod= 1
##$AUNM= <au_zg>
##$AUTOPOS= <>
##$BF1= 200.13
##$BF2= 200.13
##$BF3= 200.13
##$BF4= 200.13
##$BF5= 200.13
##$BF6= 200.13
##$BF7= 200.13
##$BF8= 200.13
##$BYTORDA= 1
##$CFDGTYP= 0
##$CFRGTYP= 5
##$CHEMSTR= <none>
##$CNST= (0..31)
1 1 145 1 1 1 1 1 1 1 1 1 1 1 1 1 1 1 1 1 1 1 1 1 1 1 1 1 1 1 1 1 
##$CPDPRG= <>
##$CPDPRG1= <>
##$CPDPRG2= <>
##$CPDPRG3= <>
##$CPDPRG4= <mlev>
##$CPDPRG5= <mlev>
##$CPDPRG6= <mlev>
##$CPDPRG7= <mlev>
##$CPDPRG8= <mlev>
##$CPDPRGB= <>
##$CPDPRGT= <>
##$D= (0..31)
0 1.2 0 0 0 0 0 0 0 0 0 0.03 0 0 0 0 0 0 0 0 0 0 0 0 0 0 0 0 0 0 0 0 
##$DATE= 1554982675
##$DBL= (0..7)
120 120 120 120 120 120 120 120 
##$DBP= (0..7)
150 150 150 150 150 150 150 150 
##$DBP07= 0
##$DBPNAM0= <>
##$DBPNAM1= <>
##$DBPNAM2= <>
##$DBPNAM3= <>
##$DBPNAM4= <>
##$DBPNAM5= <>
##$DBPNAM6= <>
##$DBPNAM7= <>
##$DBPOAL= (0..7)
0.5 0.5 0.5 0.5 0.5 0.5 0.5 0.5 
##$DBPOFFS= (0..7)
0 0 0 0 0 0 0 0 
##$DE= 6
##$DECBNUC= <off>
##$DECIM= 24
##$DECNUC= <off>
##$DECSTAT= 4
##$DIGMOD= 1
##$DIGTYP= 9
##$DL= (0..7)
0 120 120 120 120 120 120 120 
##$DP= (0..7)
150 150 150 150 150 150 150 150 
##$DP07= 0
##$DPNAME0= <>
##$DPNAME1= <>
##$DPNAME2= <>
##$DPNAME3= <>
##$DPNAME4= <>
##$DPNAME5= <>
##$DPNAME6= <>
##$DPNAME7= <>
##$DPOAL= (0..7)
0.5 0.5 0.5 0.5 0.5 0.5 0.5 0.5 
##$DPOFFS= (0..7)
0 0 0 0 0 0 0 0 
##$DQDMODE= 0
##$DR= 18
##$DS= 0
##$DSLIST= <SSSSSSSSSSSSSSS>
##$DSPFIRM= 0
$$ [...]
##$SUBNAM2= <"">
##$SUBNAM3= <"">
##$SUBNAM4= <"">
##$SUBNAM5= <"">
##$SUBNAM6= <"">
##$SUBNAM7= <"">
##$SUBNAM8= <"">
##$SUBNAM9= <"">
##$SW= 24.9337058887773
##$SWIBOX= (0..15)
0 0 2 0 0 0 0 0 0 0 0 0 0 0 0 0 
##$SW_h= 4990.01996007984
##$TD= 16384
##$TD0= 1
##$TE= 0
##$TE2= 300
##$TE3= 300
##$TEG= 300
##$TL= (0..7)
0 120 120 120 120 120 120 120 
##$TP= (0..7)
150 150 150 150 150 150 150 150 
##$TP07= 0
##$TPNAME0= <>
##$TPNAME1= <>
##$TPNAME2= <>
##$TPNAME3= <>
##$TPNAME4= <>
##$TPNAME5= <>
##$TPNAME6= <>
##$TPNAME7= <>
##$TPOAL= (0..7)
0.5 0.5 0.5 0.5 0.5 0.5 0.5 0.5 
##$TPOFFS= (0..7)
0 0 0 0 0 0 0 0 
##$TUNHIN= 0
##$TUNHOUT= 0
##$TUNXOUT= 0
##$USERA1= <user>
##$USERA2= <user>
##$USERA3= <user>
##$USERA4= <user>
##$USERA5= <user>
##$V9= 5
##$VALIST= <valist>
##$VCLIST= <CCCCCCCCCCCCCCC>
##$VD= 0
##$VDLIST= <DDDDDDDDDDDDDDD>
##$VPLIST= <PPPPPPPPPPPPPPP>
##$VTLIST= <TTTTTTTTTTTTTTT>
##$WBST= 1024
##$WBSW= 4
##$XGAIN= (0..3)
0 0 0 0 
##$XL= 0
##$YL= 0
##$YMAX_a= 317552
##$YMIN_a= -590577
##$ZGOPTNS= <>
##$ZL1= 120
##$ZL2= 120
##$ZL3= 120
##$ZL4= 120
##$ABSF1= 10
##$ABSF2= 0
##$ABSG= 5
##$ABSL= 3
##$ALPHA= 0
##$AQORDER= 0
##$ASSFAC= 0
##$ASSFACI= 0
##$ASSFACX= 0
##$ASSWID= 0
##$AUNMP= <proc_1d>
##$AZFE= 0.1
##$AZFW= 0.1
##$BCFW= 1
##$BC_mod= 2
##$BYTORDP= 1
##$COROFFS= 0
##$CY= 11.3945322036743
##$DATMOD= 1
##$DC= 2
##$DFILT= <>
##$DTYPP= 0
##$F1P= 18.9103706918063
##$F2P= -1.10871071338519
##$FCOR= 0.5
##$FTSIZE= 0
##$FT_mod= 4
##$GAMMA= 1
##$GB= 0.15
##$INTBC= 1
##$INTSCL= 1
##$ISEN= 128
##$LB= 0.24
##$LEV0= 0
##$LPBIN= 0
##$MAXI= 10000
##$MC2= 0
##$MEAN= 0
##$ME_mod= 0
##$MI= 1.114404
##$NCOEF= 0
##$NC_proc= 0
##$NLEV= 6
##$NOISF1= 3.799351
##$NOISF2= 2.8
##$NSP= 1
##$NTH_PI= 0
##$NZP= 0
##$OFFSET= 15.70392
##$PC= 1
##$PHC0= -8850.056
##$PHC1= 10.60026
##$PH_mod= 1
##$PKNL= yes
##$PPARMOD= 0
##$PSCAL= 0
##$PSIGN= 0
##$REVERSE= no
##$SF= 200.130013532006
##$SI= 16384
##$SIGF1= 3
##$SIGF2= 2
##$SINO= 400
##$SIOLD= 16384
##$SREGLST= <1H.CDCl3>
##$SSB= 0
##$STSI= 0
##$STSR= 0
##$SW_p= 3612.71676300578
##$SYMM= 0
##$S_DEV= 0
##$TDeff= 0
##$TDoff= 0
##$TI= <>
##$TILT= no
##$TM1= 0
##$TM2= 0
##$TOPLEV= 0
##$USERP1= <user>
##$USERP2= <user>
##$USERP3= <user>
##$USERP4= <user>
##$USERP5= <user>
##$WDW= 1
##$XDIM= 8192
##$YMAX_p= 0
##$YMIN_p= 0
$$ End of Bruker specific parameters
$$ ---------------------------------
##NTUPLES= NMR FID
##VAR_NAME=  TIME,          FID/REAL,        FID/IMAG
##SYMBOL=    X,             R,               I
##VAR_TYPE=  INDEPENDENT,   DEPENDENT,       DEPENDENT
##VAR_FORM=  AFFN,          ASDF,            ASDF
##VAR_DIM=   8192,          8192,            8192
##UNITS=     SECONDS,       ARBITRARY UNITS, ARBITRARY UNITS
##FACTOR=    0.0002004,     1,               1
##FIRST=     0,             0,               0
##LAST=      1.6414764,     0,               0
##MIN=       0,             -590577,         0
##MAX=       1.6414764,     317552,          0
$$ Real data points
##PAGE= N=1
##DATA TABLE= (X++(R..R)), XYDATA
$$ [...]
2548a712M110R8l576L88J328r94J365R15m049j142M882R5l959m50K546j85J265
2565I25O57m089p27O173J244n760j567K893R60Q84j177m709O80O853j104o489
2581d353l12M538J072j339j454k610K055O393j532o377R55M838L47j733o87k452
2597b651J721L979k452n254K342N156j743k274J56o74R62M112q82n464J600L984
2613B618j014n57J239k274m0L743j435m426J084L511j378j619L95j635R56M693
2629C861r60n592K96M491Q79j505j097k682J664M773j394o521J657N705j339l680
2645a444j412m03L108L613l567o465L060P018r13l790l70JK132K623l348m766
2661d923M116N175l057m729P60K143K149R09l848m293M206M756k378l180R81P57
$$ plain form
2548 -1712 2398 2496 -1080 -692 636 -358 1007 1922 -2127 -3269 1613 1708 -2251 -2701 -155 -340 925
2565 925 1582 -2507 -3234 2939 4183 -1577 -3144 -251 709 1593 416 -4293 -3613 3240 2136 -4353
2581 -4353 -4665 -127 945 -394 -1848 -4458 -2403 3990 2458 -3919 -2964 1874 2221 488 -199 -2651
2597 -2651 -930 3049 597 -4657 -2315 2841 1098 -1176 -1020 -1694 -732 3380 2498 -2966 -1366 2618
2613 2618 1604 1047 2286 12 -28 3715 2280 -2146 -1062 2449 1071 -548 -153 -1788 -832 3861
2629 3861 2901 -2691 -2395 2096 2975 1470 373 -2309 -645 4128 2734 -3787 -2130 3575 2236 -1444
2645 -1444 -2856 -3259 -151 3462 -105 -6570 -3510 3508 2595 -1195 -1565 -1564 568 3191 -157 -4923
2661 -4923 -807 4368 1311 -3418 -2658 -515 1634 2543 -1305 -5598 -1392 3364 986 -2194 -1213 -456
2677d56R12K697k221l251K500L792l608k550J499P35o0J876k314l852K547M466
2693B712j923k693M02k57J094L540k608m675L244N611l054m183Q80J922J502J521
2709C035m172m452L973N702l251l977N96K084J642J453l571l332N384L970n327
2724b43m221L713L522q8j266l569k088N329L820m892m149K848K151k27M8j637
2740i49j338M105K414m275k597L815J449j566k80j109k159L485K958l795k380
2755b222K397P47r79J334j491k560L393L433m027k963K918K618K84p96l429k840
2771d183N252M146m710l844K234K146l0J99k038j444L762K128n195l242N531L454
2787D166j941k454k344R05M963J660o279l521M759K529k535r11n07m8K950N97
$$ plain form
2677 -456 456 3153 932 -2319 181 3973 365 -2185 -686 49 -11 1865 -449 -4301 -1754 2712
2693 2712 789 -1904 -1502 -1759 -665 2875 267 -4408 -1164 4447 1393 -2790 -1910 12 1514 3035
2709 3035 -1137 -5589 -1616 4086 835 -3142 -2546 -462 1180 2633 -938 -4270 1114 5084 -243
2724 -243 -4464 -751 2771 2683 1417 -2152 -4240 1089 4909 17 -4132 -1284 867 640 688 -949
2740 -949 -2287 1818 4232 -43 -2640 1175 2624 1058 778 -331 -2490 995 3953 158 -2222
2755 -2222 175 922 -57 1277 -214 -2774 619 4052 25 -2938 -20 2598 2882 2086 -1343 -4183
2771 -4183 1069 5215 505 -3339 -1105 1041 1011 1210 -828 -2272 1490 3618 -1577 -4819 712 4166
2787 4166 2225 -229 -2573 -1668 3295 4955 -1324 -4845 -86 2443 -92 -1003 -1510 -1558 1392 1989
2803A989n442m63N765J296l827j181K88M13L044J212m489j602L671Q0k217R70
2819d93Q30j884J578J067l717o52M939J077l329r91o10K63M230K080m800l274
2835c686L654J949j312r8r45j695K568J188l833q75N374J229m348j915R11J609
2851b25L665m87n935j259O384J486l756j033P73K41J203l36l913O68N478l47n136
2868b529l82K484J471J157r90l497p5M620J00l432J022J720j872K59N76j700M69
2885e99L652j435m333R26K489K97Q08L56l899r48M569J076k662L12L93j525J199
2902F76J758k905j041L325m4l711N4K321L68J047n51l803k76N577J65m472K6K186
2920G00l71N19Q9k664N97M574j944n167J067L399L13p37q54k444R81M297j071
$$ plain form
2803 1989 -3453 -3916 1849 3145 -682 -1863 -1575 -1162 1882 3094 -1395 -2997 674 754 -1463 -493
2819 -493 337 -1547 31 1098 -2619 -3271 1668 2745 -584 -1575 -2185 -1922 2308 4388 -412 -3686
2835 -3686 -32 1917 605 507 -438 -2133 435 1623 -2210 -3085 2289 3518 -830 -2745 -1834 -225
2851 -225 3440 2953 -2982 -4241 2143 3629 -127 -1160 -387 -146 1057 721 -3192 -2524 2954 2607 -2529
2868 -2529 -2911 -427 1044 2201 1211 -2286 -2361 2259 2359 -1073 -51 1669 -203 56 632 -1068 -599
2885 -599 3053 1618 -2715 -1789 700 997 1805 2161 -1738 -2686 1883 2959 297 609 1002 -523 676
2902 676 2434 -471 -1512 1813 1769 -1942 -1888 433 801 1848 1297 -2506 -2782 2795 2960 -1512 -1486 700
2920 700 329 848 937 -1727 -1130 3444 1500 -3667 -2600 799 1112 375 -479 -2923 -1942 2355 1284
2937A284l794J745K380j898j137J457j72L61J923k260l145K746K966k087j430
2952a061P04j538J25L461o18k705R90J803k086N85J944j655j024J905j05k788
2968b063J238J745j512J68M07k254K86L363n35l276P84K398r70n18J339j696L83
2985g13L145j516l813J714L553j258j751K15j349Q13L090j376l292J933K370k492
3001g27q68K217L00n98O60j623j443L472K115l242j362J604l26l50J813j130k000
3018a488J585J050k675M99L120j236k362J780P35j532J303J051k272k19J891j730
3034e00n24L027O5l457J70J647r59%K076j962j324K472n6k522K264J878k025j133
3052h63R94l04j73K461j247k967J437K576k007o46J952q13j620J134j40p56K543
$$ plain form
2937 1284 -2510 -765 1615 -283 -1420 37 -135 226 2149 -111 -3256 -510 2456 369 -1061
2952 -1061 -357 -1895 -1770 1691 1073 -1632 -642 1161 -925 -340 1604 -51 -1075 830 725 -2063
2968 -2063 -825 920 -592 -424 -17 -2271 -1985 1378 843 -2433 -1649 749 -221 -739 600 -1096 -713
2985 -713 2432 916 -2897 -1183 2370 1112 -639 -424 -1773 -960 2130 754 -2538 -605 1765 -727
3001 -727 -1595 622 922 324 984 -639 -2082 1390 3505 263 -1099 505 179 -171 1642 512 -1488
3018 -1488 97 1147 -1528 -1029 2091 855 -1507 273 1008 -524 779 1830 -442 -661 1230 -500
3034 -500 -1024 2003 2068 -1389 -1219 428 -531 -531 1545 -417 -1741 731 675 -1847 417 2295 270 -863
3052 -863 131 -173 -346 2115 868 -2099 -662 1914 -93 -739 1213 400 -1220 -86 -226 -982 1561
3069A561M23l577o61L593l3j431Q78l30k035J495R55k188M92K727k019k537K157
3086e30J331j375P29k76j852J004K367j406j555K296lk205N88J243q08L05J289
3103A142k233j310K625N79k052L41J620j573j90K209j158r75K597p65k461J179
3119d25K292j431q83J154q03j271K096J97j698P56J071k142K89K650r32k171J544
3136B93P59j614J175R52j961J24J920j666j706K321J340k476m45R36r36J224K072
3153B312k393k261L029J232j951o32J443p05L46J019j855j440L426Q50l159l51
3169a090K090p84l44J316j760q98K765K07k933Q88K404j330q08J300r63p04K353
3186A709j19k988Q30J990j482n42J857j475j281J924L43k237J032J464j353k97
$$ plain form
3069 1561 1984 -1593 -2254 1339 1306 -125 753 423 -1612 -117 838 -1350 -858 1869 -150 -2687 -530
3086 -530 801 -574 155 -121 -1973 -969 1398 -8 -1563 733 730 -1475 -887 356 -452 -147 1142
3103 1142 -1091 -2401 224 803 -1249 -908 712 -861 -1051 1158 0 -975 1622 857 -1604 -425
3119 -425 1867 436 -447 707 -96 -1367 729 926 -772 -16 1055 -1087 -798 1852 920 -1251 293
3136 293 1052 -562 613 1565 -396 -272 1648 -18 -1724 597 1937 -539 -984 -48 -984 240 2312
3153 2312 -81 -2342 687 1919 -32 -664 779 74 420 1439 -416 -1856 1570 2420 -739 -1090
3169 -1090 1000 216 -128 1188 -572 -1470 1295 1502 -1431 -543 1861 531 -277 1023 60 -644 1709
3186 1709 1590 -1398 -568 1422 -60 -602 1255 -220 -1501 423 766 -1471 -439 1025 -328 -625
3202f25J801r62j844K547Q50k458j83J278n04J58J047k057j316L191Q98l103l73
3219a655K416j55o17P05j972m11L311N55l996l99L017k32n19J0j096l43K951j44
3237A426l961M53L278o37j606M94j49K30K133o47l072O30L116r80j423Q59m67
3254c23n46J917n02k543R34K533j500j435J482k6j073K062O62k854J6K273k84
3271G93r16O82p40q49K298N58l188J93K476n30j230P43l41n57K508J6l606L53
3289a337L279N1j828J60m72J49K322p08l480O60L331p93k764Q86Q78k90J606j139
3307E11l045J951L063j309k663J133P56n46J504m61k523J224K510j883k330J671
3323d37J005q52N11n36j916J623K450j662j674J501L20q67J696J78k336R2K266
$$ plain form
3202 -625 1176 214 -1630 917 1767 -691 -874 404 -100 58 1105 -952 -2268 923 1821 -1282 -1655
3219 -1655 761 606 -11 694 -1278 -1689 1622 2177 -1819 -2218 799 567 48 58 -1038 -1381 1570 1426
3237 1426 -2535 -2082 1196 559 -1047 -553 -702 -472 1661 1014 -2058 -1428 1688 708 -715 144 -323
3254 -323 -869 1048 546 -1997 -1063 1470 -30 -1465 17 -9 -1082 980 1642 -1212 -1196 1077 793
3271 793 -123 559 -181 -1030 1268 1826 -1362 -1169 1307 777 -453 290 -51 -608 1900 1916 -1690 -1337
3289 -1337 1942 1993 165 325 -147 2 2324 1616 -1864 -1204 2127 1334 -1430 -544 334 44 1650 511
3307 511 -2534 -583 2480 1171 -1492 -359 397 -149 1355 894 -1629 -405 2105 222 -2108 -437
3323 -437 568 -284 227 -309 -2225 -602 1848 186 -1488 13 333 -534 1162 1340 -996 -904 1362
3340A362p19k008J256M06n10J069p96k226J138L305j407k469O93O99K97J649j275
3357D64k456J046L365j586l099J298J239m2o9o49k408J999L061k006k804J689
3373i58J477n41n5m59j735J804K655k291k327J834J468j020j96K4j202R58J879
3390A315j879j430J953J202k054O44P57j556N99K403j619j999K072M91j039M04
3406B64J99j916J267K145j807j612J452Q76r03J76J20j392J138K472k422j924
3422a867J845J353p19k66p94r83J761J904k668k025K494J304j263m20j69p20J985
3439G52J203k634j950K984J917j935r97J00k95J921J049k784j594K933M18j844
3455g56o8J266q40N56J134j930j216K907P92k333J57L77o63Q12J473j588j555
$$ plain form
3340 1362 643 -1365 -109 297 -213 856 60 -2166 -1028 2277 870 -1599 -906 -207 90 1739 464
3357 464 -1992 -946 2419 833 -2266 -968 271 229 160 -489 -2897 -898 2163 157 -2647 -958
3373 -958 519 -22 -77 -536 -2271 -467 2188 -103 -2430 -596 872 -148 -344 -320 -1522 -564 1315
3390 1315 -564 -1994 -41 1161 -893 -249 508 -1048 -449 1954 335 -1664 408 899 -140 264
3406 264 463 -1453 -186 1959 152 -1460 -8 868 -35 141 261 -1131 7 2479 57 -1867
3422 -1867 -22 1331 612 346 -448 -1431 330 2234 -434 -2459 35 1339 76 -344 -513 -1233 752
3439 752 1955 -679 -2629 355 2272 337 -660 -560 -855 1066 2115 -669 -2263 670 1088 -756
3455 -756 -824 442 -398 158 1292 -638 -1854 1053 1845 -488 -331 46 -617 195 1668 80 -1475
3472a475J745N41j172p4N99p92M0J588j821j010K115J302j894m22L58m83J272
3489D17J620k547k180K722J394j840l49L32j89M22J065j822j253L149P87l131
3505a403o50J489P17J088k77k019r47K860O97k594J27J413o30l49L43q60L5K077
3523A117j20k792M82J751j94J54K77j203o63J945N75k122Q48R10j295k75J356
3540G51q74r46J705O78k344P0J500k27J44R84j728j160K271J135j805n38R60m78
3558I8pQ27j404l64K402K33k655n65K014m7J88k42j520l78K773J67k584N13J639
3577A088m00j124J234j087N7J632o61k505J235J814n55j250M10n15N1J563j29
3594H58j781P82J320r46j000J633k94p81J191k76k012J029J246p95m94Q72j058
$$ plain form
3472 -1475 270 811 -361 -435 164 -628 -588 1000 -821 -1831 284 1586 -308 -730 -372 -855 417
3489 417 2037 -510 -2690 32 1426 -414 -763 -431 -620 -198 867 -955 -2208 941 1728 -1403
3505 -1403 -2053 -564 153 1241 964 -1055 -2002 858 1555 -1039 -912 501 -129 -478 -135 -995 -960 1117
3523 1117 997 -1795 -1313 438 244 398 675 -528 -1191 754 1329 -793 55 965 -330 -605 751
3540 751 -123 -1069 636 1314 -1030 -960 540 313 457 1441 -287 -1447 824 1959 154 -384 576 98
3558 98 91 918 -486 -850 1552 1785 -870 -1435 579 532 720 478 -1042 -1420 1353 1520 -1064 -551 1088
3577 1088 688 -436 798 -289 -232 1400 739 -1766 -531 1283 728 -522 -112 -627 -576 987 858
3594 858 -923 -141 1179 233 -767 866 572 -209 982 706 -1306 -277 969 174 -320 552 -506
3611e06j202K173J070k057j43J096r41R6J127o82j134J757J98k156J47J970m81
3628C32q56M32j154j73K409J22k520J94J724m04r44J050r5q18J560n61j764R30
3646e36K161j333j371Q22l45k33J267Q1j806M68J694j014o76J592lj194O21J24
3664C19j205J239J356j516j108J252j51j315J847O60k196N55O68m60N2J550p29
3681H18j865J312L24j092M62J685j484m96O53k96m28J428K05k820J64K169o53
3698H6n44Q06j37r81J153J02j317O92J642j328j158J039L39j05Q04m18j649N70
3716d04J807j359j172J928k16j320M95O79n95O18J026j778m91J692M47j581O13
3733C89J076k116J01J507j186K42J062j097j498J317J629j658m14R38n54m75J200
$$ plain form
3611 -506 -1708 465 1535 -522 -665 431 -510 -414 713 31 -1103 654 852 -1304 -1157 813 332
3628 332 -524 -92 -1246 -1419 990 1112 -1408 -1214 510 106 -838 212 117 -701 859 298 -1466 -536
3646 -536 1625 292 -1079 -257 -602 -835 432 513 -1293 -825 869 -145 -821 771 768 -426 195 319
3664 319 -886 353 1709 193 -915 337 186 -1129 718 1378 -818 -263 405 -55 -3 1547 818
3681 818 -1047 265 589 -503 -41 1644 160 -336 317 21 -407 1021 1226 -1594 -1430 739 86
3698 86 -458 348 211 -770 383 485 -832 -140 1502 174 -984 55 394 289 1093 675 -974 -404
3716 -404 1403 44 -1128 800 584 -736 -241 438 -157 461 1487 -291 -782 910 1357 -224 389
3733 389 1465 -651 -550 957 -229 13 1075 -22 -1520 -203 1426 -232 -646 292 -262 -737 463
3750D63k52q89J178L71k219P7K030o02r65O60q24n78J732L10j672K35J555j341
3768g31k36J272K56j036M14K73j392Q54J647j407p69Q42L2j022R26J021j311M1
3786c26O64j040m71K386j27j767N04J047j056n0J221r75m09R87o69p22J262Q55
3804A314j651n10J228o19K72J012r02j028J471P60j940j53J486K6j392P91j50
3821A5j120J685N51j920k80J508j58q09R95n8j228R82L06j226N53J351p17j219
3839g89R84O22r47O31M11j291L50J137j192q25J757jj527J041P52j401L56R65
3857A033n17n97P68k75j259J256Q90j481n7P78l83MQ33j310q59J393R97j828n60
3876a174J906L6j170K83O0m77J181M30k023k63K086k97j189L14L18q76J031k42
$$ plain form
3750 463 211 -678 500 871 -1348 -1271 759 157 -808 -148 -972 -1550 182 492 -1180 -945 610 -731
3768 -731 -967 305 561 -475 -61 212 -1180 -326 1321 -86 -855 -13 19 -1003 -77 944 -367 -326
3786 -326 338 -702 -1173 1213 1086 -681 -177 870 -186 -236 985 10 -399 588 -81 -803 459 1314
3804 1314 -337 -847 381 -238 34 1046 144 -884 587 1347 -593 -746 740 766 -626 165 15
3821 15 -1105 580 1131 -789 -1069 439 281 -528 467 409 -819 163 469 -757 -204 1147 430 -789
3839 -789 195 817 -130 501 912 -379 -29 1108 -84 -909 848 847 -680 361 1113 -288 68 1033
3857 1033 516 -81 687 412 -847 409 1299 -182 -239 539 156 160 993 -317 -1176 217 1214 -614 -1174
3876 -1174 732 768 -402 -119 -59 -536 645 1075 -948 -1211 875 578 -611 -297 21 -855 176 -66
3894f6j348R16J114q93j178J286O62o60J89L11j365J97J588p25p22R13k2j107
3912i10P74N47j112K62R30p50n24J079J33j034R08L26j417L63J369k21j114N61
3930A70l55q21J396M35j400l08J366J39j614N22O00o38J110k7j907O88K119l73
3948A102j768O37L36n66R50j16j467P30J355j062j222R53Q51o75j67Q20j702J171
3966A60J555r59j184M24N39r40O91J18j030K45J239p85n98J145j72r38K87J051
3984H48j216M56J120p36p85P18L41r20O34O02j669q5J716n11j168Q15J43n21L03
4003H5N22j633P20J316r37j432J073J162q35M47j97j147K17J829p80j973J524
4020c9O91j031m9K58o43P55J219j438j350J603J189j445J72J91n74M87R15j372
$$ plain form
3894 -66 -1414 -498 616 -277 -1455 -169 493 -167 22 333 -1032 -835 753 28 -694 219 197 -910
3912 -910 -136 411 -701 -439 491 -259 -783 296 429 -605 303 629 -788 -425 944 723 -391 170
3930 170 -185 -1006 390 825 -575 -883 483 622 -992 -470 130 -508 602 575 -1332 -644 1475 1102
3948 1102 -666 -29 307 -259 691 575 -892 -162 1193 131 -1091 -138 713 38 -129 691 -1011 160
3966 160 1715 756 -428 -4 535 -405 286 404 -626 -381 858 73 -525 620 448 -490 -203 848
3984 848 -368 88 1208 472 -313 405 746 -174 460 1062 -607 -692 1024 513 -655 160 303 -218 85
4003 85 607 -1026 -306 1010 73 -1359 -286 876 41 488 291 -856 -639 1190 410 -1563 -39
4020 -39 652 -379 -428 -170 -813 -58 1161 -277 -1627 -24 1165 -280 -108 83 -491 -4 911 -461
4038d61l69J120M72j238J02Q31j083M08O10q42q52J144O73r07k6R62j057L01J259
4057A047o74j283Q24M21o26L04J92q79M70J123q53j242R61R61j040J10K85o86
4075e85N66J106r92j296J245J053q18m70K20m74M17R69j178j074J429P59j304
4092d27m45J273l38p1Q68j221n10J406Q52k043K85J204j048K60P86n29r92J075
4110C85K77j270L90Q09p10K9Q40n21n73P01L96r20j22L65m92K29J330j240r52
4129a049J221O79j173k52Q01m72o6J196p12j545J746Q93j281k01N43m51K85M84
4147F46r80j304J986P23j762n24J434l32l19O70r49m01J374K92j277j88J548m64
4165A73l92M81p78m72J400K93j768O49J285j094m13J073o00o95J337J08j128R3
$$ plain form
4038 -461 -830 290 762 -476 -374 457 -626 -218 392 -450 -1302 -158 515 -392 -418 544 -513 -212 1047
4057 1047 373 -910 -86 335 -291 13 205 -674 -204 919 66 -1176 -215 746 -294 -184 101 -585
4075 -585 -19 1087 95 -1201 44 1097 279 -191 29 -445 -28 941 -237 -1311 118 877 -427
4092 -427 -872 401 63 -8 860 -361 -871 535 1387 -656 -371 833 -215 45 831 302 -690 385
4110 385 662 -608 -218 591 -119 -90 750 229 -344 357 753 -167 -289 76 -416 -187 1143 -97 -1049
4129 -1049 172 851 -322 -574 227 -245 -311 885 173 -1372 374 1267 -14 -215 328 -123 162 646
4147 646 -334 -1638 348 1071 -691 -1215 219 -113 -432 238 -711 -1112 262 554 -723 -911 637 173
4165 173 -219 262 -516 -988 412 705 -1063 -414 871 -223 -636 437 -163 -858 479 587 -541 -448
4183d48J214o84m08O05l00q39P92Q99j297K47O23j108O3J040n47q33R11P31j460
4202g99o1J145m66O9P69q27n67J149O06j597L57J127o13l27K55l08o26J433L52
4221A071j908q1J736n33p06P77m00m34J249L01j543j31J588r59n60P10J12q19
4239e30Q04qj300O06J445p36q87J046J33j309Q58L23o02K52R47r52m75J119m39
4258B95j152J172J86j170j6J241n73oM31n86n28J112N53j405p1J272q07k46N78
4277B80k76m56P02M87j586K25J222p51q48J073j4q12J140J58j581L98J595o87
4295B69j156R35M67r38P95o2j037K39J314p55j246J072N10r08N14O47j267l8J211
4314E66p25l50J138l80q14L99O84q79K74O20o54q87J248k42r09J163N23j279l55
$$ plain form
4183 -448 766 82 -326 279 -21 -860 -68 831 -466 -219 404 -704 -641 399 -148 -981 -70 661 -799
4202 -799 -860 285 -181 -112 657 -170 -737 412 1018 -579 -222 905 292 -35 220 -88 -714 719 1071
4221 1071 -837 -918 818 285 -421 356 -44 -478 771 1072 -471 -602 986 27 -533 177 289 -530
4239 -530 274 266 -1034 -428 1017 281 -606 440 573 -736 122 445 -157 95 1042 90 -385 734 295
4258 295 -857 315 501 -669 -685 556 -17 -23 408 -178 -706 406 959 -446 -517 755 -52 -298 280
4277 280 4 -452 250 737 -849 -624 598 -153 -1001 72 58 -754 386 544 -1037 -639 956 269
4295 269 -887 48 515 -423 372 310 -727 -488 826 71 -1175 -103 407 -501 13 660 -607 -645 566
4314 566 -159 -509 629 249 -565 -166 518 -361 -87 533 -121 -1008 240 -2 -911 252 775 -504 -859
4333h59J257l16n65Q69k92o79P53J05p64L6J396o59j315R27J56n89R22L96j614
4352h35M16J385p78p33Q64o7o98M86M22n95j3J395j261r08J256K26j103Q52P72
4371A083j613o4J242k44q41R56j93j140J019N57n23k51O76q12m73J333k94q11
4389c93O96M17j343J74J063l35m96O19l81r44J118Q07j155m29R74l54p01J070
4407D07k10o89M03P05j373L74J106j36j306L72M03n55K46P99q98j87R58n16o50
4426g47J057O56j226Q9L93r00N07R79q46j072J431j98r25O24O86o86n33N56j26
4445b81m37J254M7j335O34O97o34l92J180p25m26N64K8r97R99O04j105l77R80
4464B78l08o84R24J67p80M24O12j277K72J190o35o79M02L98m58j79P55r41k35
$$ plain form
4333 -859 398 82 -483 386 94 -585 168 273 -491 -455 941 282 -1033 -106 50 -539 383 779 -835
4352 -835 -419 966 188 -545 319 252 -446 40 462 -133 -146 1249 -12 -920 336 562 -541 311 1083
4371 1083 -530 -594 648 404 -437 519 326 -814 205 762 239 -12 664 -148 -621 712 418 -393
4389 -393 303 720 -623 -449 614 279 -217 402 21 -923 195 1002 -153 -582 392 38 -663 407
4407 407 197 -492 -89 616 -757 -383 723 587 -719 -347 56 -499 -253 546 -352 -539 419 -97 -747
4426 -747 310 966 -260 -171 222 -678 -171 808 -38 -1110 321 123 -802 -178 508 -178 -711 -155 -281
4445 -281 -718 536 583 -752 -118 579 -55 -447 733 8 -418 146 174 -823 176 780 -325 -702 278
4464 278 -30 -714 210 377 -403 21 633 -644 -372 818 183 -496 -94 304 -154 -333 422 -519 -754
4483g54J349l71q99J163R4j145L81J005j148J09J032q87q43R41O72j586J025K97
4501D35n73o05J353m26p10J053k84r19N72J106j085k38J079j51q55L16K28q14
4519e18P61P25j475l39J404j92p75O6M09o83P67Q79j431m08J700o34r93N74P87
4538F24p47N60J91j078M2J157n66o91O66M23j061M69M82o34j89R69o91p24R15
4557A17O70j452K94P60r46R5J036p08k6m9N68j134M95Q77n55q60J006R3r96O89
4577b6M90j074M49R52j302n81J288L89j309M42O20j104P29N63p98n68J029j51
4595C8o95O22N63n31l31N66p71J9J401m88j198O60N80n69j55R19j064j93J157
4614E30l10j137J165M85q89l3M12l17m8R99o52n00K49N03j359Q85Q96r86m74P96
$$ plain form
4483 -754 595 224 -675 488 582 -563 -182 823 -325 -216 816 -71 -914 27 699 -887 138 435
4501 435 -138 -743 610 184 -526 527 243 -676 -104 1002 -83 -321 758 607 -248 68 296 -518
4519 -518 243 968 -507 -846 558 366 -409 -343 66 -617 150 1029 -402 -810 890 256 -737 -163 624
4538 624 -123 437 628 -450 -408 749 183 -508 158 581 -480 -11 471 -163 -352 617 -74 -798 117
4557 117 787 -665 -371 389 -557 -462 574 -134 -160 -209 359 -775 -280 597 42 -818 188 281 -715 -26
4577 -26 464 -610 -161 791 -511 -1092 196 585 -724 -282 338 -766 -37 526 -272 -840 189 38
4595 38 -657 -35 528 -3 -334 232 -539 -520 881 393 -805 -145 435 -134 -289 630 -434 -627 530
4614 530 220 -917 248 733 -156 -189 223 -94 -142 857 205 -295 -46 457 -902 -17 879 -107 -581 215
4634B15O4q90J145J89j029L4P95o15m48J148j05j371P59N79p43J95R58j228l92
4653g40J018J33q39N31N01q79k1L61m78%R01m01q17P21N80m29j61P10q40k86J247
4674H12k78j234P69R31j179k63J085n00l57R30l52r77R49M13q45m37J203r91m45
4693g66J262m75o97N90M04p00M2O28n99j66Q62n49n98O01N12p35o5P86o47l47
4713f57J096j75p64M5J054q06O8K98k65l44J103l83j315R56O56p14K3L73m64j62
4733c77P24m64o73O98N90p11o22R89j61k61O06k22m40M67M84r42n8J215l70p41
4753b69R59l16q53P79M34j018j43J130m01q11J055n3j224N83N45p60J78P44m91
4772F8l87R34m88q37N84P99n45k58O98n53j11P84k73j181R93M03r35j84Q58J34
$$ plain form
4634 215 279 -611 534 723 -306 -272 523 -92 -540 608 503 -868 -109 470 -273 -78 880 -348 -740
4653 -740 278 411 -428 103 604 -275 -296 65 -413 -413 488 87 -730 -9 571 142 -19 691 -149 -435 812
4674 812 534 -700 69 1000 -179 -442 643 143 -214 716 364 -613 336 749 -96 -533 670 -321 -766
4693 -766 496 21 -676 -86 318 -382 -340 288 -311 -477 385 -164 -762 -161 351 -384 -449 337 -310 -657
4713 -657 439 264 -500 -455 599 -207 -139 159 -106 -450 653 270 -1045 -89 567 -147 -124 249 -215 -377
4733 -377 347 -117 -790 -92 498 -213 -835 154 -7 -268 338 116 -324 143 627 -315 -373 842 472 -269
4753 -269 690 374 -479 300 734 -284 -427 703 302 -509 546 493 -731 -148 397 -363 -185 559 68
4772 68 -319 615 127 -710 -126 673 128 -130 568 15 -96 688 415 -766 227 630 -305 -489 369 503
4792E03n44O87m05o07M08J035j051j45L93j4o03L10K67r24Q68M38j151j7J198
4811F46o65k02M70k35m83O05K68q45P8R41m96n70R58m70l96N27L08q77j23Q87
4831C26m43m22N79L51j302P18N44l92Q7K14j06l45P61j93q20N83M23q21l35M79
4851a14K45k78L72o7q36P35N50q93m79J103j45n26N03r1q97Q19O44j294M7J147
4871E45m39n67O75j37p13O17O93j057K23O88m83l84O97K11o88J75K76n77o8R83
4891F70m46p07Q00j33q32P11P94q02m02N43L7m75M76N05j106O35M05m93m25O59
4911D14j74m34O83J8r27O24K94m88o06J108k10k87L67K7r83O12R12j229m3R37
4931F15l4r33O47k76k53J64M74l85o68J230J67j200O45L74r15K95O75o58l28Q57
$$ plain form
4792 503 -41 646 241 -366 42 1077 26 -119 274 260 -343 -33 234 -690 178 616 -535 -552 646
4811 646 -19 -221 249 14 -469 136 404 -441 -363 578 82 -488 470 0 -396 131 439 -438 -561 326
4831 326 -117 -539 40 391 -911 -193 351 -41 46 260 154 -191 570 377 -443 140 563 -258 -593 -114
4851 -114 131 -147 225 158 -678 57 607 -286 -765 338 193 -333 170 79 -818 1 645 -649 -602 545
4871 545 106 -461 214 77 -636 -19 674 -383 -160 528 45 -339 358 569 -119 56 332 -245 -313 670
4891 670 224 -483 317 184 -648 63 857 55 -347 196 233 -242 234 739 -367 268 673 180 -245 414
4911 414 240 -194 489 507 -420 204 498 10 -596 512 302 15 382 409 -574 38 950 -279 -322 615
4931 615 581 -352 295 19 -234 -70 404 19 -649 581 748 -452 193 567 -348 -53 622 -36 -364 493
4951D93n06m84P07K95p99JO98n96j00M38jp85J059p7q63N71L56o73n0N75k90n82
4973f13R31J23j016M84N94m39k67N70k47m00L74K09q13O08P5l00n02Q32K1o40
4993d16M11p6p3K56L49q89l07J017j41o81N93K24m36m3L46l33k93R46m22q51J267
5014D48l47m87K29L80Lj60L08j82p77R25M06n85j07K67m32k90Q42j46q28N67N36
5035E70q79J61P77p11q2L72R3n68L06M91p43Q6Q60q53J6M45k8m99K34L99l57K10
5057C00M10n98o98J133j29p24M39L94n53j22M55n35j00Q28l54q62O98M43q24J82
5077b17M56k53o68R80l99o55R51Q6o16k6O45l33j69M74K82j088N33M11p30J67
5097a69N33q00k29Q38k75l78L54K72p73K92M96j73o99J020k64o01K85K30mPN56
$$ plain form
4951 493 -13 -497 210 505 -294 -293 405 -191 -291 147 146 -639 420 343 -520 51 407 -266 -316 259 -31 -613
4973 -613 318 441 -575 -91 503 64 -203 367 120 -280 94 303 -510 98 173 -127 -629 203 224 -416
4993 -416 -5 -81 -154 102 451 -438 -745 272 131 -550 43 267 -169 -212 134 -199 -492 454 32 -819 448
5014 448 101 -386 -157 223 226 66 374 192 -585 340 746 161 54 321 -111 -401 441 295 -533 34 570
5035 570 -309 -148 629 -82 -164 208 301 -267 39 530 -213 -127 733 -120 -104 341 313 -186 48 447 90 300
5057 300 710 112 -586 547 418 -306 133 527 -26 -148 307 -228 -328 500 146 -716 -18 425 -399 -217
5077 -217 239 -14 -682 298 -101 -756 195 281 -335 -361 284 -49 -218 256 538 -550 -17 394 -336 -169
5097 -169 364 -436 -665 173 -102 -480 -126 146 -627 -335 161 -12 -711 309 45 -556 -271 -41 -45 -38 518
5118E18o27p29J164j47m39J84J31k57L6M52m69M7K99J75j081O19K89j37o3J58
5138A23l35m09J091o2p25J77J12k74N0P71l66l90N23o1o03K83L95n37J87M70m74
5159e4m45N09J21r8j10M5m52M62O02n20o85R74R4p89L42K39l14k98P67o68J38
5180a40M23N9o77J07O77q59P7M23Ol18N54J11p33K77N25m27k20L86k84j47L16
5201A36J54n98M12L65q10NQ82m06n22N60k78k56M47M06o34n6J82j15j31M50K29
5222D22q76L42L39o80M80L94m93l91O30k67j36J93L83n72p4O06m99k21M85L6n53
5243d52J33M77o48L25jpl24M17L22p94M54L68m82k93M45j64l90J092P2j112N77
5264A5L37l28m21N45J83r24Q27k52j59J18Q65r63m34P42J05k41N23m25m39N7N69
$$ plain form
5118 518 -109 -838 326 179 -260 -76 55 -202 -166 286 -183 -136 163 338 -743 -124 165 28 -35 123
5138 123 -212 -621 470 408 -317 -140 -28 -302 -252 519 153 -237 286 225 -378 -95 300 -237 -50 420 -54
5159 -54 -499 10 131 33 -77 -32 -484 -22 580 60 -625 349 443 -346 -4 235 -79 -377 390 -278 -140
5180 -140 283 342 -335 -228 449 -410 -333 90 96 -222 332 443 -290 -13 512 85 -135 251 -33 -180 136
5201 136 290 -308 104 469 -341 -336 546 140 -382 178 -100 -356 91 497 -137 -193 -11 -126 -257 193 422
5222 422 -454 -112 227 -453 27 421 -72 -463 167 -100 -236 -43 340 -232 -306 300 -199 -420 65 101 -452
5243 -452 -319 158 -490 -165 -166 -173 -497 -80 242 -552 -98 270 -212 -505 -60 -224 -614 478 550 -562 15
5264 15 352 24 -397 148 331 -593 234 -18 -177 -59 806 -157 -591 151 256 15 538 113 -326 -269 300
5285C00q09K62P42n17n9L79o3l84q0N79k95j5M79o10j43M61M17j094LO64j12m99
5307c94P72o45j1K43L70o33L36M04n24j09K42J74m33O27o0r20O43O23j170K93
5327a72N34j66l27N19o5n09M04J99l02k93N12J50m72PJ56l00M5P46m56l51O05
5348D64m35n35M04N13l60o1L87o25L6N49j15o95R96j23n60n8M26r2l29K82k15
5369a46l10L18N57p10L16L68o77J52K42J41m76K25M90q30J3J049p77k90M91J48
5389B94p37N60n9k92j08P79p48OM71l65k60M71J44m70M47om12p1O38k12l27K77
5411B0Jj72K71K27l13k74N77k01m94L91N28o53KN70m57j40L30l97O7L07p3l85
5433b68M09J49l03n92J071m92k27M50J61q66N28N90p93k97O45l0l05N47j06m62
$$ plain form
5285 300 -509 -247 495 -22 -81 298 235 -149 -229 350 55 40 519 -91 -234 227 644 -450 -447 217 105 -394
5307 -394 378 -267 -278 -35 335 -298 38 442 -82 -191 51 225 -208 419 359 -561 82 705 -465 -172
5327 -172 362 196 -131 388 323 -186 218 417 115 -178 334 484 12 19 175 -125 -80 666 210 -141 464
5348 464 29 -506 -102 411 51 -10 377 -248 -212 337 222 -473 523 400 -160 -218 208 116 -213 69 -146
5369 -146 -456 -138 419 -291 25 393 -284 -132 110 251 -225 0 490 -340 -327 722 -55 -345 146 294
5389 294 -443 117 58 -234 -342 437 -311 -305 166 -199 -459 12 156 -314 133 127 -285 -356 282 70 -257 20
5411 20 21 -151 120 347 34 -240 337 136 -358 33 561 -92 -90 480 23 -117 213 -184 -117 190 117 -268
5433 -268 141 290 -13 -605 466 -26 -253 197 358 -508 20 610 -183 -480 165 135 -170 377 271 -191
5453a91L54K82m43j32P00k50l86J24L39l98p4M32O5j131R92j81l39M73J75n35
5473a24q9O39m58l34O83r0k84J43K61n49J49P47m98n09L13q0l25Q91k72k78k50
5494c14P49l53l86K16K67n32K87L57l71J09M00n23k63N04m3l66M0Q5k44J14M65
5515A98o07J49L46K49r09O15K10l93kM86l26p17P64K44n38R0K55n73J80L24j22
5536g7k55N90n17j45M68L75l72k98L15l25R1O68j78r76M95M34n44k57J160l01
5556C51m17Q9L5j34K59J34p60M33L62n77k08Q39j68o31K05N54m93r0Q04m65o37
5577e15O35j58l92K99L22k66L9K7l22K38M34M5m66J49j92J90j74L71n92N5M95
5598B22K0n39J1N30n20k5L57k5j42K28R3m74J0O08n41j6N52r8j97j02P9l16M33
$$ plain form
5453 -191 163 445 2 -130 570 320 -66 58 397 -1 -75 357 422 -709 283 102 -237 236 411 -124
5473 -124 -213 426 -32 -366 317 227 -57 86 347 -202 -53 694 196 -313 0 -80 -405 486 214 -64 -314
5494 -314 435 82 -304 -88 179 -353 -66 291 -80 29 429 -94 -357 147 104 -262 -222 -137 -381 -267 198
5515 198 -409 -260 86 335 -574 41 251 -142 -144 342 16 -701 63 307 -231 -141 114 -459 -279 45 -77
5536 -77 -332 258 -259 -404 64 439 67 -231 84 -241 -150 518 340 -636 -141 293 -251 -508 652 351
5556 351 -66 23 58 -76 183 317 -443 -10 352 -225 -433 406 238 -393 -188 366 -127 -217 587 122 -515
5577 -515 120 -38 -430 -131 191 -75 -36 -9 -331 -93 341 386 -80 69 -123 67 -107 264 -328 -273 222
5598 222 242 -297 -286 244 -276 -301 56 31 -111 117 210 -264 -254 354 -187 -203 349 251 54 -48 31 -285 148
5621A48j96j96lO62l80m00N06Q4k18j10L06k41p5M13j04m59K54P7k29l1J66j1
5643c7l02N96o08k34N46m2l68n1N29k71N2M28j93m17N59j48m61M88M52n54l29
5664c65O15J65n11L59K7n87K52M40n08l72N53K1q67O43K52k60K12J95n17j39O01
5685B09m75k2J69M3k08K4O11q12J57P54m53l75M52L88o57J04L05l32j87R17n69
5706D3j19M52Rp64J95M81j84m36M41m2m28O96j74l93M05K05n87k00N73L16p53
5727b64J41K43n40J60M62m36K44L35l07m43O93K24m41J06K08n22NK19l2j57J7
5748h5L98o12K42J99k82j70O55l46p39Q14J13k68j72N59n93k7O18j63o10L58L70
5769B59p30L37L16l95M1M2R0j01L65N9l00J61N13p76k6L70K10n86m3K41l82J00
$$ plain form
5621 148 -48 -244 -247 415 35 -365 141 225 7 -103 203 -38 -113 300 196 -263 -9 68 -161 -192 -26 -37
5643 -37 -339 257 -351 -585 -39 -81 -449 -500 29 -242 -190 238 45 -372 187 39 -422 66 518 -36 -365
5664 -365 250 415 -96 263 290 -297 -45 395 -113 -485 68 89 -778 -135 117 -143 69 264 -253 -392 209
5685 209 -266 -288 -119 -76 -284 -260 351 -461 -304 450 -3 -378 74 462 -195 -91 214 -118 -305 612 43
5706 43 -76 376 385 -379 -184 297 113 -323 118 76 -352 344 170 -223 182 387 -200 -400 173 489 -264
5727 -264 -123 120 -420 -260 202 -234 10 345 38 -405 288 512 71 177 385 -137 -132 87 55 -102 -85
5748 -85 313 -299 -57 142 -140 -310 345 -1 -740 74 187 -81 -253 306 -287 -314 304 141 -469 -111 259
5769 259 -471 -134 182 -213 -172 -130 -40 -141 224 283 -17 144 657 -119 -145 225 435 -151 -194 47 -335 -235
5791b35N25m63o4K08j68J67N0K72l12J60r1k12l92P67L9o53M03rl26r5R04l59
5813A16l14M15O0m49J12M86m45K18k11j06J02N0J57l42L62Lk89j3L22m55j34N16
5835A61l54k09N96J99l57m49P25n92M3O68j53p19O54L4j67m26R91m29n58N33l36
5856a45k15N92R6n72R3M49m94K82L0J30p86M27K37P6q4M31o92l58Q68l80k62L11
5878C4L98q29J18L77n92M78M33N3p02k6L78j47J73K58m39l37O01j40k89N65k65
5899A00k70mP13o17n3M02j73m36J6O10l19q7K83k88R0r3J48p7L4L66m54j80K63
5922b6k5m20N58m3k10K2J74l86M79J10l20k38N76J64o20J41M77o25K09M0p2n76
5944f11Q73l13m51Q4M03m02L35N81l59l25J57R6n08O08L12n22L3K69j3m91M11
$$ plain form
5791 -235 290 -173 -237 -29 -197 -30 20 292 -20 140 49 -163 -555 212 251 -402 1 -8 -334 -429 475 116
5813 116 -198 217 277 -172 -60 426 -19 199 -12 -118 -16 34 191 -151 211 214 -75 -88 234 -221 -355 161
5835 161 -193 -402 194 393 36 -413 312 -280 -237 431 278 -441 213 247 80 -346 645 216 -342 191 -145
5856 -145 -360 232 328 -244 -151 298 -196 86 116 246 -540 -113 124 200 116 547 -145 -503 365 -15 -277 34
5878 34 432 -397 -279 98 -494 -16 417 470 -232 -258 120 -27 146 404 -35 -372 229 89 -200 365 100
5899 100 -170 -174 539 -78 -131 271 98 -338 -322 288 -31 -118 165 -123 -33 -126 22 -55 -21 345 -109 -289 -26
5922 -26 -51 -471 87 44 -166 -144 30 -356 123 233 -87 -325 251 415 -205 -64 413 -212 -3 37 -35 -611
5944 -611 262 -51 -502 -418 -15 -417 -82 499 140 -185 -28 68 -440 168 480 -42 -9 260 247 -244 167
5965A67l78k32K79N43n52j64O67k41l97N38O7n37K01L00j35j14K44J05m55P7N13
5986D96o93j4M13k57J00K06j49o01L91O40n53Q4K12k18j11K97r9j58J83Mk80K2
6008h5P35p71j30N42k61l34Q47L3p72M39p8j45k52Q04l91k58J62J08j81j30M10
6029B92o9k69N17n44j89O35K60q12L0L85o57K25L78jo08L53%l43o2N98k65j47
6051b93L96j09l99N38pj04rJ93j75k44L50l46m0O43k59l80L46L27n71k62N85m29
6073b49j73N06J69p06L26K98o71Q1O59m54j09J34J49l90N54K2q3k93O31j77l16
6094i2p3M12l46l9J81k36O0J49L58n63K37N6j77j83L77k96J41K70k07l52L42k3
6116dl53J78M56m36k00O59l87J64K08J26n47L42R1o96r2P88k99J65L97k55o59
$$ plain form
5965 167 -211 -443 -164 379 -173 -337 330 89 -308 230 297 -240 -39 261 126 12 256 361 -94 -17 496
5986 496 -197 -211 202 -55 45 251 102 -499 -108 532 -21 63 275 57 -54 243 144 -14 169 173 -107 -85
6008 -85 650 -121 -251 291 30 -304 543 576 -196 243 165 20 -232 572 181 -77 85 193 12 -118 292
6029 292 223 -46 471 -73 -262 373 633 -179 -149 236 -421 -196 182 181 -427 -74 -74 -417 -479 119 -146 -293
6051 -293 103 -6 -405 133 126 22 13 206 31 -213 137 -209 -249 394 135 -245 101 428 -143 -405 180 -249
6073 -249 -422 84 253 -453 -127 171 -500 -419 240 -214 -323 -189 -40 -430 124 146 63 -230 401 224 -92
6094 -92 -165 247 -99 -138 43 -193 -133 16 374 -189 48 104 -73 -256 121 -175 -34 236 29 -323 19 -4
6116 -4 -357 -179 277 -159 -359 300 -87 77 285 411 -136 206 297 -399 -491 297 -2 163 560 305 -354
6137c54L09L04l54j07M91k38L65k89j02l27M32P1k47q3L44P4m79K68K03l35k26
6158b80P07o08J46N25l43k97M73R7o89J73N17l83L7K30j82m39O65Q8p88j24O45
6179A70j85l39M74k8l74K77L66q19K67O31m25j87L39k25JK32l7k95L3M24n83J42
6201a41K3pl13M98P6k76n5K41l7r2N35m18o51P36J18m99J37L52j82n00M81J35
6223A61m43J76L87o60K4O21j96j97M00l06k09J42N33p63K95M90j40l02J85j11
6243H7l42L13K84o16K80M9m6q6J07j27J38P1J26k77k65L63k87j60N48n6M0j3J51
6266B82K1l53M06k70j30J0Nj69J93K98j72Kr1r4M8L45j01m16K08M76m19k07M04
6289B76j54K7j83M49p44Q8M81l58q0M83M2m46K58J26l25K02L14r90J13N40L2l74
$$ plain form
6137 -354 -45 259 -95 -202 289 51 416 127 25 -302 130 201 -46 -129 215 289 -190 78 281 -54 -280
6158 -280 427 -181 -35 490 147 -150 323 420 -269 -96 421 38 75 305 123 -316 349 437 -351 -475 170
6179 170 -15 -354 120 92 -282 -5 361 -458 -191 440 15 -172 167 -58 -57 175 138 -157 -124 300 -283 -141
6201 -141 -118 -125 -438 60 136 -140 -195 46 9 -83 452 34 -617 119 237 -262 -125 227 45 -455 26 161
6223 161 -282 -106 281 -379 -355 266 70 -127 273 -33 -242 -100 433 -330 -35 455 315 13 198 87
6243 87 -255 58 342 -274 6 55 9 -77 30 -97 41 112 238 -39 -304 59 -228 -388 160 104 144 131 282
6266 282 303 -50 356 86 -44 -34 -29 -198 -5 293 121 123 32 -62 -14 331 230 -186 22 498 79 -128 276
6289 276 122 149 -34 415 -329 -241 240 -118 -198 285 327 -119 139 265 -60 142 456 -534 -421 119 151 -223
6311b23J32J7l1K56r5l97J40M38l11l25M14J78n06J88L09o45K44N32P3o28N90
6332C50l1q02L22L80m01Q5L18k64j02K44l5O1N7j17l3l31K18L4LM4L3j50L6J78
6356I7J12l99K44r5q5M32j24l67K63K82m66QL43l32J19j64M6l31L80M25k11N6
6378B33k0m3l95K18L79j91j09j48PJ89n8M78m88Q0P9j58K23l1k89j45N84l63l28
6401b96L59j70l08L80J84k82RL06J30Q1n7j60n45J92N29m94L4M88m13N00k54M7
6423B60m74K30L45n48j2K14L4p2j98J63m9O4J54k6m08L43J03j19j70L36j18l29
6445b77N02l13j99K47K71l77J67p2r3K39J07m6k0j59k7j46O76p1n84L38Q3l31
6467h5j41P06m40j99K32m0n7nJ32m9k40J32J71m08L39M58p86L95l18O0J28L1j88
$$ plain form
6311 -223 -91 -74 -105 151 56 -341 -201 237 -74 -399 15 193 -313 -125 184 -461 -217 315 388 -240 350
6332 350 319 -483 -161 219 -182 -97 221 -43 -145 99 64 125 182 65 32 -299 -81 -47 -44 0 33 -117 -81 97
6356 97 209 -190 54 -41 -126 306 182 -185 78 360 -106 -98 245 -87 32 -132 -86 -417 -37 388 177 233
6378 233 213 170 -225 -7 372 181 72 -76 -69 120 62 540 52 132 211 53 276 245 -44 -189 395 32 -296
6401 -296 63 -107 -415 -35 149 -133 -124 182 312 393 336 176 -369 -177 352 -142 -108 380 -33 467 213 260
6423 260 -214 16 361 -187 -199 15 49 -23 -221 -58 -107 -43 111 85 -323 20 123 4 -166 170 52 -277
6445 -277 225 -88 -287 -40 231 -146 21 -51 -144 95 202 156 136 -23 -50 -196 480 409 -175 163 246 -85
6467 -85 -226 480 40 -159 73 33 -24 -29 103 54 -186 -54 117 -291 48 506 -280 115 -203 -143 -15 16 -172
6490a72K10j74J35o6l44M67l14J41J43J03l53M21p6l69K51j86K38J46o9j06n07
6511d81O04J81j94P5J55m58j06M22l8p13P06K11l63k98N17l55o6J44M55l21j10
6532c3O64p96K88k06Q4m77J88O96m09L64n65K51j97L63j81k07N09l64k59M2L36
6553I1k35L68J07o18K11K02k14q4M86q4j83k40K74j60K87p8J46o08L32J36l59
6574b23K02L69l36o7j54N7J71J4j7j06j47L64k84J71K19j71k52LO56o37K38j09
6596c9j12O4J62q4q7J68jj63j19M00j15K8R1j20o3j59q8J92J08j33J56o14M22
6619a06L3J95R2k23R3j46K22j22k73J91K08j79k82M43M9l61K58k73r8O66k91n29
6641d33N86M0Ml20k8J15j88O06o52R2N04Nm81J76J00l19J19n8J26k72K32J01k92
$$ plain form
6490 -172 38 -136 -1 -67 -411 56 -258 -117 26 129 -224 197 121 -248 3 -183 55 201 132 26 -481
6511 -481 123 304 110 185 340 -118 -224 198 160 -553 153 364 1 -297 220 -135 -201 -57 398 77 -33
6532 -33 631 -165 123 -83 1 -476 -288 408 -1 363 -202 49 -148 215 34 -173 336 -28 -287 -245 91
6553 91 -144 224 331 -287 -76 126 -88 -172 314 230 47 -193 81 -79 208 130 276 -332 0 136 -223
6574 -223 -21 348 12 -55 -209 -152 19 33 16 -90 -237 127 -157 14 233 62 -190 -187 469 -168 70 -39
6596 -39 -151 -87 75 -9 -96 72 71 -92 -211 189 74 102 193 73 10 -149 -237 -45 63 -70 86 -528 -106
6619 -106 -73 122 214 -9 84 -62 160 38 -235 -44 164 -15 -297 146 195 -166 92 -181 -279 387 96 -433
6641 -433 153 193 197 -123 -151 -36 -224 382 -270 -178 326 331 -150 26 126 -193 -74 -132 -6 -278 -46 55 -237
6664b37J22K79k95L56l60L42l48K85J95j43j93L24k44j1J23k16j44L81J19m99
6684a64r5O48j92l52L31k1m27JO62n21M50j33n49R3K81j33K03k0K97k49j89L60
6706B81l06K6M5O5k11J45J83m14J72j52J35k23K20M00l41j33K49j09m7j3n2K2
6728e8q6J54l94J92L41k97j14L16j97O9L04k08n8J5M0J1r7J8l0r7J11J9n1J8J13
6753C4j54L68k46K90k09J59j71l9P5k61Q8K10J03l50N0q7J08j31L04mm22j72N45
6776H8J2m23K56J68j67J57q2R2k07j60L68m55L32L02l53L05K15l03j98j36L13
6797A24j10r8j01k9K17k6M53k50J22l00p9L41j97k26K67K55j45k0q8j57k68M96
6819A81P0m76M1L13n2m9K9n7J74m60J97j09L96R0k59O5J9J94o15L98M6j68j11
$$ plain form
6664 -237 -115 164 -131 225 -135 207 -141 144 339 196 3 327 83 72 195 -21 -165 216 335 -164
6684 -164 -259 389 197 -155 176 155 -272 -271 391 -130 320 187 -362 -269 12 -121 82 62 359 110 -79 281
6706 281 -25 1 46 111 -100 45 228 -186 -14 -166 -31 -254 -34 366 25 -108 141 32 -15 -28 -80 -58
6728 -58 -144 10 -384 -192 149 -148 -262 54 -143 -74 230 22 -36 -21 19 30 -67 -49 -79 -176 -65 -46 -97 -79 34
6753 34 -120 248 2 292 83 242 71 32 107 -154 -66 144 247 -103 -53 -140 -32 -163 141 137 -285 -457 88
6776 88 100 -323 -67 101 -66 91 9 101 -106 -266 102 -353 -21 281 -72 233 448 145 -53 -189 124
6797 124 14 -84 -185 -214 3 -23 430 180 302 2 -77 264 67 -159 108 363 218 198 110 -47 -315 181
6819 181 251 -225 -184 129 77 28 57 0 174 -286 -89 -198 198 288 29 94 113 307 -308 90 136 -32 -143
6842a43L88l81O04k21l24J13K92j27n96L97J33P1j44J65m30J61k4l2j79L97Q1
6863B01l98L95P2j97j38O2J30l01J98j49j93l2N35J68k54L7m09J53L5j9j4k57
6885c75J06K6j91N08K21o2n16M83m45n5N18m79m9L59O0l14J17J18N7k04J20K02
6907B05p3J93k40o6j50J8J15j52M82l07k70M37j04K04l10K2r3k50K49J55k73L40
6929A32kk71k7R3K68Q5k37l13M01j42J09m0k47M54k94k06K28J22k23q5O42m44
6951Cj37L6J72lJ94L9m8j31p9j12j17M91k66m23M56J07k52K2J06m53J52M80m10
6974a73L55m83L07j98M14N0l13J11k4k89Q2r9K18j55J37K14l10n9K59k07j65L74
6996D6K69n75K77J36j46r7l1k76L36K43Nl59K73J45n32J66M71l54m91M51K0K6
$$ plain form
6842 -143 245 -136 468 247 -77 36 328 201 -395 2 135 206 62 227 -203 -42 -66 -98 -277 120 201
6863 201 -197 198 270 73 -65 -3 127 -174 24 -125 -318 -350 185 353 99 136 -273 -120 -85 -104 -118 -375
6885 -375 -269 -243 -434 74 295 233 -283 200 -245 -300 218 -261 -310 49 109 -205 -88 30 87 -117 3 205
6907 205 132 325 85 19 -131 -113 2 -150 332 25 -245 192 88 292 -18 4 -89 -339 -90 65 -208 132
6929 132 130 -141 -168 -75 193 278 41 -272 129 -13 96 56 -191 263 -31 -237 -9 113 -110 -195 447 3
6951 3 -134 -98 74 71 265 304 256 125 46 -66 -183 308 42 -381 75 182 -70 -48 58 -395 -243 237 -173
6974 -173 182 -301 6 -192 222 272 -41 70 46 -243 -161 -260 -42 -197 -60 154 -156 -215 44 -163 -328 46
6996 46 315 -260 17 153 7 -90 -121 -397 -61 182 187 -172 101 246 -286 -120 351 -3 -494 -43 -23 3
7018Cjm8N4R9j21r9Q0k55L06l27K93L32n83J02J58p4J42j50L59k31q2K54j64k33
7042a86M47l53J92j67K35k07j66J06p7N03j32m90N31j11n39L27R7J71k00j09J60
7063C2k72o7M12%l03J35K68l25q4P13k65n19J39L43m88O58m17J49l36M21l63K2
7085a47K33l32L8J21J12l8j0J37j72J01j59p7k20N10K3M3j28j27J5o1j82M43J51
7108B74L1l15k67J77J38k65R0K3K45K7j19K28l67l1L90k93l92O60l96Q4J08m7
7130a7k59K08L09j31l15K77m9o0J21K61l17j34J91m33K94P0p1m7N6j85J05k45
7152c71N05%m22K11o4P1m42O61l84n8M89j01r1N16n49RJ25o8k6r4K95j43l73M26
7176A22k20j25K91J19k67j78K67j94M5K36j99j89N28r8j50j76J44m4o9K57K39
$$ plain form
7018 3 2 -46 8 107 -14 -113 -33 -288 18 -309 -16 316 -267 -165 -7 -81 61 -89 270 39 -43 211 47 -186
7042 -186 261 -92 100 -67 168 -39 -205 -99 -176 327 195 -295 236 125 -414 -87 10 181 -19 -128 32
7063 32 -240 -307 105 105 -198 -63 205 -120 -204 509 244 -275 -136 207 -281 377 -40 109 -227 194 -169 -147
7085 -147 86 -246 -208 -87 25 -13 -23 114 -58 43 -116 -193 -413 97 120 163 35 -92 -77 -138 -320 123 274
7108 274 305 -10 -277 -100 38 -227 -137 -114 131 158 39 267 -100 -131 259 -34 -426 234 -162 -78 30 -17
7130 -17 -276 -68 241 110 -205 72 23 -37 84 345 28 -106 85 -348 -54 16 -55 -102 -46 -231 -126 -371
7152 -371 134 134 -288 -77 -141 -70 -512 149 -235 -293 196 95 4 520 -29 -20 105 37 11 -83 212 69 -304 122
7176 122 -98 -223 68 187 -80 -258 9 -185 -140 96 -103 -292 236 138 -12 -188 -44 -88 -157 100 339
7197C39n20K27Qk00J50K7J70k26K29k65J6j08K59j97J03j09j26R7K28K3n5K1J23
7220B14k31m80M73K39n86M12L5k50J46R5l8n10L24oQ3K18k63k48K73J69k11K35
7242I3o8K2R5r4l08K32j38J09L4n9J69k81M7K45J92n02K09J65j54q3K54l26J91
7265D4P4oj84O5j4J13k90NK46r5j68k2m4K79P3m71K81M8J45Nj42J30l68K90J47
7290A41k20k22M7J78kL12j62J13j49J24k22m4j34K54O1q2m2J42m0n8J9j01L12
7313B25j17k06J3M19m08n5q8J85r2K4K36l58K99k50K17r1q6J86o3J06jl73J49
7336a29M66k39j53K31j76j75L69k88L27k08K6j22J17j46K97k18j08L80k36o0k
7357d7k40j99O14p6J04k80L3k61K83j2j43J0O14k87j75K22k87J07N1N5j5j16J27
$$ plain form
7197 339 -181 46 54 -146 4 31 201 -25 204 -61 -45 -153 106 -91 12 -97 -223 -126 102 125 70 91 214
7220 214 -17 -497 -24 215 -371 41 76 -174 -28 67 29 -481 -157 -163 -80 138 -125 -373 -100 69 -142 93
7242 93 25 47 142 48 -260 -28 -166 -57 -23 -82 87 -194 -147 98 290 -212 -3 162 8 -75 179 -147 44
7265 44 118 112 -72 -7 -21 92 -198 -193 53 -42 -210 -232 -276 3 76 -395 -114 -66 79 84 -58 72 -296 -6 141
7290 141 -79 -301 -254 -76 -78 234 72 185 36 160 -62 -106 -240 14 75 -7 -49 93 53 -5 14 -87 225
7313 225 108 -98 -85 334 -74 -129 -217 -32 -124 -100 136 -222 77 -173 44 -47 -133 53 -10 96 95 -278 -129
7336 -129 337 98 -55 176 0 -175 194 -94 233 25 51 -71 46 -100 197 -21 -129 251 15 -45 -47
7357 -47 -287 -486 128 52 156 -124 -91 -352 -69 -81 -224 -214 400 113 -62 160 -127 -20 31 86 71 -45 82
7380H2k88J19OL02m67J30L40k88q0L20k02P1q9j27J35K0M6j85L0K1j41J64R3m4
7404c2J11j13j79K49k46J44J66m85N67j80J45k23K13Rk79N3P5k20L81j47pQ5l2
7427E5j0L8r5J10k11L77j31j95k4K10k55J11L18m94K28k74L15rk64K32K1R4j02
7450D5j19r6K99R6n23N18l11O8j53R3o4K03m3J60n82L79k30K27O9j96j5JK39N
7474G0k55K00l2J76l66J34M11m64K10J25m8j2O6l82J45K24j72l44K98l4k10L24
7496F4m0k0j3K52p7j59J70J68n75j30K67L67n76J67m4K82j81M0J63j12K93n55
7518b49J86N41l99l66J57K8p6J96j4l24N10n8j12j63K39N5j92l98M21p1j04P3
7540a20r2K35O5J9j55N5J70j32j45l3J03k25K66j8j71j83L45O7l58L36n7K87m7
$$ plain form
7380 82 -206 -87 -81 221 -246 -116 224 -64 -144 176 -26 45 -44 -171 -36 -16 30 -155 -125 -104 -245 -81 12 -32
7404 -32 79 -34 -213 36 -210 -66 100 -385 182 2 147 -76 137 146 -133 -80 -5 -225 156 9 2 87 55
7427 55 45 83 -12 98 -113 264 133 -62 -86 124 -131 -20 298 -196 32 -242 73 64 -200 32 53 147 45
7450 45 -74 -170 129 225 -298 220 -91 -23 -176 -83 -147 56 13 173 -409 -30 -260 -33 36 -160 -175 -174 65 70
7474 70 -185 15 -17 159 -207 -73 338 -126 84 209 161 149 215 -167 -22 202 30 -314 -16 -50 -260 64
7496 64 24 4 -9 243 166 7 177 345 -230 -360 -93 274 -302 -135 -179 103 -78 -38 125 13 306 -249
7518 -249 -63 478 79 -287 -130 -102 -178 18 4 -320 190 132 20 -143 96 151 -41 -439 -18 -89 -193 -120
7540 -120 -212 23 88 107 -48 7 177 45 -100 -133 -30 -255 11 -7 -178 -361 -16 51 -307 29 -28 259 212
7563B12k48l16K44K01j98R2k1n5k5mJ75j80J37rPk19L47n4k05K22k68Q6q5o9J87
7588d6k1M8J05k16K83j27R3l83M55o3l41L69l79j0J96J73k10L1K9N8j04J46q5
7611Ak33N99k60j03j81J57R1J13l04j98ML55K0k92J57j16L7R9J57k11M9ol6j26
7635b27K31J51J27j06k66N4n3l98O05n6k45Q5j18J54K07j59Q9q6n9jJ9K13j00
7658F1l0k3k00k38N96j55j2l22J60J10q6J52j42M0N5N4jm62N29K75n67L90l1j33
7682B0k67L18J36j05n8K41l36J01j02j9J86ml28K1J59K28m72J64L7J45L11lo18
7705b45O9K50N9m59N51k33k55L64l18K28N5K69l63j5L84r9l34M9n3K97K05r0j28
7728A88k16j41K92J01m50L52k48K28k71K41k33K11K25o20MK93K5q0J28j30j35
$$ plain form
7563 212 -36 -352 -108 93 -105 -13 -34 -89 -114 -118 57 -123 14 5 12 -207 140 86 -119 103 -165 -79 -164 -233 -46
7588 -46 -67 -19 86 -130 153 26 119 -264 191 128 -213 156 -223 -233 -37 136 -74 -43 -14 44 -60 86 1
7611 1 -232 367 107 4 -177 -20 71 184 -120 -318 -314 41 61 -231 -74 -190 -153 -54 103 -108 -59 -65 -101 -227
7635 -227 4 155 282 176 -90 -36 -89 -487 118 62 -183 -98 -216 -62 145 -14 75 -11 -70 -71 -52 161 61
7658 61 31 8 -192 -430 166 11 -1 -323 -163 -53 -139 13 -129 -89 -34 20 19 -443 86 361 -206 184 153 20
7682 20 -247 71 207 102 44 285 -51 50 -52 -71 115 111 -217 -196 -37 191 -281 -117 -80 65 376 373 -245
7705 -245 -176 74 133 -326 225 -8 -263 101 -217 11 66 335 -28 -43 341 242 -92 -43 -96 201 406 316 188
7728 188 -28 -169 123 224 -226 126 -122 106 -165 76 -157 54 279 -341 -337 -44 -19 -99 29 -101 -236
7749b36J76M0Q2K74m36k52K52K87j1k50J04P6k10J43P1j26m3n0k30K62L12K8L2
7772B95m27L62m42L12on6k66L54J7k44L74m87n7K9p1K32L0j5J13J71l32J06j34
7795a42L3K61j35j5k54L57k58J34J96n90L49o0L04q2j52P3j20J34Q7j73J05j4
7817C8J15j36j10L01l58L08K90o02o1L65j28j21J92j72L1o4M50o72M47k84M8l8
7839a61O2r7M21j78j42m6j99N36m03J70K29j06j5k42L3J22m04N55m3l46M59j40
7861F5j32lN1m8N0q5M79k59j97o3J05R7l1l5l26J42L30r0m8Kr2k4K60j25n4r9
7887a30K83m16M91l3m20R7jK85l42K06k15M02o12N15o9K4J86m62M25o1r9k18J46
7910a8Q8n4K05n5l97j77K15L48J4p3OJ41k36J3L8j58L85k68j59J07J05l52M1K80
$$ plain form
7749 -236 -60 -20 62 336 -100 -352 -100 187 176 -74 30 106 -104 39 110 -16 -59 -109 -339 -77 235 263 295
7772 295 -132 230 -212 100 94 38 -228 126 143 -101 273 -214 -271 -242 -313 -81 -51 -66 47 218 -114 -8 -142
7795 -142 -109 152 17 2 -252 105 -153 -19 177 -413 -64 -124 180 98 -54 19 -101 33 120 -53 52 38
7817 38 153 17 -93 208 -150 158 448 -154 -215 150 22 -99 93 -79 -48 -112 338 -334 113 -171 -123 -161
7839 -161 -99 -196 225 47 -95 -141 -340 196 -207 -37 192 86 71 -171 -138 -16 -420 135 92 -254 205 65
7861 65 -67 -70 -19 -67 -17 -102 377 118 -79 -142 -37 60 29 -6 -332 -190 140 50 2 4 -88 -112 148 23 -31 -130
7887 -130 153 -263 228 195 -225 -128 -129 156 -186 20 -195 207 -405 110 41 65 251 -211 214 153 54 -164 -18
7910 -18 70 16 221 166 -231 -408 -193 155 169 96 102 243 7 20 58 -100 285 17 -142 -35 70 -282 -241 39
7934C9L66n29M15l79N5J50Q2m44J39M73m99J71N7M8l97M00J04l8j47M1J57j19
7956A45J32l42P1J17k00J76j81K01on21P62j60j73J76l17K70j10K43l65m7L27
7977A98N3l07M2J36o0j55K88k47J21j38M1p4L3l1j79K03J81k40K64j96m23P6M30
8000A6K89m33r1R3pk7J46L02l09j53M52k02j68J17j43j6p6K80J89j33J69n37O6
8023a76K37J6m19L06m2j43l2L81r2j80M17l39p1K04R7j49R9k44j92K03K43k11
8045h7QK14q5k13J82j05l10L95k1k33o6M39m1j18K68k02k69J73N1J43j8m0j06
8068d1l27K00L16j97n4L26l70k18M58J07j25J23n5o7n6J31m0j91K0O4j04J34j
8091C3O8k84J19J32qj97J50p1k4L0m4J10L25k96k83M41k49j22J00j97J92J5J62
$$ plain form
7934 39 405 -124 291 -88 -33 117 199 -245 -106 367 -132 39 96 144 -253 147 251 213 66 107 264 145
7956 145 277 -65 6 123 -77 99 -82 119 113 -408 354 194 21 197 -120 150 40 283 -82 -129 198
7977 198 251 -56 -14 122 62 -93 195 -52 69 -69 -28 -102 -69 -100 -279 -76 105 -135 129 -67 -490 -414 16
8000 16 305 -128 -219 -126 -133 -160 -14 288 -21 -174 278 76 -92 25 -118 -134 -210 70 259 126 295 -242 -176
8023 -176 61 77 -342 -36 -78 -221 -253 128 36 -144 273 -66 -137 67 164 15 114 -130 -322 -119 124 -87
8045 -87 -79 135 50 -163 19 -86 -396 -1 -22 -255 -321 118 77 -41 227 25 -244 -71 -20 123 105 65 -41
8068 -41 -368 -168 148 -49 -103 223 -147 -365 93 200 75 198 143 76 20 151 111 -80 -60 4 -100 34 33
8091 33 101 -183 -64 68 60 -137 13 -58 -82 -52 -96 14 339 43 -240 201 -48 -170 -70 -267 -75 -60 102
8114A02m62q8N61k35J70O7k79J99K13m0n28O66k60j55k30L16Kn3n1K60m43J96
8136g2P6J59l11L38m59L74k07l6K93k13p4L49o11L18J64j39m1L13k24j49K36M9
8158A33l69J45M67l48j12r5J37K8L23k84r0k62L87k86J92r3O3r2K49L75l26k21
8180g9L84q1r6O2n16L67k7R4r4R1j65
$$ plain form
8114 102 -360 -448 113 -122 48 115 -164 35 248 208 -320 346 86 -69 -299 17 19 -34 -85 175 -268 -72
8136 -72 4 163 -148 190 -269 105 -102 -138 155 -58 -132 217 -394 -76 88 -51 -92 221 -3 -152 84 133
8158 133 -236 -91 376 28 -84 -179 -42 -14 309 25 -65 -327 60 -226 -34 -127 -64 -156 93 468 142 -79
8180 -79 305 224 128 190 -326 41 14 108 14 105 -60
8191f0
$$ Imaginary data points
##PAGE= N=2
##DATA TABLE= (X++(I..I)), XYDATA
0@%%%%%%qJ6j6J6k2L0l3M1n2O1p3Q8j04J22j43J66j91K21k55K89l29L77m27M80
30B54n41O06o78P61q50R45j050J165j290J429j583J752j940K149k381K641k937
47a548L277l664M114m652N301o100P115q453J0304j3037J7485k5921M7315j95175
61a63639m26938M62644M45485j56985l05536P8447J34892q3344q1198J56904J36553
72A97285j37341k34221K3823J77838K1309p9993O2819N6787j38900j08197J55541
83c250J89909m7066k03050r9672J24049J97641j0048j86432l4460J47415J6872
94I1908j34293k2405Q4128l987o5516j5086P408m257J2743K9875K2808j7805o6560
107h1039j5169J00049O0033q8150o7447P5901P8369l4715q3244l3571P8495J16016
$$ plain form
0 0 0 0 0 0 0 0 -8 8 -8 8 -14 16 -17 24 -28 33 -40 48 -56 66 -77 89 -102 119 -136 153 -176 201 -226 254
30 254 -287 319 -359 402 -448 497 -553 612 -678 751 -832 920 -1020 1129 -1252 1389 -1548
47 -1548 1729 -1935 2179 -2473 2828 -3272 3843 -4610 5694 -7343 10142 -15779 31536 -163639
61 -163639 -590577 -127933 317552 160567 -144969 -66522 68370 -14974 -96172 60732 197285
72 197285 59944 -174277 -150454 27384 48693 -31300 31519 88306 -50594 -158791 -3250
83 -3250 186659 139593 -63457 -163129 -39080 158561 148513 -37919 -72379 75036 91908
94 91908 -42385 -64790 19338 15351 -50165 -65251 -57843 -62100 -49357 -19482 3326 -14479 -81039
107 -81039 -96208 3841 63874 -24276 -91723 -15822 62547 27832 -55412 -88983 -10488 105528
119A05528n6098j98554l081K24423O5287j83270r1518J11245Q2272l4853l6487
130a5106R046J4498L480J2510L0087q319o9396m894J05324N192j57748l7808J67824
143E4690O7686j41423q3236R2706R5212k6416r5842l8889Q7762R1051o1164j03660
155f1523L4482R1556R097k2734j6589n6065l1554O3392N6978m3185p8157k2183
167g6485N4804P4980j1763q0581j448O9990j4243o5846K2715N8978k577j9016
179I508j5443l5695K5040R6601J604j21696n6027P0124P0282l556n5270m7079
191f1607K9465P4646O954n4585k3398J7051L1101L3992k6602p5348K2941J07252
203H1862r913j11986k059R2378P445p5549l5120L5023O2068J3127p2378n2883
$$ plain form
119 105528 49430 -149124 -152205 72218 137505 -45765 -137283 -26038 56234 21381 -15106
130 -15106 -6060 8438 11918 24428 54515 46196 -23200 -28094 77230 82422 -75326 -113134 54690
143 54690 122376 -19047 -102283 -9577 85635 59219 -36623 -75512 12250 103301 42137 -61523
155 -61523 -27041 64515 73612 50878 34289 -21776 -53330 10062 67040 23855 -54302 -76485
167 -76485 -21681 53299 41536 -39045 -40493 29497 15254 -50592 -27877 31101 28524 9508
179 9508 -5935 -41630 -16590 80011 81615 -40081 -96108 -25984 44298 40742 -14528 -61607
191 -61607 -32142 42504 49458 -5127 -28525 -11474 19627 53619 27017 -48331 -25390 81862
203 81862 71949 -40037 -42096 50282 57727 -17822 -52942 -17919 44149 57276 -15102 -67985
215f7985N7152O9378j5568l7880k2822k6270K3845Q0091R332p9887l4436M0353
227d697L2960k483k4480k4024J7016K2093m0185k6203O5383M3174n2492l4896
239b8834K3273j618k248M7001M199p3705k6938O1476N1202j5996n1950k2466M6363
252I759M3232m7171n4799M2573M9931k8824l1049R550L478J8419M1408k2609p2564
265c8666L888O5691J1941m1965k7549N606L5173K0538m1591l0326N6446M4685
277F3871n2939n2328K3910L7982J4855k162l8459l3700L6799M9809j1439l0242
289E957r271q400P164K2686j5268k4707K5943J7398l6506m170M7962R405k5500
302A2693Q42k506k1993J3268L0682r383k6126q439K924K3245K4917k8160l8729
$$ plain form
215 -67985 -10833 58545 42977 5097 -17725 -43995 -20150 59941 69273 -10614 -45050 -4697
227 -4697 28263 25780 1300 -22724 -5708 16385 -23800 -50003 15380 58554 6062 -28834
239 -28834 -5561 -7179 -9427 37574 41773 -31932 -58870 2606 53808 37812 -14138 -36604 9759
252 9759 52991 5820 -48979 -6406 43525 14701 -16348 -6798 -3320 15099 56507 33898 -38666
265 -38666 -34778 30913 42854 889 -26660 -21054 14119 34657 -6934 -37260 19186 63871
277 63871 10932 -41396 -17486 20496 35351 33189 -5270 -38970 -2171 47638 36199 5957
289 5957 -3314 -11714 -4550 18136 2868 -21839 4104 21502 -15004 -19174 28788 38193 12693
302 12693 13535 11029 -10964 2304 32986 23603 -2523 -10962 -8038 15207 40124 11964 -26765
315b6765K1473K3353k8520j0254K7130k451j1488K2311J821k8603J8252M1388
327D7647j7500m6501q376K2047K4788j242m3972k0065M9498K6590m8846k0569
339c6501M5144J2644l2124o521J1210M676J9662R637k6653j0984K4769J3653k883
352B5729n549k7681j5740L2817J3154m6037j3133M1833P01l6129Q270L3760M337
365A6332j0721r418q317J5842J9473j5804j1849J9678j740k1707J9026K4291k5316
378I770k0464J2670q202j8218J5895R624j8517M668K1350k544r4J6384j326r199
392A1797K377j3161j4076K5957J5610l5133j2286L4158L024k8397J687Q899j5523
405a5067o282L702p814R993K8607m50j2457J1336Q420j584J4293n845l8913K623
$$ plain form
315 -26765 -5292 18061 -10459 -20713 6417 3966 -7522 14789 16610 -11993 6259 47647
327 47647 30147 -16354 -24730 -2683 22105 20863 -23109 -43174 6324 32914 -15932 -36501
339 -36501 8643 21287 -10837 -17358 -6148 -1472 18190 27827 1174 -9810 14959 28612 25729
352 25729 20180 -7501 -23241 9576 22730 -23307 -36440 5393 6094 -30035 -21765 11995 16332
365 16332 5611 -3807 -12124 3718 23191 7387 -4462 15216 13476 -8231 10795 35086 9770
378 9770 -10694 1976 -6226 -24444 -8549 1075 -17442 -12774 8576 6032 5938 22322 20996 11797
392 11797 14174 1013 -13063 12894 28504 -6629 -18915 15243 18267 -10130 -8443 456 -15067
405 -15067 -21349 -17647 -25461 -15468 13139 12689 232 11568 19988 18404 32697 26852 -12061 -9438
419i438M1517j0626m1409J5391L6327j3362l2022p455J0431K0098l35l5444q989
432c5316M3221J8847k4681P18J9621q469n704J3644j3318k1545J8334J6275k3603
445a976j5921J2017R217K703o280k5299j248L6837O136k9398O602K9142q057j0376
459D099J6618j250j7874Q292Q273j8423o427J0482j149n15J647k3320j4416K5353
473h610J1754k0682k563J3264l190J1078K5964j4426k8374K0386K4904k4873k4962
486b0330J0750J8608P476j3504l2433J684M6009N445n1935j8458K9516J5285P21
499a166M322j2932o299L2317J7899l1361j6256K0946J2781j1164j9954j4897J9790
512e974M1338j3749n6272L85M6697L618k7783n257L938M935K1039N322k2650r39
$$ plain form
419 -9438 32079 21453 -19956 -4565 31762 18400 -13622 -21077 -10646 9452 9117 -26327 -35316
432 -35316 7905 26752 2071 2789 22410 13941 8237 21881 8563 -12982 5352 21627 -1976
445 -1976 -17897 -5880 3337 6040 -240 -25539 -26787 10050 16186 -13212 -6610 22532 14475 4099
459 4099 20717 19467 1593 9885 18158 -265 -6692 3790 2641 2126 3773 -19547 -33963 -8610
473 -8610 3144 -17538 -20101 -6837 -10027 1051 27015 12589 -15785 4601 29505 4632 -20330
486 -20330 -9580 9028 16504 3000 -29433 -27749 18260 23705 -28230 -46688 -17172 -1887 -1166
499 -1166 3156 -9776 -16075 16242 34141 2780 -13476 7470 20251 9087 -10867 -25764 -5974
512 -5974 35364 21615 -34657 -34272 12425 16043 -11740 -16997 -13059 -8124 12915 18237 -4413 -5352
526e352K3642K424j5267r573r807Q320K7680o743m0726O44L3436j152j7915q5
540a0474o773p454K2897J6157k0519o529K5284J0932j1287j5170j2906J4062L4490
553C2710j4033n4579O99N5062J6424k8813k2832r559R358K8074k226l9461n447
566c4623L8331J7212j4305j2751j464J9835K4326k8129n3964J5617N8963k649
578B6399m6977p041L0006K2960K126k7009k8809J8200L6010j0497l2845l851J7923
591c405K5073J9307k3994m3881J2401M3640q818l8625m128J0275P48P635L856
604H4j1001N108J5718j1425k1681L332J3811J3197O865k7635l5056K9587O0287
617D1191n324n1715j8176J7561K2991J6028j6352l6293M608L8555M294k6175o587
$$ plain form
526 -5352 18290 20714 5447 -4126 -13933 -5613 22067 15324 -25402 -24758 8678 7526 -10389 -10474
540 -10474 -17247 -24701 -1804 14353 -6166 -12695 12589 23521 12234 -2936 -15842 -1780 32710
553 32710 18677 -35902 -35203 19859 36283 7470 -15362 -24921 -15563 12511 10285 -29176 -34623
566 -34623 3708 20920 6615 -6136 -7600 12235 36561 8432 -45532 -29915 29048 26399
578 26399 -20578 -27619 2387 25347 27473 464 -28345 -10145 25865 15368 -17477 -21328 -3405
591 -3405 21668 40975 16981 -26900 -14499 29141 20323 -18302 -22430 -12155 -11407 -3772 84
604 84 -10917 -5809 9909 -1516 -23197 -19865 -6054 7143 14008 -13627 -48683 -19096 41191
617 41191 35867 -15848 -34024 -16463 6528 22556 6204 -30089 -25481 13074 17368 -8807 -15394
630a5394J4788J7202M336l1017l0688L4877N0625k5977o0238J633M3509J6872
642B0528j6829k8403o766L5969K6332l3718l5374K1654L6126L907j8481l0714
654b5769j3099M3116M9557k4167n4629j689K9682J0683n928j2749j2072Q699J0183
667A818j5602l995L1145J7694j8408k0667j4345M01L7760L0272l9078n4682J4027
680c3660M9524J8261j5514l0427j9703J9396K7524j5067k6587J0070K0892L827
692H536m707j3206m510L4829K9832l7429n0456J6294M3552K927k6173j8841N251
705a4101K7370P738l7663j9700L7036K8521k4573l5302j0032K2929M9538J8394
717E0155n2128m6726L3600N3948j650l3128k0698P24J6833M859j8610L8K6544
$$ plain form
630 -15394 -606 16596 20932 -10085 -40773 -5896 44729 18752 -41486 -39853 3656 20528
642 20528 3699 -24704 -31470 4499 30831 -2887 -38261 -16607 19519 23426 4945 -25769
654 -25769 -38868 4248 53805 29638 -24991 -26680 3002 13685 7757 -4992 -17064 -8365 1818
667 1818 -13784 -17779 13366 31060 12652 -8015 -22360 -21959 15801 46073 6995 -47687 -33660
680 -33660 15864 34125 18611 -11816 -31519 -12123 15401 334 -26253 -16183 4709 8536
692 8536 3829 -9377 -13887 20942 50774 13345 -37111 -20817 22735 25662 -511 -19352 -14101
705 -14101 13269 21007 -16656 -36356 680 29201 4628 -30674 -40706 -17777 31761 50155
717 50155 -1973 -48699 -15099 38849 37199 4071 -16627 -15903 930 5789 -12821 -12783 13761
730A3761l153l6402p463K6191K0117J0247j0181m1766j4518M8322M1584j7904
742B8835l5628j2006J0756K6094R657k9629k2461J8746J4934j5925j4139j99P834
755a3131K2972J0139l4886k6649L4197L9843j1903l0029q176J4447K3077j150
767A8751l2278o998L8243R132m5605k6834K3375L3916J2359k3914m8471p105N9673
780D244M2405k8646m3639l242K5194K5094J070k3201l083K2217p879l2738M997
793a7207L1663K487j8975j6661j4531R994M1236J2455l7612k4332J9253K6477
805A4247Q741j1740k1724K957L0837M381k8055p826J6732O652k153j0004k7241
818b4196q442L4904K0322k5268k1102R818J4460R764k78j5117N51K3379l244l4305
$$ plain form
730 13761 10608 -25794 -33257 -7066 13051 23298 13117 -28649 -43167 5155 46739 28835
742 28835 -6793 -18799 -8043 18051 27708 -1921 -24382 -5636 9298 -6627 -20766 -20965 -13131
755 -13131 9841 19980 -14906 -41555 -7358 32485 20582 -9447 -17623 -3176 19901 18751
767 18751 -13527 -20525 17718 26850 -18755 -45589 -22214 11702 24061 147 -48324 -55429 4244
780 4244 46649 18003 -25636 -28878 -3684 21410 22480 -721 -3804 18413 10534 -22204 -17207
793 -17207 14456 16943 -2032 -18693 -33224 -23230 18006 30461 -7151 -31483 -12230 14247
805 14247 22988 11248 -10476 -7519 23318 27699 -356 -8182 8550 15202 13049 3045 -24196
818 -24196 -32638 2266 22588 -2680 -23782 -13964 496 10260 9982 -5135 -4584 18795 15551 -18754
832a8754j208L7187J7723j7061k9238k2042J5585M3630M887m7883k8479K2563
844b3090L2077J0638j6164k4945Q451L6397j56l5489J575L3694K109k4416j1057
857a0376L268J4278J6941j3681l5773q54L1375R291j8702j5175N45J9599J9561
870B0297j7669k9000J4557L4287o30j8736m063l183L025K1196L975k7314j5510
883a8768J0517P064R77J618p446k617J4390k314j8040R502K5184p403k6432q016
897b1784Q842K0860K2380j3372l8544m831L1496J4729j4308k2005j6006R771K9024
910F252j475k6041R871L3554m897k7298k347J5924J0744L06j7396j7993J7309
923c487L0266m377k2494m679O283O942J889j9300j9261J9126K6675j3589k1456
$$ plain form
832 -18754 -19962 17225 34948 17887 -11351 -33393 -17808 25822 30709 -17174 -45653 -23090
844 -23090 8987 19625 3461 -21484 -13033 23364 23208 -12281 -10706 22988 25097 681 -10376
857 -10376 -7108 7170 24111 10430 -25343 -26197 5178 14469 -4233 -19408 -18863 736 20297
870 20297 2628 -26372 -11815 22472 21842 3106 -957 -4140 -1115 20081 24056 -3258 -18768
883 -18768 -8251 -1187 -210 1408 -6038 -8655 5735 3421 -14619 -5117 20067 12664 -13768 -21784
897 -21784 -12942 7918 30298 16926 -21618 -26449 5047 19776 5468 -16537 -32543 -22772 6252
910 6252 4777 -21264 -11393 22161 17264 -10034 -12381 3543 14287 14593 -2803 -20796 -3487
923 -3487 26779 22402 -92 -4771 1512 8454 10343 -8957 -28218 -9092 17583 3994 -17462
936a7462J1281J6871J919r25j0197j6831N226J8176l839j0509M311K274j144P108
950F259k30j1397M338J1342j2183j2793J0530J1257K233L880o526j4743P978K0941
964B0886n232j7968m169J363O563J1614q327k2603Q882K5137r709k4063N279J6870
978D523K833l885q720o128J2826J5343j2106j5013O488Q582j006J539n852p293
992g869J5720J2807k3767j8708K0549J8480j1378j0997P57L606J0871O936j3249
1005C758r014Q186q60j0317M325N602q326P28Q032m995l102J1973j139j4554k50
1020i953O936k019N877P035q459n037J2537M229p394J099l613j5081L031J7701
1034F889m457j3858O513Q583k566N21j72n616L850M763j0792l856J6025O136j0517
$$ plain form
936 -17462 -6181 10690 12609 11684 1487 -15344 -10118 8058 4219 -6290 -1979 295 -849 6259
950 6259 6029 -5368 -1030 10312 -1871 -14664 -4134 7123 9356 13236 6710 -8033 -55 20886
964 20886 15654 -2314 -6483 -5120 1443 13057 4730 -17873 -8991 16146 6437 -17626 -12347 4523
978 4523 7356 3471 -5249 -11377 1449 16792 4686 -10327 -3839 4743 3737 5276 -576 -7869
992 -7869 7851 20658 -3109 -21817 -1268 17212 5834 -5163 -4406 -800 10071 17007 3758
1005 3758 -5256 2930 2070 -8247 -3922 1680 -6646 -5918 2114 -2881 -5983 5990 4851 -9703 -9953
1020 -9953 -3017 -5036 841 7876 -583 -5620 6917 11146 3752 4851 1238 -13843 -10812 6889
1034 6889 2432 -11426 -4913 3670 1104 1625 1453 -4163 -313 4450 -6342 -10198 5827 11963 1446
1049A446k168J109m239P330O902j8589j3702J6895J1317j1234l665Q811J825o61
1063A377N2o198L092J3512m640j5730P052J3743m887n282J959o636l527R569l746
1078b90j2913N899J3077o705o775O457L292K005M503q869r441J4143J2070j2962
1092C491o663J1832J499q516M89r34o215K700K102r932j22J1217n93k949P135
1107D541j620q339P693Q105r372k727R131l442n948R847K682j2061r56O447n703
1122a722n644K802j672J670P690o163r389J4056J5295j0790j0877O951L920l98
1136E729L941o682j1293R299J1013j2817j1552Q112O242k062m971r604j108J9863
1150D110Q682k2242r322K0920J1596p887m636j209J387R227K99j6410l590J3480
$$ plain form
1049 1446 -722 387 -3852 3478 10380 -8209 -21911 -5016 6301 -4933 -8598 213 2038 1377
1063 1377 1429 -4769 -1677 11835 7195 -8535 -1483 12260 7373 2091 4050 -2586 -6113 3456 -290
1078 -290 -13203 -7304 5773 -932 -7707 -1250 2042 4047 8550 -319 -9760 4383 16453 3491
1092 3491 -3172 8660 10159 1643 2132 1198 -5017 -2317 -215 -10147 -10269 948 355 -2594 4541
1107 4541 2921 -5418 2275 10380 1008 -1719 7412 3970 -1978 7869 10551 -1510 -2466 3981 -1722
1122 -1722 -7366 -4564 -6236 -4566 3124 -3039 -12428 1628 16923 6133 -4744 2207 6127 5729
1136 5729 9670 2988 -8305 994 12007 -810 -12362 -4250 1992 -70 -5041 -14645 -15753 4110
1150 4110 12792 -9450 -18772 2148 13744 5857 1221 12 1399 10626 10925 -5485 -9075 4405
1164D405k28j1604j592J064Q01J0952J739j7949k774J9575M160j1956j164L331
1178a240N80P316L956j0078k616R380j334p769R3m030o154Q973P123j4140n992
1193a5932J6676P595o326k835j390r76J1679M439j6881o111J7167Q432r400q137
1207b000l394L675J4322k245k7048p017K5286R720j6062q703O532J0302J0245
1220A3613m591j6538L452K0456j352j9972l585Q744O705M862q003j8889M348K5467
1234A4717j155k3980n890J2079O902J477n632r422Q716J8518l930j4917K704P882
1248H069j310J673k951j5365j156J9003K887j4619k649O252K088L924k227j2143
1262h524J319J6454j064j5486k3J2103Q164M000j1213k1182M825K7542M1k7655
$$ plain form
1164 4405 4177 -7427 -9019 -7955 -7154 3798 5537 -12412 -15186 4389 8549 -3407 -4571 -1240
1178 -1240 -660 6656 10612 534 -2082 7298 5964 -1805 -1712 -5742 -11896 -2923 4200 -9940 -15932
1193 -15932 744 8339 2013 -822 -2212 -3188 8491 12930 -3951 -10062 7105 15537 6137 -2000
1207 -2000 -5394 -1719 12603 10358 -16690 -23707 1579 11299 -4763 -13466 -6934 3368 13613
1220 13613 9022 -7516 -4064 16392 15040 -4932 -8517 227 6932 11794 3791 -15098 -10750 14717
1234 14717 13562 -10418 -16308 -4229 2673 4150 -1482 -10904 -2188 16330 12400 -2517 187 8069
1248 8069 6759 8432 5481 -9884 -11040 7963 10850 -3769 -6418 -166 1922 5846 3619 -8524
1262 -8524 -7205 9249 8185 -7301 -7324 4779 12943 16943 5730 -15452 -10627 16915 16956 -10699
1276a0699j0663J2383J2457M931q157j3749P040J9223n300k0746K716J7952M260
1289A1648p050j2056o234J7322K2860j3283l0440J277K1691N529j0119j1615m260
1302a4730J4258J4769j3765j8024J1988J7744m030j0370m095l233R640J5915p328
1315H739k0108J386J3596J725l677m321n167O104J0062r316j2547J2518J5155
1328A4149o406j1613n553r33J5962J9762j2912l0016J267K4114R683q402j5318
1341f216j0129J0463J7487p516j6703R106J6799n267j2949m197M566J5384R494
1354B0322k1374k3797J6244K9181j769k0314r587M033J4747O691j8274j5270J7940
1367a227J9037j1630j6100K635J0438J1639K941j9052j7729J3585K0553l621j2118
$$ plain form
1276 -10699 -21362 -8979 3478 8409 252 -13497 -6457 12766 7466 -13280 -10564 7388 11648
1289 11648 4598 -7458 -13692 3630 26490 13207 -17233 -15956 5735 11264 1145 -10470 -14730
1302 -14730 -472 14297 532 -17492 -5504 12240 8210 -2160 -6255 -9488 152 16067 8739
1315 8739 -11369 -9983 3613 5338 1661 -2660 -7827 -1723 8339 -977 -13524 -1006 14149
1328 14149 7743 -3870 -9423 -10356 5606 25368 12456 -17560 -16293 7821 17504 9102 -6216
1341 -6216 -16345 -5882 11605 4089 -12614 -3508 13291 8024 -4925 -9122 -4556 10828 20322
1354 20322 -1052 -24849 -8605 20576 18807 -1507 -11094 -7061 7686 14377 -3897 -19167 -1227
1367 -1227 17810 6180 -9920 -7285 3153 14792 17733 -1319 -19048 -5463 15090 11469 -649
1380f49l306M96N897N403r019p185J4153P211j7862j0146J2314J2797N642j496
1394A4250j8829j4112J6931K2870n450j8891r258K694J4306J1883j3054j7416
1406a4076Q849J3776r908j0780N271Q693P566P36j5614r837K1336J9305j5215
1419A0102k1813J94J2524J0212k318j7773n349K3951J2432k4256j9795J1687J8531
1432H329M290j0041j8747l715K5677J8600j4938j6259L052O053J66j167p007j685
1446g392J1865j63j8255q23K1292Q150j0659j0892p893K250K0698J1751j6462
1459C467j5165P028J2592Q088m88j4676j1280J2313R180j3390r342R511O810j738
1473B910l588r483r07J7564Q696j8435j2570J2222J2073K5n714q440J633J7327
$$ plain form
1380 -649 -3955 -3459 2438 7841 -1178 -8363 5790 13001 -4861 -15007 -2693 10104 15746 14250
1394 14250 -4579 -18691 -1760 21110 15660 -3231 -12489 -9795 4511 16394 3340 -14076
1406 -14076 -5227 8549 -1359 -12139 -6868 1825 9391 10127 -5487 -15324 6012 25317 10102
1419 10102 -11711 -11517 1007 11219 8901 -8872 -14221 9730 22162 -2094 -21889 -10202 8329
1432 8329 12619 2578 -16169 -19884 5793 24393 9455 -6804 -3752 2301 2467 1300 -5707 -7392
1446 -7392 4473 4310 -13945 -14768 6524 14674 4015 -6877 -14770 -12520 8178 19929 3467
1459 3467 -11698 -4670 7922 16010 15522 846 -10434 1879 11059 -2331 -11673 -2162 4648 2910
1473 2910 -678 -10161 -11068 6496 15192 -3243 -15813 -3591 8482 8507 2793 -5647 -4014 13313
1487A3313K364k3623q715K0743J3588j0467j5701q692Q789K2196M402k2463j0725
1500a4991J3868J1246p59k418m407j025Q589j616j6573J586K0114K36j9315q064
1514a3529O068R721R479n247j9261l607J6242O532n384k141j759K181J1962K104
1528A3361j4678k046J4017J156j1668n081n35J449J1063M128j4714p789J1034
1541c03O496m835k575k916l15Q444J24j2099L306K0602K150j8804j1062L981J1215
1556C409J1068q861k3939k630K2290R619r163n716m81J194O270J52r388M280J4271
1571A2375m859j6018L026J4293M596l899j1043j0562O260J5074m701j3515R09
1584h064N279m27M010O78p420J717J1776k657j1124K170O654M85K260m25r154
$$ plain form
1487 13313 15677 -7946 -16661 4082 17670 7203 -8498 -17190 -8401 13795 18197 -4266 -14991
1500 -14991 -1123 10123 9364 6946 2539 1514 10103 8487 -8086 -6500 13614 13850 -5465 -13529
1514 -13529 -7461 2260 11739 6492 -12769 -16376 -134 6398 1014 -1127 -2886 -705 11257 13361
1528 13361 -1317 -3363 10654 11810 142 -4939 -5474 -4025 7038 11166 -3548 -11337 -303
1541 -303 6193 1358 -1217 -4133 -4448 3996 4120 -7979 -4673 15929 18079 -725 -11787 -7806 3409
1556 3409 14477 5616 -18323 -20953 1337 10956 1793 -3923 -4404 -3210 3060 3212 -6176 -1896 12375
1571 12375 7516 -8502 -5476 8817 13413 9514 -1529 -12091 -5831 9243 4542 -8973 -8064
1584 -8064 -2785 -3212 798 1476 -5944 -4227 7549 4892 -6232 -4062 2592 3077 5337 4912 -4242
1599d242j695R563N96o284L32r0l592M023K388p129K252J1860l062j3226L013
1614e293J0671L892q17o922j0716N310J6897k434j5033k459N883K000K212r11
1628B280q228K325J0447m331j1182O182J1381k136o058l239m71Q837Q224j0204
1642C827j1785P556Q516n392m133O80k816L008O780o357q157P738P222n274k628
1657a215K927k008L98N156k938m173M331P85o643K507N565n154l493N934j564
1672D15o389M515M567l613o96J596m346K357R313k949r243K703N800l109n0O53
1688A524n670R93Q322m103q079N528O932m612l619J436j98K896L737o674m779
1703f366R757M774r770l308O976K25k069N28m248l645Q261M181q609k324O273
$$ plain form
1599 -4242 -5937 3626 4222 -2062 -1730 -1820 -5412 -1389 999 -6130 -3878 7982 4920 -8306 -5293
1614 -5293 5378 9270 8453 1531 -9185 -3875 13022 10588 -4445 -6904 -1021 979 3191 2280
1628 2280 -5948 -3623 6824 2493 -8689 -2507 8874 6738 680 -2559 -3030 5807 14031 3827
1642 3827 -7958 -402 8114 2722 -1411 -731 -3547 -539 6241 -116 -8273 -535 6687 1413 -1215
1657 -1215 1712 -296 102 5258 2320 -1853 2478 3263 -3380 -873 4692 -462 -3955 1979 415
1672 415 -5974 -1459 3108 -505 -1201 395 -3951 -1594 7719 4770 -4473 -1770 4030 921 871 1524
1688 1524 -4146 -3153 5169 1066 -7013 -1485 5447 835 -2784 -1348 -1546 1350 5087 -1587 -6366
1703 -6366 3391 8165 -1605 -4913 2063 2288 219 747 -3501 -7146 1115 5296 -3313 -5637 636
1718F36M23k085K610j536j888M914p84q316L589Q768m896p256M109J937k537L289
1734I77O45o126R83N332m548k366O450M54n283K472K910k971K565M016n937l866
1750d293O594m63o542L241L669l702K23M130k853o75N071k128n230M705K467o796
1766b582Q44P680j891m381K745r2k951L248m65q130K22P377k043m404L711K703
1782A591j51K410k068p077N458Q569p204q944N730P168j696j223j667l555M196
1797A537M580q356o183P031M262m781q98J842j028N638L210q438n064Q914L169
1812E435p670k225L209n95K335J680o229j456P290n71p471K231M189l016J480
1827a384M596l100l694O433K535m767L03J176l433J953M646o196n257N857K537
$$ plain form
1718 636 1059 -1026 1584 48 -1840 3074 2290 -6026 -2437 6331 1435 -5821 -1712 225 -2312 977
1734 977 1622 -4504 -3521 1811 -2737 -5103 1347 1801 -3482 -1010 1900 -1071 1494 5510 -427 -4293
1750 -4293 2301 1838 -4704 -1463 2206 -1496 -1273 2857 4 -671 4400 2272 -2958 1747 4214 -2582
1766 -2582 -1738 5942 4051 -330 2415 2323 -628 2620 2155 -5975 -5753 1624 -419 -4823 -1112 1591
1782 1591 1440 3850 1782 -5295 163 8732 1528 -7416 -1686 5482 3786 2563 896 -2659 1537
1797 1537 6117 -2239 -8422 -1391 2871 -1910 -2808 -966 -1994 3644 6854 -1584 -6648 2266 5435
1812 5435 -2235 -4460 -1251 -1846 489 2169 -4060 -5516 1774 1203 -6268 -4037 152 -2864 -1384
1827 -1384 3212 112 -3582 2851 5386 619 922 2098 -1335 618 5264 -932 -6189 -332 2205
1842B205n079n97O2j963M530N297p858n834Q951O215n822m412P24J853N241K014
1858E527r342m189J0706M208q929n204K592K430L917k67r451k87J3560M132j0985
1873a582m377O718L047j47k931o314J453J0576p33j0535J8O448n75j691q91n622
1889g138r85R516J632p594K71O338P82M22M50n306p20P533K65q492L40N318n82
1906B050K79R79o726l041R111K443q902l311M988L705K622p15o833K36J1055K86
1922H226j1815k346Q157L029j552m479o800K835J3202j292j4102k927R557M191
1936C884k244l473l143M540R675m056j2042L163J1296o19p673l596m67N348Q097
1951H690m897j2354J513R743o6m652j847j392L511O810l153p985M412Q834l359
$$ plain form
1842 2205 -2874 -3471 -3409 -5372 -842 4455 -3403 -9237 -286 5929 107 -4305 -3581 -1728 3513 5527
1858 5527 -3815 -8004 2702 6910 -2019 -7223 -4631 -2201 1716 1449 -8002 -8289 5271 9403 -1582
1873 -1582 -5959 759 3806 3659 728 -5586 -4133 6443 5710 -4825 -4807 1641 1066 -625 -1516 -7138
1889 -7138 -8123 1393 3025 -4569 -4298 2040 2822 3244 3694 -1612 -2332 5201 5466 -3026 -2686 2632 2050
1906 2050 2329 3308 -3418 -6459 2652 5095 -3807 -7118 -2130 1575 4197 3482 -3351 -3115 7940 8226
1922 8226 -3589 -5935 2222 5251 3699 -780 -7580 -4745 8457 7165 -6937 -9864 -307 3884
1936 3884 1640 -1833 -4976 -436 9239 5183 -6859 -3696 7600 6981 -692 -4288 -4755 593 8690
1951 8690 3793 -8561 -7048 2695 2629 -2023 -3870 -5262 -1751 5059 1906 -6079 -1667 7167 3808
1966C808n410l42j081J964O156j629r984k71Q820J066l342k533l304K200P893
1981D011k735r888M079J0756l07o939k542k51N300Q675n706j4073J077J2846L146
1996G449o499m699j199M622O672n209r359O280J1000m710r646K75O480O156J004
2011H617r754j0043Q938J2595l986j0668p99K827L398K946n540o465O422Q199
2025F687o015p015L825N261J848L52n658o199O385Q339m613o063J497J183J419
2040A233K974l475o062N252P099o490p722L523O009L531M81p065p314P310J1609
2055A0893l449r993k870K829N594L557o009o459P215Q369p755q616N364P489L02
2070F461m202p501k065J2095R121r236j1293L394P711J657k909p413k798R272
$$ plain form
1966 3808 -1602 -1944 -3025 -1061 5095 3466 -6518 -6789 2031 3097 -245 -2778 -6082 -3882 4011
1981 4011 1276 -8612 -4533 6223 5916 -1023 -3565 -3816 1484 10159 4453 -9620 -8543 4303 7449
1996 7449 950 -3749 -4948 -326 6346 1137 -8222 -1942 9058 4348 -5298 -5023 1457 7613 8617
2011 8617 -1137 -11180 -2242 10353 6367 -4301 -5100 -2273 1125 4071 -1469 -7934 -1512 6687
2025 6687 672 -6343 -2518 2743 4591 4943 -715 -6914 -529 7810 3197 -2866 -1369 -186 1233
2040 1233 4207 732 -5330 -78 7021 531 -7191 -3668 2341 5872 6353 -712 -8026 -716 10893
2055 10893 7444 -2549 -5419 -2590 3004 6561 552 -5907 1308 9677 1922 -6694 -1330 6159 6461
2070 6461 2259 -5242 -7307 4788 13909 4673 -6620 -3226 4485 6142 3233 -4180 -6978 2294
2084B294N427j0236o882Q787O844k363m661m458n55Q389M487q294n728O211L453
2099B715k501m51p2j690M041J565q675l284Q633N110l654l807l562K60R414O531
2115A0573q256q709K943M956J817N41m609m740N837O058p498m924P242N324l636
2130B919n827k958K477R687K813j1517o056R256P434l428m612k924J216P038p
2145E511j1103l378J2019N587p789n900j36M219O564P59j0111k627P619K669l746
2160A57N6K120j029P24p02n650J555R619n70r274l525L409M168N081m61r021l495
2177f838P896N021k648j034k208j725M034L035n665k327P341J697p446k832K623
2192a076K897M391j662q998k130R645L763n557k834J768J660L123j430p049J077
$$ plain form
2084 2294 7721 -2515 -9397 -610 6234 3871 -790 -5248 -5803 2586 7073 -1221 -6949 -738 2715
2099 2715 214 -237 -309 -1999 2042 3607 -5068 -8352 281 5391 1737 -2070 -5632 -5372 4042 10573
2115 10573 2317 -6392 -3449 1507 3324 3865 -744 -5484 353 6411 -1087 -6011 1231 6555 2919
2130 2919 -2908 -5866 -3389 6298 9111 -2406 -8462 794 8228 4800 188 -2736 -1520 5518 5511
2145 5511 -5592 -8970 3049 8636 847 -5053 -5189 -970 5594 6353 -3758 -6385 1234 3903 157
2160 157 213 2333 1304 2028 1326 -4324 -2769 6850 6280 -2994 -6519 -3110 1058 6139 5678 -3343 -6838
2177 -6838 1058 6079 3431 2397 189 -1536 2498 5533 -132 -2459 4882 6579 -867 -3699 -1076
2192 -1076 1821 6212 4550 -4448 -6578 3067 6830 1273 -1561 207 1867 4990 3560 -3489 -2412
2207b412J0242P9j0752l987M619N309K727l507r122L12J0019J827p036r68L322
2222F72n65l05Q25j747K534N728m256q816K298P211J352k807l968m700K550Q440
2238D446m21o555Q4K085j392K195K544l645j404N386J3n148J197L277o69Q6r49
2255A130n037N13O769Q9o242j1L054P6M56p1l934J514P233j593q310P42P924J483
2273E785j991m550m720L455P655j995q001L83N076p81r45R10j057J122L185l879
2289c48n068N644O433k658l908j0K7K594M079m448o544L022M048k903j424K613
2305A149r85q82L071j152l573K724L233k835j415J506j365O85M792j056n339J413
2321b9K290k774m17K236j931j201M122j460m462L023N474j044l273j271j212K878
$$ plain form
2207 -2412 7830 7909 -2843 -6830 -2211 3098 5825 2318 -6804 -6492 3527 5354 -1682 -2650 672
2222 672 107 -198 627 -1120 1414 7142 2886 -5930 -3632 3579 4931 2124 -1844 -6544 -3994 4446
2238 4446 4025 -2530 -2446 -361 -1753 442 2986 -659 -2063 3323 3336 -1812 -615 2662 1993 2079 1130
2255 1130 -3907 -3394 3375 3464 -2778 -2789 265 341 797 726 -3208 -1694 5539 3946 -4364 -3622 4302 5785
2273 5785 3794 -756 -5476 -2021 5634 3639 -4362 -3979 1097 316 -629 281 -776 346 3531 -348
2289 -348 -5416 228 6661 4003 95 85 112 2706 6785 2337 -4207 -1185 2863 -40 -1464 1149
2305 1149 164 -718 2353 1201 -2372 352 3585 750 -665 841 -524 161 4953 3897 -1442 -29
2321 -29 2261 -513 -930 1306 -625 -1826 2296 836 -3626 -603 4871 3827 554 -717 -1929 949
2337I49N517k784o820K155M432j838j617J318j909k97K071k260l529M396M411
2352D195m703l301K427J888N20J776k445l176M142K983m944j489M241r1k948O44
2368b81n59r53L016J342m183q9L290j791k039L386N64l162P75J756k132J500L297
2385C737l449l649K878P04l150J227K466k406j670K612o49J222L267k360m898
2400d118K307M476k236j321K266j057j257K740J21k996K350J165m983j801M387
2415D3Q65j552P75p29k023L967K229m805p03M040j227l334J978J567j031J308
2431A368j22l550J277L882j913l691K905J379k368M20J473p61J231L132m116l643
2447c097M505L172l637j725J025o44P15J992k964j760M199j05m381P16L594j443
$$ plain form
2337 949 6466 3682 -3138 -983 3449 1611 -6 1312 -597 -894 1177 -1083 -4612 -216 4195
2352 4195 -508 -3809 -1382 506 1026 2802 357 -2819 1323 4306 -638 -2127 2114 2023 -925 -281
2368 -281 -840 -1793 1223 2565 -1618 -1707 1583 -208 -2247 1139 1703 -1459 -684 1072 -1060 440 3737
2385 3737 288 -3361 -483 221 -2929 -1702 764 -1642 -3312 -700 -1349 -127 3140 780 -4118
2400 -4118 -1811 2665 429 -892 1374 317 -940 1800 1921 -1075 1275 2440 -2543 -4344 43
2415 43 908 -644 131 -598 -2621 1346 3575 -1230 -1933 2107 880 -2454 -476 1091 60 1368
2431 1368 1246 -2304 -1027 2855 942 -2749 156 1535 -833 -413 1060 299 1530 4662 546 -3097
2447 -3097 1408 4580 943 -782 243 -401 314 2306 -658 -2418 1781 1676 -2705 -1989 1605 162
2463A62n04J362k414j032M721L52l850J82K238j741o13K439j065k627K547k1k614
2480b478J702K021k745k70M123j803l052K893K228k378q81J136k166J641L293
2495C264l444l739M133K328l165j439J300o31J468K032l928j950N435K816n169
2510f89j627K528Q51N65l64l904q77N797Q00o291p47M479M7j467K40k148j28M643
2528A708K77n442L60M734n02j984N65j741J8L455k85n144J184L799j983j154J443
2545f92j241j507M039J122m222L96L084n30l56J709k647j269M549J001n052n23
2561b139L260L33q14L95k976o62N324J068n932j266M473J597n36j238k533M59
2577a187O414q49p021L3N697O2l610j275j057K164M359j861o482J205N689j09
$$ plain form
2463 162 -342 1020 -1394 -2426 2295 2647 -1203 -1021 1217 -524 -1137 1302 237 -2390 157 136 -2478
2480 -2478 -776 1245 -1500 -1770 2353 550 -2502 391 2619 241 -640 496 -1670 -29 3264
2495 3264 -180 -3919 214 2542 -623 -2062 -762 -1393 75 2107 -1821 -3771 1664 4480 -689
2510 -689 -2316 212 1063 1628 1264 -2640 -3517 2280 3080 -3211 -3958 521 568 -899 -659 -2807 -2935 1708
2528 1708 1985 -3457 -3097 1637 1135 -849 -284 -2025 -2007 1448 1163 -3981 -2797 1002 -981 -2135 -692
2545 -692 -1933 -3440 599 1721 -2501 -2105 979 449 93 1802 -845 -2114 2435 3436 -1616 -2139
2561 -2139 1121 1454 640 1035 -1941 -2603 2721 3789 -2143 -3409 1064 2661 2125 887 -1646 -1187
2577 -1187 5227 4378 -2643 -2610 3087 3149 -461 -1736 -2793 -629 3730 1869 -4613 -3408 2281 2172
2593B172l093n20n7J423L019j633n332K336N517k313l933L65M70R29K234j825
2609b41m744J699M800j004k226J505n72j49K926l84l979J103M172j423k368N22
2625c63K36n25L849j176n964O96N198J65l052r46lJ277M341j648n772K142O051
2642D506j448n073m30J864J879J996l707n693L390O402j713n466l15J913J336
2657e59J713k652l610M119N664l794m929J867L994J33m38l380l214M403M791m104
2673Dm122K189J412k76J216j114l005K348M192l257l009L188J826p53P13j586
2689c4k910K650M302k728l881O06J752K59J568j640m351L379N073k621m399J867
2705a108K980P41k41k991l141M276N141l599n500J963K926J08m41k851k251M280
$$ plain form
2593 2172 -921 -1441 -1498 -75 2944 1311 -4021 -1685 3832 1519 -2414 -2049 -1579 -650 1584 -241
2609 -241 -4985 -3286 1514 510 -1716 -211 -783 -932 1994 1610 -2369 -1266 2906 1483 -885 -363
2625 -363 -127 -652 3197 2021 -3943 -3247 1951 2116 -936 -1882 -1885 -608 3733 2085 -3687 -1545 4506
2642 4506 3058 -2015 -2445 -581 1298 3294 -413 -6106 -2716 3686 1973 -3493 -3808 -1895 -559
2657 -559 1154 -1498 -5108 -989 4675 881 -4048 -2181 1813 1946 1508 -1872 -5086 -683 4108 4
2673 4 -4118 -1929 -517 -793 423 -691 -3696 -1348 2844 -413 -3422 -234 1592 839 1552 -34
2689 -34 -2944 -294 4008 1280 -2601 -1995 -243 16 1584 -56 -4407 -1028 4045 1424 -2975 -1108
2705 -1108 1872 2613 2372 -619 -3760 516 5657 2058 -3442 -1479 1447 1555 1114 -1737 -3988 292
2721B92L710n155m297M798M626j864k268j971o6M563K744n182m279M119L407k118
2737A059j149q05o70K864J824m363k747M443K260k865p47M3p47L135K655m111
2753G9k596K640J918j920m59k21k136K575K591l912l113M075L380k020j947j464
2769b530p64M516L667m688m484L728L405j504r80j135j104K675J892n198k593
2784e097N984L110m197l139N27J637M069P87n958k599N983K771l645j351O87L49
2800h2J557K09m646o33N866P02m905j578K319Q48J709N08l818j480M487R97l008
2817i48K98K170j798J45J353k716p11M106Q87m734j169J716O05K828J054m934
2833a848k782M873K674k232r00L04o84J464J714l134j015M885K75n649j086K629
$$ plain form
2721 292 4002 -1153 -5450 -652 3974 2110 -158 -2129 -2195 2368 5112 -70 -4349 -230 3177 1059
2737 1059 -90 -895 -1565 1299 3123 -1240 -3987 456 2716 -149 -896 -853 -1600 1535 4190 79
2753 79 -2517 123 2041 121 -338 -559 -2695 -120 2471 -1441 -4554 -479 2901 881 -1066 -2530
2769 -2530 -3294 1222 4889 201 -4283 -555 2850 1346 366 -769 -1873 802 2694 -2504 -5097
2784 -5097 887 3997 -200 -3339 -2812 -1175 2894 3681 -2277 -4876 1107 3878 233 -1118 -431 -82
2800 -82 1475 1684 -2962 -3595 2271 2973 -1932 -3510 -1191 -343 1366 1874 -1944 -3424 1063 2060 -948
2817 -948 -650 1520 -278 -133 1220 -1496 -2207 1899 2786 -1948 -3117 -1401 -796 2032 3086 -1848
2833 -1848 -4630 243 2917 685 -215 89 -595 869 2583 -551 -1566 3319 3594 -2055 -3141 -512
2849e12K049J285j317m840n54O758J769n332q40K161O11L25p6k926Q43M484p71
2866C117n758k51M153Q06j160p85k651o3M769J28m129R58K586j450j030J472m78
2883B34J77K256j586m089J133L557n30r70l78k663k56M810R52m028M8J318p17
2900g32R85J636k007j362L268K78l778K31L455l5j125o66k898K98N422m45n210
2917b685j92L332N62j265N37j391P07L120j479m509J258M793r24k068j053q96
2933b153J006L604j581m155J235L223j831j717K491M49m33J128j032k613K528
2948A49L406k318k493J038k74o01L118n51l162N15K182j645n26K501j072j686
2964a419K307K74k195R20K498j486r23J000j146l82K934k37m097N68K955r20j404
$$ plain form
2849 -512 1537 2822 1505 -3335 -3889 2869 4638 -694 -1534 627 1238 1563 1487 -1439 -596 3888 3117
2866 3117 -2641 -2892 1261 2067 907 122 -2529 -2592 2177 2305 -1824 -866 1720 270 -760 712 234
2883 234 411 2667 1081 -3008 -1875 1682 1152 182 -196 -2859 -3115 1695 2647 -1381 -1333 -15 -732
2900 -732 253 1889 -118 -1480 1788 2066 -1712 -1481 1974 1939 814 148 -2750 -2452 2970 2525 -2685
2917 -2685 -2877 455 1017 -248 289 -1102 -395 2725 1246 -3263 -2005 2788 1864 -204 -1257 -2153
2933 -2153 -1147 2457 876 -3279 -2044 1179 -652 -2369 122 571 138 1266 234 -2379 149
2948 149 3555 1237 -1256 -218 -492 -1093 2025 1474 -1688 -1173 1009 -636 -1162 1339 267 -1419
2964 -1419 888 1162 -1033 -113 2385 899 -24 976 -170 -552 2382 2145 -1952 -1384 1571 651 -753
2981g53J347q83k79K338n91l727K060L509j552k307P38K24O27K209j570l710J653
2998f67K882k279j776K419K62j456O36m43j227K572K633l579j788K420Q94q44
3014F59R99k72k455R44K035k207k67K500j299k631J384J095j001L34J553k472
3030a101J60J744m99j170K532L10l392L48K343r40p37Q09p55j617J786Q65k683
3047a997J267K110k099k131K481N43l69J209m66l194J895L098k232j643K271l75
3063C68k316R33J180j038R80Q04l189o22M233J37k320N16R70j721J246J350j700
3080a89k95K204j002k972K122K318k264p47J149j853L57K639j482j786K170J146
3096A515k748M22K265o80j112J117j156j446K777J085k746n25K022j214r86K138
$$ plain form
2981 -753 594 -289 -568 1770 1179 -2548 -488 3021 1469 -838 -100 124 751 2960 1390 -2320 -667
2998 -667 2215 -64 -1840 579 841 -615 21 -422 -1649 923 3556 -23 -1811 609 1503 659
3014 659 1658 1386 -1069 -125 1910 -297 -564 1936 637 -1994 -610 485 -516 -182 1371 -1101
3030 -1101 -941 803 304 -866 1666 1976 -1416 -1068 1275 335 -402 407 -348 -1965 -179 686 -1997
3047 -1997 -730 1380 -719 -2850 -369 174 -195 1014 548 -2646 -751 2347 115 -1528 743 368
3063 368 -1948 -1015 165 -873 107 911 -2278 -2900 1333 1470 -850 -334 636 -1085 161 1511 -189
3080 -189 -484 1720 718 -2254 -132 2186 -78 -825 324 -1529 -1172 1467 -15 -1801 369 1515
3096 1515 -1233 -811 1454 774 -338 779 -377 -1823 954 2039 -707 -1232 790 -424 -1410 728
3112G28q21j074J545J49k558J319K726j301j936K144q6j671J758O57j780J03J302
3129A204j891j38K527j150k131J134J460j483L03J938j780r36K468q59k073K205
3145G98J741k361q35J255r17N56J563k109j830K159J945k851o64K046l30q14J446
3162G98j442r20L119R70l357q93K744j77j158M10m21j565K551L04k893L86K433
3179H89r25j527J129J10p94J824O05k714K16K672j198j206J526j59j934J434R95
3196I43k147j25J762q96j025J901k45j886J925J119k290n79K282k35r73R74r56
3213d51j373K631J141l253j307L155L7j242P1n36m66K727M24l175k59L439L29
3230A892k086jr9l42K066J09l546N73L491n24l098Q32O48j83J427j13k943Q90
$$ plain form
3112 728 -93 -1167 378 527 -2031 -712 2014 713 -1223 921 835 -836 922 1579 -201 -98 1204
3129 1204 -687 -825 1702 552 -1579 -445 1015 -468 -165 1773 -7 -943 1525 666 -1407 798
3145 798 2539 178 -657 598 -319 237 1800 -309 -2139 20 1965 -886 -1550 496 166 -648 798
3162 798 -644 -1564 1555 2525 -832 -1725 1019 842 -316 94 -327 -1892 659 963 -1930 -1544 889
3179 889 -36 -1563 -434 -324 -1118 706 1311 -1403 -1187 1485 287 -919 607 448 -1486 -52 943
3196 943 -1204 -1329 433 -463 -1488 413 168 -1718 207 1326 -964 -1543 739 504 -469 505 -451
3213 -451 -1824 807 1948 -1305 -2612 543 580 -662 -591 -1127 -1593 1134 1558 -1617 -1876 1563 1892
3230 1892 -194 -195 -294 -636 1430 1539 -2007 -1434 2057 1533 -1565 -733 -85 -268 1159 1046 -1897 -1007
3248a007L217r94k052J458K72p54J188J78k529M28K583j371k207J637N53j366
3264g66J077O57k430J73K578o16j276Q43l3j173J768R81k182q94L112o17j931
3281g29O66J88n58J317J68l086L11L799m41k637K84P20J68J217j90k795M78L254
3299B134n01l199Q25J420j26L07j020k102J474L035j457k961J362J376m80L64
3315D51P8j715R05K072j159k633J817J566j490m00K81j556P95K108j246k136J340
3332i22J158j331Q98R08k252J22L073j071k089J426Q46q23L19k01j997Q47L109
3349B020j664k487Q56J554Q1N04p48j837R46L352j270l290J269K242m80n56m69
3366B3j243J554K446j961l486J625K546j214p74q3o72J191K424k123k459K342
$$ plain form
3248 -1007 2210 1216 -836 622 894 140 1328 1506 -1023 -595 1988 617 -1590 47 600 -766
3264 -766 311 968 -1462 -1289 1289 673 -603 240 207 -966 802 1783 -399 -1293 1819 1202 -729
3281 -729 -63 125 -433 884 1052 -2034 -1723 2076 1635 -1002 -718 2 170 1387 1197 -1598 -1120 2134
3299 2134 1633 -1566 -741 679 553 860 -160 -2262 -788 2247 790 -2171 -809 567 87 451
3315 451 529 -1186 -281 1791 632 -2001 -184 1382 -108 -508 -227 -1783 -988 1120 -126 -2262 -922
3332 -922 236 -1095 -197 711 -1541 -1419 1654 583 -1506 -80 766 -57 262 61 -1936 -1089 2020
3349 2020 356 -2131 -1275 279 360 864 116 -1721 -775 2577 1307 -1983 -714 1528 1048 492 23
3366 23 -1220 334 2780 819 -2667 -1042 1504 290 -484 -567 -1239 -48 2376 253 -2206 136
3382A36K225j932j062O81n94J301J176j784j960K015J109j644k00M65p69M48J818
3399A429j214k113K284J249j855j18J061j078N30J858j276k263J468J573j459
3414G6l84N95j342J008J895j565k601K417J903j398j006M34m47J327J497k237
3430A72k243K203J880j834j031Q47m87N64J164k523j605L272J891k630j172R68
3446e64O80P96O88k576j109K417J569k605k84J270k11n72J031j274j296K542O55
3463A157k266m82J584j90N26O90j226j433J793J502j895k97P97m71l42J420j251
3480c84j651K349J233k653o05J398J35L74J410j979j943K404J990j840j296J257
3496A99k12k1Q51j382j192K657Q55l239p28K297P67j78n3j908n53K972P82k491
$$ plain form
3382 136 2361 429 -633 48 -546 755 1931 147 -1813 202 1311 -333 -533 -68 -837 -389 1429
3399 1429 215 -1898 386 1635 -220 -338 723 -355 175 2033 757 -1506 -38 1535 76
3414 76 -308 287 -1055 -47 1848 283 -2318 99 2002 604 -402 32 -415 912 2409 172
3430 172 -2071 132 2012 178 -853 -6 -493 71 1235 -1288 -2893 379 2270 -360 -1532 -564
3446 -564 116 912 1600 -976 -2085 332 1901 -704 -988 282 71 -501 530 -744 -2040 502 1157
3463 1157 -1109 -1591 -7 -197 329 1019 -207 -1640 153 1655 -240 -537 260 -211 -553 867 -384
3480 -384 -2035 314 1547 -1106 -1711 -313 -178 196 1606 -373 -2316 88 2078 238 -1058 199
3496 199 -13 -34 817 -565 -1757 900 1755 -1484 -2212 85 852 674 621 -1287 -1840 1132 1914 -577
3514e77o19K123k75j017J026q13n37J947j18k727K50K230Q0j385R70q08j001K459
3532A208L09k155K96J666r56p61J071j45q75J122N00k243j91J584J17n08N11j285
3550g35j182K632J237k208q20J451j21m15J120q64j078J927O70l243KK198M71
3567A042j027k62q21J20J698N71k156o45K777m25j312N20P2n06J069L7k381N24
3585a105K779q82j946M73K56p85J462J28j541R2K028r57j075J365K60j061M58
3602e1O31j416K27J731n19j820R98q8j087J607O79j972p9J418m62n65J312l75
3620A69j355J601O41j888J13J870l74j356K57m6k61J605ok070k8K073l11j749
3638a115J085M07p34O47J92j670R28K009r87j947J044O98p29O42J66j717N04J472
$$ plain form
3514 -577 -1196 927 652 -365 661 -152 -689 1258 1140 -1587 -1337 893 973 -412 558 -250 -1251 1208
3532 1208 1517 -638 -342 1324 368 -393 678 533 -342 780 1280 -963 -1154 430 547 39 550 -735
3550 -735 -1917 715 1952 -256 -1076 375 254 -161 959 95 -983 944 1614 -1629 -1627 571 1042
3567 1042 15 -247 -1068 -948 750 1321 -835 -1480 1297 872 -440 80 152 -354 715 752 -1629 -1105
3585 -1105 1674 792 -1154 -681 -425 -1210 252 380 -1161 -1069 959 2 -1073 292 552 -509 -51
3602 -51 580 -836 -609 1122 603 -1217 -219 -307 -1394 213 892 -1080 -1159 259 -203 -768 544 169
3620 169 -1186 415 1056 -832 -719 1151 777 -579 -322 -368 -629 976 970 -1100 -1128 945 634 -1115
3638 -1115 -30 377 -357 290 482 -1188 -260 1749 762 -1185 -141 557 -172 470 636 -1081 -577 895
3656H95j324q93J742N18j750J49J086r75P61J116j294j184J626J23j029J175K46
3673I88j621J94J235m18l37P83m84j325J115Q70j089K56J171p24j037Q04K88m00
3691B69P71J10k122m9K049q0j555R11P3j354P23L27n88K75J500j364j291J159
3709b36J036j052N64O6j586M36J792j064j276J430m6j143K79Q07l12n3Q32j482
3727a008j07J922l0j875R20Q88j186l45J485m09r97J041k23j075J199J224j252
3744A72j242J244k25n83J258M3j591J219M14j405K05J768j53j679L31K5j81J032
3762F52L03j638m33J762o85j306J410Q21j315o3O97j236P89J427o79j586J001
3779g9L42j297Q33P64q66k95M16l53k08J436J73j659K60Q85m24k18J084m14r80
$$ plain form
3656 895 -429 -1322 420 938 -812 -663 423 -552 209 1325 31 -1153 473 596 -433 742 988
3673 988 -633 -439 796 378 41 824 340 -985 130 1000 -89 167 1338 614 -423 381 669 269
3691 269 1040 1150 -972 -1021 1028 948 -607 304 377 -977 -254 73 -515 -240 1260 -104 -1395 -236
3709 -236 800 -252 312 378 -1208 -772 1020 -44 -1320 110 64 -1079 -800 7 -305 -358 474 -1008
3727 -1008 -1115 807 777 -1098 -178 710 -476 -821 664 255 -742 299 76 -999 200 1424 172
3744 172 -1070 174 -51 -634 624 667 -924 295 709 -696 -491 1277 1124 -555 -224 -199 -380 652
3762 652 955 -683 -1116 646 -39 -1345 65 886 -429 -492 205 -1031 -242 1185 506 -1080 -79
3779 -79 263 -1034 -201 563 -303 -598 -182 -535 -743 693 866 -793 -533 352 -72 -290 794 380 -600
3798f00R91o7p01R28J228j690q99J017L82m65L76j20j455J447J056j724l07J751
3816A148j01j585M76N99o90P97N85k040lJ685m59j004M48P37j351O45O65j336
3834g84K39J696p16j836J309R00j210J92Q30j310k13J475j96j645J563L0j676
3851a352P91J212r72m69J074m71p59R35M24r91N75J074j200r03J564J77p57K61
3869B13N1j273J160J202j856m24J457Jj399M87O24m95R15J73j902LK066L13k221
3888i05O76N07o45L30L91j130j07J727o05j785J146R35n90l46P83j079NJ601l49
3907E60j512J223L09r34M96Q74j332l65J126j74q84Q13M82j139N35L15q71k40
3925g18J512J14j121K11L29o66J064L92j633k02J763l69j525N47J020n08k7K59
$$ plain form
3798 -600 391 324 -377 551 1779 89 -810 207 589 124 500 380 -1075 372 1428 -296 -603 1148
3816 1148 1047 -538 -62 537 -153 644 1229 -811 -814 871 412 -592 -144 593 -758 -113 552 -784
3834 -784 -545 1151 435 -1401 -92 808 -402 -210 620 -690 -903 572 376 -1269 294 324 -1352
3851 -1352 -561 651 -321 -790 284 -187 -946 -11 413 -578 -3 1071 -129 -1032 532 709 -48 213
3869 213 264 -1009 151 1353 -503 -927 530 531 -868 -381 243 -252 663 836 -1066 -1063 1003 1316 -905
3888 -905 -229 278 -367 -37 354 -776 -883 844 239 -1546 -400 535 -55 -401 382 -697 -692 909 560
3907 560 -952 271 580 -354 142 1016 -316 -681 445 271 -613 200 682 -457 78 393 -478 -718
3925 -718 794 908 -213 -2 327 -339 725 1117 -516 -718 1045 676 -849 -302 718 210 183 442
3943D42j142L38J992l89k217P37Q27k65J79J04j137J12J236k91j513O94J143r09
3961e9m28L98l57L4J656j008j444J051P70n91k06Q17p41m30J403l50j532J072
3979E5N58j457N19Q04q08k09R70l81j021O05J103r78K98P12j310k11J671J1k017
3998a086R38P83o43k41M12o52K53J239r87j188O09J255m95j98O6q11L17J491o30
4017D32j785J246J076j263J39M24k90r0Q46j029j163J414J177j182p40J092m86
4034a82j42R70q54r55J191J212j436k17R29n50m09J066o70r24J307Q24j573L99
4052a4M57q13R1J097n20j417R92J000o47m37J177j097k6J268p61j550J377Q79
4070A056j139J1J82j55L3J023p27j482R34J351j151n10P37k01L4P63n88j585J954
$$ plain form
3943 442 -700 -362 1630 1241 -976 -239 588 323 502 606 -531 -419 817 526 -987 -293 850 -59
3961 -59 -487 -89 -446 -412 1244 236 -1208 -157 613 22 -184 633 -108 -538 865 515 -1017 55
3979 55 613 -844 -325 479 -329 -538 432 51 -970 -365 738 -240 58 770 -540 -751 920 931 -1086
3998 -1086 -148 635 -8 -249 163 -489 -236 1003 16 -1172 -563 692 197 -1 65 -746 -429 1062 432
4017 432 -1353 -107 969 -294 -155 269 -21 -111 735 -294 -1457 -43 1134 -48 -788 304 -182
4034 -182 -324 646 -208 -1163 28 1240 -196 -413 516 -34 -443 623 -47 -971 336 1160 -413 -14
4052 -14 443 -370 -279 818 298 -1119 -127 873 226 -211 966 -131 -157 1111 350 -1200 177 1056
4070 1056 -83 -72 110 -45 -12 1011 284 -1198 -264 1087 -64 -574 163 -38 -4 759 171 -1414 540
4089E40Q36j734l50R96j86r9O54j049p47J766M82j466l27J499m57m34M29o78n14
4108h39J498n8j160n9J041m57o85Q99o4j403J390P98j389P5Q10n75k44J115n38
4127A55j355J202J091j231n03J016n1l14L92k58j244J385Q78j275q91J216m0j87
4145a4N81r58j150J849O53j514n93J519O5r95O52n45j91J029L37j607n1J530k8
4164E69r24O80k25j151J311M29j226j84J791q21p43O19J27n98O49L36j380L15
4182d26P42J99q48O60l02q73J461K95j146k89J163l22p96J091k4j352R85J063
4200A281j590o20J412Op65N07j23j005J484Q35j915l03J521l2j113M93n9o65R41
4219B90N24j658R6J707m04j282Q67j93m27M93P76j369l88K200r08j003M73P35
$$ plain form
4089 540 1376 -358 -708 288 102 3 657 -392 -1139 627 1109 -357 -684 815 358 -76 353 -325 -839
4108 -839 659 601 -559 -618 423 -34 -719 180 116 -1287 103 901 -488 -413 397 -178 -422 693 155
4127 155 -1200 2 1093 -138 -641 375 324 10 402 144 -1100 285 1163 -112 -1003 213 173 -14
4145 -14 567 -391 -1541 308 961 -553 -1146 373 438 -557 95 -450 -641 388 725 -882 -933 597 569
4164 569 -355 325 100 -1051 260 689 -537 -721 1070 249 -494 125 252 -346 303 639 -741 -426
4182 -426 316 515 -333 327 25 -848 613 908 -238 -527 636 314 -482 609 585 -767 218 1281
4200 1281 -309 -929 483 489 -276 231 108 -897 587 1422 -493 -796 725 693 -420 73 14 -651 290
4219 290 814 -844 -748 959 555 -727 140 -53 -480 13 789 -580 -968 1232 324 -679 -206 529
4237E29p12J09N70j217L95Q23l24r98Q86K27o48M73O53r07k03R93o53p44J034
4256B86P5q05L24P94j138r0J139j53q37K14K02o92R88L75j187m89J146M1j082
4275h89O09P02r07P58M12j484j38J524l41j258P63L07o19O07L50j312J74J552
4293H10p70o95N28O87q83R2L86o42K81J391j092r63R16M81r77N22L45o50l66R59
4313C60n31n63J267l6j113L83R36r13q3J030o85m41L90M69q04M82P14j014l41
4332d93J181m0q99L28O71j041L39R08j177m70J627l33j284J121N11r88N34p1r36
4351e12j63J366k73j019N87M71o67r0Q53q02Q3O48o54j145J534N88j027l1N17
4370B64o09j27J283n60p22Q74K56j657Q02J051j023n46Q77m1q89J131J56p93j74
$$ plain form
4237 529 -183 -74 496 -721 -326 497 173 -825 61 288 -360 113 766 -141 -344 649 -4 -748 286
4256 286 361 -444 -120 674 -464 -554 585 432 -405 -191 11 -681 307 682 -505 -994 152 193 -889
4275 -889 -280 422 -485 273 685 -799 -937 587 246 -1012 -249 58 -561 46 396 -916 -742 810
4293 810 40 -655 -127 560 -323 -231 155 -487 -206 1185 93 -870 46 527 -450 72 417 -233 -599 360
4313 360 -171 -734 533 497 -616 -233 703 -210 -293 737 52 -389 1 470 -334 148 862 -152 -493
4332 -493 688 648 -251 77 748 -293 46 954 -223 -693 934 601 -683 438 949 -39 495 424 -512
4351 -512 -675 691 418 -601 -14 457 -210 -300 553 -249 -166 482 -172 -1317 217 805 -222 -253 264
4370 264 -345 -472 811 251 -471 403 659 -998 -196 855 -168 -714 163 122 -767 364 520 -273 -447
4389d47R95o90n29J321j52p29L41K02r87O34Q04j309l59J024L7j006J248Q4r26
4408d44K72Q32q16l39J541p74j034N41N78o50J0R43j226j80J164m73n61N53P57
4427F94j186n8J011n19k63J166m70j051Q25K98j069K10J045q91o22R99K37q29
4445d73N87K15q50K65R10o58m46J024k30q12M25L97m46J31P00j092m52J651k30
4464F16p83K07L62q80N50N13r19PQ19J1j361Q32Q68q77o4N62p76n1Q21J64r32
4485c11L14P97j046p2J149o89l80Q42n94o93J027L77p82J39P34q77o60J015j20
4504A70q58Q29L01r40J19J212m14j070N20J40m78L27O67q38K85M31p25o93J625
4523F10J95j147J49L74o90L88O94p76n09J210j77j101M64O86m54m7K08o85o9J315
$$ plain form
4389 -447 548 -142 -671 650 498 -231 110 312 -675 -41 763 -546 -905 119 156 -850 398 482 -444
4408 -444 -172 660 -156 -495 1046 272 -762 -221 357 -293 -283 660 -566 -746 418 -55 -616 -63 694
4427 694 -492 -550 461 -58 -321 845 375 -676 149 447 -622 -412 633 -258 -880 119 356 -473
4445 -473 114 329 -521 -256 654 -4 -450 574 344 -468 -43 354 -92 39 739 -353 -805 846 616
4464 616 -167 40 402 -478 72 585 -334 -327 492 503 -858 -26 842 -35 -99 463 -313 -364 457 621 -311
4485 -311 3 800 -246 -318 831 142 -238 604 10 -683 344 721 -61 78 812 -65 -725 290 170
4504 170 -688 141 442 -498 -379 833 419 -651 -131 9 -469 -142 525 -313 -28 403 -322 -1015 610
4523 610 805 -342 -193 181 -509 -121 573 -203 -712 498 321 -780 -316 370 -84 -131 77 -608 -677 638
4543F38r0j087K37P33q66p2R95q59k59R11j52j082J091P14j163l93J224o64m89
$$ plain form
4543 638 548 -539 -302 431 -435 -507 488 -371 -630 281 129 -953 138 852 -311 -704 520 -144 -633
$$ [...]
8191A14
##END NTUPLES=NMR FID
##END=
