##TITLE=1H_ANY-167B
 CDCl3,8 sc, 
 11.4.2019
##JCAMPDX= 6.0         $$ Bruker NMR JCAMP-DX V2.0
##DATA TYPE= NMR FID
##DATA CLASS= NTUPLES
##ORIGIN= UXNMR, Bruker Analytische Messtechnik GmbH
##OWNER= root
$$ XWIN-NMR		Version 3.5
$$ Thu Apr 11 14:47:53 2019 Russian Standard Time (UT+4h)  she@DPX200
##.OBSERVE FREQUENCY= 200.1315
##.OBSERVE NUCLEUS= ^1H
##.DELAY= (6, 6)
##.ACQUISITION MODE= SIMULTANEOUS
##.ACQUISITION SCHEME= undefined
##.AVERAGES= 8
##.DIGITISER RES= 18
##SPECTROMETER/DATA SYSTEM= spect
##.PULSE SEQUENCE= zg30
##.SOLVENT NAME= CDCl3
##.SHIFT REFERENCE= (INTERNAL, CDCl3, 0, 15.7039)
##AUDIT TRAIL= $$ (NUMBER, WHEN, WHO, WHERE, WHAT)
$$ ##TITLE= Audit trail, XWIN-NMR		Version 3.5
$$ ##JCAMPDX= 5.01
$$ ##ORIGIN= Bruker BioSpin GmbH
$$ ##OWNER= she
$$ F:/spectra/data/she/nmr/H-F/1/audita.txt
$$ ##AUDIT TRAIL=  $$ (NUMBER, WHEN, WHO, WHERE, WHAT)
(   1,<2019-04-11 14:46:58.51 +0400>,<she>,<DPX200>,
      <created by zg, POWCHK disabled, PULCHK disabled
       configuration hash MD5:
       00 E9 B6 7A A2 85 ED C7 34 08 36 98 17 FE 4E 26
       data hash MD5: 16K
       6B DD 00 11 E6 C5 3E 47 8A C1 DD 7C 54 4C 1A 49>)
$$ ##END=
$$ 
$$ hash MD5
$$ 88 F2 86 BE 96 58 AA B8 98 32 19 FB F1 F7 89 48
##$RELAX= 
##$RELAX= 
##$RELAX= 
##$RELAX= 
##$RELAX= 
##$RELAX= 
$$ Bruker specific parameters
$$ --------------------------
##$DU= <F:/spectra>
##$EXPNO= 1
##$NAME= <H-F>
##$PROCNO= 1
##$TYPE= <nmr>
##$USER= <she>
##$AMP= (0..31)
100 100 100 100 100 100 100 100 100 100 100 100 100 100 100 100 100 100 
100 100 100 100 100 100 100 100 100 100 100 100 100 100 
##$AQSEQ= 0
##$AQ_mod= 1
##$AUNM= <au_zg>
##$AUTOPOS= <>
##$BF1= 200.13
##$BF2= 200.13
##$BF3= 200.13
##$BF4= 200.13
##$BF5= 200.13
##$BF6= 200.13
##$BF7= 200.13
##$BF8= 200.13
##$BYTORDA= 1
##$CFDGTYP= 0
##$CFRGTYP= 5
##$CHEMSTR= <none>
##$CNST= (0..31)
1 1 145 1 1 1 1 1 1 1 1 1 1 1 1 1 1 1 1 1 1 1 1 1 1 1 1 1 1 1 1 1 
##$CPDPRG= <>
##$CPDPRG1= <>
##$CPDPRG2= <>
##$CPDPRG3= <>
##$CPDPRG4= <mlev>
##$CPDPRG5= <mlev>
##$CPDPRG6= <mlev>
##$CPDPRG7= <mlev>
##$CPDPRG8= <mlev>
##$CPDPRGB= <>
##$CPDPRGT= <>
##$D= (0..31)
0 1.2 0 0 0 0 0 0 0 0 0 0.03 0 0 0 0 0 0 0 0 0 0 0 0 0 0 0 0 0 0 0 0 
##$DATE= 1554979617
##$DBL= (0..7)
120 120 120 120 120 120 120 120 
##$DBP= (0..7)
150 150 150 150 150 150 150 150 
##$DBP07= 0
##$DBPNAM0= <>
##$DBPNAM1= <>
##$DBPNAM2= <>
##$DBPNAM3= <>
##$DBPNAM4= <>
##$DBPNAM5= <>
##$DBPNAM6= <>
##$DBPNAM7= <>
##$DBPOAL= (0..7)
0.5 0.5 0.5 0.5 0.5 0.5 0.5 0.5 
##$DBPOFFS= (0..7)
0 0 0 0 0 0 0 0 
##$DE= 6
##$DECBNUC= <off>
##$DECIM= 24
##$DECNUC= <off>
##$DECSTAT= 4
##$DIGMOD= 1
##$DIGTYP= 9
##$DL= (0..7)
0 120 120 120 120 120 120 120 
##$DP= (0..7)
150 150 150 150 150 150 150 150 
##$DP07= 0
##$DPNAME0= <>
##$DPNAME1= <>
##$DPNAME2= <>
##$DPNAME3= <>
##$DPNAME4= <>
##$DPNAME5= <>
##$DPNAME6= <>
##$DPNAME7= <>
##$DPOAL= (0..7)
0.5 0.5 0.5 0.5 0.5 0.5 0.5 0.5 
##$DPOFFS= (0..7)
0 0 0 0 0 0 0 0 
##$DQDMODE= 0
##$DR= 18
##$DS= 0
##$DSLIST= <SSSSSSSSSSSSSSS>
##$DSPFIRM= 0
$$ [...]
##$SUBNAM2= <"">
##$SUBNAM3= <"">
##$SUBNAM4= <"">
##$SUBNAM5= <"">
##$SUBNAM6= <"">
##$SUBNAM7= <"">
##$SUBNAM8= <"">
##$SUBNAM9= <"">
##$SW= 24.9337058887773
##$SWIBOX= (0..15)
0 0 2 0 0 0 0 0 0 0 0 0 0 0 0 0 
##$SW_h= 4990.01996007984
##$TD= 16384
##$TD0= 1
##$TE= 0
##$TE2= 300
##$TE3= 300
##$TEG= 300
##$TL= (0..7)
0 120 120 120 120 120 120 120 
##$TP= (0..7)
150 150 150 150 150 150 150 150 
##$TP07= 0
##$TPNAME0= <>
##$TPNAME1= <>
##$TPNAME2= <>
##$TPNAME3= <>
##$TPNAME4= <>
##$TPNAME5= <>
##$TPNAME6= <>
##$TPNAME7= <>
##$TPOAL= (0..7)
0.5 0.5 0.5 0.5 0.5 0.5 0.5 0.5 
##$TPOFFS= (0..7)
0 0 0 0 0 0 0 0 
##$TUNHIN= 0
##$TUNHOUT= 0
##$TUNXOUT= 0
##$USERA1= <user>
##$USERA2= <user>
##$USERA3= <user>
##$USERA4= <user>
##$USERA5= <user>
##$V9= 5
##$VALIST= <valist>
##$VCLIST= <CCCCCCCCCCCCCCC>
##$VD= 0
##$VDLIST= <DDDDDDDDDDDDDDD>
##$VPLIST= <PPPPPPPPPPPPPPP>
##$VTLIST= <TTTTTTTTTTTTTTT>
##$WBST= 1024
##$WBSW= 4
##$XGAIN= (0..3)
0 0 0 0 
##$XL= 0
##$YL= 0
##$YMAX_a= 331797
##$YMIN_a= -539592
##$ZGOPTNS= <>
##$ZL1= 120
##$ZL2= 120
##$ZL3= 120
##$ZL4= 120
##$ABSF1= 10
##$ABSF2= 0
##$ABSG= 5
##$ABSL= 3
##$ALPHA= 0
##$AQORDER= 0
##$ASSFAC= 0
##$ASSFACI= 0
##$ASSFACX= 0
##$ASSWID= 0
##$AUNMP= <proc_1d>
##$AZFE= 0.1
##$AZFW= 0.1
##$BCFW= 1
##$BC_mod= 2
##$BYTORDP= 1
##$COROFFS= 0
##$CY= 11.3945322036743
##$DATMOD= 1
##$DC= 2
##$DFILT= <>
##$DTYPP= 0
##$F1P= 18.9103706918063
##$F2P= -1.10871071338519
##$FCOR= 0.5
##$FTSIZE= 0
##$FT_mod= 4
##$GAMMA= 1
##$GB= 0.15
##$INTBC= 1
##$INTSCL= 1
##$ISEN= 128
##$LB= 0.24
##$LEV0= 0
##$LPBIN= 0
##$MAXI= 10000
##$MC2= 0
##$MEAN= 0
##$ME_mod= 0
##$MI= 1.114404
##$NCOEF= 0
##$NC_proc= 0
##$NLEV= 6
##$NOISF1= 3.799351
##$NOISF2= 2.8
##$NSP= 1
##$NTH_PI= 0
##$NZP= 0
##$OFFSET= 15.70392
##$PC= 1
##$PHC0= -8852.891
##$PHC1= 15.20026
##$PH_mod= 1
##$PKNL= yes
##$PPARMOD= 0
##$PSCAL= 0
##$PSIGN= 0
##$REVERSE= no
##$SF= 200.130013532006
##$SI= 16384
##$SIGF1= 3
##$SIGF2= 2
##$SINO= 400
##$SIOLD= 16384
##$SREGLST= <1H.CDCl3>
##$SSB= 0
##$STSI= 0
##$STSR= 0
##$SW_p= 3612.71676300578
##$SYMM= 0
##$S_DEV= 0
##$TDeff= 0
##$TDoff= 0
##$TI= <>
##$TILT= no
##$TM1= 0
##$TM2= 0
##$TOPLEV= 0
##$USERP1= <user>
##$USERP2= <user>
##$USERP3= <user>
##$USERP4= <user>
##$USERP5= <user>
##$WDW= 1
##$XDIM= 8192
##$YMAX_p= 0
##$YMIN_p= 0
$$ End of Bruker specific parameters
$$ ---------------------------------
##NTUPLES= NMR FID
##VAR_NAME=  TIME,          FID/REAL,        FID/IMAG
##SYMBOL=    X,             R,               I
##VAR_TYPE=  INDEPENDENT,   DEPENDENT,       DEPENDENT
##VAR_FORM=  AFFN,          ASDF,            ASDF
##VAR_DIM=   8192,          8192,            8192
##UNITS=     SECONDS,       ARBITRARY UNITS, ARBITRARY UNITS
##FACTOR=    0.0002004,     1,               1
##FIRST=     0,             0,               0
##LAST=      1.6414764,     0,               0
##MIN=       0,             -539592,         0
##MAX=       1.6414764,     331797,          0
$$ Real data points
##PAGE= N=1
##DATA TABLE= (X++(R..R)), XYDATA
$$ plain form
0 0 0 0 0 -8 8 -8 8 -16 16 -24 32 -38 48 -57 72 -86 104 -121 145 -169 201 -234 271 -311 359 -415 471
27 471 -534 605 -684 773 -866 972 -1089 1215 -1353 1505 -1672 1856 -2056 2279 -2524 2792
43 2792 -3094 3428 -3800 4223 -4701 5252 -5890 6643 -7542 8647 -10035 11841 -14299 17862
57 17862 -23518 33917 -59413 251648 194055 -271290 107570 331797 185749 79583 269240
68 269240 176994 -75567 -31428 296201 309967 47044 -44557 128258 122251 -27673 54708
79 54708 282390 151135 -136889 -51042 240460 201336 7406 17435 70645 -17893 -9574
90 -9574 124809 113235 -42776 -73419 39165 109174 54708 -28074 -16007 66582 68849 -1358
102 -1358 10526 80222 69298 27398 49315 74706 68834 72053 58184 28663 54067 93956 78326
$$ packed form
0@%%%qJ6j6J6k4L2m0N6p0Q6j05J29j58J90k25K66l14L70m35N05n82O70p74Q86
27D71j005J139j289J457j639J838k061K304k568K858l177L528l912M335m803N316
43B792n886O522p228Q023q924R953j1142J2533j4185J6189j8682K1876k6140L2161
57A7862m1380N7435r3330L11061n7593m65345L78860K24227j46048j06166J89657
68B69240r2246k52561M4139L27629J3766k62923r1601J72815o007j49924Q2381
79E4708K27682j31255k88024Q5847K91502l9124j93930J0029N3210q8538Q319
90i574J34383j1574j56011l0643J12584P0009n4466q2782J2067Q2589K267p0207
102a358J1884O9696j0924m1900K1917K5391n872L219j3869k9521K5404L9889j5630
$$ plain form
115 78326 70846 77833 29967 34104 160269 180765 21192 -16300 144582 201894 98065 66291
127 66291 119435 110226 80756 113501 140847 97702 44924 66748 127230 103463 19552 50921
139 50921 152721 89462 -49639 11397 145632 82626 -23276 34763 86478 28894 33510
150 33510 91468 35371 -38820 23544 97232 38571 -46737 -25395 61483 84503 14564 -25283
162 -25283 27900 58186 21306 31153 61250 2670 -25183 79499 116562 9283 -5496 98248
174 98248 86693 -4400 25737 97901 65679 19151 39265 53422 44975 66310 96245 78619
186 78619 20565 1197 77364 142297 64383 -32929 31428 124629 74100 18471 63629 62819
198 62819 3680 38258 96875 39194 -17313 35873 72678 27739 3536 37649 62799 39527
$$ packed form
115G8326p480O987m7866M137J26165K0496j59573l7492J60882N7312j03829l1774
127F6291N3144r209k9470L2745K7346m3145n2778K1824O0482k3767q3911L1369
139E0921J01800o3259j39101O1036J34235o3006j05902N8039N1715n7584M616
150C3510N7958n6097p4191O2364P3688n8661q5308K1342Q6878K3020o9939l9847
162b5283N3183L0286l6880R847L0097n8580k7853J04682L7063j07279j4779J03744
174I8248j1555r1093L0137P2164l2222m6528K0114J4157q447K1335K9935j7626
186G8619n8054j9368P6167O4933p7914r7312O4357R3201n0529n5629M5158q10
198F2819n9139L4578N8617n7681n6507N3186L6805m4939k4203L4113K5150k3272
$$ plain form
210 39527 -13670 -19219 49949 80200 9814 -30867 13644 31269 18412 48380 44244 -31956
222 -31956 -40269 44753 70525 19291 -7408 163 19773 45557 32852 -1996 18923 44908
234 44908 -2017 -24428 35328 53102 5233 5099 29396 6533 4740 52833 51100 -6659 -23972
247 -23972 15275 59780 60071 1528 -32081 29240 73599 16654 -15191 29493 24291 -22444 8502
260 8502 46934 -544 -22972 32482 43989 -6600 -8194 37176 49758 18347 -18691 -9960 46455
273 46455 56290 -4936 -19619 28283 26103 -4318 25768 36938 -19722 -23353 37814 32501 -19374
286 -19374 -5584 36181 32574 12568 4525 11818 42739 49744 5254 -12804 19552 21830 3314
299 3314 22150 21705 -22404 -13445 37054 23695 -16328 -2367 15962 857 -1427 3319 2142
$$ packed form
210C9527n3197n549O9168L0251p0386m0681M4511J7625j2857K9968m136p6200
222c1956q313Q5022K5772n1234k6699P571J9610K5784j2705l4848K0919K5985
234D4908m6925k2411N9756J7774m7869j34K4297k2863j793M8093j733n7759j7313
247b3972L9247M4505K91n8543l3609O1321M4359n6945l1845M4684n202m6735L0946
260H502L8432m7478k2428N5454J1507n0589j594M5370J2582l1411l7038Q731N6415
273D6455R835o1226j4683M7902k180l0421L0086J1170n6660l631O1167n313n1875
286a9374J3790M1765l607k0006q043P293L0921P005m4490j8058L2356K278j8516
299C314J8836m45m4109Q959N0499j3359m0023J3961J8329j5105k284M746j177
$$ plain form
312 2142 25901 40286 -1128 -19232 25349 41567 12257 5974 974 -27452 -13543 30484 18648
325 18648 -18667 -12837 1010 1934 14500 14039 -2789 10980 22232 -13701 -16780 40419 49838
338 49838 1700 -5823 11738 3798 13958 38555 12440 -26539 -15785 5581 8065 13924 7479
351 7479 -9349 6136 22060 -1882 505 44312 34880 -16157 -11939 17099 8314 7144 22510
364 22510 -1786 -31095 -13144 8308 5931 3379 -14134 -37397 -17690 8596 -11912 -18286 17068
377 17068 11787 -25183 -9144 25513 14874 5162 9275 -15003 -32292 -4171 15341 2846 -5549
390 -5549 -16553 -26358 2829 25726 -6387 -23626 5668 653 -30973 -6793 30034 14192 -3348
403 -3348 5906 686 -3560 15842 15154 -9127 -15233 -18145 -23828 4511 26349 -5497 -22220 7800
$$ packed form
312B142K3759J4385m1414j8104M4581J6218k9310o283n000k8426J3909M4027j1836
325A8648l7315N830J3847R24J2566m61j6828J3769J1252l5933l079N7199R419
338D9838m8138p523J7561p940J0160K4597k6115l8979J0754K1366K484N859o445
351G479j6828J5485J5924k3942K387M3807r432n1037M218K9038q785j170J5366
364B2510k4296k9309J7951K1452k377k552j7513k3263J9707K6286k0508o374L5354
377A7068n281l6970J6039L4657j0639r712M113k4278j7289K8121J9512j2495q395
390e549j1004r805K9187K2897l2113j7239K9294n015l1626K4180L6827j5842j7540
403c348R254n220m246J9402o88k4281o106k912n683K8339K1838l1846j6723L0020
$$ plain form
417 7800 9262 -14504 6708 28063 -2808 -20963 2401 12949 11733 23061 16153 -3706 -745
430 -745 1378 -7539 8999 17744 -19269 -32488 4788 13277 -8906 4673 18175 -11566 -22653
443 -22653 4963 11325 1720 5552 -1114 -12392 1797 9250 -3798 4345 10302 -22018 -30498 7869
457 7869 12327 -15716 -7616 7152 -13888 -19185 6783 7694 -8890 -9023 -13137 -14810 6044 8531
471 8531 -13798 -8546 3689 -20221 -25486 7713 3443 -30117 -17560 6118 -10341 -14867 8826
484 8826 6027 -14205 -12916 -7821 -5969 6288 792 -18431 -3174 16243 -3668 -10463 13824
497 13824 4871 -21725 -4418 11782 -12007 -14187 13801 9087 -10326 -1683 4852 -4250 799
510 799 70 -17998 -11208 6695 -5932 -14719 3079 1196 -13870 -3028 -45 -19759 -13297 6614
$$ packed form
417G800J462k3766K1212K1355l0871j8155K3364J0548j216J1328o908j9859K961
430g45K123q917J6538Q745l7013j3219L7276Q489k2183J3579J3502k9741j1087
443b2653K7616O362r605L832o666j1278J4189P453j3048Q143N957l2320q480L8367
457G869M458k8043Q100J4768k1040n297K5968R11j6584j33m114j673K0854K487
471H531k2329N252J2235k3910n265L3199m270l3560J2557K3678j6459m526K3693
484H826k799k0232J289N095J852J2257n496j9223J5257J9417j9911o795K4287
497A3824q953k6596J7307J6200k3789k180K7988m714j9413Q643O535r102N049
510G99p29j8068O790J7903j2627q787J7798j883j5066J0842K983j9714O462J9911
$$ plain form
524 6614 -9123 -23130 -5801 -3642 -15235 -2905 -3484 -32244 -27980 1887 -7768 -28719 -15591
537 -15591 -7626 -17978 -10238 -444 -12450 -14412 -5574 -12314 -11157 4048 -1652 -7756 10845 5425
551 5425 -22548 -4519 27542 -691 -33831 -9665 12456 1109 3066 9076 -5240 -3853 16895
564 16895 13874 -789 -3066 -6714 -2675 18109 11676 -13892 679 23667 -2817 -24123 597
577 597 8394 -16613 -21643 -12689 -12097 1669 14432 -5041 -16539 1586 4625 -3419 6330 -3583
591 -3583 -33443 -16779 23551 7667 -27827 -15793 4305 -7686 -19260 -17098 -16509 -15744 -19413
604 -19413 -26704 -12199 2532 -11425 -12241 13577 -1305 -38021 -5932 37409 -5565 -51027 -8762
617 -8762 27611 -6784 -28034 -1916 7534 -9516 -13232 -4713 -5225 -13612 -10515 13666 18034 -24618
$$ packed form
524F614j5737j4007J7329K159j1593J2330n79k8760M264K9867r655k0951J3128
537a5591P965j0352P740R794j2006j962Q838o740J157J5205n700o104J8601n420
551E425k7973J8029L2061k8233l3140K4166K2121j1347J957O010j4316J387K0748
564A6895l021j4663k277l648M039K0784o433k5568J4571K2988k6484k1306K4720
577E97P797k5007n030Q954N92J3766J2763j9473j1498J8125L039q044R749r913
591c583k9860J6664M0330j5884l5494J2034K0098j1991j1574K162N89P65l669
604a9413p291J4505J4731j3957q16K5818j4882l6716L2089M3341m2974m5462M2265
617h762L6373l4395k1250K6118R450j7050l716Q519n12q387L097K4181M368m2652
$$ plain form
631 -24618 -37340 25578 51485 -13992 -42449 9168 18998 -21651 -10514 18874 -12585 -43815
643 -43815 -18525 2857 -9432 -12662 -3750 -10713 -27002 -28107 1295 36248 14215 -46619 -47231
656 -47231 8982 27497 8026 2157 -15469 -43507 -17736 31133 18493 -23575 -30221 -25424 -23947
669 -23947 -2099 15812 4013 -7387 -14571 -29189 -12461 34323 33919 -18096 -43723 -26109 861
682 861 22965 19441 -17046 -36596 -17139 2856 8642 4429 -22744 -39390 -5605 18961 -12209
695 -12209 -22491 16164 18119 -19784 -13517 16816 5788 -11702 -3376 -4709 -16503 -5304 9207
708 9207 -809 -19638 -19457 6415 25334 -6140 -49031 -21855 33487 21107 -18570 -11898 -3363
721 -3363 -15952 9777 42404 3953 -43599 -15841 19563 809 -13949 2395 3664 -18634
$$ packed form
631b4618j2722O2918K5907o5477k8457N1617R830m0649J1137K9388l1459l1230
643d3815K5290K1382j2289l230Q912o963j6289j105K9402L4953k2033o0834o12
656d7231N6213J8515j9471n869j7626k8038K5771M8869j2640m2068o646M797J477
669b3947K1848J7911j1799j1400p184j4618J6728M6784m04n2015k5627J7614K6970
682H61K2104l524l6487j9550J9457J9995N786m213k7173j6646L3785K4566l1170
695a2209j0282L8655J955l7903O267L0333j1028j7490Q326j333j1794J1199J4511
708I207j0016j8829J81K5872J8919l1474m2891K7176N5342j2380l9677O672Q535
721c363j2589K5729L2627l8451m7552K7758L5404j8754j4758J6344J269k2298
$$ plain form
733 -18634 -25995 -6547 16593 13341 -14217 -24488 -13310 -13034 -3550 28592 12759 -51990 -47917
746 -47917 24588 31122 -22360 -24759 -1223 -19264 -27293 3254 4060 -25328 -20304 3676 -6784
759 -6784 -28582 -18497 12871 17700 -20284 -42347 -5634 26153 -4943 -28930 -94 8601 -17938
772 -17938 -8183 15228 -8473 -22909 14036 19617 -24502 -28167 16225 29117 3440 -18161 -19444
785 -19444 69 20916 14432 -5570 -11047 -10059 -3273 16814 16278 -13236 -15853 10488 5420 -16027
799 -16027 -3353 11725 -1720 -8770 -5079 -10949 -1128 19157 -2648 -39474 -20932 16483 10790
812 10790 -11975 -18652 -21031 -10001 17061 17981 -13030 -29554 -17389 5463 17787 513 -25379
825 -25379 -13003 10268 -3858 -13037 15977 14822 -26535 -25965 8353 5653 -3960 18043 12947
$$ packed form
733a8634p361J9448K3140l252k7558j0271J1178K76R484L2142j5833o4749M073
746d7917P2505O534n3482k399K3536j8041q029L0547Q06k9388N024K3980j0460
759f784k1798J0085L1368M829l7984k2063L6713L1787l1096k3987K8836Q695k6539
772a7938R755K3411k3701j4436L6945N581m4119l665M4392J2892k5677k1601j283
785a9444J9513K0847o484k0002n477R88O786K0087n36k9514k617K6341n068k1447
799a6027J2674J5078j3445p050L691n870R821K0285k1805l6826J8542L7415n693
812A0790k2765o677k379J1030K7062R20l1011j6524J2165K2852J2324j7274k5892
825b5379J2376K3271j4126r179K9014j155m1357N70L4318k700r613K2003n096
$$ plain form
838 12947 -29660 -24775 31890 51657 10693 -29437 -21159 17417 32219 8939 -4061 4656 -2418
851 -2418 -8269 18218 24515 -13216 -17176 17905 8417 -25204 -1030 34849 7498 -27508 -10079
864 -10079 15206 14251 4586 -6392 -15871 -10703 2253 7636 2221 -18992 -30863 -3160 20646
877 20646 -7745 -33267 -6448 13456 -3828 -6916 4427 -6951 -10086 11972 7653 -18217 -7812
890 -7812 17530 6301 -13636 -9202 1423 6411 3601 -13382 -22152 -4807 9227 1604 -4232
903 -4232 -5589 -4590 14769 27525 -1039 -21202 7596 25057 -38 -10152 4456 3579 3401 17719
917 17719 8580 -15057 -4137 17607 6880 -11059 -8295 -148 8087 11038 137 -1517 17135
930 17135 18975 -3790 -10522 -1950 -439 5909 8991 -16287 -29028 3526 24842 510 -15513
$$ packed form
838A2947m2607M885N6665J9767m0964m0130Q278L8576J4802k3280j3000Q717p074
851b418n851K6487O297l7731l960L5081r488l3621K4174L5879k7351l5006J7429
864a0079K5285r55r665j0978r479N168J2956N383n415k1213j1871K7703K3806
877B0646k8391k5522K6819J9904j7284l088J1343j1378l135K2058m319k5870J0405
890g812K5342j1229j9937M434J0625M988k810j6983q770J7345J4034p623n836
903d232j357R99J9359J2756k8564k0163K8798J7461k5095j0114J4608q77j78J4318
917A7719r139k3637J0920K1744j0727j7939K764Q147Q235K951j0901j654J8652
930A7135J840k2765o732Q572J511O348L082k5278j2741L2554K1316k4332j6023
$$ plain form
943 -15513 -7867 -7731 -3943 10322 1359 -15916 -803 18804 7889 -2508 7888 14655 11445
956 11445 3080 -9597 -8275 12677 15555 -3307 -7156 -1118 -1929 9592 20207 -4313 -21795
969 -21795 7574 23998 -4068 -13853 11803 18229 2849 -1001 -1419 -3112 7940 13966 -128
982 -128 -11842 -9115 -1179 12566 13524 -10728 -17167 9490 13883 -8467 -2102 20374 9413 -7553
996 -7553 2353 5306 -523 11172 15278 -9200 -21377 -4335 10734 13069 4508 -15062 -18731 4239
1010 4239 11854 -6151 -8400 2108 -3783 -6412 5030 4301 54 11690 9388 -14302 -13971 6646
1024 6646 9989 2330 -2118 -14079 -13351 14518 22251 -4969 -14464 1002 2600 -3249 1575 770
1038 770 -3219 5251 5508 -6726 -2891 11402 7196 -1105 -4891 -14451 -9771 16085 15768 -13894 -14506
$$ packed form
943a5513P646J36L788J4265q963j7275J5113J9607j0915j0397J0396O767l210
956A1445q365j2677J322K0952K878j8862l849O038q11J1521J0615k4520j7482
969b1795K9369J6424k8066r785K5656O426j5380l850m18j693J1052O026j4094
982a28j1714K727P936J3745R58k4252o439K6657M393k2350O365K2476j0961j6966
996g553R906K953n829J1695M106k4478j2177J7042J5069K335q561j9570l669K2970
1010D239P615j8005k249J0508n891k629J1442p29m247J1636k302k3690L31K0617
1024F646L343p659m448j1961P28K7869P733k7220r495J5466J598n849M824q05
1038G70l989Q470K57j2234L835J4293m206q301l786r560M680K5856l17k9662o12
$$ plain form
1053 -14506 8664 7993 -1614 4673 2280 -7769 -168 5831 -3794 -893 11270 6679 -2055 -1576
1067 -1576 -4405 -703 15261 9119 -15555 -11138 10710 9425 1667 5627 -581 -8592 3917 9407
1081 9407 -4529 -3392 7559 1260 -4877 2583 2331 524 10416 5054 -15405 -8793 13658 10348
1095 10348 -2029 -710 -1148 -1252 9463 8903 -6934 -5268 4615 -2324 -6316 2707 1350 -2852 7239
1110 7239 4432 -12812 -4482 14963 6501 -8810 -4239 440 604 8863 7421 -6035 -2839 7371
1124 7371 232 -5478 1870 -2847 -8582 1892 1737 -11738 -3871 12180 1840 -10180 -1602 2439
1138 2439 -2297 3086 2329 -9075 -4872 6240 -315 -5169 1482 -3690 -9576 1796 2909 -12212
1152 -12212 -8111 5892 -1022 -9285 -353 2453 -975 5692 4399 -6781 -73 11244 339 -7351
$$ packed form
1053a4506K3170o71r607O287k393j0049P601N999r625K901J2163m591q734M79
1067a576k829L702J5964o142k4674M417K1848j285p758L960o208q011J2509N490
1081I407j3936J137J0951o299o137P460k52j807R892n362k0459O612K2451l310
1095A0348j2377J319m38j04J0715n60j5837J666R883o939l992R023j357m202J0091
1110G239k807j7244Q330J9445q462j5311M571M679J64Q259j442j3456L196J0210
1124G371p139n710P348m717n735J0474j55j3475P867J6051j0340j2020Q578M041
1138B439m736N383p57j1404M203J1112o555m854O651n172n886J1372J113j5121
1152a2212M101J4003o914q263Q932K806l428O667j293j1180O708J1317j0905p690
$$ plain form
1166 -7351 1170 -865 -7067 2107 2904 -11613 -7097 7965 643 -9408 -2660 645 -2729 1242
1180 1242 -102 -6198 2833 9267 -3207 -4277 9463 3575 -8777 372 3203 -11804 -8294 6223
1194 6223 -1994 -13014 -3352 3516 -795 503 1194 -4776 -741 3844 -2843 -698 7861 -499 -7471
1209 -7471 6799 8367 -7149 -3467 9096 -3189 -13905 -1186 3451 -4265 -1449 2511 -3355
1222 -3355 296 9070 3878 859 6238 867 -4672 5617 6505 -5592 -1235 8286 -3348 -9303
1236 -9303 3745 4336 -5641 -3130 -2175 -9030 -3254 5226 -2498 -3871 6031 -280 -6915 7011 12028
1251 12028 -4766 -7802 1104 -5277 -9320 1914 2291 -9393 -9151 -3816 -3402 1285 1677 -9290 -9347
1266 -9347 -1227 -6678 -7456 9649 7024 -14575 -9619 9491 3396 -5815 2170 -1978 -16768 -9415
$$ packed form
1166g351Q521k035o202R174P97j4517M516J5062p322j0051O748L305l374L971
1180A242j344o096R031O434j2474j070J3740n888j2352R149K831j5007L510J4517
1194F223q217j1020R662O868m311J298O91n970M035M585o687K145Q559q360o972
1209g471J4270J568j5516L682J2563j2285j0716J2719M637p716K816L960n866
1222c355L651Q774n192l019N379n371n539J0289Q88j2097M357R521j1634n955
1236i303J3048N91r977K511R55o855N776Q480p724j373R902o311o635J3926N017
1251A2028j6794l036Q906o381m043J1234L77j1684K42N335M14M687L92j0967n7
1266i347Q120n451p78J7105k625k1599M956J9110o095r211P985m148j4790P353
$$ plain form
1280 -9415 5309 358 -5790 -3616 -3559 -2435 1785 -95 0 5219 -3221 -12803 1703 11320 -2850
1295 -2850 -4650 9371 -365 -15057 483 10946 -7118 -13119 1286 -561 -10732 -4382 3354
1308 3354 -128 -415 -1261 -5780 -3482 551 -649 4227 4756 -11816 -13926 7569 10321 -7557 -5397
1323 -5397 3003 -10571 -13016 7942 9194 -7410 -5280 891 -8320 -5644 10479 9449 -4973 -11114
1337 -11114 -8822 1254 14103 8706 -9312 -9428 -2778 -4000 3355 11454 -3874 -15883 -1232
1350 -1232 7599 -1771 2742 10938 -2927 -12759 -910 4164 546 6678 3169 -12773 -9035 9218
1364 9218 9163 -1197 -2418 -5315 -7911 914 5101 -1254 -1068 809 -3683 -375 4078 -4495 -4646 9724
1380 9724 1497 -19537 -7560 13099 1456 -9414 3473 1589 -13664 -4425 11490 1693 -11202
$$ packed form
1280i415J4724m951o148K174N7J124M220j880R5N219q440r582J4506R617j4170
1295b850j800J4021r736j4692J5540J0463j8064o001J4405j847j0171O350P736
1308C354l482k87q46m519K298M033j200M876N29j6572k110K1495K752j7878K160
1323e397Q400j3574k445K0958J252j6604K130O171r211K676J6123j030j4422o141
1337a1114K292J0076J2849n397j8018j16O650j222P355Q099j5328j2009J4651
1350a232Q831r370M513Q196j3865r832J1849N074l618O132l509j5942L738J8253
1364I218n5j0360j221k897k596Q825M187o355J86J877m492L308M453q573j51J4370
1380I724q227k1034J1977K0659j1643j0870J2887j884j5253R239J5915r797j2895
$$ plain form
1393 -11202 -4405 2837 -1043 -5438 -3212 5789 6070 -13015 -19183 3576 10855 -8708 -9823 4418
1407 4418 -6576 -15596 9761 17029 -14720 -21556 7898 13050 -7258 -8344 4522 4660 -2786 -4703
1421 -4703 1131 4844 -4812 -13687 -2179 6254 -6767 -7259 9762 512 -19802 -1094 22863 1729
1435 1729 -21959 -7585 6500 1674 4077 6893 -6573 -12193 1327 10441 6180 -4887 -14136
1448 -14136 -8825 4964 3266 -4333 5071 9010 -6525 -8303 8479 9270 923 2035 -4494 -14307
1462 -14307 1326 19841 5878 -12195 -7252 -822 672 6961 944 -17043 -12721 6231 6282 -2750
1476 -2750 -1252 1295 1164 4062 2653 -474 4175 3634 -6060 -2616 7760 1175 -2607 6547 -702
1491 -702 -14250 2493 19421 -1958 -20467 -1887 12259 3996 438 1531 -5264 -5085 6874
$$ packed form
1393a1202O797P242l880m395K226R001K81j9085o168K2759P279j9563j115J4241
1407D418j0994r020K5357P268l1749o836K9454N152k0308j086J2866J38p446j917
1421d703N834L713r656q875J1508Q433j3021m92J7021r250k0314J8708K3957k1134
1435A729k3688J4374J4085m826K403K816j3466n620J3520R114m261j1067r249
1448a4136N311J3789j698p599R404L939j5535j778J6782P91q347J112o529r813
1462a4307J5633J8515j3963j8073M943O430J494O289o017j7987M322J8952N1r032
1476b750J498K547j31K898j409l127M649n41r694L444J0376o585l782R154p249
1491g02j3548J6743J6928k1379j8509J8580J4146q263l558J093o795J79J1959
$$ plain form
1504 6874 10181 1492 -7344 -8823 985 7677 -4520 -11661 2815 5387 -14864 -11849 10524 6869
1518 6869 -9043 -539 4368 -8501 -1980 17345 7174 -15354 -9222 8954 9961 684 -5939
1531 -5939 -4260 3472 2600 -6922 -5543 -153 -5303 -3943 6588 -2501 -15239 3836 19681 -1844
1545 -1844 -16097 2909 10877 -4297 -7283 372 -432 -656 3503 -1156 -6609 -1527 2442 2260 -615
1560 -615 -10533 -10343 8303 12952 -7139 -10392 7727 8018 -1860 2030 2045 -8247 -2457 7933 -2997
1575 -2997 -12416 -1278 6428 958 -2344 -5143 -7080 3149 8549 -4696 -8789 3453 5762 -1412
1589 -1412 329 2739 1657 7665 6282 -8412 -8848 7716 10298 1311 -1950 -6792 -7861 9988
1603 9988 18441 -1807 -12675 2626 7985 -578 2943 8773 1178 -2678 993 -528 658 8197
$$ packed form
1504F874L307q689q836j479R808O692j2197p141J4476K572k0251L015K2373l655
1518F869j5912Q504M907j2869O521J9325j0171k2528O132J8176J007r277o623
1531e939J679P732q72r522J379N390n150J360J0531r089j2738J9075J5845k1525
1545a844j4253J9006P968j5174k986P655q04k24M159m659n453N082L969j82k875
1560f15r918J90J8646M649k0091l253J8119K91r878L890J5j0292N790J0390j0930
1575b997r419J1138P706n470l302k799j937J0229N400j3245m093J2242K309p174
1589a412J741K410j082O008j383j4694m36J6564K582q987l261m842j069J7849
1603I988Q453k0248j0868J5301N359q563L521N830p595l856L671j521J186P539
$$ plain form
1617 8197 6131 -2381 -6934 -8355 246 15427 9387 -15994 -14854 8342 9018 -3354 1372 3261
1631 3261 -8364 -4502 8368 1515 -7098 1159 4812 -5457 -8503 -2311 4235 6728 -2052 -13831
1645 -13831 -5718 9311 4499 -4436 -53 -1966 -7739 2931 10236 -4407 -9245 6332 7159 -7638
1659 -7638 -6342 3465 4963 4006 84 -9441 -6201 8893 9037 -1627 -3873 -3042 -1877 7395 7817
1674 7817 -5978 -5850 7153 2311 -8151 -1600 5007 572 345 -699 -9129 -4363 11203 7910
1688 7910 -8078 -8600 -1446 1042 5118 3439 -7626 -7860 4056 3104 -4562 -1981 -83 -3947 -1158
1703 -1158 -471 -7918 -3707 9075 3391 -9370 -4072 4186 2462 4269 3789 -6751 -6040 7643 6141
1718 6141 -4320 -1945 2510 112 1262 2309 -4617 -1528 8936 3294 -7024 -1383 5820 4504
$$ packed form
1617H197k066q512m553j421Q601J5181o040k5381J140K3196O76j2372M726J889
1631C261j1625L862J2870o853q613Q257L653j0269l046O192O546K493q780j1779
1645a3831Q113J5029m812q935M383j913n773J0670P305j4643m838J5577Q27j4797
1659g638J296R807J498r57l922r525L240J5094J44j0664k246Q31J165R272M22
1674G817j3795J28J3003m842j0462O551O607m435k27j044q430M766J5566l293
1688G910j5988n22P154K488M076j679j1065k34J1916r52p666K581J898l864K789
1703a158O87p447M211J2782n684j2761N298Q258j724J807m80j0540P11J3683j502
1718F141j0461K375M455k398J150J047o926L089J0464n642j0318N641P203j316
$$ plain form
1732 4504 5061 3326 -5276 -515 12262 6297 -5399 -285 4952 15 904 3103 -3724 -2273 8375
1747 8375 3250 -7763 -1621 7337 4664 1113 -1404 -4950 1745 9711 1276 -8344 -1222 4035 -172
1762 -172 581 590 -7608 -5295 5789 -333 -12028 -4303 4733 -135 -2985 -1078 -2276 1428 7483 418
1778 418 -7552 -1254 3583 -301 1043 632 -5823 -1055 9503 1648 -9803 -2344 4694 -1032 -3256
1793 -3256 -1162 -4012 -208 8127 2432 -5526 1120 5960 443 -881 -856 -5429 -1527 6649 -742
1808 -742 -9424 169 6658 -322 -3214 -940 -3500 -126 5673 -708 -6366 2296 7139 527 531 3074
1824 3074 -1967 -836 5789 -1790 -8913 336 5425 -2739 -5170 -802 -2173 -143 3937 -2479 -7076
1839 -7076 611 4325 -1589 -85 2331 -2788 60 6959 -237 -7001 2670 7075 -2373 -4257 1425
$$ packed form
1732D504N57j735q602M761J2777n965j1696N114N237m937Q89K199o827J451J0648
1747H375n125j1013O142Q958k673l551k517l546O695P966q435r620P122N257m207
1762a72P53Rq198K313J1084o122j1695P725R036m868k850J907j198L704O055p065
1778D18p970O298M837l884J344m11o455M768J0558p855j1451P459P038n726k224
1793c256K094k850L804Q335n695p958O646M840n517j324K5m573L902Q176p391
1808g42q682R593O489o980k892K274k560L374N799o381n658Q662M843o612MK543
1824C074n041J131O625p579p123R249N089q164k431M368j371K030M080o416m597
1839g076P687L714n914J504K416n119K848O899p196o764R671M405r448j884N682
$$ plain form
1854 1425 375 1556 5002 -1416 -6322 2667 7365 1746 460 1898 -1039 2296 7816 -83 -5340
1869 -5340 3258 4876 -4119 -3297 3625 248 -107 3520 -2782 -7478 2577 7585 -1812 -4952 -260
1884 -260 14 2109 6078 1034 -3371 2438 3492 -3376 -1397 2517 -1902 -1433 2666 -3100 -5128 5803
1900 5803 6828 -4914 -5059 794 -1137 -937 3846 -515 -6096 577 4405 -1142 -627 1622 -2753
1915 -2753 -3073 555 -3142 -3806 4368 3262 -6180 -3875 2861 559 450 3447 -3769 -8600 1041 5410
1931 5410 -1069 -1564 632 -4018 -3068 3148 -737 -4908 928 607 -8146 -4422 4955 2696 -2641 -1714
1947 -1714 -3846 -4649 2906 3972 -2520 -3552 -1728 -3644 1499 6466 -1454 -6446 2182 1830 -7341
1962 -7341 -746 9168 808 -6665 641 3674 -322 2225 4207 -1053 -3982 -1639 894 4553 3077
$$ packed form
1854A425j050J181L446o418m906Q989M698n619j286J438k937L335N520p899n257
1869e340Q598J618q995Q22O922l377l55L627o302m696J0055N008r397l140M692
1884b60K74K095L969n044m405N809J054o868J979L914m419M69M099n766k028J0931
1900E803J025j1742j45N853j931K00M783m361n581O673L828n547N15K249m375
1915b753l20L628l697o64Q174j106r442K305O736k302j09K997p216m831R641M369
1931E410o479m95K196m650R50O216l885m171N836l21q753L724R377k259n337R27
1947a714k132q03P555J066o492j032J824j916N143M967p920m992Q628l52r171
1962g341O595R914q360p473P306L033l996K547J982n260k929K343K533L659j476
$$ plain form
1977 3077 -4010 -2640 5687 1256 -5525 3318 7549 -4582 -6555 5395 3167 -5012 1914 7649
1991 7649 -2534 -7378 748 3657 -56 -2440 -4321 -2816 51 -2186 -3209 2850 1701 -7627 -3721
2006 -3721 5129 -1443 -6437 3358 3750 -8215 -5306 5854 2782 -3528 -1136 -677 -3144 673 2073
2021 2073 -1847 -1069 518 -2696 -283 4773 838 -2967 2758 2833 -2019 1211 4399 -1394 -2325 2592
2037 2592 -337 -3412 1571 500 -4793 438 4028 -3928 -4758 3147 469 -6194 -277 3676 -4201
2052 -4201 -5609 1017 1755 -1786 -2120 -3144 -3908 -2318 -3213 -4180 -503 -4141 -11016 -3141 5380 -3902
2068 -3902 -10001 938 1539 -9760 -4737 6494 -1139 -10706 -2736 3714 -1293 -3062 34 -566 -3259
2083 -3259 -4049 -1402 3110 370 -7775 -3511 6919 1876 -5070 4345 6620 -6319 -4339 11442
$$ packed form
1977C077p087J370Q327m431o781Q843M231j2131j973J1950k228q179O926N735
1991G649j0183m844Q126K909l713k384j881J505K867k237j023O059j149r328L906
2006c721Q850o572m994R795L92j1965K909J1160l072o310K392M59k467L817J400
2021B073l920P78J587l214K413N056l935l805N725P5m852L230L188n793r31M917
2037B592k929l075M983j071n293N231L590p956q30P905k678o663N917L953p877
2052d201j408O626P38l541l34j024p64J590q95r67L677l638o875P875Q521r282
2068c902o099J0939O01j1299N023J1231p633r567P970O450n007j769L096o00k693
2083c259p90K647M512k740q145M264J0430n043o946R415K275j2939J980J5781
$$ plain form
2097 11442 6421 -8630 -3449 6544 1447 -2394 3196 2840 -3251 -3934 355 3207 1993 -4471 -4534
2112 -4534 969 -433 -3866 4075 7550 -7040 -11658 3859 8279 -4813 -6239 440 -4765 -7908
2126 -7908 1875 3599 -4774 -6843 -2679 -1576 -1741 -1260 -2948 -1810 -2126 -5893 -2900 5107 1681 -5753
2142 -5753 -1591 1855 -3777 -2152 4458 -1497 -8213 -1283 3425 -2154 -2089 977 -1653 -1108 3873 -207
2158 -207 -4514 1219 4227 -2017 -2917 1113 -240 -723 1597 -1044 -3431 -849 -814 -2690 -503 -2026
2174 -2026 -5934 -545 3366 -5825 -7905 4616 3572 -8495 -6012 3422 -1513 -6778 -383 463 -6806
2189 -6806 -4920 1393 -521 -6237 -6607 -1334 2760 -1816 -9760 -5168 4208 -1098 -7464 816 2832
2204 2832 -8616 -6595 5992 1653 -8155 -1291 3863 -5601 -8391 2522 6030 -1691 -6773 -5049
$$ packed form
2097A1442n021j5051N181R993n097l841N590l56o091o83M289K852j214o464o3
2112d534N503j402l433P941L475j4590m618J5517M420j3092j426O679n205l143
2126g908R783J724q373k069M164J103j65M81j688J138l16l767K993Q007l426p434
2142e753M162L446n632J625O610n955o716O930M708n579O5L066k630N45M981m080
2158b07m307N733L008o244r00M030j353m83K320k641k387K582L5j876K187j523
2174b026l908N389L911r191k080J2521j044j2067K483R434m935n265O395Q46p269
2189f806J886O313j914n716l70N273M094m576p944M592R376n306o366Q280K016
2204B832j1448K021J2587m339r808O864N154r464k790J0913L508p721n082J724
$$ plain form
2218 -5049 145 3625 1234 -907 -264 -4273 -6051 3846 9194 -3430 -9595 1481 3729 -4956 -1803
2233 -1803 6321 44 -6867 -2376 394 -1400 2021 3304 -3399 -5755 -1503 2629 4245 603 -6630
2248 -6630 -4886 3957 1630 -5360 -1187 2606 -2687 -3224 1779 -1657 -3985 3167 3752 -5081 -4785 2005
2264 2005 1387 157 977 -2372 -3977 1009 1398 -3380 -1119 2514 -1220 -3380 -1225 -1796 -107 4635
2280 4635 1392 -6690 -4043 1889 1298 1749 2008 -4878 -6072 3392 3991 -4395 -3327 1483 -3345 -5515
2296 -5515 898 1185 -1770 177 -1 -4888 -3476 2312 2819 -141 -3831 -6079 -560 6855 1660 -5650
2312 -5650 -1562 2369 -3937 -2545 3516 -1624 -5935 1394 3161 -5816 -3269 6198 4342 -3910 -5029
2327 -5029 -1335 1821 2765 -1294 -4154 -1278 363 -1985 940 2826 -3947 -4862 2990 556 -7633
$$ packed form
2218e049N194L480k391k141O43m009j778R897N348j2624o165J1076K248q685L153
2233a803Q124o277o911M491K770j794L421J283o703k356M252M132J616l642p233
2248f630J744Q843k327o990M173L793n293n37N003l436k328P152N85q833K96O790
2264B005o18j230Q20l349j605M986L89m778K261L633l734k160K155n71J689M742
2280D635l243q082K647N932n91M51K59o886j194R464N99q386J068M810m828k170
2296e515O413K87k955J947j78m887J412N788N07k960l690k248N519P415n195p310
2312e650M088L931o306J392O061n140m311P329J767q977K547R467j856q252j119
2327e029L694L156R44m059k860K876J641k348K925J886o773r15P852k434q189
$$ plain form
2342 -7633 -1734 6809 69 -5765 -659 1989 729 2935 2032 -3104 -2930 1047 1639 1103 -95 -3546
2358 -3546 -1599 4643 778 -5442 -777 4458 -602 -3534 1029 617 -561 2758 1234 -4399 -397
2373 -397 4822 1598 -2564 -508 -904 291 4429 499 -5312 -792 5022 623 -2513 1324 1267 507
2389 507 3368 1370 -1996 1714 4721 103 -1697 1462 394 398 4335 549 -5216 254 5765 -447
2405 -447 -4316 58 1325 179 2216 875 -2798 974 4465 648 -2002 -5 -586 160 3090 -1044
2421 -1044 -5663 705 5606 -1357 -4136 256 493 -1590 1002 -780 -5035 -898 4513 -278 -3827
2436 -3827 -871 -140 92 1447 -2587 -5748 183 3361 -2983 -4882 81 668 -440 1752 -957 -4689
2452 -4689 841 5148 -437 -3518 1300 2313 773 2368 821 -2032 2210 4515 -1234 -2502 2512
$$ packed form
2342g633N899Q543o740n834N106K648j260K206r03n136J74L977N92n36j198l451
2358c546J947O242l865o220M665N235n060k932M563m12j178L319j524n633M002
2373c97N219l224m162K056l96J195M138l930n811M520N814m399l136L837n7p60
2389E07K861j998l366L710L007m618j800L159j068ML937l786n765N470N511o212
2405d47l869M374J267j146K037j341l673L772L491l817k650J997n81P46K930m134
2421a044m619O368M901o963k779M392K37k083K592j782m255M137N411m791l549
2436c827K956P31K32J355m034l161N931L178o344j899M963N87j108K192k709l732
2452d689N530M307n585l081M818J013j540J595j547k853M242K305n749j268N014
$$ plain form
2467 2512 2418 347 1576 94 -2052 3488 5871 -789 -2861 2436 2498 539 2259 719 -2705 1480
2483 1480 4237 -1368 -3074 1744 988 -853 374 -988 -2759 1955 3416 -3094 -4053 1413 1373 -681
2499 -681 480 -1434 -3887 1742 4191 -2183 -4211 622 1305 -1221 568 -241 -1888 2504 3504 -2236
2515 -2236 -2332 3951 3754 372 999 365 -709 4427 6205 -433 -1882 3722 4059 1640 2729 1770 -51
2532 -51 3833 4513 -784 150 6138 4186 -496 1391 2063 327 3741 4977 -1812 -3071 1980 2700
2548 2700 28 322 -1651 -2685 1264 1890 -3480 -2336 2692 47 -4035 -646 -183 -2581 1273 1808
2564 1808 -4678 -5261 2009 2215 -1892 -2169 -2361 -2842 1246 1701 -2694 -2201 2263 423 -1403 1561 1830
2581 1830 -277 2886 3291 -2615 -1285 5961 4362 -781 522 1679 934 4417 4342 -757 -55 4186
$$ packed form
2467B512r4k071J229j482k146N540K383o660k072N297O2j959J720j540l424M185
2483A480K757n605j706M818p56j841J227j362j771M714J461o510r59N466m0k054
2499f81J161j914k453N629K449o374k028M833O83k526J789q09j647M392J000n740
2515b236r6O283j97l382O27o34j074N136J778o638j449N604L37k419J089r59j821
2532e1L884O80n297R34N988j952m682J887O72j736L414J236o789j259N051P20
2548B700k672K94j973j034L949O26n370J144N028k645m082L389M63k398L854N35
2564A808o486n83P270K06m107k77j92m81M088M55m395M93M464j840j826K964K69
2581A830k107L163M05n906J330P246j599n143J303J157p45L483p5n099P02M241
$$ plain form
2597 4186 2489 22 3044 3409 598 2605 3122 -973 632 5815 2691 -1904 -287 785 357 2792
2613 2792 2178 -3054 -2340 2976 709 -1618 1613 980 -2775 -22 2303 -2106 -1656 3842 1017 -3556
2629 -3556 -1264 1751 1017 1650 549 -3385 -1143 3449 1606 -837 1288 528 -321 3415 4420 -1090
2645 -1090 971 6329 1879 -2764 1950 4876 1462 1894 2814 -284 240 5217 3479 -51 576 1212
2661 1212 847 2909 2539 -882 1909 4843 411 -1629 3669 2752 -1318 843 1966 -2486 -1633 4354
2677 4354 2052 -3622 -1207 1482 -27 496 798 -1808 -1378 1438 -192 -767 1839 327 -1829 1209
2693 1209 1552 -2869 -258 3961 -989 -4938 898 2781 -1248 -593 1186 -1606 -1641 3448 2226 -2016
2709 -2016 -30 1406 295 1709 1529 -1025 569 2811 -728 -1718 3134 2129 -1919 -74 1621
$$ packed form
2597D186j697k467L022L65k811K007N17m095J605N183l124m595J617J072m28K435
2613B792o14n232P14N316k267k327L231o33l755K753K325m409M50N498k825m573
2629c556K292L015p34O33j101l934K242M592j843k443K125p60q49L736J005n510
2645a090K061N358m450m643M714K926l414M32R20l098N24M977j738l530O27O36
2661A212l65K062l70l421K791K934m432k040N298r17m070K161J123m452Q53N987
2677D354k302n674K415K689j509N23L02k606M30K816j630n75K606j512k156L038
2693A209L43m421K611M219m950l949N836J883m029O55J779k792l5N089j222m242
2709b016J986J436j111J414j80k554J594K242l539r90M852j005m048J845J695
$$ plain form
2724 1621 -1647 256 3513 -200 -3443 1520 3199 -699 611 1713 -1700 -1056 3398 990 -2532
2739 -2532 115 1351 -1046 -392 1445 -36 392 1539 -803 -670 3086 1244 -1535 2205 2233 -1891
2755 -1891 853 5951 834 -3803 2059 3975 -1720 -1056 3094 534 -1093 1792 1985 -177 171 1095
2771 1095 773 1718 -103 -1920 1659 3476 -1934 -1882 3878 1436 -3905 417 4124 -2278 -3458 2833
2787 2833 1337 -3883 -133 3211 407 -1348 544 764 513 859 -804 162 2353 -668 -1993 2686
2803 2686 1792 -3018 -431 4027 -1154 -3727 2407 2564 -2318 -459 3719 -188 -2307 1712 2274 -280
2819 -280 -170 330 -572 658 744 -1055 296 1414 -2351 -2487 2117 720 -2795 -135 1083 -3161 -1322
2836 -1322 3457 312 -3502 59 575 -2709 -698 1707 -1713 -2881 196 -492 -2526 394 726 -2248
$$ packed form
2724A621l268J903L257l713l243M963J679l898J310J102l413O44M454k408l522
2739b532K647J236k397O54J837j481M28J147k342J33L756j842k779L740K8m124
2755a891K744N098n117m637N862J916n695O64M150k560j627K885J93k162L48R24
2771A095l22R45j821j817L579J817n410N2N760k442n341M322L707o402j180O291
2787B833j496n220L750L344k804j755J892K20k51L46j663R66K191l021j325M679
2803B686q94m810K587M458n181k573O134J57m882J859M178l907k119M019N62k554
2819b80J10N00r02J230Q6j799J351J118l765j36M604j397l515K660J218m244J839
2836a322M779l145l814L561N16l284K011K405l420j168L077o88k034K920L32k974
$$ plain form
2852 -2248 -1054 -16 -1486 -234 1511 -802 -966 1767 -294 -2138 2053 2211 -2685 -1080 3089
2867 3089 -866 -3352 2399 3096 -2211 -949 2914 -41 -1722 2447 3235 -309 -1084 -348 1379 3133
2883 3133 912 -1672 827 1157 -2659 -751 4732 855 -5552 -140 3219 -2518 -1804 4807 1339
2898 1339 -5549 -2266 3274 1423 -435 -178 -1335 -1615 -727 2 1177 1632 -2983 -3805 1995 2180 -2419
2915 -2419 232 4096 -2197 -5123 1875 4116 -915 -680 1773 -960 -2047 2191 2591 -291 -1054 -1677
2931 -1677 -1412 1014 1412 -1546 -200 1728 -2128 -2852 1622 1732 -1624 137 480 -3472 -1432 3476
2947 3476 363 -2978 -534 -548 -2445 99 1637 -2909 -2616 637 -1301 -3498 88 1256 -1579 -1694
2963 -1694 -754 -2008 -257 1609 -619 -2406 -110 -973 -1765 1630 776 -4064 -2054 2893 -1178 -4327
$$ packed form
2852b248J194J038j470J252J745k313j64K733k061j844M191J58m896J605M169
2867C089l955k486N751O97n307J262L863k955j681M169P88l544p75P36J727J754
2883C133k221k584K499L30l816J908N483l877o407N412L359n737P14O611l468
2898A339o888L283N540j851j858K57j157k80Q88P29J175M55m615q22N800J85m599
2915b419K651L864o293k926O998K241n031K35K453k733j087M238M00k882p63o23
2931a677K65K426L98k958J346J928l856p24M474J10l356J761L43l952K040M908
2947C476l113l341K444j4j897K544J538m546K93L253j938k197L586J168k835j15
2963a694R40j254J751J866k228j787K296q63p92L395q54m840K010M947m071l149
$$ plain form
2979 -4327 1174 2004 -2645 -1544 1612 -528 -1529 1249 608 -1141 -561 -46 -8 800 -785 -3017 848
2996 848 2189 -2221 -3052 2102 631 -3077 154 1749 -2732 -2387 2619 740 -3369 -843 1307 -427
3012 -427 -893 -404 -1567 -221 900 -1740 -1754 804 -248 -1774 621 719 -2657 -85 3753 -1205 -3225
3029 -3225 1720 2903 -1242 -306 1477 -1040 -137 2500 -3 -2142 675 1691 -645 -45 409 -1151
3045 -1151 537 2347 -634 -2017 1755 1108 -1280 529 1146 -1944 -494 2139 -1389 -3222 1227
3060 1227 1473 -1991 -1600 -71 -1685 -592 1785 -1065 -3314 -242 1321 -1417 -870 -279 -2291 -268
3076 -268 1439 -1819 -2726 689 487 -2625 -333 167 -1875 -441 2181 -1501 -3141 1264 1801 -1589
3092 -1589 -948 809 -1005 -56 1800 -663 -1815 1253 1203 -1179 -8 380 -1421 434 1884 -2401
$$ packed form
2979d327N501Q30m649J101L156k140j001K778o41j749N80N15L8Q08j585k232L865
2996H48J341m410q31N154j471l708L231J595m481L45N006j879m109K526K150j734
3012d27m66M89j163J346J121k640j4K558j052j526K395R8l376K572L838m958k020
3029c225M945J183m145R36J783k517R03K637k503k139K817J016k336O00M54j560
3045a151J688J810k981j383L772o47k388J809O17l090J450K633l528j833M449
3060A227K46l464L91J529j614J093K377k850k249L072J563k738N47N91k012K023
3076b68J707l258r07L415k02l112K292N00k042J434K622l682j640M405N37l390
3092a589O41J757j814R49J856k463j152L068n0k382J171L88j801J855J450m285
$$ plain form
3108 -2401 -2521 2343 1985 -2437 -536 1033 -994 -520 1663 -735 -2760 1124 1372 -1452 -1090 136
3124 136 -858 -343 1092 -1472 -1920 1474 609 -2525 -312 804 -1246 -206 1902 -1776 -2789 1654
3140 1654 1777 -1398 -1000 703 -572 160 1574 -1078 -1566 1881 1440 -1795 -356 1478 48 521
3156 521 1540 -1373 -1225 3338 2075 -1892 -927 1250 -622 -17 1296 -1293 -1993 1848 1177 -1975
3172 -1975 106 1351 -456 -253 1283 -765 -1104 2344 1056 -2224 -665 1546 -95 9 817 -1872
3188 -1872 -1787 2069 1282 -2176 -210 1003 -1325 -177 1833 -821 -1525 1713 995 -2709 -952 1744
3204 1744 -247 -351 174 -2054 -1759 1900 849 -2443 -1175 284 -1205 -350 1236 -1312 -1857 1360
3220 1360 155 -3120 -669 1776 -787 -1598 -283 -1969 -1254 1813 198 -3014 -1433 580 -804
$$ packed form
3108b401j20M864l58m422J901J569k027M74K183k398k025L884K48k824L62J226
3124A36r94N15J435k564m48L394q65l134K213J116k050J040K108l678j013M443
3140A654J23l175L98J703j275P32J414k652m88L447m41l235J439J834j430M73
3156E21J019k913J48M563j263l967R65K177j872O05J313k589p00L841o71l152
3172a975K081J245j807K03J536k048l39L448j288l280J559K211j641J04Q08k689
3188a872Q5L856p87l458J966J213k328J148K010k654p04L238p18l704J757K696
3204A744j991j04N25k228K95L659j051l292J268J459j489Q55J586k548n45L217
3220A360j205l275K451K445k563q11J315j686P15L067j615l212J581K013j384
$$ plain form
3235 -804 -248 494 -1574 -1733 1349 110 -2129 373 1779 -919 -1009 1182 -567 -752 2386 1142 -2829
3252 -2829 -463 2213 -27 181 1149 -771 -1040 2114 1269 -1476 749 1683 -957 -406 1082 -429
3268 -429 -61 2390 -135 -2989 33 2397 -328 -1122 344 -1310 -1026 2234 879 -2472 -232 1510
3284 1510 -914 -1230 290 -821 -848 1434 -366 -2784 201 2141 -299 -1378 -22 -1210 -442 2405
3300 2405 402 -2420 265 2272 -383 128 1836 -41 -447 2135 526 -2123 856 3037 -167
3315 -167 -1204 1156 350 34 1638 655 -1260 652 1577 -153 96 1119 -953 -432 2358 -407 -2812
3332 -2812 561 1761 -1637 -1554 697 -465 -1559 763 54 -2574 -709 1257 -1018 -1472 -680 -941
3348 -941 -484 606 -1122 -2471 613 1373 -2274 -1349 1470 -434 -1356 1497 -77 -2611 145 2513
$$ packed form
3235h04N56P42k068j59L082j239k239K502J406k698r0K191j749j85L138j244l971
3252b829K366K676k240K08R68j920k69L154q45k745K225R34k640N51J488j511
3268d29L68K451k525k854L022K364k725p94J466j654K84L260j355l351K240J742
3284A510k424l16J520j111k7K282j800k418K985J940k440j079J356j188P68K847
3300B405k003k822K685K007k655N11J708j877m06K582j609k649K979K181l204
3315a67j037K360q06l16J604r83j915J912R25j730K49J023k072N21K790k765k405
3332b812L373J200l398Q3K251j162j094K322p09k628J865J966k275m54P92k61
3348i41M57J090j728j349L084P60l647R25K819j904r22K853j574k534K756K368
$$ plain form
3364 2513 -430 -1417 796 422 17 1188 440 -719 1246 1510 -666 109 1626 -365 -170 1603 268
3381 268 -1579 1570 2734 -959 -708 2183 450 -441 1564 599 -1637 717 1895 -763 -694 942
3397 942 9 -831 1531 -162 -1916 828 1691 -919 -650 1081 22 -134 1001 -488 -1371 1328 1911
3414 1911 -1144 -471 1746 135 -649 2041 710 -2041 828 2694 -59 -981 1842 1392 197 826
3430 826 508 204 1805 1062 -376 841 2042 -159 369 2496 44 -1842 1730 2852 -1543 -1056
3446 -1056 2634 932 -1915 633 1720 -836 -119 1019 343 -655 137 -313 421 886 -1469 -1015 2092
3463 2092 734 -2885 -613 2373 -932 -1974 1688 1010 -2443 -227 2523 -223 -1380 969 603
3478 603 -565 -135 81 345 1021 -200 -1638 9 1726 -558 -332 1695 -387 -1951 1626 2700
$$ packed form
3364B513k943r87K213l74m05J171p48j159J965K64k176P75J517j991J95J773j335
3381B68j847L149J164l693K51K891j733q91K005r65k236K354J178k658O9J636
3397I42r33q40K362j693j754K744Q63k610K69J731j059j56J135j489q83K699N83
3414A911l055O73K217j611p84K690j331k751K869J866k753r22K823m50j195O29
3430H26l18l04J601p43j438J217J201k201N28K127k452j886L572J122m395M87
3446a056L690j702k847K548J087k556P17J138o76r98P92m50P34M65k355M54L107
3463B092j358l619K272K986l305j042L662o78l453K216K750k746j157K349l66
3478F03j168M30K16K64O76j221j438J647J717k284K26K027k082j564L577J074
$$ plain form
3494 2700 -1682 -1075 1751 292 -843 1295 1173 -605 -262 368 -488 42 1970 -280 -1155 425 152
3511 152 -725 1285 2045 -1356 -979 1072 39 -168 1560 61 -1495 847 1057 -850 451 2378
3527 2378 -1016 -1103 1926 1134 -1236 982 2266 -904 -1161 1672 1901 154 38 297 -5 943 524
3544 524 -250 1327 1243 -1320 -223 2295 24 -1309 2041 2053 -2236 -1326 3353 1196 -1606 364 1546
3561 1546 -520 -847 1227 1020 47 -568 -689 563 1110 -786 -227 1972 77 -2601 701 3189 -458
3578 -458 -1905 1854 712 -2261 113 2579 156 -1588 590 444 -547 229 104 38 589 -408 -1163
3595 -1163 598 1492 -984 -879 1249 -159 -1886 873 1598 -1593 -958 813 -672 -1404 644 785
3611 785 -1725 -515 501 -1011 -276 1185 -639 -1567 562 261 -1121 676 1027 -1060 -612 775
$$ packed form
3494B700m382O07K826j459j135K138j22j778L43O30q56N30J928k250q75J580k73
3511A52q77K010P60l401L77K051j033k07J728j499j556K342K10j907J301J927
3527B378l394q7L029p92k370K218J284l170k57K833K29j747j16K59l02R48m19
3544E24p74J577q4k563J097K518k271j333L350J2m289R10M679k157k802J970J182
3561A546k066l27K074k07r73o15j21J252N47j896N59K199j895k678L302K488l647
3578d58j447L759j142k973K374K466k423j744K178j46r91P76j25o6N51r97p55
3595a163J761Q94k476J05K128j408j727K759P25l191O35J771j485p32K048J41
3611G85k510J210J016j512P35J461j824r28K129l01j382J797L51k087M48J387
$$ plain form
3627 775 -199 -267 782 -157 -986 591 783 -1348 297 1574 -763 -1447 1773 854 -1627 487 1809
3644 1809 -581 -736 1204 828 -251 514 280 -451 169 283 -966 284 725 -1274 -353 1790 -424
3661 -424 -1991 1380 1835 -1705 -1218 1685 173 -1798 422 806 -924 -774 483 -680 -52 218 -261
3678 -261 -152 321 -773 -1239 1792 928 -1750 -112 2182 -744 -980 1649 1166 -1580 -76 1945 -271
3695 -271 -508 1094 564 -412 385 545 163 869 575 -1094 -17 1603 -312 -79 1655 -156 -1753
3712 -1753 881 1167 -1487 -627 1125 -573 -1636 -301 -92 -1545 -34 316 -1915 -1435 565 -583
3728 -583 -1298 40 -926 -1735 -275 -205 -1777 -1088 423 -1221 -1549 75 -712 -1239 581 286 -1358 -389
3746 -389 1139 -672 -995 1027 379 -1242 883 794 -1055 -406 1038 253 -358 351 -279 -495 607 800
$$ packed form
3627G75r74o8J049r39q29J577J92k131J645J277k337o84L220r19k481K114J322
3644A809k390j55J940l76j079P65k34p31O20J14j249J250M41j999R21K143k214
3661d24j567L371M55l540M87K903j512j971K220L84j730J50J257j163O28K70m79
3678b61J09M73j094m66L031q64k678J638K294k926k36K629m83k746J504K021k216
3695b71k37J602n30r76P97J60l82P06k94j669J077J620j915K33J734j811j597
3712a753K634K86k654Q60J752j698j063J335K09j453J511L50k231M80K000j148
3728e83p15J338r66q09J460P0j572O89J511j644l28J624p87n27J820k95j644R69
3746c89J528j811l23K022o48j621K125q9j849O49J444p85o11P09o30k16J102J93
$$ plain form
3764 800 -555 234 1099 -263 -390 1594 -84 -1122 1187 1082 -1484 -923 1410 -135 -1249 -404 -386
3781 -386 -1094 -42 198 -1349 -645 12 -790 -721 169 -925 -1244 443 222 -1971 -622 946 -558 -1440
3799 -1440 606 132 -1212 322 768 -1090 -319 1143 344 -714 764 547 -572 769 706 -651 515
3816 515 1708 -282 -662 1066 674 -311 942 1171 -973 -167 1713 301 -303 1219 320 -764 853
3833 853 1249 -598 -342 1062 -329 -1070 366 355 -1251 443 -114 -1832 -189 943 -611 -1763 -342
3850 -342 -559 -1357 603 380 -1977 -1006 552 -1058 -1453 254 68 -1045 -401 -73 -1424 -333 1141
3867 1141 -112 -1433 61 248 -462 1064 544 -1221 37 1158 -71 -418 1241 324 -886 673
3883 673 511 -748 230 1581 -337 -1361 485 702 -428 671 494 -767 27 1133 -17 -723 548
$$ packed form
3764H00j355P89Q65j362j27J984j678j038K309j05k566N61K333j545j114Q45J8
3781c86p08J052K40j547P04O57q02O9Q90j094l19J687k21k193J349J568j504q82
3799a440K046m74j344J534M46j858P71J462p99j058J478k17j119J341o3j357J166
3816E15J193j990l80J728l92r85J253K29k144Q06J880j412o04J522q99j084J617
3833H53L96j847K56J404j391p41J436j1j606J694n57j718J643J132j554j152J421
3850c42k17p98J960k23k357R71J558j610l95J707j86j113O44L28j351J091J474
3867A141j253j321J494J87p10J526n20j765J258J121j229l47J659r17j210J559
3883F73j62j259R78J351j918j024J846K17j130J099j77j261P94J106j150p06J271
$$ plain form
3900 548 34 -691 443 229 -890 66 1010 -974 -1455 760 269 -877 41 469 -1313 65 1312
3917 1312 -176 -1408 406 280 -814 606 628 -741 -81 1007 -615 -820 1198 856 -566 730
3933 730 181 -746 408 1990 157 -945 925 822 -115 685 913 -702 569 1172 -361 -376 1382
3950 1382 407 -463 711 586 -712 546 1448 -519 -738 850 454 -363 692 530 -1032 43 1336
3967 1336 -587 -758 802 84 -988 494 58 -1186 51 1013 -774 -1371 531 332 -408 166 238
3984 238 -643 140 1185 -598 -986 822 -139 -942 598 322 -872 -84 1350 -771 -880 772 769 -923
4002 -923 -355 321 -297 -101 644 -204 -514 740 105 -424 182 71 -922 257 1006 -991 -1015 1263 473
4021 473 -1412 60 982 -495 -307 951 -178 -986 564 692 -145 100 15 -337 574 706 -734 -702
$$ packed form
3900E48n14p25J134k14j119R56R44j984m81K215m91j146R18M28j782J378J247
3917A312j488j232J814j26j094J420K2j369O60J088j622k05K018l42j422J296
3933G30n49r27J154J582j833j102J870j03r37Q00K28j615J271O03j533j5J758
3950A382r75q70J174j25j298J258R02j967k19J588l96q17J055j62j562J075J293
3967A336j923j71J560p18j072J482m36j244J237R62j787n97J902j99p40N74P2
3984B38q81P83J045j783l88J808r61q03J540k76j194P88J434k121j09J652lj692
4002i23N68O76o18J96P45q48l10J254o35n29O06j11r93J179P49j997k4K278p90
4021D73j885J472R22j477J88J258j129q08J550J28q37K45q5l52R11J32j440L2
$$ plain form
4039 -702 1367 201 -649 493 631 -662 54 1612 -505 -660 1338 617 -467 21 668 80 430
4056 430 902 -678 -180 1259 667 -342 321 629 -629 517 1273 -591 -645 1320 667 -1027 548
4073 548 764 -331 170 575 -276 -605 1310 597 -888 493 767 -780 441 1137 -692 -861 918
4090 918 636 -473 -105 461 -297 54 351 -547 -160 965 -83 -1072 689 463 -1231 172 1225 -708
4108 -708 -1324 778 467 -1188 -252 485 -276 -97 361 -590 -263 196 -528 -765 719 -164 -724 330 936
4127 936 -1238 -578 1976 216 -2017 75 1239 -525 -589 690 402 -535 230 463 -305 83 183 -14
4145 -14 36 357 -968 -76 1778 -367 -1473 934 1067 -951 -13 1354 -580 -1250 926 577 -892
4162 -892 268 742 -166 -271 128 -251 88 633 120 -456 513 416 -429 644 1203 -680 -894 1519 580
$$ packed form
4039g02K069j166q50J142J38j293P16J558k117j55J998p21j084M88O47n88L50
4056D30M72j580M98J439n92j009O63L08j258J146P56j864n4J965o53j694J575
4073E48K16j095N01M05q51l29J915p13j485J381K74j547J221O96j829j69J779
4090I18k82j109L68N66p58L51K97q98L87J125j048r89J761k26j694J403J053j933
4108g08o16K102l11j655R36P37p61J79M58r51L27M59p24k37J484q83n60J054O06
4127I36k174O60K554j760k233K092J164j764o4J279k88r37P65K33p68L88J00j97
4145a4N0L21j325Q92J854k145j106K407J33k018R38J367j934o70K176l49j469
4162h92J160M74r08j05L99l79L39N45n13n76R69r7q45J073N59j883k14K413r39
$$ plain form
4181 580 -816 447 859 -514 270 827 -365 85 1084 54 -1077 666 904 -309 -28 790 -184
4198 -184 4 1135 907 -314 400 212 -138 513 1107 -238 154 1089 -381 -829 1027 1358 -931 -196
4216 -196 938 -43 -774 976 503 -1008 -509 674 -235 -504 414 -252 -302 97 -407 -451 730 76 -1196
4235 -1196 269 861 -1232 3 1500 -11 -1667 60 1442 -621 -624 997 -377 -1047 305 62
4251 62 8 -28 4 -445 447 56 -525 311 1358 -675 -1482 1335 1045 -1231 -218 1056 -717 -768 827
4270 827 334 -1184 126 1002 -604 -229 410 143 -9 299 -273 -460 513 277 -807 409 495 -736
4288 -736 -298 1068 -287 -1100 517 978 -998 -540 915 -464 -603 1026 306 -696 469 567 -441
4305 -441 157 666 -43 -11 858 318 -623 357 542 -694 193 815 -676 11 1704 153 -696 928 818
$$ packed form
4181E80j396J263M12j373P84N57j192M50R99j030j131J743K38j213K81Q18r74
4198a84J88J131k28j221P14j88l50O51N94j345L92R35j470m48J856L31k289P35
4216a96J134r81p31J750m73j511M99J183r09k69R18o66n0L99n04m4J181o54j272
4235a196J465N92k093J235J497j511j656J727J382k063lJ621j374o70J352k43
4251F2n4l6L2m49Q92l91n81Q36J047k033q07K817k90k276J013J274j773n1J595
4270H27m93j518J310Q76j606L75O39k67j52L08n72j87R73k36j084J216Q6j231
4288g36M38J366j355q13J617M61j976M58J455j379j39J629p20j002J165R8j008
4305d41N98N09p09L2Q69n40r41R80J85j236Q87O22j491O87J693j551q49J624j10
$$ plain form
4324 818 -762 277 1278 -121 -883 981 592 -870 542 920 -398 112 761 111 131 814 -93 -509
4342 -509 845 175 -775 717 1045 -837 -400 1467 25 -1097 526 915 -922 -463 630 -187 -767
4359 -767 253 198 -832 140 -23 -177 208 82 -719 -9 954 -599 -1212 641 555 -1320 -210 827
4377 827 -593 -1061 906 10 -1162 420 605 -806 -365 457 -317 -483 97 -188 -619 363 324 -838
4395 -838 -134 655 -667 -232 802 -307 -1001 681 578 -1081 -423 938 -624 -606 676 -345 -709
4412 -709 146 350 -301 -328 570 -339 -126 773 -305 -602 178 536 -528 -55 402 -765 -466 990 -61
4431 -61 -788 705 512 -484 -230 713 -655 -517 474 -37 -1148 354 627 -458 -60 993 -333 -599
4449 -599 432 25 -374 1009 -63 -801 380 570 -200 -217 898 -6 -770 629 884 -733 -151 838
$$ packed form
4324H18j580J039J001j399p62J864l89j462J412L78j318N10O49o50K0O83r07m16
4342e09J354o70r50J492L28j882M37J867j442j122J623L89j837M59J093q17n80
4359g67J020n5j030R72j63j54L85j26q01P10R63j553o13J853q6j875J110J037
4377H27j420m68J967q96j172J582J85j411M41Q22p74j66N80k85m31R82l9j162
4395h38P04P89j322M35J034j109o94J682j03j659O58J361j562J8J282j021l64
4412g09Q55K04o51k7Q98r09K13Q99j078k97P80L58j064M73M57j167K99J456j051
4431f1p27J493j93r96K54R43j368J38R91n11j111J502K73j085L98J053j326k66
4449e99J031m07l99J383j072p38J181J90p70j7J115r04p64J399K55j617N82R89
$$ plain form
4467 838 -302 -461 515 104 -458 502 218 -315 35 631 -325 -305 356 -704 -749 875 567 -1278 -141
4486 -141 705 -681 -383 1055 -92 -813 -96 444 -825 -162 398 -438 -917 240 -229 -487 493 -179
4504 -179 -894 58 164 -625 -496 594 -259 -1294 133 410 -922 -169 535 -762 -845 409 -157 -995
4522 -995 333 -176 -961 -204 532 -339 -542 207 -442 -1001 199 512 -569 -146 613 -456 -356 667
4540 667 -212 -592 137 110 -958 -85 600 -613 -474 594 -391 -1051 824 494 -483 -62 416 -346 -275
4559 -275 575 -5 -450 258 247 -883 177 686 -178 -271 437 -230 -683 548 570 -445 -288 849 -260
4578 -260 -427 703 41 -485 312 159 -946 -79 674 -556 -619 577 -417 -664 356 378 -729 -71 539
4597 539 -432 -432 620 11 -797 13 156 -566 137 635 -585 -145 366 19 -484 264 90 -749 10 646
$$ packed form
4467H38j140j59R76m11n62R60k84n33L50N96r56K0O61j060m5J624l08j845J137
4486a41Q46j386K98J438j147p21P17N40j269O63N60q36m79J157m69k58R80o72
4504a79p15R52J06p89J29J090q53j035J427K77j332P53P04j297q3J254n66q38
4522i95J328n09p85P57P36q71k03P49o49n59J200L13j081M23P59j069J00J023
4540F67q79l80P29k7j068Q73O85j213J39J068r85o60J875l30r77M21M78p62P1
4559b75Q50n80m45P08j1j130J060N09q64r3P08o67m53J231K2j015J57J137j109
4578b60j67J130o62n26P97j53j105Q67P53j230o3J196r94k47J020K2j107O58O10
4597E39r71%J052o09q08Q10J43p22P03M98j220M40N11l47n03P48j74q39P59O36
$$ plain form
4617 646 -681 -395 410 -547 -951 563 180 -1057 -257 393 -499 -229 209 -356 -452 177 8 -694 -148
4636 -148 563 -795 -174 204 -487 -417 356 339 -1026 -109 396 -557 -779 298 -353 -448 733 235 -661 -311
4656 -311 467 -621 -642 329 -113 -505 132 5 -733 -45 381 -922 -432 401 -212 -868 360 37 -979
4675 -979 -124 653 -518 -213 941 -340 -1130 542 491 -887 -241 769 -303 -355 426 -172 -522 503
4693 503 350 -385 312 537 -59 -63 322 -320 -581 915 450 -777 276 1048 -454 -188 667 -109 -380
4712 -380 171 216 -294 -23 341 -538 130 63 -107 -465 619 -170 -857 21 634 -533 -249 772 -329
4731 -329 -557 232 453 -851 -152 612 -314 -564 126 -80 -317 106 43 -790 -180 337 -576 -208 289 -212
4751 -212 -526 343 37 -525 -16 349 -435 -263 517 -52 -534 190 160 -1075 47 636 -722 -457 371
$$ packed form
4617F46j327K86Q05r57m04J514l83j237Q00O50q92K70M38n65r6O29j69p02N46
4636a48P11j358O21L78o91P0P73j7j365R17N05r53k22J077o51r5J181m98q96L50
4656c11P78j088k1R71m42l92O37j27p38O88M26j303M90Q33o13o56J228l23j016
4675i79Q55P77j171L05J154j281p90J672n1j378O46J010j072n2P81n98l50J025
4693E03j53p35O97K25n96mL85o42k61J496m65j227J053P72j502K66Q55p76k71
4712c80N51M5n10K71L64q79O68o7j70l58J084p89o87Q78O13j167K84J021j101
4731c29k28P89K21j304O99P64r26k50O90k06k37M23o3q33O10N17r13L68M97n01
4751b12l14Q69l06n62N09L65p84J72P80n69m82P24l0j235J122N89j358K65Q28
$$ plain form
4770 371 -392 -526 458 43 -917 -218 340 -559 -537 174 149 -370 243 -203 -529 163 243 -764 -137 304 -532
4791 -532 -621 499 239 -982 -217 652 30 -287 466 -86 -275 -33 163 -83 246 360 -253 -209 495 -147
4811 -147 -322 599 -97 -939 433 1068 -850 -643 902 -470 -462 569 510 -237 -318 538 -186 -289 415 -90
4831 -90 -155 266 132 -419 737 528 -572 -501 880 -184 -706 793 517 -1028 -134 577 -437 -346 477
4850 477 62 -386 -21 225 -351 269 426 -582 -8 495 34 -131 667 322 -628 17 444 -587 -190
4869 -190 345 -515 -196 614 500 -443 549 680 -434 -420 543 -44 -452 142 45 -712 -244 469 -103 -201 -13
4890 -13 -278 -273 520 -160 -579 333 301 -947 -573 442 -51 -494 432 -236 -1055 -194 711 -285 -439 263 150
4911 150 -285 -100 -92 -117 303 167 -810 229 553 -474 -82 827 205 -807 730 797 -700 -522 617
$$ packed form
4770C71p63j34R84m15r60O99N58q99K2P11k5n19O13m46l26O92Q0j007O27M41q36
4791e32q9J120k60j221P65Q69o22l17P53n52j89K42J96k46L29J14o13M4P04o42
4811a47j75R21o96q42J372O35j918K07J545j372QJ031n9p47q1Q56p24j03P04n05
4831i0o5M21j34n51J156k09j100P1J381j064n22J499k76j545Q94P11j014R1Q23
4850D77m15m48L65K46n76O20J57j008N74N03m61j65P98l45r50O45M27j031L97
4869a90N35q60L19Q10j14r43R92J31j114J4R63n87m08N94r7p57M68P13n72r8J88
4890a3k65NP93o80m19R12l2j248L74J015m93m43R26o68q19Q61R05r96j54P02j13
4911A50m35J85Qk5M20j36r77J039L24j027L92R09o22j012J537O7j497J78J139
$$ plain form
4930 617 176 -546 395 494 -676 -272 646 -162 -285 485 -401 180 318 -71 -595 449 543 -699 123 663
4950 663 -173 -417 852 351 -536 75 470 -359 -344 709 136 -372 266 353 -331 255 688 -354 32 817
4970 817 -59 -135 711 138 -622 397 374 -541 57 567 -112 -251 367 241 -408 448 772 -100 -153 810 72
4991 72 -90 374 635 -74 134 331 98 157 573 89 106 224 -107 -59 504 281 -607 -421 886 -371 -477
5012 -477 691 295 -332 223 419 -136 -146 333 252 -148 264 50 28 224 -199 -332 -66 365 -418 -348 546
5033 546 36 -678 311 662 -780 -361 817 -3 -538 161 155 -521 197 392 -219 -331 421 -82 -65 377
5053 377 352 -275 171 474 -458 47 718 -14 -291 995 372 -234 302 608 -122 -78 795 163 -50 445
5073 445 325 -26 245 426 -124 -68 613 -185 -168 600 277 -353 401 573 -430 94 865 -110 -161 513 328
$$ packed form
4930F17m41p22R41R9j170M04R18q08j23P70q86N81J38l89n24J044R4j242Q22N40
4950F63q36k44J269n01q87O11L95q29J5J053n73n08O38Q7o84N86M33j042L86P85
4970H17q76p6Q46n73p60J019k3r15N98N10o79j39O18j26o49Q56L24q72n3R63p38
4991G2j62M64K61p09K08J97k33N9M16m84J7J18l31M8N63k23q88J86J307j257j06
5012d77J168l96o27N55J96n55j0M79q1m00M12k14k2J96m23j33K66M31p83P0Q94
5033E46n10p14R89L51j442M19J178q20n35O99oo76P18J95o11j12P52n03J7M42
5053C77k5o27M46L03r32N05O71p32k77J286o23o06N36L06p30M4Q73o32k13M95
5073D45j20l51K71J81n50N6O81p98J7P68l23o30P54J72j003N24P71r75n1O74j85
$$ plain form
5094 328 -45 85 710 -269 -181 987 111 -413 420 467 -289 274 450 -197 50 200 -71 -171 527 107
5114 107 -307 606 325 -270 -195 757 -142 -249 605 410 -351 35 897 -298 -62 328 282 -157 622 74
5134 74 -165 542 193 -177 341 822 -167 -410 679 261 -232 358 224 -465 -263 731 86 -360 326 -202
5154 -202 -158 44 377 89 3 183 -102 -321 731 44 -431 360 212 -582 -83 356 40 -304 587 72
5174 72 -98 -161 434 124 -207 175 3 -295 109 184 -210 239 479 64 14 616 -48 -83 284 101 -327 563
5196 563 615 -171 200 455 42 -273 687 582 -337 211 718 -164 79 935 -162 -315 278 135 -145 527
5216 527 226 -296 105 678 -231 -341 326 289 -524 348 356 -202 252 656 -147 -65 398 382 -158 379 399 -344
5238 -344 -277 374 -88 -86 328 35 40 357 445 -363 384 615 -404 -252 578 109 -296 459 553 -653 -240 368
$$ packed form
5094C28l73J30O25r79Q8J168q76n24Q33M7p56N63J76o47K47J50k71j00O98m20
5114A07m14R13k81n95P5R52q99j07Q54j95p61L86Q62j195K36L90m6m39P79n48
5134G4k39P07l49l70N18M81r89k43J089m18m93N90j34o89K02R94o45m46O86n28
5154b02M4K02L33k88q6J80k85k19J052o87m75P91j48p94M99M39l16l44Q91n15
5174G2j70o3N95l10l31L82j72k98M04P5l94M49K40m15n0O02o64l5L67j83m28Q90
5196E63N2p86L71K55m13l15R60j05r19N48N07q82K43Q56j097j53N93j43k80O72
5216E27l01n22M01N73r09j10O67l7q13Q72Qn58M54M04q03Q2M63j6n40N37K0p43
5238c44O7O51m62KM14k93NL17Q8q08P47K31j019J52Q30m69m05P55R4j206M13O08
$$ plain form
5260 368 -280 -310 501 345 -308 -42 235 -191 25 560 -44 -176 277 -10 -313 345 372 -470 -164 450 -185
5281 -185 -458 108 312 -250 -1 76 -403 -283 427 -251 -197 453 416 -328 87 109 -528 -70 491 -23 68 663
5303 663 -144 -282 309 471 -530 317 405 -97 -233 276 458 -537 303 153 -254 44 761 38 -238 445
5323 445 141 -728 -66 693 -323 19 512 -262 -212 307 56 128 233 295 -138 99 356 -225 -332 155 404
5344 404 -314 183 147 -403 -48 413 149 -195 311 462 -268 63 369 -376 148 433 -97 -270 577 126
5364 126 -450 470 112 -469 51 559 -230 52 502 193 -92 108 426 -106 273 475 -328 -203 324 -180
5384 -180 -407 469 164 -332 144 466 29 -325 268 65 -483 37 341 -573 -327 71 73 -664 333 -212 -394
5405 -394 32 50 -552 -210 640 -214 -214 121 -316 -467 390 47 -622 -293 360 -438 -287 151 107 -511 -29
$$ packed form
5260C68o48l0Q11j56o53K66K77m26K16N35o04j32M53k87l03O58K7q42L06O14o35
5281a85k73N66K04n62K49P7m79J20P10o78N4O50l7p44M15K2o37M58N61n14R1N95
5303F63q07j38N91J62j001Q47Q8n02j36N09J82r95Q40j50m07K98P17p23k76O83
5323D45l04q69O62P59j016L42M93p74N0N19k51P2J05O2m33K37K57n81j07M87K49
5344D04p18M97l6n50L55M61k64l44N06J51p30L31L06p45N24K85n30j73Q47m51
5364A26n76R20l58n81N20N08p89K82M50l09k85K00L18n32L79K02q03J25N27n04
5384a80k27Q76l05m96M76L22m37l54N93k03n48N20L04r14K46L98Kp37R97n45j82
5405c94M26J8o02L42Q50q54%L35m37j51Q57l43o69L29O53p98J51M38m4o18M82
$$ plain form
5426 -29 161 -109 11 495 -326 -89 94 -2 -443 -100 165 -529 -142 212 -392 -386 51 44 -515 -69 95 -503
5448 -503 27 201 -414 -482 446 308 -161 510 -6 -292 -234 212 -122 -193 506 48 159 95 525 -293 88
5469 88 218 -473 -177 346 -334 -477 162 313 -313 168 521 -68 -438 525 119 -636 135 207 -161 246 -14
5490 -14 -118 -132 426 78 -465 129 238 -408 62 325 -118 -134 351 242 -345 252 287 -264 -4 444 -389
5511 -389 -33 226 -109 36 64 -22 -169 119 264 -428 20 205 37 -576 92 144 -418 100 301 -218 -211 192
5533 192 100 -724 331 138 -499 -147 195 -500 -635 171 -300 -354 -293 -52 -387 -57 194 -302 27 295 -20
5554 -20 -232 29 -27 -619 137 290 -312 -677 327 -3 -423 228 131 -126 -88 372 -167 -46 -87 270 0
5575 0 -156 126 -157 444 -267 -401 -246 298 -34 -441 189 339 -496 -173 733 -137 -428 413 103 -523 175
$$ packed form
5426b9J90k70J20M84q21K37J83r6m41L43K65o94L87L54o04OM37pn59M46J64n98
5448e03N30J74o15o8R28j38m69O71n16k86N8M46l34p1O99m58J11o4M30q18L81
5469H8J30o91K96N23o80j43O39J51o26M81L53n89l70R63m06p55P71P2l68M07k60
5490a4j04j4N58l48n43N94J09o46M70K63m43j6M85j09n87N97L5n51K60M48q33
5511c89L56K59l35J45K8q6j47K88J45o92M48J85j68o13O68N2n62N18K01n19PM03
5533A92r2q24J055j93o37L52L42o95j35Q06m71n4O1K41l35L30K51m96L29K68l15
5554b0k12K61n6n92P56J53o02l65J004l30m20O51r7k57L8M60n39J21m1L57k70
5575@j56K82k83O01p11j34J55N44l32m07O30J50q35L23R06q70k91Q41l10o26O98
$$ plain form
5596 175 355 84 -155 29 -81 -56 292 138 -313 251 43 -222 293 283 -430 94 468 144 -708 649
5616 649 637 -385 71 408 -171 156 423 -65 -297 225 122 -78 87 260 -268 -138 391 4 -465 646
5636 646 117 -84 380 538 -252 94 291 127 -392 62 301 -332 103 99 -496 -406 79 -45 -305 67 202
5657 202 -325 105 316 -77 -97 376 33 -405 91 277 -67 70 408 -153 -237 203 154 -276 -37 -66 -517
5678 -517 -265 381 -279 39 419 182 -161 -237 -23 -268 -120 59 -336 9 513 -130 -431 474 -142 -669
5698 -669 77 461 -479 -358 61 -168 -478 -61 374 -355 -166 99 -336 -229 368 -225 -134 466 20 -139
5718 -139 168 379 -578 -202 393 -94 -344 182 246 -343 13 552 78 -176 224 253 -67 -104 -8 -494 219
5739 219 368 -28 49 334 -181 -209 -7 97 -467 -1 219 -94 -396 203 -249 -418 367 104 -366 -152 123
$$ packed form
5596A75J80k71k39J84j10K5L48j54m51N64k08k65N15j0p13N24L74l24q52J357
5616F49j2j022M56L37n79L27K67m88k32N22j03k00J65J73n28J30N29l87m69J111
5636F46n29k01M64J58p90L46J97j64n19M54K39o33M35mn95R0M85j24k60L72J35
5657B02n27M30K11l93k0M73l43m38M96J86l44J37L38n61q4M40m9m30K39k9m51
5678e17K52O46o60L18L80k37l43p6K14k45J48J79l95L45N04o43l01R05o16n27
5698f69P46L84r40J21M19k29l10M17M35p29J89K65m35J07N97n93R1O00m46j59
5718a39L07K11r57L76N95m87k50N26O4n89L56N39m74k54M00K9l20l7R6m86P13
5739B19J49l96P7K85n15k8K02J04n64M66K20l13l02N99m52j69P85k63m70K14K75
$$ plain form
5760 123 228 28 -17 -97 -154 7 34 -459 258 257 -108 -133 261 38 -347 150 -105 -345 -297 357 -264 -36 70
5783 70 -277 -476 289 146 -262 221 165 -126 -127 422 -198 -203 93 254 -552 -360 -194 -85 226 409 -367 -43
5805 -43 384 -21 -586 -102 -16 -43 -262 189 -14 -188 60 -127 -553 -54 214 -138 -283 -179 -256 -121 206
5826 206 83 -330 20 102 -249 -170 414 -145 -337 176 74 -204 -137 363 -3 -14 63 -99 197 114 -221 -54
5848 -54 165 44 82 43 216 -105 -142 91 91 -135 383 497 -187 -269 306 -146 213 285 238 -223 -55 216 -336
5871 -336 -137 248 135 -183 269 77 -224 -89 218 -333 -366 189 -263 -91 315 93 -290 269 -18 -125
5891 -125 -1 346 7 -498 12 263 -264 466 202 25 -227 353 144 -189 348 58 -830 182 314 -245
5911 -245 -1 22 -239 -342 189 88 -468 -136 600 -297 -119 172 -198 -383 154 -58 -32 -161 61 -216 -86
$$ packed form
5760A23J05k00m5q0n7J61K7m93P17jl65k5L94k23l85M97k55k40M8O54o21K28J06
5783G0l47j99P65j43m08M83n6k91jN49o20nK96J61q06J92J66J09L11J83p76L24
5805d3M27m05n65M84Q6k7k19M51k03j74K48j87m26M99K68l52j45J04p7J35L27
5826B06j23m13L50Q2l51P9N84n59j92N13j02k78O7N00l66j1P7j62K96q3l35J67
5848e4K19j21L8l9J73l21l7K33%k26N18J14o84q2N75m52L59P2m7m61J68K71n52
5871c36J99L85j13l18M52j92l01J35L07n51l3N55m52J72M06k22l83N59k87j07
5891a25J24L47l39n05N10K51n27P30k64j77k52N80k09l33N37k90q88J012J32n59
5911b45K44K3k61j03N31j01n56L32P36q97J78K91l70j85N37k12K6j29K22k77J30
$$ plain form
5932 -86 567 59 -58 215 28 -675 -44 224 -452 -62 64 -276 -388 -116 -40 -413 7 84 -41 -239 164
5953 164 64 -87 38 52 -172 154 263 -431 -117 384 -184 -135 295 202 -461 62 410 -7 309 279 17
5974 17 -308 114 48 -496 -53 211 -320 80 274 -190 -197 136 74 -332 186 290 -276 -253 387 -17 -306 68
5996 68 5 -400 -55 51 -459 153 432 -112 15 226 121 -331 244 507 -80 -348 199 -90 -306 212 222
6017 222 -325 -32 127 -183 -96 267 -159 -469 219 241 -438 37 370 -167 -28 271 -123 -476 160 110 -568
6038 -568 -119 -124 -487 -64 -108 -523 -126 -88 -111 -285 -121 169 79 208 160 -299 -191 265 221 -310 5 236 -111
6061 -111 -170 95 11 137 316 111 -366 -126 305 -235 -90 293 -215 -54 -9 89 -327 251 30 -471 -149
6082 -149 379 149 222 -14 82 191 126 175 55 114 -79 -186 -436 558 223 -270 276 134 -275 51 307 275
$$ packed form
5932h6O53n08j17K73j87p03O31K68o76L90J26l40j12K72P6l73M20P7j25j98M03
5953A64j00j51J25J4k24L26J09o94L14N01n68M9M30r3o63N23L48m17L16l0k62
5974A7l25M22o6n44M43K64n31M00J94m64pL33o2m06N18J04n66K3O40m04k89L74
5996F8o3m05L45J06n10O12K79n44J27K11j05m52N75K63n87k68N47k89k16N18J0
6017B22n47K93J59l10Q7L63m26l10O88K2o79M75L33n37J39K99l94l53O36n0o78
6038e68M49nl63M23m4m15L97L8k3j74J64K90r0J29m8m59J08M56m4n31L15K31l47
6061a11n9K65q4J26J79k05m77K40M31n40J45L83n08J61M5R8m16N78k21n01L22
6082a49N28k30P3k36R6J09o5M9j20N9j93j07k50R94l35m93N46j42m09L26K56l2
$$ plain form
6104 275 -164 370 -15 -125 11 305 -180 -4 204 -88 -34 319 226 -257 24 267 -256 -305 421 1 -59
6125 -59 528 10 -417 194 -80 -183 55 545 -164 -89 244 -37 -464 336 438 -460 -158 136 -284 -176 -53
6146 -53 -114 -80 9 199 -352 -390 178 -343 147 -273 -222 -91 -206 201 -151 43 340 176 -264 -172 69 -310
6168 -310 -17 2 -279 -144 197 148 -177 89 94 -56 -53 89 -359 -57 -184 -182 -117 387 146 -445 45 24 -23 147
6192 147 96 -174 -444 62 346 -162 88 53 48 -136 115 -348 -509 99 -43 -52 114 115 -451 203 79 -73 -189
6215 -189 319 125 -278 125 56 -268 -329 311 370 -273 239 189 -47 102 113 -53 29 253 -29 -71 269 13
6237 13 -253 80 315 -254 10 397 -78 -119 260 182 -403 -149 79 -534 -216 -43 -310 138 121 162 -306 113
6259 113 265 -570 -185 -99 -85 -96 92 347 -274 207 207 -31 134 551 -183 -210 277 -33 -553 134 194 -85
$$ packed form
6104B75m39N34l85j10J36K94m85J76K08k92N4L53r3m83K81K43n23m9P26m20o0
6125e9N87n18m27O11k74j03K38M90p09P5L33k81m27Q00J02q98L02K94m20J08J23
6146e3o1L4Q9J90n51l8N68n21M90m20N1J31j15M07l52J94K97j64m40R2K41l79
6168c10K93J9k81J35L41m9l25K66Nj50LJ42m48L02j27KO5N04k41n91M90k1m7J70
6192A47n1k70k70N06K84n08K50l5nj84K51m63j61O08j42rJ66Jn66O54j24j52j16
6215a89N08j94m03M03o9l24o1O40N9o43N12n0k36J49J1j66Q2K24k82m2L40k56
6237A3k66L33K35n69K64L87m75m1L79p8n85K54K28o13L18J73k67M48j7M1m68M19
6259A13J52q35L85Q6J4j1J88K55o21M81%k38J65M17p34k7M87l10n20O87O0k79
$$ plain form
6281 -85 -47 194 -273 -487 329 397 -22 197 157 166 -65 227 -123 -88 145 -101 -157 -93 124 -411 -212 176 -274
6304 -274 20 239 -92 -169 129 349 -323 50 219 -112 60 265 136 -102 -201 165 -213 0 361 -259 -301
6325 -301 193 -35 -95 -92 -9 -195 -367 -90 -196 -328 287 20 -283 -115 205 -182 -296 170 28 -141 309
6346 309 154 -330 27 334 43 109 311 70 -99 207 158 -76 323 145 -211 -68 481 -152 173 143 -58
6367 -58 -125 269 161 -231 231 202 -247 166 48 165 -285 -102 188 -364 -35 115 -290 -403 259 85 -251
6388 -251 226 364 -1 -109 394 170 -441 145 250 -241 277 134 197 -132 225 -243 65 128 -2 -28 77
6409 77 75 -13 -74 260 138 39 394 371 -60 112 -192 -279 32 11 242 -82 80 137 -188 194 34 -232 -351
6432 -351 189 -373 -382 411 172 -47 -260 -195 -236 -163 231 -388 -109 103 -309 -320 -147 123 10 -53 76 -141
$$ packed form
6281h5L8K41m67k14Q16O8m19K19m0Rk31K92l50L5K33k46n6O4K17n35J99L88m50
6304b74K94K19l31p7K98K20o72L73J69l31J72K05j29k38r9L66l78K13L61o20m2
6325c01M94k28o0LQ3j86j72K77j06j32O15k67l03J68L20l87j14M66j42j69M50
6346C09j55m84L57L07k91O6K02k41j69L06m9k34L99j78l56J43N49o33L25l0k01
6367e8o7L94j08l92M62k9m49M13j18J17m50J83K90n52L29J50m05j13O62j74l36
6388b51M77J38l65j08N03k24o11N86J05m91N18j43O3l29L57m68L08O3j30k6J05
6409G7kq8o1L34j22r9L55k3m31J72l04q7L11k1K31l24J62N7l25L82j60k66j19
6432c51N40n62rP93k39k19k13O5m1P3L94o19K79K12m12j1J73K70j13o3J29k17
$$ plain form
6454 -141 -44 -39 -162 -179 150 -22 -426 40 -116 69 -201 111 249 -334 218 9 -181 71 16 42 84 158 -33
6477 -33 162 -22 309 86 -332 -67 -252 -214 -29 -25 -216 27 172 113 44 238 -97 -9 89 81 -3 -54 279 -73
6501 -73 -30 92 128 -181 14 -211 27 230 -50 -49 0 336 31 382 362 168 -320 106 337 -148 63 298
6523 298 -44 -208 418 192 -391 148 330 6 8 -198 181 -237 188 -146 -58 190 27 -66 -126 333 -206 -180
6545 -180 -40 -62 -397 -60 304 -346 -265 334 308 -214 -106 83 12 129 42 -197 -142 105 -57 1 -271 -34
6567 -34 -127 67 -33 -17 202 99 -91 -66 176 -142 -512 210 91 -161 186 -60 -491 -33 146 193 -208 -89
6589 -89 -121 -337 -22 -145 12 -125 59 -230 -159 88 127 -200 -135 29 -202 -1 102 152 -263 308 131 -141
6611 -141 -153 180 -165 -235 214 302 -333 180 -147 -249 66 97 92 -385 -73 88 111 55 -84 29 -245 136 -147
$$ packed form
6454a41R7Nj23j7L29j72m04M66j56J85k70L12J38n83N52k09j90K52n5K6M2P4j91
6477c3J95j84L31k23m18K65j85L8J85Mj91K43J45n9o9J94l35Q8R8qq4n1L33l52
6501g3M3J22L6l09J95k25K38K03k80JM9L36l05L51k0j94m88M26K31m85K11K35
6523B98l42j64O26k26n83N39J82l24Kk06L79m18M25l34Q8K48j63r3o0M59n39K6
6545a80J40k2l35L37L64o50Q1N99k6n22J08J89p1J17q7k39N5K47j62N8k72K37
6567c4r3J94j00J6K19j03j90K5K42l18l70P22j19k52L47k46m31M58J79M7m01J19
6589h9l2k16L15j23J57j37J84k89P1K47L9l27O5J64k31K01J03N0m15N71j77k72
6611a41j2L33l45p0M49Q8o35N13l27j02L15L1nm77L12J61K3n6j39J13k74L81k83
$$ plain form
6634 -147 -136 198 43 -209 -259 -69 -107 178 46 -127 -133 162 -17 -9 21 90 -8 -81 143 -301 -140 126 12 -116
6658 -116 -56 23 -164 -133 -3 -193 -59 318 -29 -499 -17 29 -95 -71 -28 -76 -67 311 -200 -100 181 210 -122
6681 -122 21 374 -389 -183 393 306 -482 -147 195 230 -139 4 -116 99 55 147 -87 9 330 -175 -102 -158
6703 -158 -45 -294 75 -107 -270 221 181 -65 -326 205 -129 -218 -66 77 78 70 -70 -455 -250 348 -168 -581
6725 -581 -102 48 367 -48 -360 57 30 -83 -37 87 312 217 -209 -30 -133 50 173 10 82 -140 113
6746 113 -86 34 371 192 2 51 165 -113 -169 97 172 -281 263 -12 125 -39 196 208 -8 229 113
6767 113 -236 316 74 -55 -9 599 34 -309 -106 95 -175 147 196 -213 -156 248 44 -58 -35 57 -20 135
6789 135 -94 76 -9 126 -384 58 184 -18 -380 85 326 -279 317 -73 -86 -47 -2 19 111 222 266 50
$$ packed form
6634a47J1L34j55k52n0J90l8K85j32j73oK95j79QL0O9r8p3K24m44J61K66j14j28
6658a16O0P9j87L1J30j90J34L77l47m70M82M6j24K4M3m8RL78n11J00K81K9l32
6681a22J43L53p63K06N76q7p88L35L42L5l69J43j20K15m4R2k34R6L21n05P3n6
6703a58J13k49L69j82j63M91m0k46k61N31l34q9J52J43Jqj40l85K05N98n16m13
6725e81M79J50L19m15l12M17k7j13M6J24K25r5m26J79j03J83J23j63P2k22K53
6746A13j99J20L37j79j90M9J14k78n6K66P5m53N44k75J37j64K35J2k16K37j16
6767A13l49N52k42j29M6O08n65l43K03K01k70L22M9m09N7M04k04j02K3R2p7J55
6789A35k29J70q5J35n10M42J26k02l62M65K41o05N96l90j3L9M5K1R2J11M4k16
$$ plain form
6811 50 134 -21 -9 -120 -53 -343 10 279 -116 174 -45 -48 271 -145 87 39 130 -59 -20 37 -131 478 174
6834 174 -232 -43 226 -279 -9 -69 -454 -103 54 -184 -191 -25 -143 -48 165 -23 -56 -151 125 -88 -101 -81 -9
6857 -9 -174 -94 -66 -203 15 392 41 -175 10 34 -191 144 139 -94 -72 74 -93 57 128 -2 -126 189 23
6880 23 -306 195 170 -69 -152 -101 21 -123 208 134 -125 55 131 -56 242 351 -37 -318 17 90 -268 275
6902 275 -131 -1 -21 189 -157 -78 -70 -15 -151 -141 119 -232 -153 187 94 66 162 -353 -148 -46 -86 153 -58 -211
6926 -211 36 97 59 82 63 31 38 -309 -243 210 -16 -46 231 107 -297 -5 -22 -73 -160 -127 -19 -171 -20 -53 -228
6951 -228 265 280 -371 -14 -74 -67 -144 25 -84 50 27 99 -166 -109 -46 187 -8 4 201 -161 194 -90 1 20
6975 20 247 231 87 282 122 -139 209 199 5 17 288 35 14 111 63 -107 -104 280 -11 -389 -76 12 108 -32
$$ packed form
6811E0Q4j55J2j11O7k90L53K69l95K90k19lL19m16K32m8R1j89L9N7j68O09l04
6834A74m06J89K69n05K70o0l85L51J57k38pJ66j18R5K13j88l3r5K76k13j3K0P2
6857ij65Q0K8j37K18L77l51k16J85K4k25L35nk33K2J46j67J50P1j30j24L15j66
6880B3l29N01k5k39q3N1J22j44L31p4k59J80P6j87K98J09l88k81L35P3l58N43
6902B75m06J30k0K10l46P9QN5j36J0K60l51P9L40r3k8R6n15K05J02m0K39k11j53
6926b11K47O1l8K3j9l2Pl47O6M53k26l0K77j24m04K92j7n1q7L3J08j52J51l3j75
6951b28M93J5o51L57o0Pp7J69j09J34k3P2k65N7O3K33j95J2J97l62L55k84R1J9
6975B0K27j6j44J95j60k61L48j0j94J2K71k53k1R7m8j70LL84k91l78L13Q8R6j40
$$ plain form
6999 -32 188 -228 59 -138 102 232 -185 64 -139 127 -50 -65 55 -185 1 -308 41 26 129 51 171
7020 171 2 -66 -186 153 127 200 -226 -120 166 172 -75 218 -185 2 122 -26 94 -12 74 -101 -83 -20 -149
7043 -149 -180 85 75 240 157 -90 30 232 -97 103 60 72 104 -187 -113 68 358 -57 120 215 -124 56 51
7066 51 74 -307 106 -186 4 -85 -81 -168 -113 -99 12 14 289 15 -153 73 -216 -280 -180 22 -47 -92 -23 -4 -309
7091 -309 27 41 140 57 238 133 143 100 27 0 -123 -205 163 61 -35 -148 -68 17 299 41 92 296 99 -33
7115 -33 117 11 -242 200 -173 -168 80 212 28 -244 -146 71 10 -110 166 -157 187 212 -79 -89 201 -28
7137 -28 -234 30 198 104 176 330 -156 -116 364 160 79 118 -54 87 -29 737 -208 -132 150 -463 -139 -38
7159 -38 -194 -377 199 -256 -87 -359 -12 -83 -41 64 147 -52 174 45 -100 -225 -174 -32 -129 -53 22 63 199
$$ packed form
6999c2K20m16K87j97K40J30m17K49k03K66j77j5J20k40J86l09L49j5J03p8J20
7020A71j69o8j20L39k6P3m26J06K86Ok47K93m03J87J20j48J20j06Q6j75J8O3j29
7043a49l1K65j0J65q3k47J20K02l29K00m3J2L2k91P4J81K90m15J77R5l39J80n
7066E1K3l81M13k92J90q9Mq7N5J4J11KK75k74j68K26k89o4J00K02o9m5O9J9l05
7091c09L36J4R9q3J81j05J0m3p3k7j23q2L68j02r6j13Q0Q5K82k58N1K04j97j32
7115c3J50j06k53M42l73NK48J32j84k72R8K17o1j20K76l23L44K5k91j0K90k29
7137b8k06K64J68r4P2J54m86M0M80k04q1L9j72J41j16P66r45P6K82o13L24J01
7159c8j56j83N76m55J69k72L47p1M2J05Q3j99K26j29j45j25N1J42r7P6P5M1J36
$$ plain form
7182 199 3 242 -20 268 -57 -21 93 23 -63 -26 -251 -12 -168 -145 -459 -191 113 -83 67 172 -200 -77
7204 -77 -116 -48 189 182 201 -87 -3 -46 212 -15 1 128 207 -30 -71 89 1 -75 204 -51 29 86 -135 -113 -61 84
7230 84 -68 241 1 -116 -3 -353 177 -1 -114 -135 3 162 311 -88 -189 267 254 170 154 -71 95 30
7252 30 190 -9 42 -137 147 91 76 369 -257 334 16 -54 149 -171 234 -168 89 -130 117 25 -142 -102
7274 -102 -235 80 104 32 -10 73 218 3 -116 -260 64 46 -81 -275 -209 233 -116 36 -53 -75 -150 267 179
7297 179 17 138 -50 -112 -76 264 16 134 -165 -249 29 62 105 -3 58 -133 -134 -84 78 14 38 -148 152 -209
7321 -209 123 143 -182 27 -68 -77 -152 222 77 4 32 -57 -54 -51 157 -189 -100 -74 70 13 135 207 -182 22 256
7346 256 171 -50 -55 -120 -129 312 157 60 -54 36 -27 -375 -364 -52 -65 -86 -45 -300 -33 -149 283 85 -6 -23 -82
$$ packed form
7182A99j96K39k62K88l25L6J14p0q6L7k25K39j56K3l14K68L04j96J50J05l72J23
7204g7l9O8K37pJ9k88Q4m3K58k27J6J27P9k37m1J60q8p6K79k55Q0N7k21K2N2J45
7230H4j52L09k40j17J13l50N30j78j13k1J38J59J49l99j01M56j3q4j6k25J66o5
7252C0J60j99N1j79K84n6j5K93o26N91l18p0K03l20M05m02K57k19K47r2j67M0
7274a02j33L15K4p2m2Q3J45k15j19j44L24j8j27j94O6M42l49J52q9k2p5M17q8
7297A79j62J21j88o2L6L40k48J18k99q4K78L3M3j08O1j91jN0J62o4K4j86L00l61
7321b09L32K0l25K09r5rp5L74j45p3K8q9LLK08l46Q9K6J44n7J22P2l89K04K34
7346B56q5k21no5rM41j55r7j14R0o3l48J1L12j3k1M1k55K67j16M32j98r1j7n9
$$ plain form
7371 -82 -167 42 441 43 -167 78 54 44 58 -175 -27 5 -311 369 70 -109 -135 126 61 38 267 -28 -55
7394 -55 -67 215 199 -176 -38 11 313 156 375 285 -119 289 -274 142 -22 21 -219 0 176 7 -78 -8 -73
7417 -73 123 149 127 56 71 -130 136 122 -228 -130 185 87 -121 -61 -252 -36 206 266 -77 -4 -180 347 -146 101
7441 101 58 115 133 10 49 49 -170 -97 -40 111 -13 146 -58 -298 119 -25 -93 70 -33 -115 94 154 133 230
7465 230 88 -203 -45 -199 -74 163 117 -169 -15 95 68 -5 -58 -360 69 112 51 231 -93 267 -60 206
7487 206 25 164 -220 -64 120 -118 -66 -113 -36 -127 -51 -20 -16 73 91 40 87 -39 -112 7 -311 -219 75 -197 141
7512 141 152 -158 -137 -78 63 49 192 26 31 -242 30 122 116 100 -79 -317 95 -84 -88 -197 227 -259 -331 222
7536 222 -182 41 -83 187 182 -108 -93 231 66 204 -28 -6 289 -222 119 60 253 194 -39 308 -220 169
$$ packed form
7371h2q5K09L99l98k10K45k4j0J4k33J48L2l16O80k99j79k6K61o5k3K29k95k7
7394e5j2K82j6l75J38M9L02j57K19r0m04M08n63M16j64M3k40K19J76j69q5P0o5
7417g3J96K6k2p1J5k01K66j4l50R8L15r8k08O0j91K16K42O0l43P3j76N27m93K47
7441A01m3N7J8j23L9%k19P3N7J51j24J59k04k40M17j44o8J63j03q2K09O0k1R7
7465B30j42k91J58j54J25K37m6k86J54J10k7p3n3l02M29M3o1J80l24L60l27K66
7487B06j81J39l84J56J84k38N2m7P7r1P6L1MQ9J8n1M7j26p3J19l18R2K94k72L38
7512A41J1l10K1N9J41j4J43j66Nk73K72R2oj6j79k38M12j79mj09M24m86p2N53
7536B22m04K23j24K70nk90J5L24j65J38k32K2K95n11L41n9J93n9k33L47n28L89
$$ plain form
7558 169 262 96 309 -237 120 -110 17 -76 285 -156 -190 -118 144 -27 -198 284 -177 -52 -50 88 -110 -143
7580 -143 -67 -180 -375 -86 126 70 -107 19 -137 -362 51 185 -176 -121 -111 96 -2 -54 -19 104 -143 -46 63
7603 63 139 -245 -60 -8 61 -17 -43 108 -25 13 -118 125 -130 -7 205 -221 196 -98 93 106 57 -50 -175
7626 -175 -10 -33 69 45 53 -24 151 392 -158 335 -199 -39 277 -224 28 -78 37 113 -268 -74 -175 -143
7648 -143 171 -100 39 -36 323 55 167 171 -184 -125 17 251 -59 -2 117 94 -156 161 106 -89 25 298
7670 298 -216 252 -57 -274 -210 12 252 121 2 62 226 110 8 143 20 16 -85 -42 153 24 127 -106
7692 -106 -144 74 -33 -186 -120 185 -111 69 -326 7 -39 -189 42 207 -20 -233 493 129 -326 -144 648
7713 648 -22 -68 -55 209 -153 199 244 -239 294 222 91 375 -70 -79 -162 45 -4 -323 -115 343 6 22 -20
$$ packed form
7558A69R3j66K13n46L57k30J27r3L61m41l4P2K62j71j71M82m61J25KJ38j98l3
7580a43P6j13j95K89K12n6j77J26j56k25M13J34l61N5J0K07r8n2L5J23k47R7J09
7603F3P6l84J85N2O9p8k6J51j33L8j31K43k55J23K12m26M17k94J91J3m9j07j25
7626a75J65k3J02k4Qp7J75K41n50M93n34J60L16n01K52j06J15P6l81J94j01L2
7648a43L14k71J39p5L59k68J12Ml55N9J42K34l10N7J19k3k50L17n5j95J14K73
7670B98n14M68l09k17O4K22K40j31j19O0J64j16j02J35j23mj01M3J95j29J03k33
7692a06l8K18j07j53O6L05k96J80l95L33m6j50K31J65k27k13P26l64m55J82P92
7713F48o70m6J3K64l62L52M5m83N33p2j31K84m45rq3K07m9l19K08M58l37J6m2
$$ plain form
7736 -20 -165 -144 88 301 -8 -144 25 -377 -157 89 -201 -245 -96 119 283 -219 -1 -117 16 -172 243
7757 243 -56 -34 54 -59 54 154 -198 -183 231 166 -95 -185 -15 103 181 -109 34 51 -4 201 13 -142 84
7780 84 -278 -67 -263 32 140 -80 -95 120 -84 -46 35 -93 -37 66 -41 -306 41 -158 -170 68 -40 -102
7802 -102 -59 -185 151 53 -205 6 98 32 73 -132 -102 -147 111 -58 47 -157 97 669 117 19 -32 -43 -213
7825 -213 67 135 210 266 -8 -249 -65 38 -6 -332 -111 -41 262 -182 -37 237 15 -149 107 -126 15 -301
7847 -301 50 -95 -402 -100 -329 -126 -193 -21 133 -70 259 138 -16 -134 -152 280 47 46 287 -6 -133
7868 -133 -247 125 -12 -229 64 -414 -64 -17 62 56 -73 1 64 -79 -1 -83 -413 -240 -95 247 80 -8 20
7891 20 -9 -126 -19 71 122 316 67 372 94 49 70 56 452 132 130 -276 -323 -171 70 -200 -15 -191 -16
$$ packed form
7736b0j45K1K32K13l09j36J69m02K20K46k90m4J49K15J64n02K18j16J33j88M15
7757B43k99K2Q8j13J13J00l52J5M14o5k61r0J70J18P8k90J43J7n5K05j88j55K26
7780H4l62K11j96K95J08k20j5K15k04L8Q1j28N6J03j07k65L47j99j2K38j08o2
7802a02M3j26L36r8k58K11R2o6M1k05L0m5K58j69J05k04K54N72n52r8n1j1j70
7825b13K80O8P5N6k74k41J84J03m4l26K21P0L03m44J45K74k22j64K56k33J41l16
7847c01L51j45l07L02k29K03o7J72J54k03L29j21j54j18j8M32k33jK41k93j27
7868a33j14L72j37k17K93m78L50M7P9oj29P4O3j43P8q2l30J73J45L42j67q8K8
7891B0k9j17J07R0N1J94k49L05k78m5K1j4L96l20km06m7J52K41k70J85j76J75
$$ plain form
7914 -16 -187 99 150 -350 5 -45 109 -44 20 92 -140 183 -83 272 -343 -80 -56 -217 113 32 168 219 212
7937 212 57 112 -142 -99 -56 39 -128 113 -223 119 -17 11 337 106 96 -119 -74 109 214 -168 216 225 -173
7960 -173 98 103 17 170 -71 -98 227 25 157 -30 -36 -37 44 -74 120 176 -254 117 -2 117 -432 17 -112
7983 -112 100 7 -31 -223 41 -215 6 90 -258 -189 -213 -8 -245 -68 -223 -75 -136 1 -74 -3 -240 -474 198
8006 198 51 187 58 1 -81 41 3 -267 -288 165 188 -101 -88 -101 -325 66 -235 -42 -233 333 175 80 312
8029 312 -173 160 49 -245 19 136 35 -19 -23 -120 -132 -133 145 -245 -213 -91 -108 306 -136 -12 220 -55 168
8052 168 39 170 -125 271 12 281 5 -207 32 -18 -43 188 -86 -54 -107 14 6 -132 -73 280 249 -10 -108
8075 -108 -81 86 9 -76 -41 107 -64 34 59 108 -55 34 -298 -293 149 -65 -89 -317 38 -106 -154 95 -70 198
$$ packed form
7914a6j71K86N1n00L55n0J54j53O4P2k32L23k66L55o15K63K4j61L30q1J36N1p
7937B12j55N5k54M3M3R5j67K41l36L42j36K8L26k31j0k15M5J83J05l82L84Rl98
7960a73K71Nq6J53k41k7L25k02J32j87ojQ1j18J94N6m30L71j19J19n49M49j29
7983a12K12r3l8j92K64k56K21Q4l48O9k4K05k37J77j55J48o1J37p5P1k37k34O72
8006A98j47J36j29n7q2J22l8k70k1M53K3k89J3j3k24L91l01J93j91N66j58r5K32
8029C12m85L33j11k94K64J17j01n4mr7j2jK78l90L2J22j7M14m42J24K32k75K23
8052A68j29J31k95L96k59K69k76k12K39n0k5K31k74L2n3J21qj38N9L53l1k59r8
8075a08K7J67p7q5L5J48j71R8K5M9j63Q9l32NM42k14k4k28L55j44m8K49j65K68
$$ plain form
8099 198 111 234 -47 -115 -33 110 122 -178 -75 51 63 82 134 -11 -271 -71 46 46 127 -477 14 -240 -186 -500
8123 -500 154 -166 -64 69 -116 4 347 -109 -174 -1 -79 50 -160 -254 -279 77 -6 13 -239 -213 -109 135
8145 135 -106 52 -101 78 -131 -90 -45 -44 -98 -110 232 22 228 43 121 -128 -134 64 89 67 77 -151 -258 130
8169 130 -41 -163 -75 -59 -171 -264 43 -76 -183 184 -144 -110 149 156 -134 -117 493 -75 -188 72 94 210
$$ packed form
8099A98q7J23k81o8Q2J43J2l00J03J26J2J9N2j45k60K00J17%Q1o04M91k54N4l14
8123e00O54l20J02J33j85J20L43m56o5J73p8J29k10r4k5L56q3J9k52K6J04K44
8145A35k41J58j53J79k09M1M5Jn4j2L42k10K06j85P8k49oJ98K5k2J0k28j07L88
8169A30j71j22Q8J6j12r3L07j19j07L67l28L4K59Pk90J7O10n68j13K60K2J16
8191B10
$$ Imaginary data points
##PAGE= N=2
##DATA TABLE= (X++(I..I)), XYDATA
$$ plain form
0 0 0 0 0 0 0 0 -8 8 -8 8 -8 16 -21 24 -24 32 -40 48 -56 64 -79 88 -102 119 -136 156 -174 201 -228 253
30 253 -286 322 -361 402 -448 497 -553 616 -680 755 -836 923 -1024 1135 -1258 1397 -1555
47 -1555 1735 -1944 2189 -2481 2835 -3281 3849 -4613 5690 -7327 10087 -15623 30973 -157786
61 -157786 -539592 -84713 252193 41798 -132490 40195 29443 -173459 -90806 218976
71 218976 195478 -108899 -181326 35492 85617 -58276 -11454 176685 59880 -198351 -81257
82 -81257 224997 164014 -86037 -71573 50254 5121 -7172 104984 83507 -75524 -90368
93 -90368 39326 81981 -12902 -102614 -83366 -7209 -15227 -96338 -95091 -25677 -37823 -93446
105 -93446 -74719 -38883 -53376 -63278 -64674 -79965 -56875 -17361 -38923 -66773 -56313 -73467
$$ packed form
0@%%%%%%qJ6j6J6j6K4l7M5m8N6p2Q8j04J20j43J67j90K21k55K92l30L75m29M81
30B53n39O08o83P63q50R45j050J169j296J435j591J759j947K159k393K655k952
47a555L290l679M133m670N316o116P130q462J0303j3017J7414k5710M6596j88759
61a57786l81806M54879L36906k10395j74288J72685j0752k02902Q2653L09782
71B18976k3498l04377p2427K16818N0125j43893M6822J88139j16805k58231J17094
82h1257L06254o0983k50051J4464J21827m5133j2293J12156k1477j59031j4844
93i0368J29694M2655r4883q9712J9248P6157q018q1111J247O9414j2146n5623
105i3446J8727L5836j4493r902j396j5291K3090L9514k1562k7850J0460j7154
$$ plain form
117 -73467 -72527 15918 23511 -122569 -148915 22253 77633 -52665 -94641 -11738 6472 -23877
129 -23877 6928 39114 3370 -31181 5547 65111 46367 -25286 -918 89053 39567 -83611
141 -83611 -20346 120859 58855 -64557 -3479 77918 20676 -2164 53605 19257 -47314 14769
153 14769 87540 22535 -58649 -18713 66700 64260 -20887 -61387 -5657 28560 -19533 -35433
165 -35433 -5529 -40393 -68233 17242 51464 -57505 -85822 20872 22528 -74964 -51369 31563
177 31563 -856 -60107 -31560 1291 -9260 -2551 14247 -9846 -52630 -48340 22572 67860
189 67860 -8393 -89495 -14449 89267 34735 -41596 5588 33877 -17541 3504 63926 15776
201 15776 -42695 14461 61971 12061 -17019 21882 42681 12143 -26089 -16993 45649 64552
$$ packed form
117g3467R40Q8445P593j46080k6346J71168N5380j30298m1976Q2903J8210l0349
129b3877L0805L2186l5744l4551L6728N9564j8744p1653K4368Q9971m9486j23178
141h3611O3265J41205o2004j23412O1078Q1397n7242k2840N5769l4348o6571O2083
153A4769P2771o5005q1184L9936Q5413k440q5147m0500N5730L4217m8093j5900
165c5433K9904l4864k7840Q5475L4222j08969k8317J06694J656r7492K3595Q2932
177C1563l2419n9251K8547L2851j0551O709J6798k4093m2784M290P0912M5288
189F7860p6253q1102P5046J03716n4532p6331M7184K8289n1418K1045O0422m8150
201A5776n8471N7156M7510m9910k9080L8901K0799l0538l8232R096O2642J8903
$$ plain form
213 64552 -9383 -48967 9503 41363 12076 14504 13565 -43872 -44015 41723 59619 -12037 -41078
226 -41078 -12222 12042 23831 9432 -24343 -9941 21194 -11873 -35043 21343 42047 -14483
238 -14483 -25445 10037 -1404 -13219 22726 19847 -35148 -39030 14884 48418 30765 -20071
250 -20071 -37510 25636 68741 9318 -32295 17163 30770 -15014 3423 45886 3856 -28111
262 -28111 23731 38055 -16214 -22027 26097 31664 -6507 -29356 -6687 43571 47797 -10839 -24211
275 -24211 32780 41575 1462 15437 32945 -14089 -23256 36351 33946 -24947 -14799 32172 22374
288 22374 -7106 -7318 7488 28766 30834 -6939 -19136 24107 38861 14176 22775 31645 -2367
301 -2367 1379 48201 33508 -17274 -6325 20283 3185 -6548 5515 6707 17050 25992 -6516
$$ packed form
213F4552p3935l9584N8470L1860k9287K428r39n7437j43Q5738J7896p1656k9041
226d1078K8856K4264J1789j4399l3775J4402L1135l3067k3170N6386K0704n6530
238a4483j0962L5482j1441j1815L5945k879n4995l882N3914L3534j7653n0836
250b0071j7439O3146M3105n9423m1613M9458J3607m5784J8437M2463m2030l1967
262b8111N1842J4324n4269n813M8124N567l8171k2849K2669N0258M226n8636j3372
275b4211N6991Q795m0113J3975J7508m7034r167N9607k405n8893J0148M6971r798
288B2374k9480k12J4806K1278K068l7773j2197M3243J4754k4685Q599Q870l4012
301b367L746M6822j4693n0782J0949K6608j7098r733J2063J192J0343Q942l2508
$$ plain form
314 -6516 -21432 25293 44924 6359 -6365 5456 -5669 5902 43798 27699 -18296 -12963
326 -12963 10601 5505 3410 873 -17631 -12389 2633 -19242 -22326 30205 38877 -13938 -21283
339 -21283 15470 18688 16930 33336 11459 -23737 -4976 26118 21053 11593 4893 -10588 -1170
352 -1170 17096 -1778 -8018 26547 21046 -27048 -16550 29942 27297 14474 27681 14762 -7736
365 -7736 14836 40986 28044 11125 -462 -14823 2811 29474 9477 -8078 19900 20012 -16278
378 -16278 -2223 36928 24315 1034 8271 1748 -7218 24173 44342 21406 4373 2314 -1133
391 -1133 17366 31700 -3826 -28967 230 7007 -21569 -3244 34585 14883 -12315 2404
403 2404 10352 4950 19983 22133 -1762 -4019 8856 11570 28249 41423 7502 -16813 13305
$$ packed form
314f516j4916M6725J9631l8565j2724J1821j1125J1571L7896j6099m5995N333
326a2963K3564n096k095k537j8504N242J5022k1875l084N2531Q672n2815p345
339b1283L6753L218j758J6406k1877l5196J8761L1094n065r460o700j5481R418
352a170J8266j8874o240L4565n501m8094J0498M6492k645j2823J3207j2919k2498
365g736K2572K6150j2942j6919j1587j4361J7634K6663j9997j7555K7978J12l6290
378a6278J4055L9151j2613k3281P237o523q966L1391K0169k2936j7033k059l447
391a133J8499J4334l5526k5141K9197O777k8576J8325L7829j9702k7198J4719
403B404P948n402J5033K150k3895k257J2875K714J6679J3174l3921k4315L0118
$$ plain form
416 13305 20964 -7071 2534 24244 -3327 -22131 9647 27568 17198 18612 14710 -3160 1896
429 1896 14752 9216 15509 23409 -5529 -18024 20641 32536 156 916 16520 -7497 -19385
442 -19385 12856 23382 5525 5413 7844 802 13558 24953 11020 9873 18346 -2771 -10512
455 -10512 25680 32413 -2986 -3585 16655 216 -9901 14586 16137 -6361 -6676 346 274 14305
469 14305 17034 -6607 -7004 10257 -4983 -13659 15038 15439 -19678 -11705 17863 2907 -11617
482 -11617 7963 6850 -17375 -14183 -334 470 5393 2536 -13204 -2493 17837 189 -14309
495 -14309 7353 6228 -20052 -5197 17964 -1969 -9006 18877 17531 -6405 1751 15465 5670
508 5670 5775 10676 -979 3387 23747 14040 -125 14925 17657 -289 5386 14731 -1409 719
$$ packed form
416A3305P659k8035R605K1710k7571j8804L1778J7921j0370J414l902j7870N056
429A896J2856n536O293P900k8938j2495L8665J1895l2380P60J5604k4017j1888
442a9385L2241J0526j7857j12K431p042J2756J1395j3933j147Q473k1117p741
455a0512L6192O733l5399n99K0240j6439j0117K4487J551k2498l15P022p2J4031
469A4305K729k3641l97J7261j5240q676K8697M01l5117P973K9568j4956j4524
482a1617J9580j113k4225L192J3849Q04M923k857j5740J0711K0330j7648j4498
495a4309K1662j125k6280J4855K3161j9933p037K7883j346k3936Q156J3714r795
508E670J05M901j1655M366K0360r707j4165J5050K732j7946N675R345j6140K128
$$ plain form
522 719 22307 10919 -6327 11674 20635 5001 9328 13671 -8568 -6574 23488 15197 -12043
535 -12043 -1612 11076 -1990 -3194 5818 -6102 -12868 -1644 -3296 -6161 6880 4853 -6241
548 -6241 6036 6923 -17175 -5803 24522 -548 -34760 -7539 21177 2671 -8573 -1575 -11884
561 -11884 -14935 3739 1359 -16438 -14215 -5701 1343 17087 15169 -6941 3841 29407 8547
574 8547 -14834 10970 25167 -1817 -8297 9456 11956 14168 19249 -905 -15517 3728 11435
587 11435 -2314 918 1691 -16524 -413 37842 21320 -18499 -5652 20440 5826 -12020 -7528
600 -7528 -4851 -7494 -9574 -14374 -6213 5629 -8572 -18663 1130 -4600 -34941 -9050 33610
613 33610 -2619 -45953 -22 43059 5187 -23892 5407 18875 -4867 -12934 -2738 -2646 -10684
$$ packed form
522G19K1588j1388j7246J8001Q961j5634M327M343k2239J994L0062q291k7240
535a2043J0431J2688j3066j204R012j1920o766J1224j652k865J3041k027j1094
548f241J2277Q87k4098J1372L0325k5070l4212K7221K8716j8506j1244O998j0309
561a1884l051J8674k380j7797K223Q514P044J5744j918k2110J0782K5566k0860
574H547k3381K5804J4197k6984o480J7753K500K212N081k0154j4612J9245P707
587A1435j3749L232P73j8215J6111L8255j6522l9819J2847K6092j4614j7846M492
600g528K677k643k080m800Q161J1842j4201j0091J9793n730l0341K5891M2660
613C3610l6229m3334M5931M3081l7872k9079K9299J3468k3742q067J0196R2q038
$$ plain form
626 -10684 -9487 5083 5484 -26542 -32971 22484 43369 -21244 -47772 13539 35984 -8363 -6306
639 -6306 27898 4462 -26369 3653 30117 9554 -4231 2384 -2926 -14774 -9265 14705 31476
652 31476 3443 -45433 -32246 33409 47610 9212 -6007 -6520 -17145 7529 48409 25487
664 25487 -25890 -26812 -3826 2344 13169 20675 -601 -19646 -17722 -16735 -1908 31324 21767 -30807
678 -30807 -42375 -2300 29679 35328 18703 -14980 -25822 3795 24528 15753 72 -18843
690 -18843 -28007 3531 26692 -5849 -24890 10464 15929 -22842 -19065 16395 8107 -15523 -4529
703 -4529 4121 -5403 2391 15400 2377 -15626 -10424 9471 16089 -13964 -46343 -15682 36482
716 36482 16720 -33371 -23835 2933 -3570 7925 31156 -3964 -45764 -10120 34846 12647
$$ packed form
626a0684J197J4570M01l2026o429N5455K0885o4613k6528O1311K2445m4347K057
639f306L4204k3436l0831L0022K6464k0563j3785O615n310j1848N509K3970J6771
652C1476k8033m8876J3187O5655J4201l8398j5219n13j0625K4674M0880k2922
664B5487n1377r22K2986O170J0825P506k1276j9045J924R87J4827L3232r557n2574
678c0807j1568M0075L1979N649j6625l3683j0842K9617K0733q775j5681j8915
690a8843r164L1538K3161l2541j9041L5354N465l8771L777L5460q288k3630J0994
703d529Q650r524P794J3009j3023j8003N202J9895O618l0053l2379L0661N2164
716C6482j9762n0091R536K6768o503J1495K3231l5120m1800L5644M4966k2199
$$ plain form
728 12647 -12809 3571 9002 -11242 -13916 7881 22313 9547 -18834 -24244 -2926 6081 6714
741 6714 21798 7219 -42193 -29901 42649 45120 -20207 -27881 9147 1398 -13106 11379 14469
754 14469 -17600 -16759 9020 762 -21406 -10296 15301 10713 -24575 -38091 313 29622 -4320
767 -4320 -33757 -4238 13020 -15060 -14076 11172 -5924 -24969 5083 14683 -26137 -27945 17655
780 17655 25671 -9868 -27680 -14242 8719 22355 9287 -13658 -13301 -750 6388 16972 13830
793 13830 -12655 -15035 13947 13881 -9537 418 19714 5563 -5599 4967 5849 8198 20867 3501
807 3501 -26705 -5296 33386 19398 -13489 -15366 -5747 3938 18676 11628 -21114 -31385 -7911
820 -7911 13770 14748 -5607 -26961 -12383 14148 1949 -15265 4650 6566 -30618 -30121 9951
$$ packed form
728A2647k5456J6380N431k0244k674K1797J4432j2766k8381n410K1318R007O33
741F714J5084j4579m9412J2292P2550K471o5327p674L7028p749j4504K4485L090
754A4469l2069Q41K5779q258k2168J1110K5597m588l5288j3516L8404K9309l3942
767d320k9437K9519J7258k8080R84K5248j7096j9045L0052R600m0820j808M5600
780A7655Q016l5539j7812J3438K2961J3636j3068k2945L57J2551P138J0584l142
793A3830k6485k380K8982o6k3418R955J9296j4151j1162J0566Q82K349J2669j7366
807C501l0206K1409L8682j3988l2887j877R619R685J4738p048l2742j0271K3474
820g911K1681R78k0355k1354J4578K6531j2199j7214J9915J916l7184M97M0072
$$ plain form
833 9951 8989 -13567 -3461 -3222 -35549 -27608 25597 31792 -19486 -50069 -23510 19953 26976 -3170
847 -3170 -18975 -3699 1164 -5033 12201 17408 -16720 -23946 12360 10703 -24090 -6458 28646
860 28646 910 -34385 -9507 23105 15004 -2304 -7536 -7461 3228 16269 16063 5200 -9356
873 -9356 -13448 10358 28112 -1919 -29790 -2933 19588 -3961 -17050 -2982 -7917 -15142 3612
886 3612 3942 -20012 -10859 16101 4928 -17915 -9735 5466 4224 -3664 -16435 -21022 -2549 9406
900 9406 -4369 -14665 -10522 -6834 3821 10454 -13751 -29385 2347 24357 -1184 -13215 9025
913 9025 15006 7993 15856 9536 -12528 -3336 18847 6099 -15596 -8674 4296 7570 5792 -3429
927 -3429 -6660 8614 10589 -10939 -14598 4020 9848 9402 10672 -4939 -12554 17531 33687 2042
$$ packed form
833I951r62k2556J0106K39l2327P941N3205O195n1278l0583K6559M3463P023l0146
847c170j5805J5276M863o197J7234N207l4128p226L6306j657l4793J7632L5104
860B8646k7736l5295K4878L2612q101j7308n232P5J0689J3041k06j0863j4556
873i356m092K3806J7754l0031k7871K6857K2521k3549j3089J4068m935p225J8754
886C612L30k3954R153K6960j1173k2843Q180J5201j242p888j2771m587J8473J1955
900I406j3775j0296M143L688J0655O633k4205j5634L1732K2010k5541j2031K2240
913I025N981p013P863o320k2064R192K2183j2748k1695O922J2970L274j778r221
927c429l231J5274J975k1528l659J8618N828m46J270j5611p615L0085J6156l1645
$$ plain form
941 2042 -19947 -6399 722 -988 6110 -353 -16899 -3482 15902 3613 -10528 733 9283
954 9283 1667 -5235 -9574 -4054 14570 14777 -7190 -11959 163 915 1644 5919 -13872 -29357 -2168
969 -2168 16761 -11264 -23735 5073 14025 -5593 -9260 -702 1675 9102 13467 -987 -10304 -742
983 -742 8945 13600 8346 -12235 -17980 7659 14197 -11147 -10311 12048 2960 -16994 -5261 6211
997 6211 -803 4242 9146 -10275 -17939 5588 19756 10844 -2763 -15971 -15098 7256 13565 -8022
1011 -8022 -13986 333 -755 -6041 4584 7129 -1431 4553 4947 -13058 -10235 14232 16543 1123
1025 1123 -3488 -6087 -2784 17380 20125 -9751 -20785 282 6345 -3855 -1200 2030 -2541 2727
1039 2727 5788 -4632 -2406 11448 6894 -5660 -5239 -5064 -124 19090 15932 -13559 -14230 12838
$$ packed form
941B042k1989J3548P121j710P098o463j6546J3417J9384j2289j4141J1261Q550
954I283p616o902m339N520J8624K07k1967m769J2122P52P29M275j9791j5485K7189
969b168J8929k8025j2471K8808Q952j9618l667Q558K377P427M365j4454r317R562
983g42R687M655n254k0581n745K5639O538k5344Q36K2359r088j9954J1733J1472
997F211p014N045M904j9421p664K3527J4168q912j3607j3208Q73K2354O309k1587
1011h022n964J4319j088n286J0625K545q560N984L94j8005K823K4467K311j5420
1025A123m611k599L303K0164K745k9876j1034K1067O063j0200K655L230m571N268
1039B727L061j0420K226J3854m554j2554M21J75M940J9214l158k9491o71K7068
$$ plain form
1053 12838 12573 -4188 -1166 1708 -6566 -789 8460 629 -730 10597 5729 -5701 -2897 767
1067 767 2491 11623 5832 -15333 -9594 15547 12580 -2794 -782 -1161 -7312 3159 10723 -2414
1081 -2414 -4891 7853 3863 -5373 2425 5339 -766 3607 1142 -14874 -7831 15043 9923 -8343
1095 -8343 -6178 -126 -699 5599 5556 -9144 -8040 5746 1856 -5313 3291 4537 -2993 2238 2329 -12262
1111 -12262 -6662 12064 3696 -15203 -7641 3811 2614 4738 4709 -7334 -5222 7623 2067 -6044
1125 -6044 1195 1512 -5746 1547 4647 -7735 -4683 10357 92 -14681 -5084 3429 -3138 -1359
1139 -1359 1387 -7079 -3925 9498 4256 -3852 3016 2816 -4272 3842 6551 -7596 -6898 8028 1618
1154 1618 -10306 -1712 3904 -2975 -527 947 -7595 -2818 9772 1219 -8243 2446 5864 -1304
$$ packed form
1053A2838k65j6761L022K874q274N777R249p831j359J1327m868j1430K804L664
1067G67J724R132n791k1165N739K5141k967j5374K012l79o151J0471P564j3137
1081b414k477J2744l990r236P798K914o105M373k465j6016P043K2874n120j8266
1095h343K165O052n73O298m3j4700J104J3786l890p169Q604J246p530N231R1j4591
1111a2262N600J8726q368j8899P562J1452j197K124k9j2043K112J2845n556q111
1125f044P239L17p258P293L100j2382L052J5040j0265j4773R597Q513o567J779
1139a359K746q466L154J3423n242q108O868k00p088Q114K709j4147O98J4926o410
1154A618j1924Q594N616o879K448J474q542M777J2590q553r462J0689L418p168
$$ plain form
1168 -1304 4910 8457 -4463 -3169 11306 4352 -9615 -3116 3247 -2130 -1449 161 -4493 1484
1182 1484 9171 -912 -4703 9156 7297 -6024 1561 9568 -2636 -2604 12225 5301 -8956 -284
1196 -284 7913 -942 -4013 -2455 -7532 -5205 1041 -3603 -4152 4946 356 -6850 5229 10273 -5840
1211 -5840 -5176 8920 -130 -12340 -96 7256 -4195 -5370 -39 -5379 -5713 2538 -2711 -9096
1225 -9096 -2892 -3360 -7747 1703 6001 -4778 -2402 9213 1591 -6951 5629 7814 -5531 -5711
1239 -5711 -410 -5772 -3551 5046 -2343 -7942 1361 33 -8188 2587 9075 -6892 -10851 3212
1253 3212 1948 -4046 5548 7460 -6290 -6583 2221 1073 -703 -1988 -11375 -12191 -1795 -3653 -7596
1268 -7596 4816 4398 -15618 -10812 11278 6227 -8805 -1865 303 -10690 -4007 11680 4994 -6496
$$ packed form
1168a304O214L547j2920J294J4475o954j3967O499O363n377O81J610m654N977
1182A484P687j0083l791J3859j859j3321P585Q007j2204L2J4829o924j4257Q672
1196b84Q197q855l071J558n077K327O246m644n49R098m590p206J2079N044j6113
1211e840O64J4096r050j2210J2244P352j1451j175N331n340l34Q251n249o385
1225i096O204m68m387R450M298j0779K376J1615p622q542J2580K185j3345j80
1239e711N301n362K221Q597p389n599R303j328q221J0775O488j5967l959J4063
1253C212j264n994R594J912j3750k93Q804j148j776j285r387q16J0396j858l943
1268g596J2412m18k0016M806K2090n051j5032O940K168j0993O683J5687o686j1490
$$ plain form
1282 -6496 -3807 -1455 -2840 -566 -2160 -5296 -1952 -5755 -12649 594 11819 -1508 -7900 6660
1296 6660 3151 -11108 1535 14289 -3361 -11857 5092 6179 -6349 -1516 7355 1174 -3306
1309 -3306 -2087 -4903 -2807 3468 2266 2008 3404 -7317 -8471 12223 14745 -6703 -7755 5090
1323 5090 -2912 -8063 9281 10838 -9877 -10809 1054 -4497 -5272 7788 4990 -11654 -13384 -3804
1337 -3804 5439 11760 3113 -14019 -11989 1362 1933 2507 6606 -5809 -17320 -1332 10652 -1810
1351 -1810 -4628 3220 -7081 -16333 -1552 7232 -609 -641 -1016 -12057 -8325 10530 7858 -7337
1365 -7337 -8837 -5331 -6149 608 5082 -2864 -5122 -825 -3119 -3021 2047 -3622 -6506 5129 445
1380 445 -17475 -6662 15229 3468 -13386 -1847 1721 -12246 -6329 9926 0 -14731 -5820
$$ packed form
1282f496K689K352j385K274j594l136L344l803o894J3243J1225j3327o392J4560
1296F660l509j4259J2643J2754j7650q496J6949J087j2528M833Q871o181m480
1309c306J219k816K096O275j202k58J396j0721j154K0694K522k1448j052J2845
1323E090q002n151J7344J557k0715r32J1863n551p75J3060k798j6644j730R580
1337c804R243O321q647j7132K030J3351N71N74M099j2415j1511J5988J1984j2462
1351a810k818P848j0301r252J4781Q784p841l2l75j1041L732J8855k672j5195
1365g337j500L506q18O757M474p946k258M297k294R8N068n669k884J1635m684
1380D45j7920J0813K1891j1761j6854J1539L568j3967N917J6255r926j4731Q911
$$ plain form
1393 -5820 4085 -368 -5182 -2047 3793 2690 -11610 -14554 7184 14722 -7450 -12895 4212 -415
1407 -415 -12510 6240 13676 -16413 -23063 8842 15417 -9497 -12041 4973 5516 -4550 -5521 427
1421 427 3116 -4326 -10942 -742 8673 -3415 -9161 5445 1109 -18227 -4193 18071 -2447
1434 -2447 -26739 -7482 13763 5053 319 3625 -5511 -9144 5866 13533 2774 -8610 -11630
1447 -11630 -3324 9762 6341 -4914 -447 4266 -9041 -11913 5029 6205 -6991 -6737 -4950 -9262
1461 -9262 3191 18590 2707 -16973 -7615 4997 3209 2236 -2857 -15869 -10898 8946 7505
1474 7505 -7535 -7029 -1646 -2243 -1332 -1334 -4400 -1226 1210 -5863 -3283 7710 2533 -5445 1449 -412
1490 -412 -12862 -1077 13452 -7723 -26144 -5121 11983 -1865 -11028 -6386 -7984 -7375 4131
$$ packed form
1393e820R905m453m814L135N840j103j4300k944K1738P538k2172n445J7107m627
1407d15j2095J8750P436l0089o650L1905O575k4914k544J7014N43j0066r71N948
1421D27K689p442o616J0200R415j2088n746J4606m336j9336J4034K2264k0518
1434b447k4292J9257K1245q710m734L306r136l633J5010P667j0759j1384l020
1447a1630Q306J3086l421j1255M467M713j3307k872J6942J176j3196K54J787m312
1461i262J2453J5399j5883j9680R358J2612j788r73n093j3012M971J9844j441
1474G505j5040N06N383n97R11kl066L174K436p073K580J0993n177p978O894j861
1490d12j2450J1785J4529k1175j8421K1023J7104j3848r163M642j598O09J1506
$$ plain form
1503 4131 5784 -5558 -11159 -6230 3060 7567 -2818 -11221 1426 6068 -11520 -11270 10551 6439
1517 6439 -14219 -8549 1744 -8540 -6397 10220 1027 -19782 -10294 11240 8921 -4748 -8960
1530 -8960 -4319 2928 1532 -8471 -7662 -86 -3784 -6114 1875 -3363 -15183 -488 14180 -6634
1544 -6634 -21766 -277 11618 -5127 -9726 2873 4469 1014 3443 476 -5385 -216 3957 106
$$ packed form
1503D131J653j1342n601M929R290M507j0385q403J2647M642j7588K50K1821m112
1517F439k0658N670J0293j0284K143J6617r193k0809R488K1534k319j3669m212
1530h960M641P247j396j0003Q09P576l698k330P989n238j1820J4695J4668k0814
1544f634j5132K1489J1895j6745m599J2599J596l455K429k967n861N169M173l851
$$ [...]
8191H8
##END NTUPLES=NMR FID
##END=
