##TITLE=1H_ANY-167A-k
 CDCl3,8 sc, 
 11.4.2019
##JCAMPDX= 6.0         $$ Bruker NMR JCAMP-DX V2.0
##DATA TYPE= NMR FID
##DATA CLASS= NTUPLES
##ORIGIN= UXNMR, Bruker Analytische Messtechnik GmbH
##OWNER= root
$$ XWIN-NMR		Version 3.5
$$ Thu Apr 11 15:53:56 2019 Russian Standard Time (UT+4h)  she@DPX200
##.OBSERVE FREQUENCY= 200.1315
##.OBSERVE NUCLEUS= ^1H
##.DELAY= (6, 6)
##.ACQUISITION MODE= SIMULTANEOUS
##.ACQUISITION SCHEME= undefined
##.AVERAGES= 8
##.DIGITISER RES= 18
##SPECTROMETER/DATA SYSTEM= spect
##.PULSE SEQUENCE= zg30
##.SOLVENT NAME= CDCl3
##.SHIFT REFERENCE= (INTERNAL, CDCl3, 0, 15.7039)
##AUDIT TRAIL= $$ (NUMBER, WHEN, WHO, WHERE, WHAT)
$$ ##TITLE= Audit trail, XWIN-NMR		Version 3.5
$$ ##JCAMPDX= 5.01
$$ ##ORIGIN= Bruker BioSpin GmbH
$$ ##OWNER= she
$$ F:/spectra/data/she/nmr/H-F/1/audita.txt
$$ ##AUDIT TRAIL=  $$ (NUMBER, WHEN, WHO, WHERE, WHAT)
(   1,<2019-04-11 15:52:46.42 +0400>,<she>,<DPX200>,
      <created by zg, POWCHK disabled, PULCHK disabled
       configuration hash MD5:
       00 E9 B6 7A A2 85 ED C7 34 08 36 98 17 FE 4E 26
       data hash MD5: 16K
       80 C0 76 90 C2 4B ED 90 88 52 FF B3 48 44 79 3B>)
$$ ##END=
$$ 
$$ hash MD5
$$ 57 FE D8 BD D3 D5 01 18 8E C4 C8 1A 16 09 46 1A
##$RELAX= 
##$RELAX= 
##$RELAX= 
##$RELAX= 
##$RELAX= 
##$RELAX= 
$$ Bruker specific parameters
$$ --------------------------
##$DU= <F:/spectra>
##$EXPNO= 1
##$NAME= <H-F>
##$PROCNO= 1
##$TYPE= <nmr>
##$USER= <she>
##$AMP= (0..31)
100 100 100 100 100 100 100 100 100 100 100 100 100 100 100 100 100 100 
100 100 100 100 100 100 100 100 100 100 100 100 100 100 
##$AQSEQ= 0
##$AQ_mod= 1
##$AUNM= <au_zg>
##$AUTOPOS= <>
##$BF1= 200.13
##$BF2= 200.13
##$BF3= 200.13
##$BF4= 200.13
##$BF5= 200.13
##$BF6= 200.13
##$BF7= 200.13
##$BF8= 200.13
##$BYTORDA= 1
##$CFDGTYP= 0
##$CFRGTYP= 5
##$CHEMSTR= <none>
##$CNST= (0..31)
1 1 145 1 1 1 1 1 1 1 1 1 1 1 1 1 1 1 1 1 1 1 1 1 1 1 1 1 1 1 1 1 
##$CPDPRG= <>
##$CPDPRG1= <>
##$CPDPRG2= <>
##$CPDPRG3= <>
##$CPDPRG4= <mlev>
##$CPDPRG5= <mlev>
##$CPDPRG6= <mlev>
##$CPDPRG7= <mlev>
##$CPDPRG8= <mlev>
##$CPDPRGB= <>
##$CPDPRGT= <>
##$D= (0..31)
0 1.2 0 0 0 0 0 0 0 0 0 0.03 0 0 0 0 0 0 0 0 0 0 0 0 0 0 0 0 0 0 0 0 
##$DATE= 1554983565
##$DBL= (0..7)
120 120 120 120 120 120 120 120 
##$DBP= (0..7)
150 150 150 150 150 150 150 150 
##$DBP07= 0
##$DBPNAM0= <>
##$DBPNAM1= <>
##$DBPNAM2= <>
##$DBPNAM3= <>
##$DBPNAM4= <>
##$DBPNAM5= <>
##$DBPNAM6= <>
##$DBPNAM7= <>
##$DBPOAL= (0..7)
0.5 0.5 0.5 0.5 0.5 0.5 0.5 0.5 
##$DBPOFFS= (0..7)
0 0 0 0 0 0 0 0 
##$DE= 6
##$DECBNUC= <off>
##$DECIM= 24
##$DECNUC= <off>
##$DECSTAT= 4
##$DIGMOD= 1
##$DIGTYP= 9
##$DL= (0..7)
0 120 120 120 120 120 120 120 
##$DP= (0..7)
150 150 150 150 150 150 150 150 
##$DP07= 0
##$DPNAME0= <>
##$DPNAME1= <>
##$DPNAME2= <>
##$DPNAME3= <>
##$DPNAME4= <>
##$DPNAME5= <>
##$DPNAME6= <>
##$DPNAME7= <>
##$DPOAL= (0..7)
0.5 0.5 0.5 0.5 0.5 0.5 0.5 0.5 
##$DPOFFS= (0..7)
0 0 0 0 0 0 0 0 
##$DQDMODE= 0
##$DR= 18
##$DS= 0
##$DSLIST= <SSSSSSSSSSSSSSS>
##$DSPFIRM= 0
$$ [...]
##$SUBNAM2= <"">
##$SUBNAM3= <"">
##$SUBNAM4= <"">
##$SUBNAM5= <"">
##$SUBNAM6= <"">
##$SUBNAM7= <"">
##$SUBNAM8= <"">
##$SUBNAM9= <"">
##$SW= 24.9337058887773
##$SWIBOX= (0..15)
0 0 2 0 0 0 0 0 0 0 0 0 0 0 0 0 
##$SW_h= 4990.01996007984
##$TD= 16384
##$TD0= 1
##$TE= 0
##$TE2= 300
##$TE3= 300
##$TEG= 300
##$TL= (0..7)
0 120 120 120 120 120 120 120 
##$TP= (0..7)
150 150 150 150 150 150 150 150 
##$TP07= 0
##$TPNAME0= <>
##$TPNAME1= <>
##$TPNAME2= <>
##$TPNAME3= <>
##$TPNAME4= <>
##$TPNAME5= <>
##$TPNAME6= <>
##$TPNAME7= <>
##$TPOAL= (0..7)
0.5 0.5 0.5 0.5 0.5 0.5 0.5 0.5 
##$TPOFFS= (0..7)
0 0 0 0 0 0 0 0 
##$TUNHIN= 0
##$TUNHOUT= 0
##$TUNXOUT= 0
##$USERA1= <user>
##$USERA2= <user>
##$USERA3= <user>
##$USERA4= <user>
##$USERA5= <user>
##$V9= 5
##$VALIST= <valist>
##$VCLIST= <CCCCCCCCCCCCCCC>
##$VD= 0
##$VDLIST= <DDDDDDDDDDDDDDD>
##$VPLIST= <PPPPPPPPPPPPPPP>
##$VTLIST= <TTTTTTTTTTTTTTT>
##$WBST= 1024
##$WBSW= 4
##$XGAIN= (0..3)
0 0 0 0 
##$XL= 0
##$YL= 0
##$YMAX_a= 218707
##$YMIN_a= -244722
##$ZGOPTNS= <>
##$ZL1= 120
##$ZL2= 120
##$ZL3= 120
##$ZL4= 120
##$ABSF1= 10
##$ABSF2= 0
##$ABSG= 5
##$ABSL= 3
##$ALPHA= 0
##$AQORDER= 0
##$ASSFAC= 0
##$ASSFACI= 0
##$ASSFACX= 0
##$ASSWID= 0
##$AUNMP= <proc_1d>
##$AZFE= 0.1
##$AZFW= 0.1
##$BCFW= 1
##$BC_mod= 2
##$BYTORDP= 1
##$COROFFS= 0
##$CY= 11.3945322036743
##$DATMOD= 1
##$DC= 2
##$DFILT= <>
##$DTYPP= 0
##$F1P= 18.9103706918063
##$F2P= -1.10871071338519
##$FCOR= 0.5
##$FTSIZE= 0
##$FT_mod= 4
##$GAMMA= 1
##$GB= 0.15
##$INTBC= 1
##$INTSCL= 1
##$ISEN= 128
##$LB= 0.24
##$LEV0= 0
##$LPBIN= 0
##$MAXI= 10000
##$MC2= 0
##$MEAN= 0
##$ME_mod= 0
##$MI= 1.114404
##$NCOEF= 0
##$NC_proc= 0
##$NLEV= 6
##$NOISF1= 3.799351
##$NOISF2= 2.8
##$NSP= 1
##$NTH_PI= 0
##$NZP= 0
##$OFFSET= 15.70392
##$PC= 1
##$PHC0= -8851.948
##$PHC1= 13.00026
##$PH_mod= 1
##$PKNL= yes
##$PPARMOD= 0
##$PSCAL= 0
##$PSIGN= 0
##$REVERSE= no
##$SF= 200.130013532006
##$SI= 16384
##$SIGF1= 3
##$SIGF2= 2
##$SINO= 400
##$SIOLD= 16384
##$SREGLST= <1H.CDCl3>
##$SSB= 0
##$STSI= 0
##$STSR= 0
##$SW_p= 3612.71676300578
##$SYMM= 0
##$S_DEV= 0
##$TDeff= 0
##$TDoff= 0
##$TI= <>
##$TILT= no
##$TM1= 0
##$TM2= 0
##$TOPLEV= 0
##$USERP1= <user>
##$USERP2= <user>
##$USERP3= <user>
##$USERP4= <user>
##$USERP5= <user>
##$WDW= 1
##$XDIM= 8192
##$YMAX_p= 0
##$YMIN_p= 0
$$ End of Bruker specific parameters
$$ ---------------------------------
##NTUPLES= NMR FID
##VAR_NAME=  TIME,          FID/REAL,        FID/IMAG
##SYMBOL=    X,             R,               I
##VAR_TYPE=  INDEPENDENT,   DEPENDENT,       DEPENDENT
##VAR_FORM=  AFFN,          ASDF,            ASDF
##VAR_DIM=   8192,          8192,            8192
##UNITS=     SECONDS,       ARBITRARY UNITS, ARBITRARY UNITS
##FACTOR=    0.0002004,     1,               1
##FIRST=     0,             0,               0
##LAST=      1.6414764,     0,               0
##MIN=       0,             -244722,         0
##MAX=       1.6414764,     218707,          0
$$ Real data points
##PAGE= N=1
##DATA TABLE= (X++(R..R)), XYDATA
0@%%%%%%Qj6J6j8K6l2M0n6O6p5R6j19J37j61J91k23K57k96L43l93M48n09N76o52
30c46P38q31R30j043J169j304J450j611J787j982K198k434K695k985L306l663
46a926M066m523N045n650O357p195Q211r476J1100j3268J6334k1039K9265m7807
60c0506J65452K180j91069J68510N3284n0836K1703P9989j14399j16552N9194
71D6950J49003P994j01961p6153L9426K5556l1875K8615Q4982q5572j58766N8789
83a3012J60790m7514j01868M7751J6857j01113J8967J22469j2705j05420j0502
94b5300M0778J3824Q950J729j4538j672r629q194M7579L2617n7942k5368O4504
107F7338R873m8653K7697M0728l8713q290M9445j2968l0878M0164J2751m0113
$$ y = [0, 0, 0, 0, 0, 0, 0, 8, -8, 8, -10, 16, -16, 24, -32, 34, -41, 55, -64, 73, -88, 103, -120, 137, -159, 184, -209, 239, -270, 306, -346, 392, -439, 491, -552, 617, -687, 763, -848, 939, -1043, 1155, -1279, 1416, -1569, 1737, -1926, 2140, -2383, 2662, -2988, 3369, -3826, 4385, -5091, 6009, -7259, 9075, -11964, 17301, -30506, 134946, 137126, -53943, 114567, 167851, 117015, 138718, 218707, 104308, -12244, 46950, 195953, 203947, 101986, 25833, 65259, 90815, 58940, 87555, 172537, 86965, -71801, -13012, 147778, 100264, -1604, 46147, 63004, -38109, -19142, 103327, 90622, -14798, -25300, 15478, 29302, 38252, 39981, 25443, 23771, 14142, 5948, 53527, 86144, 28202, 2834, 67338, 77211, 28558, 56255, 96983, 58270, 49980, 99425, 86457, 55579, 95743, 108494, 68381]
119F8381K2252L3960n0219j7111O4351O78n3823J6970K7655l8959j2176M1883
131A03842M536l2153k0576o344K2149K5413l5207l2200L7887l936o3781L5501
143C5131P6635p0493q4961P5122N5414q1897j9069P7159j8985p5354L1759O3278
155F3739k5191m6114Q677L4467P966l3657j3563N1424J4126o8777L925R0120k2404
168F4738r1950N2376Q7090o8325n7392Q2234K5985q2676N589Q1693j3268o5210
180B0884M545M1902J1159j6112j7308Q453J0338l3125o733O6659N660r4309r684
193g671Q4819r285n9976L9439K8991p7175k1551P7686J4449n4353q166J0661j3164
206D704Q566J9781o175o958j2235k7295K0575M9169k1849m3995K1094J1523l1745
$$ y = [68381, 90633, 124593, 74374, 57263, 121614, 122292, 68469, 85439, 113094, 74135, 61959, 103842, 108378, 76225, 55649, 49305, 71454, 96867, 61660, 29460, 67347, 63411, -370, 35131, 111766, 41273, -43688, 31434, 86848, 4951, -14118, 63041, 44056, -31298, 461, 63739, 38548, -7566, 1111, 35578, 43544, 9887, -3676, 47748, 61874, -6903, -2978, 87142, 64738, -27212, 25164, 112254, 43929, -13463, 68771, 94756, 12080, 17669, 99362, 86094, 20884, 25429, 67331, 78490, 62378, 45070, 53523, 63861, 30736, 24003, 90662, 96322, 2013, -7671, 77148, 67863, 7887, 47326, 76317, -858, -22409, 55277, 69726, 15373, 7207, 17868, 4704, 13270, 33051, 26876, 19918, 7683, -19612, 963, 50132, 28283, -15712, 5382, 16905, -14840]
219a4840K3198M4745l9129m1496L4657J9261j9686J5652P204l9758K975M1286
231C4069j3621k0893K6276m122l4718K4446L2616k9723j7797K2651n150j1668
243B366K0911l23k2316P535L802j4864K2433J9139m4438j7068M7370j199l8772
256a5424K8677K3587n4595j4868N8357P702m0738L826J3729j7755K896K1753m022
269A3125q053m942j7145J2379L4155j7424k9518K9283Q118m6640J3269N7964k3681
282B0890m9448K6447K0364l0873Q541L5923k0645l0717J2213J0154l2J3436q382
295G871k2119J0234N994j9310J8335K9622l4133l1289L4437J0935k8858J9372
307A091K5348l9326k3212L4102Q968j4594J5757j240l3446O490K8298n275j128
$$ y = [-14840, 8358, 53103, 13974, -27522, 7135, 26396, 6710, 22362, 29566, -10192, -7217, 34069, 20448, -445, 25831, 21709, -13009, 11437, 44053, 14330, -3467, 19184, 14034, 2366, 23277, 22954, 638, 8173, 11975, -2889, 19544, 38683, -5755, -22823, 24547, 23348, -15424, 13253, 36840, -17755, -32623, 25734, 33436, -7302, -3476, 10253, -7502, -4606, 17147, 13125, 5072, 130, -17015, -4636, 29519, 12095, -17423, 11860, 19978, -26662, -13393, 44571, 20890, -28558, -2111, 18253, -12620, -4079, 31844, 11199, -19518, -7305, 2849, 2817, 16253, 7871, -14248, -4014, 1980, -17330, 1005, 30627, -3506, -34795, -358, 10577, -18281, 1091, 26439, -12887, -36099, -1997, 6971, -7623, 8134, 6894, -26552, -20062, 8236, 2961, 1833]
320A833J1470k5374j9437L3400J5488k2169P615R479l1627l294L8618L15k0874
333d557J2777n203l0514J9160L4786j7029j7307J1519j4605j3902L5129J5656
345B5910l1181p155J1675j7720K301L3533p250k9583P471K919j6503J9780K5012
358A9209k6657j9568J6742o249r570L0933Q130l7704o327J9290q334M354K8937
371A3186j4617l5589J2449J8049r993J1917J4780k9342j7063K5439M914r230K0257
384E157Q48l5295J229K8245n676j692J9252j9076l1012K3256K4863j4426J877
397b450R517k6891j1116L4374P938j9371P799o17k6698R629L0684r405j3234J2310
411B469j2838j9138K7234J9998k2355n459J0632j9853m689L4840M049k7747K451
$$ y = [1833, 13303, -12071, -31508, 1892, 17380, -4789, 2826, 12305, -19322, -22616, 16002, 16317, -4557, 8220, 3017, -27497, -8337, 26449, 9420, -7887, 3632, -10973, -24875, 10254, 25910, -5271, -12426, -751, -18471, -16170, 17363, 10113, -19470, -11999, -9080, -25583, -5803, 19209, -7448, -27016, -10274, -16523, -26093, 4840, 12970, -24734, -31061, -11771, -20105, -15751, 13186, -1431, -37020, -24571, -6522, -16515, -4598, 10182, -19160, -36223, -10784, -5870, -15100, 5157, 6005, -29290, -28061, 184, -5492, -7184, 12068, -7008, -38020, -14764, 10099, -4327, -2450, 7067, -19824, -30940, 3434, 11372, -7999, -200, -817, -27515, -17886, 12798, 3393, -9841, 2469, -10369, -29507, -2273, 17725, -4630, -10089, 543, -19310, -23999, 10841, 14890, -12857, -10406]
424a0406N332j6317J3451K7317j7388k1416J3351k054j1183K3339J2038k8496
436a2432n801J7464j0706l791K8380k905l0531M015J3617j1078R261J9753k1801
449f555k0783J9215O596j1555J5944O912k9506l192K4597n400q701J9041n468
462A145k5948J1478J9059j1821J588J3903j8254j3450K3450N350j5700J2514N966
475I280k7635J735L1549p283j7636J5511K28k1794J2503K0479j5690q461J3656
488F442p695j0086J6949J371j4438J0696L789k3203N959K5724j5312j7764K0706
501C138O61k6458J3355K3520k1251j3934K0379j608j7054J1946Q455j2742P20
514a0873M657j1200N710J5426j3499q353J9426n915k1057K1833J9317k7797r404
$$ y = [-10406, -5074, -21391, -7940, 19377, 1989, -19427, -6076, -8130, -19313, 4026, 16064, -12432, -18233, -769, -11475, -15266, 13114, 10209, -20322, -16307, -2690, -13768, -4507, 15246, -6555, -27338, -8123, -1527, -13082, 2862, 9774, -19732, -22924, 1673, -3727, -12428, 6613, 1145, -24803, -13325, 5734, -6087, -4499, 9404, -8850, -22300, 1150, 6500, -9200, 3314, 9280, -18355, -16620, 14929, 7646, -9990, 5521, 5749, -16045, -3542, 16937, 1247, -7214, 6442, -1253, -11339, 5610, 6981, -7457, 3239, 7028, -16175, -10216, 15508, 196, -17568, 3138, 3799, -22659, -9304, 14216, -7035, -20969, -590, -2198, -19252, -7306, 1149, -11593, -10873, -6216, -17416, -11706, 3720, -9779, -18132, 1294, -4621, -25678, -3845, 15472, -12325, -21729]
527b1729K7214m324j9156K0073J2525k4193k192K0449l581o533R802m665p182
540c492J2669P9j2366J3036Q187k2137J767K4190j0730j7465J9991M062k4588
553f797Q260K1958j7175j4203J7515r69j1797J3376K629k1802L751J7534j0897
566A383o687J4404r524j7014J6862J2187j5813j293P309j2457N76J9010o200j2832
580a0089J1844l445j7963J9597K0880k5303j2840K5891l960k2124K2489K1628
592B6605k7047j7358K1163P427p599M682J708p071n97j976L477J8798l900k8713
606a0401Q117K7351k1034j9240L8087J0801m7766n393M3117n060k8630J8235J5983
619B4167k8162j5219K2180J6813o650j5417p924R760O038j3227Q491K7186k3080
$$ y = [-21729, 5485, 1161, -17995, 2078, 14603, -9590, -11782, 8667, 5086, -1447, 8355, 3690, -3492, 9177, 9256, -3110, 9926, 18113, -4024, -2257, 21933, 11203, -6262, 13729, 17791, -6797, 1463, 23421, 6246, -7957, 9558, 8589, -3208, 10168, 12797, -9005, -5254, 12280, 1383, -5304, 9100, -424, -17438, -576, 11611, -4202, -5495, 1814, -10643, -10067, 8943, 2743, -10089, 1755, -1690, -19653, -56, 20824, -4479, -17319, 8572, 4612, -17512, 4977, 26605, -442, -17800, 3363, 10790, 3191, 7873, 9581, 2510, 1913, -63, 3414, 22212, 18312, -10401, -2284, 25067, 4033, -15207, 22880, 33681, -14085, -19478, 23639, 18579, -10051, 8184, 24167, -3995, -19214, 2966, 19779, 13129, -2288, -10212, -452, 5586, -7641, 850, 28036, 4956]
632D956m2742K5853M1830k4698k1774K9316l963m1465J5954M7562r060l3537j089
645a2857P431M16J1838R893o223j2667j7018J796L6159J5830l4510j6889K0684
658C883l184j0546L0786J3235m1760j7466K9100R698o333J0936n510k6682L528
671a0315K2350K725o07P40k1863r253K5854J3114j4559k936P79j2562N475K0016
685A8958m016j0876J518o500j931K2087J070k7722O293K3931j7110j4710K8922
698A9914L566l4770O785L3857j3354k7065J3378J6850j0735o837P525M088o416
711F786j2845M348K7028j492l8297p8L7366j0319k7736K9231J8320m9408j5907
724c3003N5190J4100m4342n701K5365r397j6334K0223J9393j5339k7733j133L0196
$$ y = [4956, -37786, -11933, 29897, 5199, -16575, 12741, 8778, -32687, -16733, 30829, 21769, -11768, -12857, -5426, -5010, 6828, 16721, 10498, -2169, -19187, -17391, 18768, 34598, 88, -16801, 3883, 699, -9847, 20939, 34174, -7586, -25052, 4048, 13746, 7413, 18349, 12839, -13843, -10315, 12035, 14760, 14153, 14893, -6970, -16223, 9631, 22745, 8186, 5250, 6029, -6533, -1058, 18958, 14942, 4066, 5584, -916, -2847, 19240, 20310, -7412, -1119, 22812, 5702, -9008, 19914, 23480, -11290, -4505, 29352, 15998, -11067, 2311, 19161, 8426, 1589, 9114, 13202, 6786, -6059, -1711, 25317, 23825, -14472, -14550, 22816, 12497, -15239, 13992, 32312, -17096, -33003, 22187, 36287, -8055, -13756, 11609, 2212, -14122, 6101, 25494, 10155, -17578, -18711, 11485]
737A1485J4016k5191j0530K5364o695l3325K4258M4515l1327m2561L1325K6326
749B7660l1421l908L6554p262l6998O289K8285L87j3534l362M989K965q583m918
763b857J9806Q251k8163p864K8417l511k6877J7451K5294k7526k2242K3317J0397
776A3893j5329O417Q349j8877q871J4648N223p0L383j4003j4432J4102J3936n828
790B541O46K49j7697k949K2642O981r083j614r592j0908K0462J9990j6424r435
804d191J0272j2446r031L3640J7101l6641j7813K4811P202r377J2184N366k2017
817i40j0670J5492J7821K554j6655j6737J1561J4636j2841k38K3148j5973l7973
830b6815K2144M2006k2689l1965K1453J0433k7473M499L3012q951l3778L2K2485
$$ y = [11485, 25501, 310, -10220, 15144, 8449, -24876, -618, 43897, 12570, -29991, 1334, 27660, -3761, -7669, 28885, 21623, -15375, -9086, 19199, 19586, 6052, 2690, 7679, 10644, 2061, -2857, 16949, 25200, -2963, -10827, 17590, 14079, -12798, 4653, 29947, 2421, -19821, 3496, 13893, -1436, 4981, 13330, -5547, -14418, 230, 5453, 5383, 8766, -5237, -19669, -5567, 8369, 2541, 3187, 3436, -14261, -17210, 5432, 12413, 3330, 1716, -7876, -18784, 1678, 21668, 5244, -4191, 6081, -6365, -15396, 18244, 35345, -1296, -19109, 5702, 12904, 3527, 15711, 21077, -940, -11610, 3882, 21703, 24257, 7602, -9135, 2426, 17062, 4221, 3983, 27131, 11158, -26815, -4671, 37335, 14646, -17319, 4134, 14567, -12906, -8407, 24605, 15654, -18124, -18092, 4393]
843D393P936r455j0284L710M791j2036j438K7788J319m1267k459M1561j600l1336
857a8377J4304J9375k7815j1095L4560R271k7916o014J4779J430l411L457K356
870D904m77p158p988J3917J8097j6746j8359J7477R044j9241M807K2080j5812
883D545k1142J8258J3239j6067n74J0679r089o896J0060n17o016O560j405j1219
897i584O718O932j0500P87J1331q547j0605J0458K391q425P848M305j5157L25
911a1723J3989o652n914J5242k768k0898R055J8035j1676o411J4986m507j7235
924a6477R302J5674m484o301k57m500L036R125l195j251N857j1180j0160K0475
938E664J2014k1701l754J8706r720j6253K0243J4457k1761q705J4513p17p904
$$ y = [4393, 12329, 2874, -7410, -3700, 1091, -10945, -12383, 15405, 16724, -24543, -27002, 14559, 12959, -18377, -4073, 15302, -12513, -23608, 10952, 20223, -7693, -13707, 1072, 2502, -909, 2548, 4904, 4427, -2731, -10719, 3198, 21295, 4549, -13810, 3667, 12711, -6530, -1723, 20357, 4545, -16597, 1661, 14900, -1167, -1741, 8938, -151, -7047, 3013, 2496, -3520, 3040, 1635, -9584, -2866, 4066, -6434, -5647, 5684, -2863, -13468, -3010, -619, -9044, -1196, 3109, -12048, -11723, 2266, -4386, -10300, 4942, 2174, -18724, -9669, 8366, -3310, -9721, 5265, 758, -16477, -7175, 8499, 4015, -2286, -2543, -7043, -4007, 5118, 1923, 672, 6529, -4651, -14811, 5664, 17678, -4023, -7777, 10929, 1209, -15044, 5199, 19656, -2105, -10810, 3703, 2986, -4918]
951d918Q370M517p776k999j689P06J0697J153j4736K093J1133j2324o217K2447
965A0457J622k4474L280J7894j1058q807J8007K483j7801l41R269k690K416O610
979F867q119o003N625k394J448J2881m519j8462N758J3001q806j039J5360q523
993C075j8629J0290J2861p829J95P762j2889q295J3952N508o265M049k258j4161
1007a2634M874J5754m416n883N744q060r699J4335J0924j1726k890M304r569m75
1021i417J7072k89j3768M111K417j1323O884J5938q506j2024P230p35o793J2186
1035B983Q552j4378o164P614k492Q31J1336l992j3837N023N719p087O306J1246
1049A1660j3213j0659J2193K415q612J0447N727j6894m007J3455p13l568Q972
$$ y = [-4918, 3452, 7969, 193, -2806, -4495, -3789, 6908, 8061, -6675, -4582, 6551, -5773, -11990, 10457, 12079, -12395, -9115, 8779, -2279, -11086, 6921, 9404, -8397, -8738, 531, -2159, 257, 6867, -1252, -7255, -1630, -4024, -2576, 10305, 5786, -12676, -6918, 6083, -2723, -3762, 11598, 3075, -15554, -5264, 7597, -232, -37, 7725, -5164, -13459, 493, 6001, -264, 3785, 1527, -12634, -7760, 7994, 3578, -2305, 3439, -4621, -14320, 15, 10939, -787, -3677, 627, -8942, -9417, 7655, 7366, -6402, -2291, 126, -11197, -4313, 11625, 3119, -8905, -1675, -2410, -9203, 2983, 11535, -2843, -9007, -1393, -3885, -3054, 8282, 4290, -9547, -4524, 1195, -5892, 414, 11660, -1553, -12212, -19, 2396, -6216, 4231, 9958, -6936, -10943, 2512, 1799, -1769, 7203]
1062G203l487j4027N653R671n118K241O096j2791o916J4740L394r511O184L816
1076G148j4745M07J5296k472p876P390j612j2845P427J1626p249l167O118q217
1090b771n004J4231L264j2418L374M101j0438J852J4117n628r372P265K85r808
1104f950P604J0522j0966m713Q334m866m898J2116K034j2893J988P015q034J421
1118b286J1873o871j0493Q270L074p909N973O781j1609l329J1352l457o415R578
1132D532J773j2720L119R110q608o47J1056o593j0334R896M911r838L434O940
1146F031j0054l411J2081l004q227P907J856j0217M512P763r290j930J1005n110
1160h8q815J0478L322j2636L209J0483q704m614J1320j647r558P368M430r055
$$ y = [7203, 3716, -10311, -4658, 5013, -105, 2136, 8232, -4559, -11475, 3265, 6659, -2852, 3332, 7148, -7597, -7190, 8106, 5634, -2242, 5148, 3536, -9309, -1882, 9744, 2495, -672, 5446, -2771, -7775, 6456, 9720, -2698, 676, 4777, -5661, -3809, 10308, 4680, -4692, 2573, 2858, -6950, 654, 11176, 210, -4503, 3831, -1035, -5933, 6183, 8217, -4676, -2688, 4327, -3707, -2286, 9587, 2716, -7777, 493, 3567, -4342, 1631, 8412, -3197, -6526, 4826, 1369, -5046, 4532, 6305, -6415, -3296, 5814, -2794, -3441, 7615, 1022, -9312, 584, 5495, -4343, -909, 6031, -4023, -7434, 4647, 1643, -6584, 1323, 3179, -7038, -2526, 5237, -4053, -5983, 5022, -88, -8903, 1575, 4897, -7739, -4530, 5953, -2751, -7365, 3955, 2308, -7250, 118, 4548, -4507]
1174d507K429O425p115j693R322l457o950Q435R41j1163O609J1088j1480o766
1188g882J3151r66j0830Q188O267j1536j026R911m277m154P689j574p398M930
1202D93J944p110O274O204j1888l753J3127k602r567R955M329j4896N7J3496m827
1217A236o362Q480j338j0005N515O912o067N55N847q381l650J1605n98q078P080
1232B751K336j2970K488J4171n283o651O559l288q245J0655P175j1173r52O836
1246D409q272k739J4736l62j3582L661O668q871N56J2373m414j0699L795J763
1260i78k182O161J371r496P02N911p247J247J3265p844j5236J1053R646j3708
1274g335p11J5631o784j5021R752R407q938j924O615k377m028J421o37L765N439
$$ y = [-4507, -2078, 4347, -2768, -4461, 4861, 1404, -5546, 2889, 3830, -7333, -724, 10364, -1116, -7882, 5269, 4303, -6527, 1661, 7928, -3608, -4634, 5277, 1000, -3154, 4535, 2961, -4437, 493, 2437, -4673, 1601, 7805, -4083, -7836, 5291, 2689, -6878, 3077, 7406, -7490, -7433, 6063, 1236, -5126, 3354, 2016, -7989, -2474, 4438, -1629, -1074, 4773, -3608, -7258, 4347, 3749, -4329, 2751, 5087, -7883, -5395, 8776, 3493, -3158, 3401, 113, -8132, 2523, 9698, -1475, -2427, 4409, -3863, -6602, 8134, 7772, -5810, -2149, 4519, -4352, -3796, 8577, 4163, -6536, -2741, -978, -3160, 3001, 4372, -5124, -4422, 1489, -5758, -4511, 8754, 910, -14326, -3273, 6373, -7335, -8046, 7585, 801, -14220, -4468, 4939, -3999, -5923, 692, -1685, -5713, -4292, -4929, -1164, 4275]
1289D275q872o168J1982J168j3534Q244J5163j5601j4081J8506P179j6540K947
1302e332J5093r958j3261R902R310l401k038k379m028L415K360j124P333N35j8212
1317a1785k189K1263J471j5346O364O359j7814j776K2480J880j6730k09M652n687
1331g067M364J0342m630p432n44k622K887J2976k216j3874J679N117o142N475
1345a687J2682r124j4318P212O706m756N901M829j4085m069J2500p83n788R692
1359D912R28j6346J493J4106k989n874O682j461j0527L423P782J82K94l278p335
1374h008M180P801o728j377J2912p475j8701J2187J8455j3845j0461J5991j046
1387C885j9059P134J9531o265j4194K060M916l11O13J229K839j677j2855j736
$$ y = [4275, -4597, -10765, 1217, 2385, -11149, -2905, 12258, -3343, -17424, 1082, 8261, -8279, -5332, 9761, -197, -13458, -3556, 5754, 2353, 315, -2064, -6092, -2677, -317, -1441, 5892, 6427, -11785, -13974, 7289, 8760, -6586, -222, 6137, -11677, -13453, 9027, 10907, -5823, -6032, -1380, -7067, -2703, 7639, 3009, -4423, -4967, -7589, -4702, 8274, 6058, -7816, -6137, -1020, -7162, -1687, 10995, 1871, -12447, -5235, 1471, -3285, 2616, 7445, -6640, -10709, 1791, 1008, -4780, 4912, 5840, -10506, -9013, 5093, 2104, -3770, 2912, 1451, -9076, -5653, 2129, 2311, 2605, -673, -8008, -3828, 3973, -2755, -4132, 8780, 1305, -17396, -5209, 13246, -599, -11060, 4931, 3885, -15174, -8040, 11491, 5226, -8968, -6908, -1992, -2303, -1690, -461, 2378, 701, -12154, -13890]
1401a3890K1470M457k3196j096J8789r118j4409K0184J2424k5724j0064K2184
1413B011M663j4537K900Q578p690o821N466P683K717r400r253R771J0803j1233
1427d342n874J5303k833j9413J0045K1035j3890j6542J4590P821j3112J823J0988
1440E599p112q150O550M779q17p25n684j989R055K089q310L212M685j1177p02
1455h697J5455j141j2985L335N382q044L975J1026q068j0099P732K235n589Q735
1469C252M402j5360l955J4220J534q025M813M09q432J512P853J15j581j945o422
1484g610L748J0144n980p512J0816j97j5919P318J8779j1931j6110J4794Q549
1497H889j5703o52J4853l839j2294L934Q141r47m168l310K711O737n716p325J0696
$$ y = [-13890, 7580, 12037, -11159, -12255, 6534, -2584, -16993, 3191, 15615, -10109, -20173, 2011, 6674, -7863, -4963, 3615, -4075, -10896, -5430, 2253, 4970, -4430, -13683, -3912, 6891, -4342, -10216, 5087, 2254, -17159, -7114, 13921, 31, -16511, -1921, 5900, -7212, -5389, 5599, -1513, -9663, -3113, 1666, 849, 124, -5560, -7549, 1506, 3595, -4715, -1503, 3182, -7995, -8697, 6758, 5617, -7368, -4033, 1349, -6695, -2720, 8306, 238, -9861, -2129, 106, -5483, 3252, 7654, -7706, -11661, 2559, 4093, -3932, 881, 1290, -7142, -5630, 2223, 2338, 757, -1188, -7610, -3862, 6282, 302, -7210, 3606, 3409, -12510, -5192, 13587, 1656, -14454, 340, 8889, -6814, -7466, 7387, 3548, -8746, -4812, 3329, 2382, -1786, -5096, -2385, 4352, -1364, -8689, 2007]
1512B007N474j7066j216K1222m142k2428R891J8152j3792j1543J5984M433j6118
1525i142M04J1988p30p102l14K201K956j234n740M735Q068j0578q509J5646O074
1540H723j7894j24J7344p078j4172J2095R400j2960l629J0820j470o703M056K448
1554H56k680J085n81l793N137J962o657K415P376q729o486J2389L642j0918J296
1569c686O370q622q89J2202k087j0279M182K597o610N505Q852q910p515P372P81
1584g37m248P609K941j0391l257O709R75K522L861q386o205P944L163m753P379
1599E126K495j6220k538J8072J163j1486N632L326j2777j77J6196L31j0674m14
1613a945J331j945M398L025k191L88l342p767O804J2641q100j0525Q892K071j2878
$$ y = [2007, 7481, -9585, -10801, 10421, 6279, -16149, -6258, 11894, -1898, -13441, 2543, 6976, -9142, -8738, 3250, 2520, -4582, -4896, -2695, 261, -973, -6713, -1978, 6090, -4488, -12997, 2649, 8723, -9171, -9295, 8049, 971, -13201, -1106, 8294, -4666, -8295, 2525, 1055, -5648, -1592, 856, -1824, -739, -1320, -5113, 24, 1986, -4671, -2256, 5120, -3609, -10095, 2294, 5936, -4982, -3686, 2684, -5938, -6827, 5375, 3288, -6991, -2809, -212, -6822, -1317, 7535, -1375, -8890, -1518, -737, -4985, 2624, 5565, -4826, -8083, -1374, -399, 2123, 5984, -2402, -8607, -663, 2500, -2253, 5126, 7621, -8599, -11137, 6935, 8098, -3388, 2244, 5570, -7207, -7384, 8812, 9143, -1531, -1945, -614, -2559, 1839, 4864, 2673, 3061, -281, -8048, -1244, 11397, 3297, -7228, 1664, 3735, -9143]
1628i143O679J4835j0265j2835R163N628q087J818P537n319n518K353O29J954
1642e71M497n272m594N810l65p086P846Q376j2378o180J1746O85r494P472P282
1657G774j1316m782R481Q32l375M485q77p276L003M269l462L099M082q453m213
1672f729R454M00n400O007J283j0967P30J0809k421n584N650k416q060O007P083
1687E846o231k027N278n641m390R573K272p902J559K721o247J091Q489l221n361
1702d191L854j145n265O989M805q200j164O534m887l497J0737L82j0441K045O983
1717C539n575j066Q447k764p236M552K271l919L721L864o863j457O262l233j720
1732a177P960j990j0147N074O816o761q35Q105m448p950O919M117o476J586M979
$$ y = [-9143, -2464, 12371, 2106, -10729, -1566, 4062, -4025, -2207, 5330, 11, -5507, -3154, -2525, -571, 3926, -1346, -5940, -130, -495, -7581, 265, 8641, -3737, -9917, 1829, 2514, -6980, 492, 7774, -3542, -8324, 1157, 1989, -1386, 3099, 2222, -5054, -2051, 2218, -1244, 1855, 5937, -2516, -6729, 2725, 3125, -2275, 3732, 5015, -5952, -5222, 5587, 3166, -2418, 3232, 816, -7244, -1237, 5846, -385, -2412, 2866, -2775, -7165, 2408, 4680, -3222, -1663, 1058, -5189, -4098, 4391, 1170, -4191, -337, -1482, -6747, 242, 5047, -3153, -4317, 2217, -2670, -6167, 4570, 4952, -5489, -3444, 3539, -2036, -3102, 5345, 2581, -4655, -103, 2168, -1751, 1970, 5834, -1029, -2486, 3776, 543, -1177, 6783, 4793, -5354, -280, 6536, -225, -1060, 7045, 2597, -5353, 1566, 5683, -793, 793, 5772]
1747E772o875k436O705o04l629M558j163p456M381N884o217r43O136m920n935
1762f742Q258L139q055J211N312o366j628P914j347o386M652J654o637L069N423
1777C471n161j990O048k869n207P296K335q172J850N596n510j291P502k453o526
1792e081N519K529o475J696O122n786k520O892j824n626N291L322p745J909N862
1807D085n759k422O974j955n640N187K495p170J499N996n333k105O990k342o314
1822e814N140L712o989J362N610n883l170P295M71o271L562K286o200J821N712
1837B644m139k636N756k208n514O152L225o579J004N466n792k904R097n82p167
1852d177K930L408n535Q20O849l804m257M835q87l675N210K349o540M43M823n058
$$ y = [5772, -1103, -3539, 3166, 2562, -1067, 3491, 2328, -5128, -747, 5137, -1080, -2023, 4113, -807, -6742, 1516, 4655, -3400, -2189, 3123, -3243, -4871, 3043, 1696, -4690, -38, 1616, -5021, -1952, 3471, -1690, -3680, 2368, -501, -5708, 1588, 3923, -4249, -2399, 3197, -2313, -3604, 3898, 1445, -5081, 438, 2967, -3508, -1812, 4310, -1476, -3996, 2896, 1072, -4554, 737, 4059, -3686, -1777, 4085, -1674, -4096, 2878, 923, -4717, 470, 2965, -4205, -2706, 3290, -2043, -4148, 2842, 500, -5814, -674, 3038, -3951, -2589, 3021, -2862, -6032, 1263, 1734, -4537, -975, 1311, -4889, -3068, 2644, -1495, -4131, 1625, -583, -6097, 55, 3280, -3299, -2295, 3171, -2621, -5525, 3572, 2990, -4177, -1247, 2161, -3374, -2554, 4295, 491, -3766, 1069, 182, -3493, 1717, 4066, -2474, -2031, 2792, -2266]
1868b266j403Q030j157q534M361M254o182O89P093m608n810M891J714l681L060
1883D51K769p025p49N712k254j770N918k120p323M436M287n460J189N932n753
1898a760o022P207K650m864K837J808p306j66P860j441l996M464k113o748N133
1913b457N800m988j260L869m475l646P629K627o034O18J136n282K117P463l364
1928b47m916L942j394n357P099O212q568m424O359j469l439O810K260q129j428
1943f689M919q14L43L399k909l596L004l90j925O477J671j0054j11Q814l154m589
1959e604Q297J327j1291J039R639k206m941M217J16n169J709L393j82R25j227
1974D2n463K283N477l968k474P537k729j0471N828R157o756m309P148j610p809
$$ y = [-2266, -3669, 4361, 3204, -5330, -969, 3285, -2897, -2208, 4885, 277, -5533, -642, 1072, -2609, 451, 3220, -3805, -4554, 1158, -1096, -2866, 3052, 932, -6391, -1955, 2332, -3128, -1939, 3993, -1760, -7782, -575, 2075, -2789, 48, 1856, -5450, -5616, 2244, 803, -3193, 1271, -842, -7590, -2457, 3343, -1645, -2905, 964, -3511, -7157, 472, 3099, -2935, -2317, -1181, -6463, -4346, 3117, -247, -5163, -1221, -2615, -7972, -873, 5339, -3229, -7653, -1294, -2763, -6202, 608, 2868, -5261, -6689, -1770, -2584, -2241, 1158, -1751, -5347, -2343, -2733, -4658, 1819, 3490, -6564, -6675, 2139, -1015, -5604, 2693, 4020, -7271, -6232, 3407, 1201, -3740, 477, 593, -4576, -2867, 526, 344, 1269, 42, -5421, -3138, 2339, -1629, -4103, 3434, 705, -9766, -3938, 5219, -1537, -5846, 1302, -308, -8117]
1989h117M527P552m877l761K092j050q3L999j663j732K557k378m184N828M855
2004C565o745k491O625k593n326P820L782q583j039O110k590j673N332n46n783
2019d135L224K295m094J911M777m647l061N013k32m033L747K154n018m9L170l258
2035b236J43N101l353m454M681M88o737M160O863p607n852Q023J497p235K451
2050d067O473n839m541L829K801r70K00j765j669K780j359j266O495N44j1055
2065i409j34J2718j633r348O412N165j0673k500J2621J956r747k8N175j768j069
2080b262K967J414j204l479k690O135N851p314n100Q198N25r598M845J0917q515
2095F90j0149Q912O153p674j186O244k997n425L642L230j187j692k248J40M344
$$ y = [-8117, -3590, 3962, -915, -4676, -2584, -3634, -3717, 282, -1381, -3113, -556, -2934, -7118, -1290, 3565, -3180, -5671, 954, -1639, -6965, 855, 4637, -3946, -4985, 1125, -1465, -3138, 2194, 1648, -4135, -911, 1384, -2710, -799, 3978, -669, -3730, 1283, 1051, -2982, 765, 2919, -2099, -2148, 1022, -2236, -2093, 3008, -345, -4799, -118, 370, -6367, -2207, 4656, -2951, -8803, -780, 717, -6518, -4067, 2406, -3433, -7974, -4145, -1344, -2314, -2114, -3879, -5548, -2768, -4127, -5393, 1102, 1646, -9409, -9543, 3175, 1542, -7806, -1394, 3771, -6902, -9402, 3219, 5175, -4572, -4600, 575, -1193, -2262, 705, 2119, 915, -2564, -5254, 881, 6732, -582, -5682, 2516, 3041, -6557, -1712, 9205, 690, -9459, -547, 5606, -2068, -3254, 2990, -7, -5432, -1790, 1440, 253, -1439, -3687, -3547, 797]
2110G97o46n438L668L726p393j435R387o87q998L369O120n587j701O670r96n768
2126d912L250K604k800Q81K698l832j18M369j613k617M108J23m869K684L155k830
2142B81o12L531l198j569M904j010m315M178K515p546M50Q010l183o367N508K954
2158D531p904J74P965k070o172J951K059j109K00l2j92J480k741l996O151N369
2174E664q147m247Q535l44r194O272R189q805q666Q908N107o744N09M700k925
2189a88m539K031M187K347k527o072J765O519k876m131P385J407j1632P48J2702
2204G126j575r862L775N885p646j813R054P32o985j086K367R13J377r69j486J737
2220A544n16m212L978N265n418n491O842K076p389K220O547m519n264N790J416
$$ y = [797, 151, -5287, -1619, 2107, -5286, -6721, 2666, 1979, -7019, -3650, 2470, -3117, -4818, 1852, 856, -4912, -1662, 942, -1858, -977, 1721, -2111, -2229, 2140, 527, -2090, 2018, 2141, -2728, -44, 3111, 281, -331, 3200, 2, -1567, 3337, 2327, -1988, 2190, 4705, -2841, -2391, 5619, 2436, -3931, 1577, 4531, -3373, -3199, 4766, 2696, -3476, -1525, 534, -575, -375, -407, -599, 881, -1860, -5856, 295, 5664, -2483, -6730, 1805, 1461, -7733, -1461, 7728, -1077, -9743, -835, 4272, -2472, -1963, 2737, -188, -4727, -2696, 1491, 3838, 1311, -4761, -2996, 3523, 647, -3484, 3901, 5308, -6324, -5576, 7126, 5551, -4311, -536, 5349, -2297, -4110, 4944, 5676, -1309, -2395, -28, 885, 2262, 1293, -193, 1544, 1028, -3184, 794, 6059, 641, -4850, 1992, 4068, -3321, -1101, 5446, 927, -4337, 1453, 2869]
2235B869m739K095L013l514q09L278k122j014L792m87m113K611J275l710J802
2250B27M150l464k339L632j129k298M567J143n549Q14L795m103o41P160j939q013
2266c987K962N940l800j311M730k062n317K463L588j141L99j072k847K137K034
2281B716k246R44M108n457n355P338M685p847j9O047m018o042O932N258o408k661
2297b025L676j087j128K578J88o11l78l163N0O002l09n883J827M580n739k671
2313d093Q498J191q665J144N437m178j545O103k83n402J93K069j29J293K93k835
2329i09O6J944k472K67N343j988o470L279L730m137J64O070l991n320M331K930
2345B837l242J215J999m037j597M418M26k065K440j146m468K981L816l088p01
$$ y = [2869, -1870, 225, 3238, -276, -1085, 2193, 71, -943, 2849, 2362, -1751, 860, 2135, -1575, 227, 4377, 913, -1426, 2206, 1077, -1221, 3346, 4489, -1060, -246, 3549, -554, -1195, 5965, 4026, -3987, -1025, 4915, 1115, -196, 4534, 2472, -2845, -382, 3206, 2065, 2464, 1392, -1455, 682, 2716, 470, 1414, 5522, 65, -5290, 2048, 6733, -1114, -1133, 4914, 896, -5146, 1786, 7044, 636, -2025, 1651, 564, -564, 2014, 2202, 1591, 1213, -1950, -1900, 4102, 3793, -2090, -263, 4317, -1422, -4093, 4405, 5596, -3069, -1925, 3512, -666, -2211, 3892, 3609, -1793, -1600, 469, 340, 1633, 1926, -909, -843, 1101, -1371, -1104, 4239, 2251, -4219, -940, 2790, -1347, -1183, 4887, 896, -4424, -93, 2837, -405, 810, 2809, -1228, -2825, 1593, 2019, -46, 2394, 1248, -3220, -239, 3577, 489, -212]
2360b12K778k494k765M739R99l689J465J831m038k13N658j842l839L219R85m476
2376a894K376M019l734k283L604j41l007K460J602l441L12K716k907L88L138k238
2392I70k793L965K54m434K527L716m767k359N906j034m475L078K786m415o61L551
2408A815j691j100K392j125k307K904N8l159K282K530m339n92M475j303l836M204
2424A208J572n401Q18N111k991k789L996j63l201K249J863l097M23K600k484p94
2440a080L431j232k955L321J339m566R11M135l243k359M280j94m082K678J801
2455B185m012K89L565k444k323L531j77l696K803J831m210K86L340l144j155M057
2471G26n23m569K553J831l035O46L319k660k518L913J05l502L135K003m135m43
$$ y = [-212, 2566, 72, -2693, 2046, 3045, -644, 821, 2652, -1386, -1599, 4059, 2217, -1622, 1597, 2582, -1894, 482, 4501, 767, -1516, 2088, 1947, -1060, 1400, 3002, -439, -127, 2589, -318, 70, 3208, 970, -1823, 2142, 2396, -2038, 489, 4205, -562, -2921, 2985, 1951, -2524, 554, 3340, -1075, -1736, 1815, 124, -976, 1416, 291, -2016, 888, 946, -2213, 69, 2599, -1740, -2332, 2143, 840, -2996, 1208, 2780, -2621, -1803, 3308, 317, -2472, 1524, 1361, -1840, 409, 2272, -825, -402, 2198, -286, -1080, 2351, 1119, -1836, 1485, 2824, -1742, -831, 3304, 61, -2298, 1982, 1788, -2294, 384, 2185, -1827, -1538, 2027, -417, -2740, 791, 614, -3082, -279, 1552, -2658, -2372, 968, -2176, -3331, 726, 203, -4366, -1813, 18, -3017, -2371, 948, -1712, -4230, -317, -212, -3714, -579, 1424, -2711, -3154]
2487c154M243j488j701L495l32m182J983L088k452P2K826k589j635L848N26l408
2503h60K335J494l987N5M408j727k498K797m3m176J967M237l782j069K529j816
2519a36k652L677J061l387Q65N08l172J045M054k271l661L171j2m024L040L178
2535A284l673j780L536j434k360M058J204m253M20J906j923P65M080k381k972
2550c523K648O85k478K981K490m707o09L926j163k041M003N46n137J131L644k206
2566A90n69L584k343l685L171J245k454J550J553m418r50M328l82k725K239k59
2582G5m397J364M103k862j288K676j792l241L714J521l628Q66J980l907m96N505
2598A93l50m102J715J289l572J821L841k035k474K643q88j342L559J171l840J141
$$ y = [-3154, 1089, -399, -2100, 1395, 1063, -3119, -1136, 1952, -500, -428, 2398, -191, -1826, 2022, 2548, -860, 1475, 2969, -1018, -963, 3445, 1718, -780, 2017, 1974, -2202, -235, 4002, 220, -849, 1680, -136, -2788, 889, 1950, -1437, -572, -64, -3236, -2191, 1863, -408, -4069, -898, -910, -4934, -1894, 1284, -2389, -4169, -633, -2067, -4427, -369, 835, -3418, -2998, -1092, -3015, -2250, 1830, -551, -3523, -875, -190, -2668, 313, 2803, -1904, -2513, 1413, 250, -1791, 2212, 2758, -2379, -1248, 2396, 190, -379, 3205, 862, -2823, 348, 1593, -861, 689, 2242, -2176, -3126, 1202, 820, -1905, 334, 75, -4322, -2958, 1145, -1717, -3005, -329, -2121, -5362, -1648, -127, -3755, -2889, -909, -4816, -5312, 193, -157, -4259, -2544, -1255, -4827, -3006, 835, -1200, -3674, -1031, -1919, -3261, 298, 1469, -2371, -1230]
2614a230J947l319P88N055j501m715K809K622m342J274M527k749l554K682J307
2629A601k067J993R51l354j31J969j678Q97K943l205l401L773J585m288J919M026
2645C533m789l846M868K008l915J141K394l714j461L424O62j155P81j495k174
2660c738L598J008k815J695J949m336j219O003k6m673K083K631m166j54N102j163
2676A779l519K075J13k052K381K029l119k94J927j715p95M303j074m167K174J880
2692A926k930O78L306k771k822L759J04l510K614J930m233l09M001j718k258L092
2708H59M03m216J611L656l047j447K631m64j812J997j05j635J979K66k875J659
2724e40L003l699j284M819m81n171K973M000m727j797N395k74m676J464L427k334
$$ y = [-1230, 717, -2602, -1814, 3241, 1740, -2975, -166, 2456, -1886, -612, 3915, 1166, -2388, 294, 1601, -466, 1527, 2478, -876, -1007, 962, -716, 181, 3124, -81, -3482, 291, 1876, -2412, -493, 3533, -1256, -5102, -234, 1774, -2141, -1000, 1394, -2320, -3781, -357, 305, -850, -69, -1564, -3738, -140, 868, -1947, -252, 1697, -2639, -3858, 2145, 2119, -2554, -471, 2160, -2006, -2160, 2942, 1779, -1740, 335, 448, -1604, 777, 2806, -313, -607, 1320, -395, -1190, 3113, 2039, -2128, 46, 1926, -1004, -326, 2980, 209, -2613, 1146, 1250, -2260, 354, 2284, -1949, -2258, 1743, 25, -2233, 859, 1262, -2954, -1343, 2313, -734, -2181, 450, -14, -1826, 171, 66, -1569, 410, 676, -2199, -540, 2463, -1236, -2520, 2299, 1818, -3353, -380, 3620, -1107, -2904, 2491, 2217, -2459, -995, 2432, 98]
2740I8r14J263j26K34N14k233M60L870k926l261M710J731n607L89O503l196n589
2757d080M712L505n104j061M854o83l232J072J388k91K31k90j081J967j54k810
2773a057K048L954m559k881N464Q26n333J615N264m514l245M754J061l504O60
2788E53J878j928n39J813q29l32J597j617j729L216J75l497J792K525m095o59
2804a676M146p31l480K110J699l692J496L004k907j799L880p83l290K856K036
2819B869l855K9L486j611k041K527O40k028J098K97j372J097J478l175R63L448
2835C850l245k991N191J474o038J571M862l857l635M881K394m879o58L041j280
2850F81j161J998l1j008L09k166R41L700j425m755K844K971m805n85O606j016
$$ y = [98, -816, 447, 321, 555, 1069, -1164, -704, 3166, 240, -3021, 1689, 3420, -2187, -1798, 4705, 1509, -4080, 632, 4137, -967, -2028, 2826, 2143, -1089, -17, 1371, 1080, 1311, 1021, -60, 1907, 1753, -1057, 991, 4945, 386, -2495, 2969, 3795, -1538, 77, 5341, 827, -2418, 2336, 3397, -107, 553, 2431, 503, -36, 1777, 948, 616, 2213, 596, -1133, 2083, 2258, -1239, 553, 3078, -1017, -1676, 2470, 1739, -1741, 369, 2068, -1624, -128, 2876, -31, -1830, 2050, 1267, -2023, 833, 2869, -986, -957, 2529, 918, -1123, 1404, 2044, 16, 1114, 1411, 39, 1136, 2614, -561, 402, 3850, 605, -2386, 2805, 4279, -1759, -188, 4674, 817, -2818, 2063, 4457, -422, -1080, 1961, 681, -480, 1518, 1487, 479, 788, -1378, -437, 3263, 1838, -2917, -73, 2898, -1907, -2492, 4114, 3098]
2866C098p471K557N430l189k444M345n27m324J316K770M05l56j336j551J798J805
2882B326k664R74L596l535m143N258L495n299l79M458k640l669M141K869m066
2897G22r40K496j199p76K402m91j435J195j123j965L512J192l613k97K594k173
2913A01j447M018N38m647J284K339k852N62L390j893l469K646P72k880K653K469
2929C584l764j811L226O5j572K224l60k457M75J699q73P28J811l274j345L781
2945B137m05k825K617K212n540l24N276n86m545K618K383m016p66L800m10j940
2961c14M92o94l10J874m38j655K153q9l833J716M651l696l060M395R65n002R51
2978a894M813k392l198K994J147k810Q60J938j642q9O38j349P12K431k053j769
$$ y = [3098, -4373, -1816, 3614, 425, -2019, 2326, 1799, -2525, -1209, 1561, 1966, 1610, 274, -1277, 521, 2326, -338, 636, 4232, 697, -3446, 1812, 5307, 8, -371, 4087, 1447, -2222, 1919, 4788, 722, -218, 2278, 1079, 303, 2705, 2214, 779, 1974, 851, -1114, 2398, 3590, -23, -320, 2274, 101, -1346, 2672, 3210, -1437, -153, 2186, -666, -104, 3286, 1393, -2076, 570, 1342, -1538, 1115, 3584, -180, -1991, 1235, 1300, -272, 1952, 1592, -865, -390, 1309, 436, 1164, 2975, -299, -1644, 2137, 1732, -1093, 1524, 3736, -1804, -2128, 3148, 2562, -1983, 635, 3018, -998, -1764, 2036, 1626, -314, 178, -516, -826, 1048, 610, -1045, 1108, 1019, -2814, -1098, 3553, -143, -3203, 1192, 2157, -2845, -1894, 2919, 527, -2671, 323, 1470, -1340, -480, 1458, -184, -273, 365, -984, -272, 2159, 106, -1663]
2994a663L219o70l279K723L215m288j497M177n35l711K782K468l298j125K447
3009I65n69j068K098n07j981J278L48j579J203J716l167j186L824j273k262K677
3025E17J226l791N94L119k080j267K707m25l020K250J735k551J45K783k366j554
3041a978L204R3k552J424J044k624J001K385j394j596K745j398j775K559Q39l281
3057a304O93L270k553j851L489J49l941J798K248l022k89K877j400j815K062R4
3073E05j781J433N71k459J067K201k809j113L293k91l674K306J943l307l96L762
3089A251j685k668L275L52k244O35K012k009L91J782j907q11K471n67k356K238
3105A60J308l400M50L540j955j942K931k51l081J566K623k231q96K344j139k006
$$ y = [-1663, 1556, 886, -2393, 330, 3545, -743, -2240, 1937, 1402, -2309, 473, 2941, -357, -1482, 965, 396, -672, 1426, 919, -1062, 216, 564, -1015, 188, 1904, -1263, -2449, 1375, 102, -2160, 517, 1743, -2048, -1454, 1665, -415, -1682, 1025, 600, -2420, -170, 1565, -986, -841, 1942, -424, -1978, 1226, 1319, -1233, 191, 1235, -1389, -388, 1997, 603, -993, 1752, 354, -1421, 1138, 1977, -1304, -611, 2659, 106, -1745, 1744, 1893, -2048, -250, 1998, -1024, -1313, 1564, 164, -1651, 411, 505, -1276, 157, 728, -1731, -664, 1537, -1272, -2385, 908, 617, -3057, -751, 1192, -2115, -2511, 1251, -434, -3102, 173, 525, -1719, -1084, 928, -1081, -690, 1092, -815, -1626, 845, 278, -2078, 160, 1468, -1932, -1482, 2058, 103, -1839, 1092, 841, -2240, -674, 1949, -282, -1178, 1166, 27, -1979]
3121a979K680L26k230Q30J501k809K81K749j386j825K123J90k800J853K534l034
3137i96q99K759j103j534K625L75l167O50K389k461J14L021j448k505K355N13
3153F88k206J398J991k562q61K849j062j759K825k58k616J064K049k092j32K598
3169A914j686k351K652J029k960J438J685k767r60K909q1j961K125n2k940J295
3185g11K374k189l1K129k194j464K761J138l177R34J975k515r69L471j75k619
3201a262J685K56k528J604K325j734j517J916j032j422K634P54k723M67J694k397
3217a280k89L406o53l301J423J288k142R95K017j996j646K011K54j843J745P04
3233F93k660L71J958j620l83L158j313l197K087J810k275O21J963k209j615L055
$$ y = [-1979, 701, 1027, -1203, -373, 1128, -1681, -1400, 1349, -37, -1862, 261, 451, -2349, -496, 2038, -996, -1895, 864, -239, -1773, 852, 1227, -1940, -1290, 1099, -1362, -1248, 1773, 325, -2180, 175, 688, -1518, -120, 1871, -691, -1552, 1297, 235, -1524, 1301, 1043, -1573, -509, 1540, -552, -684, 1914, 228, -2123, 529, 1558, -1402, 36, 1721, -1046, -2006, 903, 822, -1139, 986, 934, -2006, -711, 1663, -526, -557, 1572, -622, -2086, 675, 1813, -1364, -430, 1545, -970, -1939, 1532, 1357, -1262, 423, 679, -1849, -245, 2080, 346, -1171, 745, -287, -1709, 925, 1679, -1044, -577, 1117, -1280, -1569, 1837, 1184, -2117, -694, 594, -1548, -553, 1464, -532, -2178, -167, 87, -1756, -11, 693, -1967, -1596, 362, -1258, -1641, 1517, 204, -2993, -906, 904, -1371, -750, 1213, -996, -2611, 444]
3249D44J64j961J667J114l021M48K629j071j114K265j189k413K355J516k183J49
3265b01J837j854j152K720J70k412J434N70k558O82K798j746j198J670n87k458
3281b285K511J677l001l73K498j482j312K109O53k453O98R99j752O81K058j694
3297d68j134J644J64k068K385J636m011O12K909j826j042K639K58l108R33K149
3313A672j402n95K176j457j157J883J16j300J197P24k698M07K554j744j330K972
3329B018j8l587J402K563k273j102J965m79j926J588P47j613M46J212k403l7K178
3346F81j220j026K039n62k344J847J844k701l73K779j247k058K412O77j924N86
3362e90J503j825p3K058o97j899J983O72k286J105J940k169n96K025p56j619K350
$$ y = [444, 608, -1353, 314, 1428, -1593, -1145, 1484, 413, -701, 1564, 375, -2038, 317, 1833, -350, -201, 1636, -218, -1370, 1350, 1520, -892, 542, 1112, -1446, -764, 2034, 288, -910, 760, 173, -2285, 226, 1903, -1098, -1471, 1027, -455, -1767, 342, 995, -1458, -760, 239, -1513, -832, 1226, -468, -1602, 42, 206, -1862, 523, 2159, -1852, -1240, 1669, -157, -1199, 1440, 1698, -1410, -477, 1672, 270, -325, 1851, 394, -763, 1120, 1236, -64, 1133, 1857, -841, -434, 2120, 376, -954, 2018, 2000, -1587, -185, 2378, 105, -997, 968, 489, -1437, 151, 898, -715, -269, 943, -1460, -1497, 681, -539, -1565, 474, -88, -2432, -585, 1259, -1442, -1815, 964, -283, -2341, 71, 748, -1176, -590, 913, -912, -985, 1073, 376, -1523, 460, 1132, -1154, -49, 1891, -278, -874, 1151, 395, -1224, 1126]
3379A126N22k193Q94J478j875j35J970j172j913K825O6l063J284K431k404j519
3395a678K958n29k282J458J419j886k1J537r47m88J142j205m26K201p31k299J734
3412d3K058l019l48L455j255l197K468K063k506p89K462o74j859J688M10k65K26
3429H75m79p69J182Q31j972L41K316j979k171L471J473m202Q20K586j800j912
3445a389L029O69l014J16J568r17O7J072q98m59Q68q93l69J931K15l091Q62J996
3463A363j821o74K796o72l275J934K017k202N1J778j297j377J698O06j762J001
3479A64Q19k306K30K427q10j138J522m04k137J907J427j920L42P99j422q11K891
3496A580n08k326J612Q36k658M73L178j550k748K465N68j898J73K106j248n80
$$ y = [1126, 1648, -545, 349, 1827, -48, -183, 1787, 615, -1298, 1527, 1593, -1470, -186, 2245, -159, -1678, 1280, 751, -1531, -73, 1346, -540, -561, 976, 29, -459, 683, -522, -948, 1253, 522, -1777, -43, 2015, -1004, -1352, 2103, 848, -2349, 119, 2182, -324, -1113, 1349, 675, -1184, 504, 914, 649, 875, 396, -373, 809, 1640, -332, 9, 2325, 346, -1825, 1646, 3119, -1083, -263, 2323, 523, -1389, 1640, 2309, -705, -589, 979, 62, 129, 1201, 303, -156, 712, -181, -550, 1381, 1596, -1495, -633, 1363, -458, -1132, 1664, 992, -2283, -349, 1668, -534, -483, 1295, -2, -1379, 319, 925, -837, 164, 983, -1323, -1093, 1334, 524, -614, 908, 504, -1633, 274, 1701, -219, 123, 922, -500, -1311, 1580, 1072, -1254, 358, 1194, -1464, -991, 2187, 637, -2111, 354, 922, -976, -803, 1303, 55, -525]
3512e25P68m17j97J131j91j151J145j90k151J735K514l029j587L173N80l563K064
3529A09K265k431j897K391R65j998Q97O63j002k75K47k07Q24Q52k483K39K732
3546A891j325k499K652J694l505p92L593p6l017J623J564k233o67K116n1j116
3562a48M33l36l07J169m35j067J823rk418O42K643j272k042K420p8k622J195K381
3580A972j546j348J998q10j249J503O85j475J53O01j348L59J571l43j863J329
3596A89P5j458J086J559j569j063J399o78p44K047O25k981J008J183j367n61K616
3613A366n30k504R04J509j537k1J796r35j308J212L68m68Q83n69j542J133J202
3630I59j603L98K028k029k099K853J346l088K26K495j221k176K314J124k076P9
$$ y = [-525, 243, -174, -371, 760, 569, -582, 563, 373, -1778, -43, 2471, -558, -2145, 1028, 1608, -1955, 109, 2374, -57, -1954, 437, 1402, -596, 301, 964, -38, -313, -66, -273, 551, 1403, -1080, -841, 1891, 566, -1933, 719, 2413, -1092, -1884, 1709, 1633, -1384, 239, 1803, -430, -1097, 1019, 968, -148, 285, -51, -358, 811, 376, -691, 1132, 1123, -1295, -653, 1990, 718, -1324, 1096, 1018, -1604, -409, 1972, 426, -922, 1076, 266, -983, 520, 1205, -270, -117, 484, -864, -505, 1066, 723, -1140, 189, 264, -1194, -108, 1451, -118, -1181, 218, -460, -1204, 843, 1468, -1513, -505, 678, -689, -1250, 1366, 836, -1668, -764, 745, -792, -813, 983, 48, -1260, -48, 320, -148, 735, 166, -1376, -243, 959, -644, -246, 1782, -247, -2346, 507, 1853, -1235, -1009, 1486, 265, -1911, 403, 1527, -549, -470]
3646d70O37m96n0N38p04K33R57j593m70K387j72k640J020K234k127j247K838L86
3664A261l191J065J872j628p89J755M4j118P51J0o11Q25K92j349Q71R94j779J65
3682e60K246j356j651J700K086k944r8K477j052j698J905j92j173M01J179j298
3698b8k03J662j185p41J642m64j311J318O03k079L39J661j430p73J680l88j583
3715a280J212N45j618N7J943j334j657K179O66k250P09J201j132l61J536l93j087
3732a064J095j18r70R42P20j493L86J672j750m24K150K3k426J286J647k109k38
3749f71K081o12k048J640P23j306K37Q24n41q60J131n32l80J500p78j456J164
3766A16R65k034J35K058j461j655J764P43j954Q14R26j293j034J702J32j071Q42
$$ y = [-470, 167, -329, -379, 159, -545, -312, 645, -948, -1418, 969, 797, -1843, -823, 1411, -716, -1963, 875, 1261, -1930, -865, 1007, -621, -1410, 345, 389, -729, 22, 32, -579, 246, 538, -811, 60, 1054, -725, -560, 1686, 330, -1321, 379, 2465, -479, -577, 1900, 848, -850, 1055, 863, -310, 91, 1270, -28, -231, 1431, 246, -495, 1147, 683, -628, 690, 1293, -786, -447, 1214, -216, -989, 691, 303, -1280, -68, 477, -1141, -1084, 859, -475, -2132, 47, 713, -1537, -828, 373, -759, -1120, 416, 23, -1064, 31, -87, -1057, -115, 605, -888, -502, 1170, -580, -1004, 1146, 1169, -1257, 29, 1676, -433, -671, 1410, 798, -1250, 390, 1113, -193, 44, 868, 327, -533, 598, 66, -314, 1186, 408, -1048, 116, 1081, -953, -818, 1240, -221, -1876, -112, 631, -1323, -509, 417, -876, -1910, -208, -76, -1147, -305]
3783c05j34j214J024Q85q94k62J554j121j060J888N43j486O01J171j715l29K257
3800A403l85j665J164N17j300M51J762j388o34J695r22q74J382O70j959L89J008
3817A314j084k50J992j009j439J247J72j547Q70J616j718j107J441j80j315J611
3833F14O61k605O67J437j427j00J256l68j513J135J032j222J61R83j307n40J742
3850F06l20j006J417K53k287P85J804r45q76J685p31j284J192J293j649L2J117
3867A086j127k95J540n6j361Q07K34j397M26J517r61j174J480k74j716J554J038
3884A321j436p35J256m13j088J777K9j674N92M68j110O04J462j148j170J786o17
3901i6j040J148O09j336n58K103r81r04J609L31j991P02J110j020LJ495p93j108
$$ y = [-305, -439, -1653, -629, 256, -638, -900, 654, -467, -1527, 361, 904, -582, 19, 1190, -525, -854, 1403, 1018, -647, 517, 1034, -266, 185, 1947, 559, -75, 1620, 698, -176, 1206, 1876, -83, 306, 1314, 230, -20, 1972, 963, -476, 771, 943, -604, 266, 1882, 164, -943, 498, 318, -997, 614, 1275, -1330, -663, 774, -653, -753, 503, 135, -1378, -243, 789, -433, -272, 711, -596, -1136, 606, 286, -720, 697, 950, -1337, -552, 1252, 307, -569, 1116, 385, -899, 293, 1586, -63, -31, 1086, -41, -336, 1204, 1148, -213, 594, 828, -569, -143, 1374, 413, -761, 719, 445, -1271, 283, 1321, -115, -850, 406, -7, -1095, 682, 711, -963, -371, 97, -1013, -409, 1053, -95, -1265, 521, -96, -1136, 12, 621, -715, -1273, 830, -151, -1055, 554, 885, -1106, -404, 706, -314, -311, 1184, 391, -717]
3919g17J047L13j218Q77P40j636P7K033j059p77J600l62j707Q85J299j531R3R88
3937I45p17j334J784L63j414O56R81j682J43J228n64j121J443k25j783J320J265
3954A288j397j29R96q21o42J665m9j855J011P40j624J74K008j088j116R22O48
3971G31j573O26J400j363m30J327m03j033J111L85j345O29Q88j324j73J809j036
3988B26j462J508O16j602K03J692j781p41J915m9j425R64N80j425M02R77r67o11
4006i80J568p24j133J715L34j828P09J512j961m52J703l48j412J046O71j149R4
4023f35J356r69n52J132m32n76P20M94j612L82J554j142q77J964o10j418J514
4040B93N90j857Q6J588p90o23J362m26j504J265P00j373L37J657j676q55J625
$$ y = [-717, 330, 643, -575, 302, 1042, -594, -517, 1516, 457, -320, 1280, 918, -789, 96, 1395, -136, -43, 945, 228, -1106, 678, 1041, -373, 283, 1264, -418, -275, 953, 389, -732, 711, 486, -1297, 23, 1288, -109, -238, 758, -63, -705, 960, 911, -944, 67, 807, -817, -643, 1365, 277, -839, 83, 731, -842, -216, 1184, -179, -609, 718, 315, -718, 393, 778, -567, 62, 950, -374, -547, 1262, 226, -1236, 272, 888, -714, -511, 1181, -600, -1341, 574, 525, -900, 64, 644, -781, -379, 598, -369, -980, 588, -136, -1269, 446, 780, -1048, -339, 1173, -788, -1240, 463, 115, -1297, -251, 420, -729, -635, 721, -248, -800, 332, -100, -676, 44, 538, -1074, -692, 862, -280, -1157, 807, 197, -1221, 293, 883, -974, -888, 700, -90, -713, 649, 223, -1281, -16, 684, -689, -352, 1305, -371, -1226, 399]
4057C99m2j430J222N72j298J82R57p92l99J354l83j364J570p0j126P40R16j178
4075a70p39J539K82j908J006J139j852j88J768l06j443J185L2j133N48Q64r32
4092c08O51K10j380l5J964o68j614J443R82k477K61K316j054j067R63P04j762
4109h71L95J599j364j96Q12m61l70R24Pj163J069K91j608N28J995j844j017J380
4127A06M13j847J019J551j690o82J540n43o75J074K8j386Q45K22q05L58R29r68
4145e11p16J535o1j325Q05R36j568k47J628m99q94J292j24j750J109J137j246
4162d99j82J856j081j512J766M44j518P13L46o00n84J566j18j017Q20k8j249J141
4180B64P36j571K83J418j349j129J869K99j891N70J282j040n71J375L60j664K81
$$ y = [399, 357, -1073, 149, 721, -577, -395, 562, -230, -629, 725, 342, -1022, 548, 478, -648, 92, 1008, -170, -909, 630, 912, -996, 10, 1149, -703, -891, 877, 571, -872, 313, 345, -788, -240, 624, -308, 343, 553, -827, -862, 1102, 434, -1180, 263, 1245, -1232, -971, 1345, 291, -776, 187, 891, -871, -476, 1123, -241, -437, 375, -86, -456, 468, 475, -688, 381, 672, -936, -408, 1587, -257, -1274, 106, 519, -1328, -309, 1242, -448, -1130, 410, -133, -808, 266, 294, -1092, -247, -25, -830, -472, 457, -511, -1227, 308, 247, -1078, -273, 663, -905, -1152, 476, -23, -917, 375, 251, -1499, -390, 747, -499, -681, 1175, 94, -1418, 348, 792, -726, -13, 333, -267, -851, 715, 597, -420, 400, 372, -877, 264, 1000, -571, -288, 1130, -219, -1348, 521, 820, -1071, -501, 781, -259, -830, 545, 905, -759, -478]
4197d78Q82o06J58M11n70j77Q16o51l97J806k53k368J223J547j861n55K462p04
4215F85k200J235J489j236j77N73O0j209O98J74j45Q06l21j141P62Q08j299J06
4233c32J599j201j658K114R79k164K23J709j198p41J305K37j304O41K93r33J12
4250c19R41o42m30P26j84j166J309K30j297L48J127j098n14J416j53j688J151
4267b43Q95j763N56J234j056r11J534k1j450R90P79j085p7J326q70p89J276o8
4285B57r77M35P36j084P15O99j319k99J638n03j671J508J225j879k17J922n81
4302F05j864J476R45j584J46Q48p12J87J79n22l87J300o80p69J584J99j829M66
4320d12J448q81j606J947L69j905N24J600p77j143J179L44r78L74O64q76P44m31
$$ y = [-478, 404, -202, -44, 367, -203, -380, 436, -215, -612, 1194, 941, -1427, -204, 1343, -518, -1073, 1389, 685, -1515, -280, 1209, -27, -204, 369, 429, -780, -82, 92, -53, 753, 432, -709, 53, 861, -438, -332, 1267, 66, -1592, 522, 1501, -663, -440, 1269, 71, -670, 635, 872, -432, 209, 502, -431, -319, 622, -20, -450, 276, 92, -1074, 235, 465, -832, -484, 643, -455, -969, 447, 294, -1394, -243, 652, -1111, -555, 679, -377, -1288, 246, 225, -1225, -235, 544, -541, -618, 708, -162, -951, 325, 257, -720, -285, 451, -633, 82, 781, -538, -837, 801, 298, -1373, 135, 1360, -519, -736, 1186, 605, -1259, 217, 1162, -422, -276, 572, -140, 47, 226, -296, -683, 617, -63, -832, 752, 951, -878, -412, 1036, 155, -1451, 496, 865, -1040, -516, 1084, 307, -836, 343, 687, -291, 83, 747, -129, 615, 184]
4338A84p38P50J200j765k35J643l58j686J244J534j846r73K132n23j200P30Q37
4355I30j078k12J257j021J27Q83p38l73J079k70r72N24O54j135K13J108o48j189
4373h61J145L90j864J289R57j077p01J458m86r91J065L10j482O98J403j459o63
4390h69J331k10q88Q74J42p08L99M61q67j05J335n66r21J148N3j471M02J763j343
4409d0j028J600%j360J033M92q75j41R68q54j5O39k40p93P17M07j174J078R65
4428A379j618m37J534k56j572J662O32j967J41J370m92j118J295J14r90K80M92
4445D49q67L50N45p24k00J516p55j048J217K40j283P0J695j090r04J532J34j428
4463e51N18J066j228K70Q57j005o18J237K89j426Q16J58j221Q37R90r72o15J323
$$ y = [184, -554, 196, 1396, -369, -604, 1039, 681, -1005, 239, 1773, -73, -1046, 1086, 563, -637, 93, 930, -148, -360, 897, -124, 3, 886, 148, -225, 854, 584, -388, 136, 790, -345, -132, 976, 328, -861, 284, 674, -1190, 99, 1056, -21, -722, 736, 250, -741, 324, 634, -848, -150, 1253, -206, -869, 462, 252, -636, 238, 380, -328, 71, 532, -335, -440, 895, 329, -592, 556, 609, -862, -460, 1303, -40, -1068, 532, 532, -828, 205, 697, -178, -319, 649, -205, -220, 419, 179, -614, 103, 510, -664, 414, 1379, -239, -676, 858, 602, -970, 692, 1324, -643, -502, 868, 376, -742, 553, 667, -323, -43, 449, -418, -68, 477, -247, -447, 1069, 314, -734, 483, 723, -560, -490, 1205, 115, -789, 743, 877, -551, -33, 1033, -195, 75, 932, -73, -691, 546, 835, -591, 225, 383, -838, -1, 989, 17, -598, 725]
4481G25k29j262J513L55j386j57J141o44q54J763j17j704Q46O07j004L75P89m26
4499C31j063J226l74n73P97K54r05l08J132n72l41R18j36j542J007O00r62K80
4517b31J384j252r15J257J95j233J198M33j395l33J347m43o08R28j96j018O40
4534b42P97r13L0J005p44j215J931J09j535M63R28j352n4J444l36o96N92K02j050
4553f36J88J046j042J22P78p34o56J321J38j182N54O79j207J45J265p33r00Q14
4571d0L93r72K29J212j472K83Q00k73o09Q81J08j136N23O88q31l35J177p40n63
4590f77J022J98j185O79N65p14q86J578j88q94J073j95r36K45P26q40k18J171
4608E24o61q88R01M56p45J77Q18q07n03J398j98j258Q38L49r60K71Q64j062m20
$$ y = [725, 496, -766, 747, 1102, -284, -441, 700, 56, -798, 965, 848, -856, -10, 597, -407, -32, 757, 331, -732, 494, 120, -453, 344, 598, -307, -615, 517, -55, -396, 522, 386, -1156, -149, 451, -511, -231, 1153, -99, -1014, 243, 438, -795, 403, 836, -559, -892, 455, 12, -596, 332, 136, -882, -242, 555, -358, -328, 677, -67, -1282, 649, 758, -777, -314, 614, -738, -792, 652, 316, -380, 212, 414, -636, -448, 598, -444, -322, 456, -278, -934, 387, 525, -657, -103, 576, -631, -486, 779, 46, -854, -40, 353, -619, -390, 822, -650, -367, 433, 160, -449, 432, 540, -596, -73, 615, -216, -551, 626, -114, -677, 345, 543, -642, 37, 602, -112, -998, 580, 392, -502, 571, 376, -560, -315, 411, -429, -647, 524, -137, -1025, -124, 332, -413, -236, 582, -225, -728, 670, 472, -786, 52, 401, -559, -288, 576, -486, -906]
4627i06J247k16j247J125L78p79jR10r65j24J172k32j165Q42M89j135M27L95l72
4646a57m62J386n09j028R06N43j540K48J139o70o91J013p8p96O50O85j199J53
4664d07R83r04m23R58K4j321J108K75j114K67R93n38q81J307k48j245O54R39j411
4683i84L65J110n69q01Q02Q6p68O85L84r40J3J015p26m49Q87K20j079N23O86j285
4703h25K87R59l58r11J212r8n59J76N17p72L7R87p50n60J386j49j438P68M42p97
4723d46K72R43o26q00Q83Q9j061Q08O47j233k0J094l64p39J159j6j481M93R91
4742E93p17r6P99l73j083Q51O13q33K43M64r78kJ266p40p05J083M5j536J101O05
4762F00p23k86J124q11q83R86N82j063L5O38n14n2O67n2q27O43j23p62R18J47
$$ y = [-906, 341, 125, -1122, 3, 381, -398, -399, 511, -454, -578, 594, 362, -803, 39, 528, -607, -180, 215, -157, -619, 767, 258, -770, 136, 679, -861, -613, 526, -144, -835, 178, 100, -696, -46, 639, -560, -407, 576, -328, -751, 207, 231, -1090, 18, 293, -821, -554, 439, -99, -980, 327, 79, -1166, -512, 427, -984, -619, 491, -78, -879, -77, 9, -759, -74, 310, -630, -617, 398, -328, -777, 110, 330, -749, -226, 460, -825, -538, 421, 63, -848, 364, 266, -293, -117, 400, -372, -335, 652, -98, -658, 728, 579, -859, -91, 351, -446, -174, 769, 143, -657, 226, 315, -746, 62, 709, -524, -544, 550, 186, -553, 606, 590, -891, -398, 593, -124, -220, 579, 206, -877, -26, 587, -246, -3, 461, -517, -519, 747, 7, -698, 385, 430, -1106, -5, 600, -123, -409, 715, -96, -979, 7, 589, -474, -439, 199, -315, -367, 300, 248, -579, 64, -59, -821, 97, 244]
4782B44p76R3J133j093n08J225N23j549J62J376j191l65R93l4n94M36J6p49M43
4801b15O71o89m89Q09n20q3P92J82j259M85J055o24p09J218j31j580J160J07n80
4820d00K87O89r27k46J152k63j037R09J92q19p8O45j93m98J080j97j014O56K72
4839B10n71J86P89r95l40J382n25o49N95O51j483K13J371p61r60J097J63o92N77
4858B58L66m28n18M93m07K07M06l15m84J012j28j210N55J455j463l09J031L1j157
4877f05R09N81j049j69P76m8n46N20k6l06q3N08q81R01P58j332p81J462o11o23
4897f45Q53J002j679l28J336l12o94M87N06j063lJ026l95j99K96k90k83O93k58
4916E0m93O00J56j094N54Q82n84q12J026J7r59N23N79k20q32Q79l64l99J032P7
$$ y = [244, -532, -439, 694, -399, -907, 318, 841, -708, -546, 830, -361, -726, 267, 233, -361, 75, 91, -658, -215, 456, -233, -722, 87, -433, -516, 276, 458, -801, -316, 739, 115, -594, 624, 493, -1087, 73, 180, -400, -113, 576, -351, -597, 555, 292, -745, 164, 356, -463, -541, 104, -89, -587, 493, 296, -718, -62, 210, -361, -175, 614, -381, -721, 661, 136, -513, 82, 733, -750, -537, 834, 73, -887, 210, 373, -319, 258, 624, 196, -322, 171, -236, -29, 377, 62, -422, 590, 462, -748, -193, 1262, -201, -510, 521, 552, -605, 304, 885, -164, -333, 443, 395, -151, 369, 343, 37, -46, 462, -419, 482, 1240, -92, -873, 589, -22, -645, 208, 1210, -469, -797, 539, 227, -467, 20, 526, -537, -540, 486, 91, -108, 188, -102, -385, 308, 50, -443, 157, 313, -781, -227, 655, 71, -741, 285, 302, -657, -134, 445, 225, -607, 272, -92, -491, 541, 618]
4936F18r30J01R72p41j28N85l65m63P67l35o23O58M82r04n1J040n33n10O98pp19
4957c88K99P76q17n23J351k94p36N29L15p35oM32k68m62J463p47m85M66K5l99
4977b04N13L36j204K18J170p66p03J015N33j139J7R43k69p04O74q6k84M55J11
4996F26o07N54k08q28O77R10j078m02J061Q7j250M69J241j279p35J508l47r78
5014e79Q51J83n31K9N25j18l26P39l61o53M36K49r97N19Q22j021k54R90k63r31
5034f91J315J17q58k42O36k5n59P85j51o66M74K15q23N12L42l52l84O35J6o30
5054c34O65K38r20K29P37q76K37P08p76m16J004Q7p54L72L40q50j66Q38L33p99
5074a03K52M49n36l0N41j93l08N13m67n24Q66j79l40L1J035j349J2J025%j236
$$ y = [618, -312, -211, 761, 20, -108, 477, 112, -351, 416, 81, -542, 116, 598, -306, -357, 683, 150, -360, 338, 331, -388, -89, 687, -130, -653, 698, 404, -332, 197, 512, -223, -229, 203, -65, -527, 936, 189, -296, 170, 195, -204, 309, 645, -559, -341, 829, 63, -640, 375, 908, -231, -214, 729, 460, -244, 430, 344, 60, 515, 626, 19, 573, 365, -463, 214, 1124, 46, -356, 705, 792, -458, 11, 1252, -27, -762, 746, 399, -579, 272, 455, -76, -47, 478, 360, 34, 773, 412, -241, 195, 444, -553, -34, 788, -233, -487, 503, 240, -691, 624, 741, -117, -359, 277, 252, -307, 478, 327, -339, 135, 350, -473, 39, 381, 29, -355, 280, 296, -334, 331, 569, -351, -122, 615, -261, -24, 684, -92, -508, 496, 583, -171, 201, 541, -309, -475, 363, 696, -103, 149, 598, 62, 32, 573, 380, 72, 585, 118, -406, 460, 281, -59, -28, 1007, -342, -330, 695, 695, -541]
5094e41P75N81q07j63P38k83o17L85K20p51N64N73q38K22M41m95l62R93k49j064
5114f78O98Q30r94J64O30l82q83R67J88q50K14O74q90N6P65k37m52N52K2p00P40
5135D34J55n69k11R51n91n27J093j15o91J63O12p83j61N78L3p82M57N20j145N36
5155d3M98n62k71Q93n88o24J094p8p89L00N50m27j90N81l94o61P41J1q90Q36P25
5176G12j037k38R80o23l05M45L79o17m4O63q14J7O27j72j74M19j91o06K07M44
5196G2o27qJ036k53q36O46L57r08N18M84q33k8N72j84o78L22P52p33K49L62o65
5217c83L6M57J6o57N94K14j195P25O23p75l16Q28j40m49M30K46m77K57K36l16
5237d6m33M71k2o38J025l17m34K93N86n25o18J016l20r09P34M05p93K28R48j016
$$ y = [-541, 234, 815, 8, -155, 583, 300, -317, 68, 288, -463, 101, 674, -164, 58, 499, 4, -358, 635, 386, -678, 20, 850, -144, 20, 650, 268, -615, 352, 540, -310, -96, 578, -312, -256, 509, 272, -180, 372, 394, -306, 434, 589, 20, -191, 760, 169, -358, 735, 620, -71, 92, 704, -79, -240, 338, 371, -411, 46, 566, -579, -43, 455, -107, -378, 515, -73, -697, 397, 319, -470, -170, 380, -47, -237, 344, -50, -711, 30, 41, -849, -13, 712, -325, -563, 417, -206, -511, -66, 313, -304, -348, 315, -499, -482, 145, -27, -201, 218, 27, -579, -372, 72, -555, -563, 473, 220, -616, 30, 387, -521, -3, 481, -352, -380, 192, 8, -670, -348, 404, -329, -80, 282, -383, -347, 110, 126, -531, 63, 277, -918, -193, 430, -345, -661, 167, 27, -422, 8, 254, -223, 34, 270, -46, -479, -8, -30, -668, 357, 40, -394, -101, 485, -40, -658, 358, 38, -871, -137, 268, -525, -297, 651, -365]
5257c65l64J025j38q34M89N95r13M33M88n65m47N22N5n31M88L48p46m8O15Qq18
5278g03Q99k80o36J043O0m22n67Q78l00p60J046k36n98M02L98p02M9O20k62o11
5298f82Q66l13l60K13O50r00J36P79n78m88N64J88j019Q36J41k81l75P55n72n2
5318d92O11j47n37K03M57m78Q7M54l08o36R84q4o24K60P75j106P4O51m10l69M32
5339b03L08o73L10L97m68p3N82q9m26J76K38k21O1M18r84K97P39k70o35R51j66
5360B69p78L67O31n22o39P10k67n96Q62J85n93K10Q18p00k40P39k49o00M90j5
5380H2p71P08J97j98j83L21N1q32O22K86r54O70K02m23K81M95o31k30M65K49o37
5401b30K99L61j04n55O03j35n46M05K52m65k97Q34q06L1R75n83n00K50K65R8m19
$$ y = [-365, -729, 296, 158, -676, -187, 408, -505, -72, 416, -149, -596, -74, -19, -550, -62, 286, -460, -508, 107, 115, -703, 196, -84, -720, 323, 383, -39, -606, 272, -28, -788, 258, 22, -576, -174, 224, -478, -429, 191, -71, -682, 184, -129, -489, -276, 374, -526, -390, 389, -189, -677, -113, 75, -944, -108, 33, -248, -623, 132, -440, -492, 119, -28, -565, -362, 95, -383, -296, 158, -150, -786, 198, 114, -510, -250, 525, -581, -507, 144, -266, -635, -203, 105, -568, -258, 139, -329, -402, 180, 91, -335, -159, 79, -142, -81, 337, -647, -350, 389, 119, -516, 435, 269, -509, -142, 489, -33, -672, 38, -229, -825, 37, 222, -371, -161, 657, -43, -283, 456, 207, -393, 97, 82, -689, 19, 216, 18, -165, 156, 207, -625, -3, 283, -671, -1, 201, -222, 59, 554, -77, -307, 158, 407, -230, 69, 430, 326, -229, 374, 239, -307, 98, 350, -115, -412, 422, -384, -353, 622, 39, -461, -211, 54, 152, -267]
5422b67Q64o81k91O35p4r35Q99K12n42K8O89p00r1K97K76o81M44R6o53L56K07
5443H8o31J29Q99n33l14O56L13j304K42O84k14o85K06O90n52M34K30o65N15n7
5463A31o10K76L70k95k61O21R3n33J89L18q9m37K27J84n23L08N86m57o52P08k8
5484A26k84L06jn13N97L86r14K01K37p2k90M80L1m73L48O56q72j58M32j20j80
5505g7M11L0q29O66K61n69j2M09m83j70N57J81n59R4N11p25R7P27q02Q8O63j38
5527C31o22M07M45q96k17J215o30k88N90P7p79J22Q15m37k77K61L94p00K39K38
5547B88n42O17j51n25N88qq7n26O71L7q63L81N66m72j28Q18p20o75Q86L5n47K27
5569a30J69k97L4K00j05j20K54Q4n27M12J40l13q1O49o49j35M87J56o74M30M44
$$ y = [-267, 597, -84, -375, 260, 186, -749, 150, 362, -180, -152, 537, -163, -254, 43, 319, -362, 82, 178, -475, -119, 88, -543, -414, 485, -48, -362, 294, 607, -697, -455, 229, 15, -670, -464, 226, -326, 108, 338, -327, 188, 131, -479, -203, 167, -128, -389, 232, 325, -208, -19, 299, 210, -227, 0, 184, -339, -31, 555, 98, -554, 154, 126, -158, 148, 147, -366, 231, 617, -297, -96, 141, 69, -221, 259, 290, -183, 165, 821, -51, -209, 223, 103, -77, 334, 364, -465, 201, 462, -107, -119, 290, -193, -363, 194, 375, -184, -90, 421, -304, -207, 520, -282, -194, 469, 331, -291, 116, 561, -335, -552, 663, 33, -255, 335, 412, -367, -245, 570, 133, -144, 117, 511, -189, 50, 288, -254, 363, 212, -313, 275, 267, 180, -346, 325, 362, -501, -120, 446, -26, -154, 664, -56, -731, 155, 190, -357, -130, 39, -258, -224, -24, -129, -249, 5, 89, -438, -26, 114, -199, -280, 369, -280, -415, 72, 228, -446, -16, 428]
5590D28p50k69P87j44l76M29J15o65O78K99o98J58J35J9o44N46J4k89O3K12l17
5611b69l98R15m29N4K89R8l89k28P05m04m41P52k08p82R95K98k55m41P25n75r0
5632g8L50m56L09j30L91n78J23O20r23o4Q04j31o37O04K90q96m5J159p67l08O51
5653B88k5m68J73N13o24L14K54n14j30L72r5k95K80L43q30J1R87q27J28M15O0
5674C30n15L1O32n89k54P36o34J46J42j14m09N36K13o57K60N37m34j58P45l47
5694A97n31L46L55n18j95Q32k66o05O36N5l13%M37n08j32P00m44n68N68J17n55
5715c92O39K87q67J45P56o07l3J25L0m58M22O61j159O8N88l03k41O71k08o00K33
5736b43K93l51J55J41J35n00L92J41p61O43N01o52k44O58k73m10Q13p78m16O15
$$ y = [428, -322, -591, 196, 52, -324, 105, 220, -445, 233, 532, -166, -8, 127, 146, -498, 48, 62, -227, -164, 48, -269, -667, 248, -181, -127, 162, 260, -129, -357, 348, -56, -497, 255, 47, -735, 260, 558, 303, -138, 587, 12, -78, 272, -184, 125, -5, 386, -192, -69, 551, -372, -436, 368, 237, -400, 204, 494, -402, -447, 712, -55, -363, 288, 263, -205, -32, 481, -143, 171, 425, -89, -219, 153, 58, -237, 43, 386, -444, -433, 554, -273, -145, 270, 330, -185, -154, 478, -111, -365, 371, -263, -117, 25, -89, -498, 38, 251, -406, -146, 391, -43, -201, 544, 197, -334, 12, 367, -151, -346, 486, 220, -385, 251, 306, -7, -7, 430, -78, -210, 490, 46, -522, 46, 163, -392, 247, 534, -333, -188, 568, -39, -72, 53, 83, -375, 47, 708, -451, -383, 205, -98, -339, 332, 124, -476, -243, 50, -301, -146, -5, 130, -370, 22, 163, -598, 45, 546, -106, -350, 308, 35, -375, 438, -340, -756, -141]
5756a41Q64n21n75M30L37n85M88j22j66K57N9o62O49p3j14m35P36p2n73J91L44
5777C16n36J97M89k86l34K29M89p33m27Q96n51R9K37O4n18N02p2m93M27K83m78
5798b00j73Q71m60m24M86M52q15k1O57n75K3P16k12n85l3O56n91O5M23l30l06
5819c76N39R0o95P49l14l01R5Q15q00k64J110m85k24K78K09p09r7O22k78l14O09
5840B59j8m53M7K11q5k30L70j91K7K43rm64M04M8m76m3N11k05m03P99m09l79K60
5863a86N01n99j8O59n38j62M92J38q04L59P66q09K50n1K01k53K35J00m71P5N14
5884C99p49M50M09l50o08Q08l29o86N35M53q0k11J12k67q7O76m46k21r3N90m15
5905a10K04L48o09P6K30q0n21N82J03n45k1O23k04k54J57l9o2J51J84l73j8M69
$$ y = [-141, 723, 202, -373, 57, 394, -191, 297, 175, 9, 266, 325, -337, 312, 239, 125, -310, 426, 354, -219, -28, 316, -220, -23, 466, 180, -154, 75, 564, -169, -596, 300, -251, -152, 85, 149, -369, 133, 61, -432, -5, 278, -200, -373, 498, 38, -386, 100, 552, -263, -284, 373, -202, -179, 537, 325, -260, -293, 363, -228, -163, 260, -70, -376, 163, 253, -442, 307, -7, -308, -213, 602, -198, -462, 648, 163, -61, 217, 426, -283, -380, 242, -36, -350, 259, 241, -212, -165, 46, -39, -269, 101, -90, -63, 180, 171, -293, 111, 159, -317, -360, 151, -54, -457, 342, -67, -446, -186, 315, -284, -302, 357, -181, -343, 149, 287, -517, -158, 608, -201, 49, -2, 199, -54, 181, 281, -190, -115, 399, -350, 100, 509, 159, -449, 359, 30, -656, -121, 332, 252, 41, 153, -114, -201, 475, 29, -192, -285, 305, -110, 94, 442, -167, -91, 139, 59, -462, 120, 223, -322, -343, 280, 76, -178, -21, -60, -122, 29, 213, -160, -178, 291]
5927B91l65r5M52rl62R9M82m83O5J57l94J42M94m27m59L66M27m86k57Q12q4p53
5949c87M88J68p53N27K66o15R0N35n29p1Q78l32o85J50M30m31J3N11l64n06Q82
5970B65j68n13L7O45l97j10O73j28n14j07L73k51j8N07m18Q0L36j00q16P55q6
5991D5o90Q95K96n68m6L12j74j81N2M62p19K51P69p54k14K03K18r4lL23n67k8
6013b12O18l35N3J52k38n19P06j94j78L19J23l06l66O53m37j11O04j21l60o4K07
6034fJ34l38K52j60m62P01L76m23o8L64l72j73M11K52o98L21L04p20O1N22pl73
6056a02L60Q1p09K34L79l49k65N68j00o08N14J77l44K86j1l24mM60l82j66M66
6077A61j55j31L49J01m42j93O42l10l53M05K57r30K65O98n39j42N25j32m31O72
$$ y = [291, -74, -169, 283, 274, -88, 11, 493, 10, 75, 232, -162, -20, 474, 47, -412, -46, 381, -105, -362, 450, 366, -387, 101, 269, -484, 43, 309, -306, -216, 319, -210, -281, 597, 265, -420, -270, 160, -271, -258, 253, -111, -617, 265, 97, -416, -379, 266, -131, -241, 432, 304, -210, -317, 56, -195, -213, 294, -124, -44, 292, 192, -624, 131, 45, -645, 250, 546, -22, -68, 244, 70, -111, -59, 403, -316, -65, 704, -50, -264, -61, 157, 63, 60, 383, -184, -212, 406, 71, 124, 276, 38, -481, 225, 31, -147, 172, 295, -11, -377, 276, -161, -272, 332, 211, -149, -213, -6, 128, -210, 42, -118, -580, 121, 497, 74, 6, 370, -2, -175, 236, 488, -210, 111, 415, -305, -244, 278, 271, -102, 258, 339, -370, -136, 243, -106, -371, 197, 97, -511, 3, 180, -164, 122, 111, -213, -217, 243, -139, -305, 161, 6, -125, 224, 325, -117, -310, 332, 22, -331, 74, 331, -599, -334, 364, -175, -317, 208, 76, -355, 317]
6097C17k27n33O25k7m45j76M56Oj61L03K19m88K02L36m99k17O83o34j59L09L73
6118B63l24o1N76m90K08j43j21r5J68L93o64K08L39m46J63K94k59l17R05l60k22
6139A5l26P02k78m56L85k43J42rN6j40N00o8m30J67O4k63j0M40k33j72J00L18
6161B61k61n8N66n20o94R73l15k70j88P96m64J50M09n25O2K76L42q76L35J14l00
6182a87K32M27p75J07M24K24o73J69M14n94Q8N92Q8q43M40J56n81n6L51j8k5K26
6204A86j86k51L76K61o27q5K22J63m10N17K3k15K01pn45J28O45o59k16P28j28
6225A21l75J11N48o74R0K93k3l32M66j70o9j23J86l99K15O57m40k42L59o5n00
6246c66L12K14k46nM23k85jJ67ol02M8k4Q8J6M7j84O0L22j53k25J21J44m84K90
$$ y = [317, 90, -443, 182, 155, -290, -466, -10, -4, -165, 138, 357, -131, 71, 407, -92, -309, 374, -260, -419, -110, 263, -61, -122, 454, -36, 172, 29, -92, -187, -19, 374, -290, -82, 257, -189, -26, 268, 9, -308, 597, 237, 15, -311, 391, 113, -343, 42, -201, -59, -68, -12, -152, 348, 280, -150, 17, 81, -182, -192, 248, 15, -157, -57, 261, 0, -58, 508, -12, -706, 267, -48, -318, -506, 290, -174, -24, 385, -140, -78, 198, 540, -336, -1, 113, -187, 45, 472, -303, -196, 228, 452, -221, -52, 362, -232, -144, 448, 536, -307, 133, 289, -292, -348, 3, -15, -40, 186, 0, -251, 125, 386, -241, -326, -104, 59, -351, 166, 189, -26, 175, 168, -377, -249, 396, -263, -479, 249, 121, -254, -143, 405, -269, -179, 114, 91, -241, 225, 55, -14, -137, 49, -350, -135, 522, 82, -160, 199, 134, -366, -54, 160, -86, -91, 332, 47, 46, 213, 207, -95, -47, -71, 17, 33, 80, -104, -44, 278, 125, -100, 21, 165, -319, -29]
6270b9L91l15l04M71j2n24L57K75l42k18M17j06n80L67j85j52Q55j52m02L5J09
6291d4k0j42J65K06l92J63K82m75N6L83l4k79J64K66m19J37M40m76k74M99m7l68
6313b09J82J91j09l02O62j52n0k17j19J34J93K97p69M24pn28M22pPl55M92j91
6335a1j90J70K19m51K16n0J01j30M20l20n8j85M24l88J27M70l01k74K22J79n27
6356c37J87L13L6l79L64j39L7Rl15K89j67K62l55L7M47k69j24K53%n76M99m5m99
6379d72K09N39l38m13O15L10o44J1K00l42K62M73m61k24K42L07m63K54J88l40
6399h7J75L58n68J52p1o0j81L57p4k55j8M21k57l42M53j38O1K51l4l41k6M11J10
6422B97o29L80K17l52N8K59l52J45K90n13j75L96oj96J94K15n02l1P72j10n13
$$ y = [-29, 362, 47, -257, 214, 202, -322, 35, 310, -32, -250, 167, 61, -519, -152, -337, -489, 366, 214, -188, -153, -44, -64, -206, -41, 165, -227, -64, 218, -257, -201, 182, 148, -131, 33, 299, -120, 17, 457, -19, -293, 206, 159, -209, -27, 164, 55, -247, 415, 263, 213, -4, -123, 11, 204, 501, -268, 156, 149, -379, 43, 36, 43, -312, 180, -11, -201, -31, 188, -263, -47, -97, 4, -126, 294, -26, -84, -269, 155, -233, -106, 364, 63, -211, 11, 190, -337, -150, 163, 199, -180, 184, 45, 82, 91, -224, 65, -102, 160, -195, -158, 289, 20, -104, 149, 149, -427, 72, 27, -472, -263, 276, -62, -475, 140, 450, -194, -183, 17, -325, -63, 410, -51, -275, -33, 274, -189, 65, 253, -87, 88, 446, -122, 30, -41, -101, -282, 75, 1, -254, -272, 149, -108, -450, 3, -135, -74, 177, 143, -198, -224, 187, 297, -332, 48, 265, -87, -29, 230, -122, 23, 313, -200, -375, 21, 15, -181, 13, 228, -274, -305, 467, 357, -156]
6443a56K83K02n00K1K25j38m41P18P4n71K85j34K1L30l60o7K5M49p6m35K18J77
6465A50k19j65J79k1K1K22j18J66j51J36j26o43M14K19n4k37M85o05L18N60p69
6486b38R4N51m83k00M90r9k19nm3N7MK15J25m37K18j32j60M11Q0m72J91n0j75
6509b77l3K23L95m58J14K03l33L40j34J16l52K85K21m68K92J42l17kK69l2j88
6530FJ02J43n26j61P30k33r3q6o0R%K52k54J07K67n37l4M92m16J12L82q8k94K41
6554F1K35k9m12L33j6m58J23J22j42M03k03l33K73M90l70Qj29J68M7n6J65j15
6576A65l16L70q3r1j28K74j73k11O57k80l08Q0J65k58J77j42J35Q9k52l7j65K57
6598g5o4j9L86m6l28K67j78k01J88K64k83j8%K27n57N33j9j37p7M5j08J03J63
$$ y = [-156, 127, 329, -171, -150, 75, -63, -504, 214, 288, -283, 2, -132, -111, 219, -141, -208, -183, 266, 190, -245, -27, 150, -69, -234, -55, -76, -55, 167, 49, 215, 64, 200, 74, -569, -155, 64, 10, -227, 258, -347, -29, 531, -238, -144, 407, -76, -276, 214, 115, -104, -109, -152, -95, -91, 124, 249, -188, 30, -102, -262, 149, 229, -243, -52, -102, -277, -310, -87, 308, -150, -36, 167, -166, 174, 40, 156, -196, 89, 310, -158, 134, 276, -41, -43, 226, 194, 6, 108, 251, -275, -436, 294, 61, -32, -118, -178, -169, -169, 83, -171, -64, 203, -334, -368, 124, -292, -180, 202, 114, -180, 61, 296, 267, -145, 188, 172, -286, -163, -41, -183, 220, 17, -316, -43, 447, 77, 85, -44, 124, 171, 115, 280, 165, -151, 219, 136, 45, -83, 191, 18, -193, 464, 184, -124, -44, 121, -137, 40, -102, 33, 122, -130, -167, -332, -75, -139, -158, 228, 182, -146, 121, -57, -258, -70, 194, -89, -107, -107, 120, -437, 96, 77, -60, -137, -92, -200, -97, 66]
6621F6m8Q4k12K49j28K7j79L24l84M56j89OrJ23k53K14j68J68l37M0M36m04J20
6644BK66l59o2J02L8Ml3l0n35M94J87J8j29j09L05j8j55J01j99j02j7J71l11M89
6668A18l5k8q5J9j78K66J0k66o1L90n1m8J82j07Mq9M6k09J89j49J87k48J94Qk17
6693a58j38M14j30o2K83k95K4K64J99l20j95K19k50j34L72k30k20M57L5l05J1
6714a59K54L0m44M36j18l00K58j17Q5kQJ52l3j9O8l37L67Q1l29R6o8o3k67M21
6738@K83l44J21L5n8J38J35k77O8j22Q9j26j01J28k73J62l8k5j36O08j55l06J25
6761f9K91j13l86J48J3J68r8q7J22k08K62j77J22L5j82NP7L37j51J42k77o1q0
6784a67K44k31J68J18m08M0K08J12k31J99j14J83k34L04k00j37J30L84l93j2K62
$$ y = [66, 18, 102, -110, 139, 11, 38, -141, 183, -201, 255, 66, 72, 63, 186, -67, 147, -21, 147, -190, -150, 286, -118, 2, 268, -91, -153, -51, -13, -9, -42, -72, -607, -113, 74, 92, -37, -146, 159, 141, -14, 87, -112, -214, -231, -60, -371, 118, 83, 55, -30, -11, -189, 77, 87, -179, -240, 150, 99, 51, 233, 126, 130, 41, 87, -122, 67, -82, 105, -143, 51, 59, -158, -296, 118, -12, -74, 209, -86, -62, 202, 401, 81, -114, 105, -145, -279, 93, -137, -357, 100, 135, -170, -159, 95, 125, -319, 117, -1, -301, -43, -160, -75, -77, -69, 83, 50, 31, 99, -238, 129, 210, -119, -23, -91, -154, -421, 0, 283, -61, 60, 95, 37, 175, 310, 33, 101, -21, 68, -58, -159, -31, -304, -142, -180, -205, -341, 267, 112, -194, -69, 222, 109, -277, -129, -116, 52, -46, -133, -11, -219, 43, -134, -12, 23, -159, -154, -77, 260, 109, 251, -26, -87, -167, 77, -154, 14, 132, -276, -236, -28, 84, -147, 52, -62, 121, -113, 191, -9, -146, -16, 368, -25, -37, 225]
6805B25l36N33k98l05N5L43K5o7n03N59k70Q3J36k71J09J23L17o74j01M09r4K27
6827B25k00pm90O20k15j4K2L7k04k24M79L33m81K10J43k70j2R7k96J34q6J6k7
6850b10J33K97k30j28K95o0o2J56k98J63p2M8k62r8L70j01j92Q5L52q01O70j6
6872C9l84M45j8p8k16N47k45m19M07N6j99k25K95o5j4L2P2l10Q9N90p50N42m8
6895A43k09l3j79M42j63j35m7o7K92Ll3l19L20K33m16q1J75J75m64K87L58m32
6917a50L0K19k21M14k09k16j74O16n10K30J79j45j09M2J06R8j42n5L12l85J79
6938A09p4j69K72j5J21j87J21l8n4p9K44l54P3K02K7l12J45N4j64O0J04k25M2
6961i7J25j69RK51p1k91N01q5j20n7K14l08k9Q2q8j60J35K53j1%m0O7l49L29j63
$$ y = [225, -111, 422, 124, -181, -126, 217, 242, 175, -328, 231, -39, 44, 180, -91, 18, 141, 458, -216, -317, 92, -2, 225, 25, 18, -472, 148, -67, -81, -59, -22, -226, -450, 29, 362, -119, 91, 234, -36, -48, 49, -247, -113, -199, -183, -210, -77, 220, -10, -138, 157, 97, 35, 191, -107, 56, -16, 32, -230, -328, 42, -59, -251, -166, 186, -615, 55, 39, -345, 100, 82, 4, -212, 335, 90, -329, 78, 134, -65, -290, 5, -60, -74, -42, 30, -280, -191, 399, -351, 191, 143, -66, -99, -278, 164, 1, -134, -181, -248, 44, 47, 14, -305, 15, 248, -168, -249, -74, 101, -363, -76, 282, -150, -120, 99, -122, 292, 83, -133, -307, 309, -201, 29, 208, 63, -46, -4, 102, 200, 58, 3, 315, -70, 109, 35, -134, 138, 123, 244, 57, 178, 140, 86, 7, 251, -103, -30, 172, 199, -113, 32, 86, -78, -18, 86, -139, -97, 28, -141, -132, 119, 48, -243, 258, 173, 53, -4, 210, -98, -127, -45, -133, -293, -158, 95, 84, 84, 44, 111, -238, 91, -72]
6986g2L6K40K5n65M09n4N8j10j17K76m27J82K91m21pJ07q8q4K86k1k43J01L93
7009A95k7k41K48l21J81j20J04l05L66J06l46J73k1J56n1j31q6mP8P6m3p4J85
7032I8n3m73N29J61o87O08j1l27K70m8Q6k99K63r8j30J03J17K3l54K53J52l29
7054a46P4r0p9K18j64m6o6K16RL4j22J59K11k67K28j13j47K05r7o5K69r0k20j46
7078b35L59%j15R4k8k42J82l9J25k90N14j70n78M30PJ09p7J36r3k06o5K4J65O0
7102F7K91o88J50J36q0J42j57O27p36J15L90l61O0r5n6m3M19m27M04j55j70J36
7124c1J17ll84M35k15Q2j06PK1k69L10J30k04j35K7J31K46k21P5n0R6L7m31L08
7148b7m2J40n14O69K4m78K51L04p24L46L50m13o5P9J80K5n6J71j95j93Q3L0J17
$$ y = [-72, -36, 204, 229, -336, 73, 19, 77, -33, -150, 126, -301, -119, 172, -249, -256, -149, -237, -321, -35, -56, -299, -198, 195, 168, -73, 175, -146, 35, -85, 19, -286, 80, 186, -160, 13, -8, 148, 97, -34, -120, -124, -46, 30, -13, -87, 98, 45, -428, 101, 262, -425, 183, 172, -155, 115, 67, 153, -146, 117, 19, -111, -8, 109, 132, -222, 31, 183, -146, -72, -162, -241, -23, -187, -233, -299, -83, -74, -40, -162, -3, 208, -59, 169, 56, -91, 114, 17, -48, 221, 131, -89, -235, 124, 124, 9, 103, 75, -167, 15, -24, 101, -189, 325, 155, -423, 7, 14, 123, 46, 182, 89, -117, -182, -158, 7, 67, 358, -330, -180, -44, -124, 18, -139, 488, -248, -133, 257, -104, -44, -139, -195, -238, 181, -246, 158, 3, -167, -31, 86, 83, -301, 134, -81, 1, -105, -98, -77, -346, -36, 94, -110, -245, -218, -87, 159, -62, 13, -37, 59, 96, -335, -27, -69, 71, -443, 226, 250, -228, 23, 327, -397, -51, 299, -114, -179, -100, 80, 105, 49, 220, 25, -168, -85, -55, 62]
7171F2L6j22N8O0k7j8N0K29k54p7K64k4l84JM24l49k9J74O5n7q9K75n02j35O29
7196B60l59k1L54l89L10M1l79L8J72J74l70J73K54l67K5R1K62l90l39J81J18L13
7218A52J35l86n2J24Q1n4j4j36R8K1Q6J83l62M34O8l92j10M07l11J12n0k44O4
7241a46J04J08k02K51j29P6k69L14j91j19L21m55M65P1j60n5J36n1k98J48r3J82
7263Hnj58K29K27n4k47J59j79K03j14L9J19k13j96M2N04k22l72N95j65n56J13
7285b43K05o9J3J08P0j41Q0M3k85L47o01K88J77K6P1j54L82j97k16J40k46K39
7307C7k59M92k31k43M33l44M9j98N97n63L17K36k43M4k9j04J13q9j77K84l53L34
7329A03l0L4P4l3k18K90j97p6j24K53k04j18K38J31j00j32J46j38K08J69m07J26
$$ y = [62, 98, -24, 34, 94, 67, 49, 99, 328, 74, -3, 261, 237, -147, -146, 278, -71, -100, 74, 139, 82, -7, 268, -234, -369, 260, -99, -120, 234, -155, 155, 196, -183, -145, 27, 201, -169, 4, 258, -109, -84, 7, 269, -121, -460, -279, -161, 152, 287, -99, -151, -27, 54, 0, -14, -150, -52, -31, 55, 238, -124, 310, 378, -14, -124, 283, -28, 84, 34, -210, -146, -42, 66, -136, 115, -14, 62, -207, 107, -84, -203, 118, -337, 128, 199, 39, -16, 120, 69, -229, -81, -174, 8, 3, -155, 74, 301, 247, 0, 159, -20, 183, 69, 108, 227, 14, -182, -140, 364, 142, -230, 365, 200, -356, -243, -38, -107, -94, 14, 84, -57, 23, 66, -219, 128, -473, -185, -8, 18, 89, -65, 317, 120, -96, 44, -202, 37, -222, 270, 39, -204, 229, -115, -66, -264, 333, -230, 87, 323, 80, 124, 95, -9, 104, 15, -162, 122, -231, 103, 73, 107, 181, 148, -70, 220, 23, -53, -177, 76, -128, -246, -8, 123, 23, -109, 37, -101, 107, 276, -131, -5]
7351eJ3J75l21J1N7J0J9J68J44l77K20m40J75L34k48m3K88l67M24l2j42q2k60
7374b79M48J14j20l74L03j74k6M47n8m06pL31n5K4j42M3j4l82N44k86P7L90n55
7397a57P4m9J69k39J04L2k24K16K52k21r3N6J33J1k80L40N4L1j71k90N6J67mo
7421c9K16j36k12J03o2P9l64N44J9k37L47l85J13j7K81o06N05m40L55k89J29M9
7443d7j30P0J49n0m6J30L5K70o48L97j70m9K33j17J66j24j39P0o5O8L54o55K97
7466aN52o75K80m01L95o7Q6j32r6K37n42K80N4J0k18L39r5nN5J82k55l9j1o2j17
7491b46K84J50j61j47K95k77j5M27o1j95pQ0o7r7l2j18J78K78j97l61K19R1j70
7514a49K51P5k16p9L81k24r3K51j60N6J1L2k75LP0J13j01J66q9J67m10K20j82
$$ y = [-5, 8, 183, -138, -127, -70, -60, -41, 127, 271, -106, 114, -326, -151, 183, -65, -108, 180, -187, 237, 205, 63, -19, -279, 169, 283, 163, -211, 92, -82, -108, 339, 281, -125, -132, 199, 144, 168, 26, 69, 55, -327, 217, -69, 8, 398, -157, -83, -132, 37, -202, -98, -66, -290, -74, 178, -43, -136, -80, 53, 64, -216, 124, 178, 209, 38, -252, -196, -29, -33, -39, 177, 41, -171, -68, -130, -51, -415, 129, 148, -89, 258, -127, -14, -31, 250, -356, 149, -291, 64, -225, -96, -47, -177, -107, 42, -8, -54, 76, 111, 381, -267, 130, -40, -89, 144, 27, 193, 69, -70, 0, -65, 3, 357, -298, -1, 551, -124, 156, -245, 150, 83, 169, 37, -59, 178, -364, -84, -30, -20, -238, 101, 6, 1, 56, 238, -17, -56, -67, -129, -246, 38, 188, 27, -120, 175, -102, -117, 310, 249, 54, 47, 127, 60, -37, -69, -187, -9, 269, 72, -289, -70, 21, -149, 102, 177, -39, -118, 263, 39, -54, 197, 37, 93, 104, 136, -139, -136, -66, 47, -54, 112, 23, 190, -220, 0, -182]
7537a82K51j31J04o3L9J23k40J41n1J98j29L4P2l61O8M46l60J69J36k88j04L98
7559B70l50k2L83k14P1l50J44K2J70l0N0k04J52k6j62k09N59k77k54M05K3r7j05
7582e1J00q6R9j64K10n15L44K16j26j17K21k93N48l60K02n4j39O3j40n5J11o5
7604e1j39r3L81l5l7n1j19k96M79Q5k03JK90l60mJ80o5K61l2l16k0L3L60l97j30
7629b78P27n22j06K96l09j9L18J59l27O9L85l67k03J79N5K3J23j81k07K48J41
7650B04l00K1j01O7L43j40P0j89n5K49r9J9k19P4j01K95l41J55R5R0l3j77R3K95
7674C15j95k2k42J78j40J78j04j32J60J01j63K17kk60J68j51O4Rj38L96p4j76
7696a3l14K5M43k14K47m82M75o9m08N40j62k64j37O02l61K89j27K03j01j00p9
$$ y = [-182, 69, -62, 42, -21, 18, 141, -99, 42, -9, 189, 60, 94, 166, -195, -127, 319, -41, 128, 264, -24, -128, 270, -80, -102, 281, 67, 138, -212, -68, -46, 124, 94, 144, -60, 92, 66, -96, -305, 254, -23, -277, 128, 151, 54, -51, 49, -37, 62, -102, 108, -407, -63, 153, 27, -90, 131, -162, 386, 26, 228, 174, 35, 98, -42, -97, 14, -51, -190, -283, 98, 63, 26, -25, -144, -440, 39, 124, -79, -78, 212, -148, -152, 28, -37, 224, 192, -124, -144, -111, 249, -148, -278, 449, -73, -179, 117, -192, -211, 107, 266, -61, 8, 393, 26, -177, 2, 57, 80, 203, 22, -185, 63, 204, -96, -75, -176, -109, 234, 94, 164, -25, -80, 169, 70, 89, -130, -56, -157, 138, -203, -48, 47, 137, 104, -73, 20, 315, 120, 98, -144, 34, -106, 72, -32, -164, -4, 97, -66, 151, 149, -111, 57, -94, -30, -21, -159, 237, 163, -13, -327, -302, 141, -73, 174, -308, 167, 98, -310, 230, 68, -196, -333, 269, -92, 197, 70, 273, 172, 72, -7]
7717gl7R9j52O1K55o0J64k27l19K59J32j61K67j97k80L14j14n7K1L29k49j98K16
7740E9j42Q2LJ8K5n8k9K83m79L00N5j59J90k39J60n9m8j75L87K8k21j64K99k92
7764a76L60m16J79j50J74l5N3j3j53N07l56J2J40m16K44Kk52L15O1l9K13m01K25
7787G8M7k82K47j70L88l03j2l0Q3L5l93L36K2k89K81k16K94l18K35j62RpK06j67
7811h8P5J88j31j04J98J13k39K70l37k82M93Q1n8J09r4j58j12M13l42K00l89K39
7833D5l76K69M5k1j1NQ5L2k7J22%k15J44k03K7l0M27o47M04L3l55J84PJ15j41
7858h2j1L39k6m16n4R9q5N75k76j48L20M3o28J14K09K63j26k32M1j13q7J67j18
7881b32K46r4M1l2J66k29J22O0j13K49j14J53k27q5j27K04J09q8k7l4j80R1R4
$$ y = [-7, -44, 55, -97, -36, 219, 159, 323, 96, -223, 36, 168, 7, 274, 77, -203, 111, -3, -60, -39, 290, 41, -157, 59, -83, -1, 2, 20, 45, -13, -42, 241, -238, 62, 117, -42, 148, -91, 69, 10, -38, -213, 174, 202, -19, -183, 116, -176, 184, -232, -53, -203, -29, -64, -11, -24, -177, 330, -26, -14, 126, -290, -46, -44, -296, 19, 80, 41, 254, -147, 78, 125, -157, 90, -80, 308, 5, -7, -37, 46, 81, -312, 24, 46, -243, 38, -178, 116, -202, 33, -129, -120, -127, 79, -88, -13, 175, 44, -60, 138, 251, 12, 282, -55, -337, 156, 237, 179, 288, 194, 36, -76, 337, -5, 195, -194, 45, -331, -62, -17, -38, -49, -44, 41, 73, 46, 168, 168, -47, 97, -106, -79, -109, 318, -329, 75, 108, -247, -63, -56, 59, -82, -93, 246, 220, -196, -250, -151, -236, 339, 63, -85, 235, 278, -350, -236, -27, 236, 110, -122, -81, -194, -281, -114, -232, 14, -80, -39, -71, 95, -134, -12, 48, -65, 184, 70, 223, -4, -89, -216, -12, 97, 9, -18, -52, -232, -141, -47]
7904d7l6j10O2J59J81k03o0J96L1j6k26J05l54M07J19k01P7j54L93l70m1K61j37
7927C6o5J15j77J42J26J4l63P5L24l51J1K03j02P6j01n3K08L7k07K86k95L00n7
7950A82n4N5r5p4j99N9K0r1m2M48k44J06j59K9j98M25l01l0P8p0L63k54K07O2
7974B23m95J61K46j63J25k68K89j57K86k99J23K1N3l17n4K21J68k17K34ok90P06
7996E90m74j49J33k10J51q9q3M31k86P2m8P7l22J10K16j64j13L07l0j88K33k04
8018d0J28j93K48o4m60M99n9Lj19K84n02K14K51j66K11p2j68j94M0J73k67L2j58
8041c79K42L25J4r3m38L89j91J33k24K68K61j46M6k04k13K32J9l26L93j75k35
8062c02K67L88l72%l99L01K13K8k48J48jK88m45j97K88pK81j21mj40K7J85J20
$$ y = [-47, -83, -193, -131, 28, 209, 6, -54, 142, 173, 157, -69, 36, -318, 89, 208, 7, 84, -70, 323, -47, -88, 173, 36, -29, 86, -91, 51, 177, 191, -172, -97, 227, -124, -113, 90, -12, 64, -37, -90, 118, 155, -52, 234, -61, 239, 182, 128, 183, 88, 14, -185, -126, -106, -197, -239, 209, -35, 71, -88, -59, -257, 168, -133, -163, -85, -155, 208, -46, 161, 223, -272, -111, 135, -28, 97, -171, 118, -39, 247, -52, 71, 92, 145, -172, -226, -5, 163, -54, 180, 174, -116, 590, 116, -33, 100, -110, 41, -48, -131, 300, 14, 86, 38, 115, -207, -97, 119, -45, -158, 149, 119, -69, 164, -40, 88, -105, 143, 79, -381, 118, 59, 62, -57, 227, -275, -61, 190, 24, 235, 163, -5, -199, -159, 14, -253, -221, -379, -137, 188, 202, 109, -329, 60, -131, 2, -222, 46, 307, 161, 207, 3, -210, 22, 41, -285, 108, -67, -302, -35, 353, -19, -19, -418, -117, 96, 124, -124, 24, 23, 311, -134, -331, -43, -50, 231, 110, 106, -34, -7, 178, 298]
8085B98n90N60l26lQ2P0j45L72m09L17p2k94J17K0l67K41L03o8j30M36O0j41k44
8108H7k56K19k96p1J85j46L16j29j21J85j6M9j38K77k62N91n34j10J98p5k07M78
8130B24l52K33j29k71N70j28j0k15Q7M7JRL4q5N4l36K31Q7J2m8l7J5J31K36j93
8155A67j87J33k9M8j72J76j93K48r1Q8o3l29p6J19K0l22L12l12M56L9j13K70l68
8178a79j20K58j77j67M86j98J71j13k3K8p1j8L92
$$ y = [298, -292, 268, -58, -61, 21, 91, -54, 318, -91, 226, 154, -140, -23, -3, -370, -129, 174, 106, -24, 412, 472, 331, 87, -169, 50, -246, -317, -132, -278, 38, -91, -212, -27, -43, 6, -132, 145, -117, 474, -60, -170, 28, -47, -254, 224, -128, 105, -24, -295, 275, 147, 137, -78, 9, 56, 57, 66, 100, 15, 69, -267, -36, 51, 63, 15, -22, -7, 124, 360, 167, -20, 113, 84, 132, -40, 136, -57, 191, 100, 188, 125, -204, -280, -161, -141, -463, -151, -463, -7, 32, -81, 189, -179, -299, -41, -218, -385, 101, -97, 74, -39, -62, -34, -105, -123, 269]
8191B69
$$ Imaginary data points
##PAGE= N=2
##DATA TABLE= (X++(I..I)), XYDATA
0@%%%%%%%%oJ4j6J6j6J6k4L2l8M6n4O2p2Q6r8J12j30J48j67J91k18K46k76L09
32A63l48L89m32M81n36N97o62P35q15R00r94J100j221J357j506J678j877K106
50A115k380K709l113L626m300N226o582Q769j2864K3049r0768j69209K03249J16412
64G4939q2600j8768O8479p8962q7979J00060J48261k5069j25536m9692P3770O1316
76E8219k1575J775N4674o5301j25049P5277J69209n3721j39305L8669N4596p6483
88b9015N219J12941k4119j24708m361P0084J0840j6978j0614k2625p693P36m333
101d4626K7136J9022n7107l3561O1436J9069n8246R062M5858l4014k4863M8033
113b2801N53l8988L2491K7373l8648Q747M2544l2798k1397O4147J4161n7032J1782
$$ y = [0, 0, 0, 0, 0, 0, 0, 0, 0, -6, 8, -8, 8, -8, 8, -16, 16, -22, 24, -30, 32, -40, 46, -52, 60, -70, 78, -89, 102, -116, 130, -146, 163, -185, 204, -228, 253, -283, 314, -348, 387, -428, 472, -522, 578, -643, 714, -792, 886, -991, 1115, -1265, 1444, -1669, 1957, -2343, 2883, -3699, 5070, -7794, 15255, -75513, -244722, -41473, 74939, -7661, -26429, 42050, -36912, -124891, -24831, 123430, 98361, -27175, -76867, -3097, 58219, 36644, 38419, 93093, 27792, -97257, -21980, 147229, 93508, -45797, -7128, 47468, -29015, -23796, 89145, 65026, -59682, -64043, 6041, 16881, -97, -10711, -33336, -41029, -40293, -44626, -17490, 1532, -55575, -89136, -27700, -8631, -66877, -57815, -11957, -45971, -70834, -22801, -22248, -61236, -28745, -1372, -40020, -31273, 11271, -21527, -42924, 21223, 35384, -21648, -9866]
126i866M6026k3981j3449M7737R560l6312q382J6761K3578K0062k7415l1922L5737
139D8134J7183m9901J9762P0916n5855q5348P2953P1216q1786m0743P6581m932
151E8180q0105K5285O7410l3255n7555J4736L6677k067l4336j4706L8910J3320
163C2494o2063p987P9028j3189r2815L8173R1728o0686p3357P7210M3291q2199
175c0372o974Q4508j0878p3428J2865N6807O051k4930j3900J1711J7238j5271
187A3427o354N1369P172q2664p605R4078L970p2321K3430M3645n9782k2775Q1465
200F7055J8043o9942j3906L0687l826J293J7682j1669j7085m254j0698J7173L9928
213F0481k3001n2322J9540K8186k6837N503L8419l5027m6821L8779L2280k7820
$$ y = [-9866, 36160, 12179, -1270, 46467, 56027, 19715, 11333, 28094, 51672, 71734, 44319, 12397, 48134, 65317, 15416, 35178, 106094, 50239, -35109, 37844, 109060, 27274, -13469, 63112, 58180, -21925, 3360, 70770, 37515, -20040, -5304, 31373, 29306, -5030, -19736, 19174, 32494, -29569, -37556, 41472, 28283, -64532, -26359, 65369, 4683, -68674, 8536, 51827, -30372, -37346, 47162, 36284, -37144, -24279, 32528, 38579, 13649, -251, 11460, 28698, 13427, 7073, 58442, 65614, -17050, -24655, 69423, 73393, 1072, 24502, 68147, 8365, -14410, 67055, 85098, 15156, 1250, 31937, 28111, 29404, 47086, 35417, 18332, 14078, 3380, 20553, 60481, 37480, -14842, 4698, 32884, 6047, 11550, 49969, 14942, -31879, 6900, 39180, 11360]
225A1360j530J3032l0167j841M3225p948l2826J9666Q589l0968J6689L5950k7633
238A5598k5695K7877P281j6649J5113N255k3821M667J5385j1357R569J7907l4816
251F314j8697M8682R518m4135J4401L0643m3148j9622N9420J0957n2329k449K7192
264B6747j1613l111K2166n451j7618m39m691Q919K7874j4921l5115K2174K0269
277C5190l7025L791N4299j9989n6347K5705L6311k8722m694L4345j7522l5209
289i867J8434K1933n955K714m786k0652Q836J6484j4807N621K4561k9075l2925
302a9484L5123K3060l1602L481K6274l2865k5456L9079J6796k6200K348M002k7590
315a3034M514L4253n913j6601O867j3356j6534L2181J9343k9840n902J5028k0781
$$ y = [11360, 9830, 22862, -7305, -9146, 34079, 26131, -6695, 12971, 21560, -9408, 7281, 43231, 15598, -10097, 17780, 25061, 8412, 23525, 28780, 4959, 9626, 25011, 13654, 23223, 41130, 6314, -12383, 36299, 45817, 1682, 16083, 46726, 3578, -16044, 43376, 54333, 2004, -445, 26747, 15134, 12023, 34189, 28738, 11120, 10681, 5990, 14909, 42783, 27862, -7253, 14921, 35190, -1835, 1956, 56255, 36266, -20081, 5624, 41935, 13213, 8519, 42864, 25342, -9867, 8567, 30500, 24545, 27259, 22473, 1821, 10657, 27141, 12334, 17955, 42516, 13441, -19484, 15639, 38699, 7097, 10578, 36852, 3987, -21469, 17610, 34406, 8206, 10554, 14556, -13034, -8520, 25733, 19820, 3219, 10086, -3270, -19804, 12377, 31720, 1880, -4022, 11006, -9775]
328i775n925L9200J993l1533N437P908k1488J4483L5941j8971k9140J3900J969
341C999j1388K7507J6160l5471j2894K2233m185k319K7258o020l4688O121J7773
354A4086j1298J0029K1193k6154k4959K2618Q260j2209J9499P689l8739r200L0510
367A1325K2p659J8774j1793l5618J4122K9311j0485l471J1409k3822j7397K9645
380D363J2667j7545O797L830l0384O00L4860j565j5275J1287j0734k6338K4032
393c405L0249j8718j3239J0874j5565r571L4041J1363k8164j504Q981j7743O404
406e997L1942j0267k4789J0284l18j5393K2400K2054k6998j5035J6592p035o712
419i272K9127M136l4309k417J6861q424N618K3324j7174k7014J5825J0719j1755
$$ y = [-9775, -15700, 23500, 25493, -6040, -603, 7305, -14183, 300, 36241, 17270, -11870, 2030, 3999, -7389, 20118, 36278, 807, -12087, 10146, 5961, 3642, 30900, 24880, -9808, -3687, 14086, 2788, 12817, 34010, 7856, -17103, 5515, 13775, 1566, 21065, 28754, -9985, -19185, 11325, 11347, 3688, 22462, 10669, -24949, -10827, 18484, 7999, 4528, 15937, -7885, -25282, 4363, 17030, -515, 6282, 10112, -20272, -19672, 15188, 13623, -1652, 9635, -1099, -27437, -3405, 26844, 8126, -5113, 5761, -9804, -19375, 14666, 26029, -2135, -3639, 5342, -12401, -5997, 25945, 15678, -9111, 1173, 855, -14538, 7862, 29916, 2918, -12117, 4475, -2560, -9272, 19855, 23991, -10318, -12735, 4126, -4298, 1320, 24644, 7470, -19544, -3719, 7000, -4755]
432d755J3519J1606k8433j0854K3959j741r978K0433l12l2078L022K3966p325
445A029j793J5094j8183k2792K2073J4756j5955M745Q151k4954n297K9226j019
458E081j7741J1780K76k4770Q439K4633j2115r496J2757j1284j4717K3111J0520
471F474k0616K546J1054k1180j789L1370m341k5732J1723R578j8600P698K3338
484A1523j5175j4741J5668L26j1330J3820O432j6505M837J0332j6836J962K6360
497A6673j0432k3281J8774R407k4181P167K5722j8754j9728K1346O005j9078P324
510c036J2782j4412m230R156p063n68J3743j0858j3340J5549J322k0848J3993
523g810K0912k6483j5708K7940K383k4240J3101J5596k3850p416K3743k83j3780
$$ y = [-4755, 8764, 20370, -8063, -18917, 5042, 3301, -6677, 13756, 13444, -18634, -15612, 8354, 1029, -764, 14330, -3853, -26645, -4572, 10184, -5771, -1026, 7125, -17829, -23126, 6100, 5081, -12660, -880, -604, -25374, -16935, 7698, -4417, -13913, -1156, -12440, -27157, -4046, 6474, -14142, -11596, -542, -21722, -23511, 7859, 3518, -22214, -10491, -913, -19513, -11815, 11523, -3652, -18393, -2725, -2399, -13729, 91, 6523, -9982, -5145, 5187, -11649, -9687, 16673, 6241, -17040, 1734, 11141, -13040, -5873, 19849, 1095, -18633, 2713, 8718, -10360, -3036, 9746, -4666, -8896, 260, -6803, -7371, 6372, -4486, -17826, -2277, -955, -21803, -7810, 13102, -13381, -29089, -1149, 1234, -23006, -9905, 5691, -18159, -25575, -1832, -2115, -15895]
536a5895P673J006r133J0144M567j2713O727J1648j7407l489K5017n011k1401
549a8267J6613J2010k1892K402K5037j3005j8664J8520P274j5211P792P720j8683
562h354R20K1148p722j2670J2348k659j6698J4078J4815j8237q086J1059o649
575f707l589J6526l899j8149Q072M422j5670J1172J9909k4647j8788K6147M634
588e67k4100J3646K1868k6951k0028K5575J3253j4499r10L846p136o63M536K455
602i675J1193l161k4778O256L0055j2941k3079K9822J5004m3635q005M7429J211
615A5696l5214J1867K1416k3768j4320K7392J5885j5119j6335k481J2057R207
627F283r863K52J8734j6876l5528K5366M4560k5259l3945K5104P761l5158J2098
$$ y = [-15895, -8222, -7216, -16349, -6205, -1638, -14351, -7624, 4024, -13383, -16872, 8145, 3134, -18267, -1654, 10356, -11536, -9134, 15903, 2898, -15766, 2754, 10028, -5183, 2609, 10329, -8354, -7434, 13714, 5992, -6678, 5670, 3011, -13687, 391, 15206, -3031, -11117, -58, -6707, -10296, 6230, 2331, -15818, -7746, -3324, -18994, -7822, 12087, -12560, -31348, -5201, -567, -24667, -11021, 10847, -16104, -36132, -10557, 2696, -11803, -12713, -8867, -16003, -16666, -12130, -9675, 1518, -1643, -26421, -20165, 9890, -3051, -26130, 3692, 18696, -24939, -32944, 14485, 15696, -19518, -7651, 13765, -10003, -24323, 3069, 18954, 3835, -12500, -14981, -2924, 6283, -3580, -3328, 15406, -1470, -36998, -11632, 32928, 7669, -26276, -1172, 6589, -28569, -16471]
640a6471M6225j4548m3327L442K0994K518M435M296j1858j3262m766Q947K8387
653A5012P796l7641j9275K8345R555j3842J7972J0998l9178j6240L7996J5885
665A7383j7974j3j406k0521O145K7752J10j2242k341j1782m914K5913J3071k1960
679b779r528P101m747L346J7693m610j7145K304K644j506J5160K001k6400J542
693a4924K6716j1116j9672K3622R034l2211K212L5514j0709l1018J3889K2400
705A3737j2157j1251Q790M620o721p062O044J9728k738l4317L91L8929l746l2962
719a8715J8407K1775l9723j7041N5024J5081n1633j1504L4656j845j9511J5718
731F89J6247k0317k4250P737K9626R013k8617j4650K4464K561k8383J6777L9150
$$ y = [-16471, 29754, 15206, -28121, -24679, -3685, -1167, 3268, 7564, -4294, -17556, -22322, -13375, 15012, 22808, -14833, -34108, -5763, 3792, -10050, 7922, 18920, -20258, -36498, 1498, 17383, -591, -604, -2010, -22531, -16386, 11366, 11476, -766, -3107, -14889, -19803, 6110, 19181, -2779, -12307, -5206, -9953, -6607, 11086, 6476, -10669, -8365, -5721, -7227, 7933, 9934, -16466, -14924, 11792, 676, -18996, 4626, 13660, -18551, -16339, 19175, 8466, -22552, -8663, 13737, 1580, -9671, -881, 3739, -2982, -10044, -4000, 15728, 12990, -21327, -20936, 17993, 14247, -18715, -308, 21467, -18256, -35297, 19727, 34808, -16825, -28329, 6327, 4482, -15029, 689, 16936, -3381, -27631, -19894, 9732, 18745, -9872, -24522, -58, 2503, -25880, -9103, 30047]
744C0047k9486m5238L1621L6451l1123j4613L4558k767l8096R155L4460k265k0662
757g958j905Q110M026n270k504J4440O922k4208q028K9324L767k6804J0972K6027
771B6911k3645k4655K7707J7554j9144k255J0768j3877q144J8766P294q217k186
784F877q354j0279J5066J5471j0430q639J822j0769r00K1939N323j7714o255j426
798h268m839J6814J6279j9947j7106J2959q14q686K4787J3098l7839j8317L2630
811G51J3921j5842K330O270j8287p148K1612J5478o359j7861r961J4497J8007
824A7408j0566p795J7216q182l0977K0921M2297k2923l8441K1748K2023k4529
836a800j258L0656r071l4928N035K8477M466j6274j0220L849Q086o799l516J9416
$$ y = [30047, 561, -44677, -13056, 23395, -7728, -22341, 12217, 9450, -28646, -19491, 14969, 12704, -7958, -9863, -1753, 2273, -2997, -5501, 8939, 15861, -8347, -16375, 12949, 16716, -10088, 884, 26911, 3266, -21389, 6318, 23872, 4728, 2473, 13241, -636, -8780, 9986, 17280, 9063, 6877, -1477, -11756, 3310, 18781, 8351, -288, 1534, -9235, -10135, 11804, 17127, -587, -6842, -8268, -13107, 3707, 19986, 39, -17067, -4108, -4922, -13608, 11179, 24277, -13562, -31879, 751, 14672, -1170, 1160, 7430, -10857, -18005, 3607, 19085, 12726, -5135, -15096, -599, 17408, 6842, -953, 16263, 8081, -22896, -1975, 40322, 17399, -21042, 706, 22729, -1800, -3058, 27598, 18527, -16401, -11366, 17111, 21577, 5303, -4917, -1068, 7018, 219, -3297, 16119]
850A6119K22l6081l003M2018J363l7922O575K4809k1869j5076L2313J0250l3154
863a3436q266K1798L703q263J787J158k835l980k691J1168J4020j5473j9236J7725
877b821J5483j8074j097K0493j0923k1754J8315J8291j6765o565J3697m639q253
890d612J0818L480q418L917J803r313M582R460q555l578J1462n304j1340R596
904C998O659r591K151N989j2656k561J5813l695j1032J0787J142j9128O093K0532
918A4501j0665j2912J2767L20j7092P890J7752q156j1313K077K48K329Q786l154
932C378o471L779m400p845J7161J1852k1725r045K0371k145j7165J6368J5208
945A9321k1590j2224J8556M282j0927N353N598r302l740L766K260O494N34j3608
$$ y = [16119, 16341, -19740, -22743, 19275, 20638, -17284, -10709, 14100, -7769, -22845, 9468, 19718, -13436, -21702, 96, 3799, -4464, -2677, -1519, -4354, -8334, -11025, 143, 14163, -1310, -20546, -2821, 12662, -5412, -6509, 13984, 3061, -18693, -378, 17913, 1148, -5417, 8280, 3641, -4612, 6206, 9686, 1268, 5185, 6988, -2325, 2257, 11717, 3162, -416, 11046, 5742, -5598, 3998, 10657, 1066, 3217, 9206, -3450, -6011, 9802, 6107, -4925, 5862, 7004, -12124, -6031, 14501, 3836, -9076, 3691, 4011, -13081, -5191, 12561, 4405, -6908, -4831, -4583, -2254, 6532, 3378, -3093, 686, -3714, -11559, 5602, 17454, -4271, -13316, 7055, 4910, -12255, 4113, 19321, -2269, -14493, 4063, 8345, -2582, 2771, 8369, -933, -4673, -907, 1353, 7847, 8381, -5227]
959e227o09J3286o912q362J7124L421k4524M80K1687o943j3143J4638N262j9329
973i151j224J3881j031l250M386o599p115P623K627j919P726l340j7272N178J7024
988G544p129p219J1992m580j7978J0310J7272q782o933P440p323p609J4037Q209
1002I251j0818j348J510j0092M923J6189m539j1599M914j783p526J2684J1235
1015A3001j4241q027Q252l509j832J4299K69j6472J672Q506p086K808J4222q487
1029C375j5153Q073N731o535P367Q134j4742q177J2118K456k898P247k979j3768
1043i751M817J0372n866J143R089j0981j1758J3562P671r785L377O714j4558n339
1057a1293J6106K757q744M113o68j2176N732J2688n090m149M980q158o550J4883
$$ y = [-5227, -5836, 7450, 538, -7824, 9300, 12721, -11803, -11323, 10364, 3421, -9722, 4916, 10178, -9151, -10375, 3506, 2475, -775, 3611, -2988, -10103, -2480, 147, -1772, 5954, 2614, -14658, -9480, 7544, 415, -6804, 5188, 608, -17370, -7060, 10212, 1430, -5503, 1937, -5386, -12995, 1042, 9251, -1567, -2915, -1405, -11497, -6574, 9615, 5076, -6523, -1609, -3392, -10918, 1766, 13001, -1240, -9267, -1015, -4524, -6356, 7943, 8212, -8260, -6588, 1918, -5168, -2360, 11862, 3375, -11778, -3705, 2026, -4509, 2858, 10992, -3750, -11927, 191, 2647, -251, 6996, 4017, -9751, -4934, 5438, -428, 715, 9804, -1177, -12935, 627, 8298, -1487, 1890, 8604, -5954, -11293, 4813, 7570, -1174, 2939, 2271, -9905, -4173, 8515, 3425, -724, 4256, -3902, -10452, 4431]
1071D431N722j3211Q92O839j1135j569J6349j400j2477N454K242j0426N631J2873
1085A0215p887p891O249k561n265J2433M370j4268l48Q156o924o92J2907m267
1099D227j2617O446N196q877M360J0690j0237p981R896j19o790R040L734j3583
1113f615n87J0809n341k122R929l894j2338P836P403q407J711P685r549n579J1950
1128B891M91r336P427M186j2248J350J1572o194m876R997l160j1097Q702P975
1142G680j0078j82P722o680m569J1616l44j0592N518N510r110J096R547p212n403
1157e481J0546j517j0521Q530O498j1920l27J2171o811p627J0254J736j1144M949
1171f64P554q466j451Q482m733m642R142j128q997O785M014r870L082J1400r387
$$ y = [4431, 10153, -3058, -2166, 4673, -6462, -8031, 8318, 6918, -5559, -105, 2137, -8289, -2658, 10215, 2328, -5563, 686, -1875, -7140, 5293, 9663, -4605, -4953, 3203, -3721, -4413, 8494, 4227, -8390, -1944, 3252, -5625, -1265, 9425, -812, -8793, 1103, 984, -5806, 3234, 6968, -6615, -7202, 3607, -1734, -3856, 6073, 2179, -10159, -2323, 5080, -3327, -1616, 6069, -3480, -9059, 2891, 3382, -5954, 1473, 5659, -6589, -5239, 6333, 139, -4737, 5260, 2100, -8997, -295, 7680, -2398, -2580, 5142, -1538, -6107, 5509, 5165, -5427, 91, 5601, -3509, -2413, 7134, -78, -5481, 5065, 3548, -6973, 1557, 8055, -3865, -4192, 7979, 1168, -6459, 3795, 5531, -5613, -664, 6890, -1576, -3027, 5455, 722, -3920, 5222, 4094, -4903, 1882, 5896, -3974, -892, 10508, 1121]
1186A121r213J3384K771j2063N077Q993j0771l680J0889j113p315O290J633q175
1200b172L523N201n972J940O969r432n957J3133J132j1922O118O943j3157k194
1214e847J5037k443j0517O464K306j0001L755R239o846l201N572n126m819J1188
1228D761J705j0385L491M519j0164Q94J4059m483j0740N670J618p244P970Q187
1242I858j1732m860R312k790m746J1957J216j4983K034J0417o141k433J1477l368
1256E218j2103M586P071l088K382J866r091l61Q491l282k635J0518m880j5089
1270a0397R680J3051j2456n653J4957l426j6091R086J2400r623n936P899o01n889
1284b999K499J944R51L245o633o406R959M592j2570L415J4875j3134j4630J7705
$$ y = [1121, -8092, 5292, 8063, -4000, 1077, 10070, -701, -4381, 6508, 5395, -1920, 4370, 6003, -2172, 1351, 6552, 580, 2520, 9489, 57, -5900, 7233, 8365, -3557, 2561, 9504, -3653, -5847, 9190, 6747, -3770, 2694, 5000, -5001, -1246, 7993, 1147, -2054, 3518, -1608, -6427, 4761, 6466, -3919, -428, 4091, -6073, -5179, 8880, 4397, -6343, -673, 945, -6299, 1671, 9858, -1874, -6734, 2578, -212, -4958, 6999, 8215, -6768, -4734, 5683, -458, -2891, 8586, 5218, -6885, -2299, 4772, 1684, 4066, 5932, -3159, -3520, 4971, 1689, -946, 9572, 4692, -10397, -717, 12334, -122, -5775, 9182, 5756, -10335, -1249, 11151, 1528, -4408, 3491, 2890, -2999, -500, 1444, 2395, 5640, -993, -7399, 2560, 7152, -5418, -2003, 12872, -262, -14892, 2813]
1298B813J1061j7209k179J5662p322j4314J1261J1922o832n971Q5j251L679M331
1312E736k283J728J024j3296j609K1066K581j9223J860J1034j2270l727K1128
1325A3749K411k1321j756J1008k377N84Q189n450j0280K414K959K091Q863k682
1339H402j4814M87J0435l637M20R742q529j4656Q842J1209n893OM625j1483m861
1354i705J3732K992r731N222K160j3555P50J6278j912j0420N101R12q481K888
1368c769J0091k235m159j710m497L743R014n268n317R758l317j6706J0380J9978
1382A5986j3404j5157J4376N104j7935M867K0404p468j7553M352Q941p23q44L98
1396A344M2j578p699K42J7740L508k2944l705K1479l317j6563J4888J3083k4004
$$ y = [2813, 13874, -3335, -5514, 10148, 2826, -11488, -227, 11695, 4863, -1108, -1023, -2274, 1405, 5736, 3453, 5181, 6205, -7091, -8700, 12366, 14947, -4276, -2416, 8618, -3652, -7379, 13749, 16160, -5161, -6917, 4091, 1714, 2298, 10487, 5037, -5243, -2829, 130, 2221, 11084, 8402, -6412, -5925, 4510, 873, 1293, 11035, 2506, -12150, -3308, 7901, 2008, 2014, 6639, -4844, -9705, 4027, 7019, -2712, 2510, 4670, -8885, -8135, 8143, 6231, -4189, 912, 1824, -6657, -3769, 6322, 4087, -72, -1782, -6279, -2536, 6478, 1210, -4107, 5651, 2334, -14372, -3992, 15986, 2582, -12575, 1801, 6905, -11030, -6163, 14241, 6773, -10780, -6428, 2513, 1790, 946, 1344, 1386, -192, -7891, -7649, 10091, 13599, -9345, -13050, 8429, 5112, -11451, 3437, 16520, -7484]
1410g484j1167K4522P719j8229p77J0817n935p284P202P938k022r064o326R665
1424d25J1012j0272r247J3249J596j7526O849K0668j2653j9174J4664J2205j3235
1437b289l255J1653m402r914P854O270m045k316k789j187P749L215r666J24O682
1452C684p017k711J4010j53j5218K253R470n753J09R612o685j1341Q228O784o684
1467a412L143M970j3422l889J5556L016j0979N97L876o737R68Q986r56n836p98
1482b917k950K750R066m600r604Q262L944j3712L671J8002j0153j8167J3470J2918
1496I980j5492m626J5348k030j3706M379J0501k867o093j049L263N158l358p764
1510h356P389P213j4065l184J9443j150k2799O707K0718j1696j4665J5029P107
$$ y = [-7484, -18651, 5871, 13590, -4639, -5416, 5401, -534, -7818, -616, 7322, 5300, -3764, -10090, -425, 10587, 315, -8932, 4317, 5913, -11613, -4764, 15904, 3251, -15923, -1259, 10946, -2289, -5544, 6109, 1707, -8207, -353, 5917, 1872, -444, -3233, -4420, 3329, 6544, -3122, -2998, 3684, -3333, -6044, 7966, 7813, -7405, -5152, 4318, -1435, -1326, 8286, 1601, -9740, -1512, 5272, -1412, 1731, 6701, -6721, -10610, 4946, 7962, -3017, -2420, 1456, -5281, -4313, 4673, 3717, -2119, -2917, -5867, -3117, 5949, 1349, -8255, 7, 3951, -9761, -6090, 11912, 1759, -16408, -2938, 9980, -5512, -10138, 5210, 3180, -10526, -6147, 4354, 1487, -4606, -5655, -2392, 2766, -592, -8356, -967, 6246, -7819, -11003, 8440, 7290, -15509, -8802, 11916, 220, -14445, 584, 7691]
1523G691j6256j685J4431r77r597R59L999J638j433m324K622O808p591q491J3143
1538I37P748j6494l773J7624l155j5772R851J2612j3673o557J2415Q04q819L811
1552b441M242l747j32J348k897L165L666o380l21P678n707p016J1521N006j2413
1567d428j118Q842n000l211J0853j032j2177K840P308o125K326P855p885r013
1581i965Q704M711o139L616L102j0143l171R702K105k680J526n951n602R088N304
$$ y = [7691, -8565, -10250, 4181, 3204, -6393, -5434, -1435, 203, -1230, -5554, -2932, 3876, -3715, -12206, 937, 8685, -7809, -11582, 6042, 2887, -12885, -3034, 9578, -4095, -10652, 1763, 2567, -6252, -2441, 1801, -1946, -2078, -730, -3627, -462, 3204, -3176, -3497, 4181, -1526, -8542, 2979, 7985, -4428, -5546, 3296, -1704, -4915, 5938, 4906, -7271, -4431, 2877, -3248, -922, 6933, -952, -9965, -1261, 3450, -2689, 927, 4029, -6114, -9285, 417, 2522, -158, 1368, -4583, -10185, -1097, 4207]
$$ [...]
8191a79
##END NTUPLES=NMR FID
##END=
