##TITLE=1H_ANY-165B-2
 CDCl3,8 sc, 
 11.4.2019
##JCAMPDX= 6.0         $$ Bruker NMR JCAMP-DX V2.0
##DATA TYPE= NMR FID
##DATA CLASS= NTUPLES
##ORIGIN= UXNMR, Bruker Analytische Messtechnik GmbH
##OWNER= root
$$ XWIN-NMR		Version 3.5
$$ Thu Apr 11 15:46:51 2019 Russian Standard Time (UT+4h)  she@DPX200
##.OBSERVE FREQUENCY= 200.1315
##.OBSERVE NUCLEUS= ^1H
##.DELAY= (6, 6)
##.ACQUISITION MODE= SIMULTANEOUS
##.ACQUISITION SCHEME= undefined
##.AVERAGES= 8
##.DIGITISER RES= 18
##SPECTROMETER/DATA SYSTEM= spect
##.PULSE SEQUENCE= zg30
##.SOLVENT NAME= CDCl3
##.SHIFT REFERENCE= (INTERNAL, CDCl3, 0, 15.7039)
##AUDIT TRAIL= $$ (NUMBER, WHEN, WHO, WHERE, WHAT)
$$ ##TITLE= Audit trail, XWIN-NMR		Version 3.5
$$ ##JCAMPDX= 5.01
$$ ##ORIGIN= Bruker BioSpin GmbH
$$ ##OWNER= she
$$ F:/spectra/data/she/nmr/H-F/1/audita.txt
$$ ##AUDIT TRAIL=  $$ (NUMBER, WHEN, WHO, WHERE, WHAT)
(   1,<2019-04-11 15:45:50.07 +0400>,<she>,<DPX200>,
      <created by zg, POWCHK disabled, PULCHK disabled
       configuration hash MD5:
       00 E9 B6 7A A2 85 ED C7 34 08 36 98 17 FE 4E 26
       data hash MD5: 16K
       14 5F 28 CF 71 AF A9 DE FE 3E 27 A6 9F 6D F4 FE>)
$$ ##END=
$$ 
$$ hash MD5
$$ 79 92 20 B7 1D 84 4C E2 91 03 CB 58 80 83 18 CA
##$RELAX= 
##$RELAX= 
##$RELAX= 
##$RELAX= 
##$RELAX= 
##$RELAX= 
$$ Bruker specific parameters
$$ --------------------------
##$DU= <F:/spectra>
##$EXPNO= 1
##$NAME= <H-F>
##$PROCNO= 1
##$TYPE= <nmr>
##$USER= <she>
##$AMP= (0..31)
100 100 100 100 100 100 100 100 100 100 100 100 100 100 100 100 100 100 
100 100 100 100 100 100 100 100 100 100 100 100 100 100 
##$AQSEQ= 0
##$AQ_mod= 1
##$AUNM= <au_zg>
##$AUTOPOS= <>
##$BF1= 200.13
##$BF2= 200.13
##$BF3= 200.13
##$BF4= 200.13
##$BF5= 200.13
##$BF6= 200.13
##$BF7= 200.13
##$BF8= 200.13
##$BYTORDA= 1
##$CFDGTYP= 0
##$CFRGTYP= 5
##$CHEMSTR= <none>
##$CNST= (0..31)
1 1 145 1 1 1 1 1 1 1 1 1 1 1 1 1 1 1 1 1 1 1 1 1 1 1 1 1 1 1 1 1 
##$CPDPRG= <>
##$CPDPRG1= <>
##$CPDPRG2= <>
##$CPDPRG3= <>
##$CPDPRG4= <mlev>
##$CPDPRG5= <mlev>
##$CPDPRG6= <mlev>
##$CPDPRG7= <mlev>
##$CPDPRG8= <mlev>
##$CPDPRGB= <>
##$CPDPRGT= <>
##$D= (0..31)
0 1.2 0 0 0 0 0 0 0 0 0 0.03 0 0 0 0 0 0 0 0 0 0 0 0 0 0 0 0 0 0 0 0 
##$DATE= 1554983149
##$DBL= (0..7)
120 120 120 120 120 120 120 120 
##$DBP= (0..7)
150 150 150 150 150 150 150 150 
##$DBP07= 0
##$DBPNAM0= <>
##$DBPNAM1= <>
##$DBPNAM2= <>
##$DBPNAM3= <>
##$DBPNAM4= <>
##$DBPNAM5= <>
##$DBPNAM6= <>
##$DBPNAM7= <>
##$DBPOAL= (0..7)
0.5 0.5 0.5 0.5 0.5 0.5 0.5 0.5 
##$DBPOFFS= (0..7)
0 0 0 0 0 0 0 0 
##$DE= 6
##$DECBNUC= <off>
##$DECIM= 24
##$DECNUC= <off>
##$DECSTAT= 4
##$DIGMOD= 1
##$DIGTYP= 9
##$DL= (0..7)
0 120 120 120 120 120 120 120 
##$DP= (0..7)
150 150 150 150 150 150 150 150 
##$DP07= 0
##$DPNAME0= <>
##$DPNAME1= <>
##$DPNAME2= <>
##$DPNAME3= <>
##$DPNAME4= <>
##$DPNAME5= <>
##$DPNAME6= <>
##$DPNAME7= <>
##$DPOAL= (0..7)
0.5 0.5 0.5 0.5 0.5 0.5 0.5 0.5 
##$DPOFFS= (0..7)
0 0 0 0 0 0 0 0 
##$DQDMODE= 0
##$DR= 18
##$DS= 0
##$DSLIST= <SSSSSSSSSSSSSSS>
##$DSPFIRM= 0
$$ [...]
##$SUBNAM2= <"">
##$SUBNAM3= <"">
##$SUBNAM4= <"">
##$SUBNAM5= <"">
##$SUBNAM6= <"">
##$SUBNAM7= <"">
##$SUBNAM8= <"">
##$SUBNAM9= <"">
##$SW= 24.9337058887773
##$SWIBOX= (0..15)
0 0 2 0 0 0 0 0 0 0 0 0 0 0 0 0 
##$SW_h= 4990.01996007984
##$TD= 16384
##$TD0= 1
##$TE= 0
##$TE2= 300
##$TE3= 300
##$TEG= 300
##$TL= (0..7)
0 120 120 120 120 120 120 120 
##$TP= (0..7)
150 150 150 150 150 150 150 150 
##$TP07= 0
##$TPNAME0= <>
##$TPNAME1= <>
##$TPNAME2= <>
##$TPNAME3= <>
##$TPNAME4= <>
##$TPNAME5= <>
##$TPNAME6= <>
##$TPNAME7= <>
##$TPOAL= (0..7)
0.5 0.5 0.5 0.5 0.5 0.5 0.5 0.5 
##$TPOFFS= (0..7)
0 0 0 0 0 0 0 0 
##$TUNHIN= 0
##$TUNHOUT= 0
##$TUNXOUT= 0
##$USERA1= <user>
##$USERA2= <user>
##$USERA3= <user>
##$USERA4= <user>
##$USERA5= <user>
##$V9= 5
##$VALIST= <valist>
##$VCLIST= <CCCCCCCCCCCCCCC>
##$VD= 0
##$VDLIST= <DDDDDDDDDDDDDDD>
##$VPLIST= <PPPPPPPPPPPPPPP>
##$VTLIST= <TTTTTTTTTTTTTTT>
##$WBST= 1024
##$WBSW= 4
##$XGAIN= (0..3)
0 0 0 0 
##$XL= 0
##$YL= 0
##$YMAX_a= 710687
##$YMIN_a= -707337
##$ZGOPTNS= <>
##$ZL1= 120
##$ZL2= 120
##$ZL3= 120
##$ZL4= 120
##$ABSF1= 10
##$ABSF2= 0
##$ABSG= 5
##$ABSL= 3
##$ALPHA= 0
##$AQORDER= 0
##$ASSFAC= 0
##$ASSFACI= 0
##$ASSFACX= 0
##$ASSWID= 0
##$AUNMP= <proc_1d>
##$AZFE= 0.1
##$AZFW= 0.1
##$BCFW= 1
##$BC_mod= 2
##$BYTORDP= 1
##$COROFFS= 0
##$CY= 11.3945322036743
##$DATMOD= 1
##$DC= 2
##$DFILT= <>
##$DTYPP= 0
##$F1P= 18.9103706918063
##$F2P= -1.10871071338519
##$FCOR= 0.5
##$FTSIZE= 0
##$FT_mod= 4
##$GAMMA= 1
##$GB= 0.15
##$INTBC= 1
##$INTSCL= 1
##$ISEN= 128
##$LB= 0.24
##$LEV0= 0
##$LPBIN= 0
##$MAXI= 10000
##$MC2= 0
##$MEAN= 0
##$ME_mod= 0
##$MI= 1.114404
##$NCOEF= 0
##$NC_proc= 0
##$NLEV= 6
##$NOISF1= 3.799351
##$NOISF2= 2.8
##$NSP= 1
##$NTH_PI= 0
##$NZP= 0
##$OFFSET= 15.70392
##$PC= 1
##$PHC0= -8854.416
##$PHC1= 17.60026
##$PH_mod= 1
##$PKNL= yes
##$PPARMOD= 0
##$PSCAL= 0
##$PSIGN= 0
##$REVERSE= no
##$SF= 200.130013532006
##$SI= 16384
##$SIGF1= 3
##$SIGF2= 2
##$SINO= 400
##$SIOLD= 16384
##$SREGLST= <1H.CDCl3>
##$SSB= 0
##$STSI= 0
##$STSR= 0
##$SW_p= 3612.71676300578
##$SYMM= 0
##$S_DEV= 0
##$TDeff= 0
##$TDoff= 0
##$TI= <>
##$TILT= no
##$TM1= 0
##$TM2= 0
##$TOPLEV= 0
##$USERP1= <user>
##$USERP2= <user>
##$USERP3= <user>
##$USERP4= <user>
##$USERP5= <user>
##$WDW= 1
##$XDIM= 8192
##$YMAX_p= 0
##$YMIN_p= 0
$$ End of Bruker specific parameters
$$ ---------------------------------
##NTUPLES= NMR FID
##VAR_NAME=  TIME,          FID/REAL,        FID/IMAG
##SYMBOL=    X,             R,               I
##VAR_TYPE=  INDEPENDENT,   DEPENDENT,       DEPENDENT
##VAR_FORM=  AFFN,          ASDF,            ASDF
##VAR_DIM=   8192,          8192,            8192
##UNITS=     SECONDS,       ARBITRARY UNITS, ARBITRARY UNITS
##FACTOR=    0.0002004,     1,               1
##FIRST=     0,             0,               0
##LAST=      1.6414764,     0,               0
##MIN=       0,             -707337,         0
##MAX=       1.6414764,     710687,          0
$$ Real data points
##PAGE= N=1
##DATA TABLE= (X++(R..R)), XYDATA
$$ plain form
0 0 0 0 0 -8 8 -8 16 -18 25 -32 48 -54 66 -81 104 -121 146 -174 209 -243 286 -333 387 -443 514 -586
26 -586 668 -760 863 -972 1096 -1233 1381 -1543 1728 -1923 2138 -2375 2638 -2923 3238 -3584
42 -3584 3967 -4393 4869 -5399 6000 -6683 7466 -8374 9450 -10737 12319 -14308 16909
55 16909 -20465 25648 -33949 49460 -88577 397301 609378 10426 225018 534093 710687
66 710687 539000 360649 208113 274499 362370 398904 336552 338172 335469 314288 214627 188478
78 188478 330601 515205 397612 117644 84028 332578 457839 354402 196563 147278
88 147278 230350 346409 270844 63148 35213 225149 302160 146234 -45758 -63989 119947
99 119947 323819 279415 36696 -59795 99500 263031 262111 164850 91085 87350 91714 37292
$$ packed form
0@%%%qJ6j6K4l4M3n7Q0j02J20j47J85k25K67l20L83m52N29o19P20q30R57j100
26e86J254j428J623j835K068k329K614k924L271l651M061m513N013n561O161o822
42c584P551q360R262j0268J1399j2683J4149j5840J7824k0187K3056k6627L1217
55A6909l7374M6113n9597Q3409j38037M85878K12077n98952K14592L09075J76594
66G10687j71687j78351j52536O6386Q7871L6534o2352J620k703k1181r9661k6149
78A88478J42123J84604j17593k79968l3616K48550J25261j03437j57839m9285
88A47278Q3072J16059p5565k07696k7935J89936P7011j55926j91992j8231J83936
99A19947K03872m4404k42719r6491J59295J63531r20r7261p3765l735M364n4422
$$ plain form
111 37292 33944 169909 238522 62787 -149459 -139219 54665 244098 243776 -17556 -262986
122 -262986 -130197 219871 311236 92518 -82893 -31770 131080 220807 163365 72397 85922
133 85922 135140 95310 23661 19678 73388 125405 90169 -49431 -101422 63281 203024 104112
145 104112 -32386 15176 134219 158274 90634 12143 35579 178549 233051 68240 -91207
156 -91207 -15819 182077 257500 128829 -76005 -124394 46438 196932 140078 6253 -29831
167 -29831 18935 82118 118114 115603 140776 195588 144698 14710 41138 227555 297645 157892
179 157892 -15012 -63119 51390 223920 227917 26311 -107636 -5599 155487 169767 60012
190 60012 -18718 34977 138539 119725 14186 17732 128671 166449 100923 30681 13503 76952
$$ packed form
111C7292l348J35965O8613j75735k12246J0240J93884J89433l22k61332k45430
122b62986J32789L50068R1365k18718j75411N1123J62850Q9727n7442r0968J3525
133H5922M9218l9830p1649l983N3710N2017l5236j39600n1991J64703J39743r8912
145A04112j36498M7562J19043K4055o7640p8491K3436J42970N4502j64811j59447
156i1207P5388J97896P5423j28671k04834m8389J70832J50494n6854j33825l6084
167b9831M8766O3183L5996k511K5173N4812n0890j29988K6428J86417P0090j39753
179A57892j72904m8107J14509J72530L997k01606j33947J02037J61086J4280j09755
190F0012p8730N3695J03562j8814j05539L546J10939L7778o5526p0242j7178O3449
$$ plain form
202 76952 160759 116279 -24226 -43911 60446 77731 -16816 -57529 7651 92157 98299 -6695
214 -6695 -87591 14782 193058 199807 37420 -80234 -33072 115228 191045 82218 -75147
225 -75147 -68038 46253 72590 14891 -16081 -13248 -3589 -7292 -52779 -69450 23843 99667 12287
238 12287 -106558 -67551 73059 150360 99444 -22038 -68703 36905 141399 85448 -38546
249 -38546 -63665 3114 57921 29295 -60816 -78351 34366 109119 24010 -68446 -25686 69450
261 69450 103011 61876 -11847 -24828 59574 108256 31533 -34916 19095 84863 54374 -31707
273 -31707 -76837 -20868 76912 57955 -85012 -147359 -40420 78011 74271 -16299 -82573 -31409
285 -31409 95267 122038 16819 -36491 30826 78015 36230 -19252 -30996 8879 54526 13816
$$ packed form
202G6952Q3807m4480j40505j9685J04357J7285r4547m0713O5180Q4506O142j04994
214f695q0896J02373J78276O749j62387j17654M7162J48300P5817j08827j57365
225g5147P109J14291K6337n7699l0972K833R659l703m5487j6671R3293P5824q7380
238A2287j18845L9007J40610P7301n0916j21482m6665J05608J04494n5951j23994
249c8546k5119O6779N4807k8626r0111j7535J12717P4753q5109r2456M2760R5136
261F9450L3561m1135p3723j2981Q4402M8682p6723o6449N4011O5768l0489q6081
273c1707m5130N5969R7780j8957j42967o2347J06939J18431l740r0570o6274N1164
285c1409J26676K6771j05219n3310O7317M7189m1785n5482j1744L9875M5647m0710
$$ plain form
297 13816 -85446 -82624 29785 76291 -2273 -86318 -80058 8055 77425 25219 -78844 -61686
309 -61686 50942 81585 7456 -49107 -29478 36386 70124 -2386 -103778 -79972 23970
320 23970 29739 -62386 -112270 -71189 5465 37394 -19623 -78604 -21886 74865 58087 -28700
332 -28700 -42883 21736 77226 57057 -30923 -76540 3285 89730 39510 -68516 -81972 -11208
344 -11208 42612 19728 -65282 -102633 -21850 56554 8952 -68762 -42588 40348 72444 32391
356 32391 -31947 -32010 52435 93189 6793 -79710 -45787 32968 43563 -18703 -82637 -62530 34775
369 34775 68812 -16294 -74087 -10676 68074 61506 518 -39760 -3739 80836 88948 -5600
381 -5600 -51720 19658 83521 49075 -27298 -62015 -20315 45131 22816 -75830 -97886 -10912
$$ packed form
297A3816r9262K822J12409M6506p8564q4045O260Q8113O9370n2206j04063J7158
309f1686J12628L0643p4129n6563J9629O5864L3738p2510j01392K3806J03942
320B3970N769r2125m9884M1081P6654L1929n7017n8981N6718R6751j6778q6787
332b8700j4183O4619N5490k0169q7980m5617P9825Q6445n0220j08026j3456P0764
344a1208N3820k2884q5010l7351Q0783P8404m7602p7714K6174Q2936L2096m0053
356C2391o4338o3Q4445M0754q6396q6503L3923P8755J0595o2266o3934K0107R7305
369C4775L4037q5106n7793O3411P8750o568o0988m0278L6021Q4575Q112r4548
381e600m6120P1378O3863l4446p6373l4717M1700O5446k2315r8646k2056Q6974
$$ plain form
393 -10912 43912 3478 -50988 -49073 14645 78724 51174 -36395 -39602 49431 81827 15889
405 15889 -46811 -38858 20614 59331 8332 -73736 -54375 38139 53041 -20267 -65084 -34118
417 -34118 29039 54600 -330 -63329 -20968 73491 73979 -5674 -37581 7411 61585 57114 -18896
430 -18896 -76343 -27942 44720 11670 -74724 -85991 -24849 25269 14986 -44990 -69729 1939
442 1939 74459 35075 -43409 -36654 30759 64495 31216 -33409 -44752 26481 71571 7813
454 7813 -65364 -42654 19638 30090 -15805 -70698 -67320 4651 40667 -22240 -76251 -29306
466 -29306 42859 47635 -3192 -45083 -23156 45391 53257 -32852 -85852 -33942 23668 4710
478 4710 -54389 -86854 -54569 12000 16275 -53758 -78805 -14773 32675 3997 -41395 -45499 656
$$ packed form
393a0912N4824m0434n4466J915O3718O4079k7550q7569l207Q9033L2396o5938
405A5889o2700P953N9472L8717n0999q2068J9361R2514J4902p3308m4817L0966
417c4118O3157K5561n4930o2999M2361R4459M88p9653l1907M4992N4174m471p6010
430a8896n7447M8401P2662l3050q6394j1267O1142N0118j0283n9976k4739P1668
442A939P2520l9384p8484O755O7413L3736l3279o4625j1343P1233M5090o3758
454G813p3177K2710O2292J0452m5895n4893L378P1971L6016o2907n4011M6945
466b9306P2165M776n0827m1891K1927O8547P866q6109n3000N1910N7610j8958
478D710n9099l2465L2285O6569M275p0033k5047O4032M7448k8678m5392m104M6155
$$ plain form
491 656 51614 28551 -46816 -50002 31795 65162 4975 -59266 -60420 -11086 28205 -8606 -84811
504 -84811 -86327 -13523 15833 -26067 -59468 -40805 9259 37936 822 -53344 -26225 44870
516 44870 40761 -28480 -57904 -24364 20591 27005 -22716 -70344 -37021 29513 18208 -47585
528 -47585 -61399 -13397 30624 22489 -32944 -59307 2186 75402 52883 -19189 -32017 16493
540 16493 57617 48304 -9468 -48728 -15610 24768 -7153 -53455 -36707 2985 5054 -24942
552 -24942 -51677 -34248 32734 61740 -3663 -67859 -31925 47288 66941 16587 -43314 -41103
564 -41103 25635 59706 8854 -40984 -23212 10614 7273 -21791 -47195 -34722 14931 24021
576 24021 -35599 -62301 -3411 51000 33639 -9914 -24019 2640 39598 27496 -30045 -45414
$$ packed form
491F56N0958k3063p5367l186Q1797L3367o0187o4241j154M9334L9291l6811p6205
504h4811j516P2804K9356m1900l3401J8663N0064K8677l7114n4166K7119P1095
516D4870m109o9241k9424L3540M4955O414m9721m7628L3323O6534j1305o5793
528d7585j3814M8002M4021q135n5433k6363O1493P3216k2519p2072j2828M8510
540A6493M1124r313n7772l9260L3118M0378l1921m6302J6748L9692K069k9996
552b4942k6735J7429O6982K9006o5403o4196L5934P9213J9653n0354n9901K211
564d1103O6738L4071n0852m9838J7772L3826l341k9064k5404J2473M9653R090
576B4021n9620k6702N8890N4411j7361m3553j4105K6659L6958j2102n7541j5369
$$ plain form
588 -45414 4138 27016 -17581 -68247 -64382 -7320 40828 5085 -78876 -86506 -4444 48536
600 48536 20608 -31268 -51365 -22210 29433 37264 -2384 -9129 24110 20387 -21280 -27167 9365
613 9365 33925 10915 -51501 -89883 -40305 41353 40622 -35256 -80447 -44496 28110 57807 9278
626 9278 -48513 -26455 32070 25503 -23802 -33182 -4694 16068 7652 -31953 -61678 -25988 28451
639 28451 10647 -50081 -61017 -21148 6283 -4222 -31439 -28110 16925 35529 -11392 -45078
651 -45078 -11 62605 60733 -3706 -69952 -62591 21600 69512 4463 -84694 -87638 -27833 17727
664 17727 16168 -23821 -53277 -32578 -5334 -19743 -26482 11259 29541 -13704 -61032 -51012
676 -51012 9503 57089 27235 -54672 -83885 -27189 28967 17987 -36931 -77089 -55197 5956
$$ packed form
588d5414M9552K2878m4597n0666L865N7062M8148l5743q3961p630Q2062N2980
600D8536k7928n1876k0097K9155N1643P831l9648o745L3239l723m1667n887L6532
613I365K4560k3010o2416l8382M9578Q1658p31p5878m5191L5951P2606K9697m8529
626I278n7791K2058N8525o567m9305r380K8488K0762q416l9605k9725L5690N4439
639B8451j7804o0728j0936L9869K7431j0505k7217L329M5035J8604m6921l3686
651d5078M5067O2616j872o4439o6246P361Q4191M7912o5049q9157k944N9805M5560
664A7727j559l9989k9456K0699K7244j4409o739L7741J8282m3245m7328J0020
676e1012O0515M7586k9854q1907k9213N6696N6156j0980n4918m0158K1892O1153
$$ plain form
688 5956 14207 -44360 -59757 3641 42840 6179 -35852 -29944 11075 45749 29369 -28427 -51503
701 -51503 -15101 14181 -1148 -25426 -26559 -12847 -10338 -37230 -52660 -5381 48732 17917
713 17917 -62175 -79231 -12952 65699 81193 8981 -71984 -48063 51758 91344 38686 -18545
725 -18545 -29990 -9319 15432 16026 -880 1749 12040 -9728 -34650 -8284 46462 65742 28690
738 28690 -26887 -30366 36475 83963 42497 -20384 -18163 22981 42938 25952 -12236 -25216
750 -25216 18381 51505 4502 -58485 -39337 27907 50395 11288 -36682 -40329 9153 53269
762 53269 43981 14640 7806 12920 11833 11565 14789 27534 38779 3547 -64358 -65163 20827 74220
776 74220 25825 -56796 -84137 -32106 49569 68198 -2961 -66383 -43548 13349 30897 11264
$$ packed form
688E956Q251n8567j5397O3398L9199l6661m2031N908M1019L4674j6380n7796k3076
701e1503L6402K9282j5329k4278j133J3712K509k6892j5430M7279N4113l0815
713A7917q0092j7056O6279P8651J5494p2212q0965K3921R9821L9586n2658n7231
725a8545j1445K0671K4751N94j6906K629J0291k1768k4922K6366N4746J9280l7052
738B8690n5577l479O6841M7488m1466o2881K221M1144J9957j6986l8188j2980
750b5216M3597L3124m7003o2987J9148O7244K2488l9107m7970l647M9482M4116
762E3269r288k9341o834N114j087k68L224J2745J1245l5232o7905q05Q5990N3393
776G4220m8395q2621k7341N2031Q1675J8629p1159o3422K2835N6897J7548j9633
$$ plain form
788 11264 -10613 -12567 338 -4332 -26241 -19429 14161 12845 -31019 -62001 -49084 -8079 18427
801 18427 -8208 -57135 -45947 14086 28939 -9824 -25600 1316 30358 28535 -9799 -47700
813 -47700 -25242 38215 48154 -14439 -67451 -54058 1848 36541 11033 -39645 -47887 -19568
825 -19568 -8328 -10582 2808 12833 -440 -19121 -28297 -10516 42759 71162 15808 -58459
837 -58459 -50611 20960 61993 32144 -33815 -67834 -27216 33111 33874 -8199 -22928 -587 20805
850 20805 20766 5362 3632 31056 43510 8331 -20858 2959 38435 38352 12299 -13733 -15795 12560
864 12560 25220 -7672 -31717 -2500 24170 1570 -35406 -35946 4418 49858 46318 -10450 -42769
877 -42769 -2165 54690 60749 18648 -25084 -27154 10151 30945 8043 -11497 -1877 -2499 -19867
$$ packed form
788A1264k1877j954J2905m670k1909O812L3590j316m3864l0982J2917M1005K6506
801A8427k6635m8927J1188O0033J4853l8763j5776K6916K9042j823l8334l7901
813d7700K2458O3457R939o2593n3012J3393N5906L4693k5508n0678q242K8319
825a9568J1240k254J3390J0025j3273j8681r176J7781N3275K8403n5354p4267
837e8459P848P1571M1033k9849o5959l4019M0618O0327P63m2073j4729K2341K1392
850B0805l9j5404j730K7424J2454l5179k9189K3817L5476q3k6053k6032k062K8355
864A2560J2660l2892k4045K9217K6670k2600l6976n40M0364M5440l540n6768l2319
877d2769M0604N6855O059m2101m3732k070L7305K0794k2902j9540R620o22j7368
$$ plain form
890 -19867 -17242 6229 23618 22394 -7073 -43366 -27552 35422 57387 10021 -37305 -29762 15797
903 15797 46695 26417 -21276 -31596 742 14226 -9764 -30370 -25762 -5878 5444 -14525
915 -14525 -44104 -25896 23493 30126 -4814 -19157 -773 17894 21556 6442 -10261 1915
927 1915 23952 7511 -27530 -23707 13494 31488 6831 -37492 -50743 -6490 40183 20682
939 20682 -33377 -45816 -12634 21888 28313 4279 -17776 -2677 22758 11842 -10127 -396
951 -396 17060 5843 -20259 -33858 -20527 13372 23491 -14898 -47659 -22262 23596 31708 4577
964 4577 -21017 -13821 21347 35628 3881 -19922 3157 31325 23488 -3692 -20335 -8831 20952
977 20952 24251 -16032 -41317 -16409 11296 1589 -19951 -24291 -7951 13173 10318 -14890 -14275
$$ packed form
890a9867K625K3471J7389j224k9467l6293J5814O2974K1965m7366m7326P543M5559
903A5797L0898k0278m7693j0320L2338J3484k3990k0606M608J9884J1322j9969
915a4525k9579J8208M9389O633l4940j4343J8384J8667L662j5114j6703J2176
927A915K2037j6441l5041L823L7201J7994k4657m4323j3251M4253M6673j9501
939B0682n4059j2439L3182L4522O425k4034k2055J5099K5435j0916k1969R731
951c96J7456j1217k6102j3599J3331L3899J0119l8389l2761K5397M5858Q112k7131
964D577k5594P196L5168J4281l1747k3803K3079K8168p837k7180j6643J1504K9783
977B0952L299m0283k5285K4908K7705r707k1540m340J6340K1124k855k5208O15
$$ plain form
990 -14275 21216 35462 5056 -24963 -18925 12115 33422 9656 -37253 -40589 5482 28639
1002 28639 2311 -25643 -24504 -2284 16532 7057 -18803 -14615 17855 22624 -5971 -17206 4516
1015 4516 28268 27986 -615 -26513 -9692 25704 19005 -22605 -37816 -16039 6015 4468 -19509
1028 -19509 -35648 -11759 23195 14563 -18713 -19590 9532 27070 18074 -8575 -22331 1575 30620
1041 30620 14717 -19907 -18991 7285 17597 2398 -19528 -21857 3363 19894 -5105 -32756
1053 -32756 -15009 18820 23324 1808 -17212 -9950 23147 38277 6513 -24987 -9552 18939
1065 18939 15312 -10552 -27571 -19152 6876 12435 -17149 -33532 -5543 21849 11119 -13318
1077 -13318 -17997 1698 26751 23668 -9334 -19450 12617 34741 16434 -9071 -10924 7145
$$ packed form
990a4275L5491J4246l0406l0019O038L1040K1307k3766m6909l336M6071K3157
1002B8639k6328k7954J139K2220J8816r475k5860M188L2470M769k8595j1235K1722
1015D516K3752k82k8601k5898J6821L5396o699m1610j5211K1777K2054j547k3977
1028a9509j6139K3889L4954q632l3276q77K9122J7538q996k6649j3756K3906K9045
1041C0620j5903l4624R16K6276J0312j5199k1926k329K5220J6531k4999k7651
1053c2756J7747L3829M504k1516j9020P262L3097J5130l1764l1500J5435K8491
1065A8939l627k5864j7019Q419K6028N559k9584j6383K7989K7392j0730k4437
1077a3318m679J9695K5053l083l3002j0116L2067K2124j8307k5505j853J8069
$$ plain form
1089 7145 23845 12799 -21507 -27326 3663 18458 -5253 -26638 -17895 6273 21263 8820
1101 8820 -17078 -11680 22281 30436 2593 -15696 -5237 13124 18017 -1178 -25419 -16818 14919
1114 14919 16162 -14001 -25837 -7265 12329 12850 -6973 -23714 -6626 24872 21481 -7868 -12385
1127 -12385 10703 26827 21269 -155 -13775 2893 25839 10611 -22739 -24968 -1363 9507
1139 9507 -2266 -21969 -26323 -1306 21055 4261 -22649 -13573 13872 20056 3716 -13535 -13393
1152 -13393 10386 24665 1225 -24873 -11838 14581 13570 -7361 -23367 -17750 5255 13536
1164 13536 -12186 -30535 -9425 16603 11906 -6765 -12610 -33 21412 22783 -4811 -20350
1176 -20350 1309 19658 4766 -18209 -23577 -10916 6058 2519 -23482 -29697 -2876 14228
$$ packed form
1089G145J6700j1046l4306n819L0989J4795k3711k1385Q743K4168J4990j2443
1101H820k5898N398L3961Q155k7843j8289J0459J8361M893j9195k4241Q601L1737
1114A4919J243l0163j1836J8572J9594N21j9823j6741J7088L1498l391k9349m517
1127a2385K3088J6124n558k1424j3620J6668K2946j5228l3350k229K3605J0870
1139I507j1773j9703m354K5017K2361j6794k6910R076K7445O184j6340j7251J42
1152a3393K3779J4279k3440k6098J3035K6419j011k0931j6006N617K3005Q281
1164A3536k5722j8349K1110K6028m697j8671n845J2577K1445J371k7594j5539
1176b0350K1659J8349j4892k2975n368J2661J6974l539k6001o215K6821J7104
$$ plain form
1188 14228 -2308 -21357 -17314 1749 16677 8708 -15555 -17080 11939 25269 5868 -11813
1200 -11813 -7587 7121 15357 2982 -19938 -17713 7669 9936 -14972 -25099 -7067 12114 14635
1213 14635 -1799 -18928 -5964 25446 26064 -3686 -17569 -2145 15159 14391 -4094 -21253 -9573
1226 -9573 13758 7014 -18429 -19631 -165 9940 2084 -14310 -21472 -918 22354 11700 -13578
1239 -13578 -9421 14852 23647 12988 -2498 -5845 10460 22121 2525 -22076 -14286 9655 11863
1252 11863 -6250 -24064 -20991 6217 22864 2669 -20839 -11304 10535 12986 2849 -5498 -5674
1265 -5674 5491 10997 -5495 -15941 2241 18152 3016 -20581 -24330 -6852 14402 10626 -20071
1278 -20071 -33938 -8126 18060 12493 -5695 -11548 -416 16966 17593 -3733 -11631 8142 17485
$$ packed form
1188A4228j6536j9049M043J9063J4928p969k4263j525K9019J3330j9401j7681
1200a1813M226J4708Q236j2375k2920K225K5382K267k4908j0127J8032J9181K521
1213A4635j6434j7129J2964L1410O18k9750j3883J5424J7304p68j8485j7159J1680
1226i573K3331o744k5443j202J9466J0105p856j6394p162K0554K3272j0654k5278
1239a3578M157K4273Q795j0659j5486l347J6305J1661j9596k4601P790K3941K208
1252A1863j8113j7814L073K7208J6647k0195k3508R535K1839K451j0137q347j76
1265e674J1165N506j6492j0446J8182J5911j5136k3597l749J7478K1254l776l0697
1278b0071j3867K5812K6186n567j8188n853J1132J7382O27k1326p898J9773R343
$$ plain form
1291 17485 -1195 -18581 -15648 -1271 9689 762 -22700 -25779 2 12171 -5416 -18923
1303 -18923 -10017 4190 6701 -5461 -17960 -4659 21560 19230 -9782 -22833 -5775 17402
1315 17402 21785 -809 -30423 -25890 5680 15026 -6283 -18188 -9909 -1542 1104 -273 -1347
1328 -1347 7862 17593 3679 -17674 -10272 15990 23751 5783 -19963 -26286 -1545 22715 8771
1341 8771 -21548 -24366 -5222 4928 -844 -13170 -17692 -2111 13229 -39 -19297 -7595 16852
1354 16852 20833 5696 -8964 -10092 5793 17545 3515 -14691 -10011 3216 -2019 -13885 -13144
1367 -13144 425 14209 6316 -20630 -26352 5477 31061 17739 -12283 -26159 -12917 17359
1379 17359 30051 3962 -22512 -14250 5221 3551 -5193 -5225 -2960 -5371 -14425 -22164 -11376 12865
$$ packed form
1291A7485j8680j7386K933J4377J0960q927k3462l079K5781J2169j7587j3507
1303a8923Q906J4207K511j2162j2499J3301K6219k330k9012j3051J7058K3177
1315A7402M383k2594k9614M533L1570R346k1309j1905Q279Q367K646j377j074
1328a347R209R731j3914k1353P402K6262P761j7968k5746o323K4741K4260j3944
1341H771l0319k818J9144J0150n772j2326m522J5581J5340j3268j9258J1702K4447
1354A6852L981j5137j4660j128J5885J1752j4030j8206M680J3227n235j1866P41
1367a3144J3569J3784p893k6946n722L1829K5584j3322l0022j3876J3242L0276
1379A7359J2692k6089k6474Q262J9471j670q744l2K265k411r054p739J0788K4241
$$ plain form
1393 12865 15416 -7839 -22609 -10593 13307 27853 15078 -13605 -16986 9535 20509 176
1405 176 -14154 -6949 4456 6275 -5834 -21546 -14359 11681 16119 -9107 -24477 -13522 4964
1418 4964 12906 4563 -9662 -9622 3930 5445 -2600 905 11397 8389 -7197 -21756 -19381 7195
1432 7195 25901 1684 -36870 -34571 1463 23683 17050 -5608 -22048 -11166 14937 20356 3913
1445 3913 -3247 1852 2216 -3030 -4619 1911 12613 9861 -12901 -26115 -7759 14063 9758 -9309
1459 -9309 -21056 -16695 2609 13238 -1310 -15049 -433 17833 9166 -7804 -8868 5059 19506
1472 19506 15919 -9362 -26339 -10055 14057 14044 -2597 -14980 -14283 -1404 7355 2497 390 7845
1486 7845 4264 -11157 -11379 6870 21167 18622 -1742 -23940 -17151 17518 31824 5035 -23838
$$ packed form
1393A2865K551k3255j4770J2016K3900J4546j2775k8683l381K6521J0974k0333
1405A76j4330P205J1405J819j2109j5712P187K6040M438k5226j5370J0955J8486
1418D964P942q343j4225M0J3552J515q045L505J0492l008j5586j4559K375K6576
1432G195J8706k4217l8554K299L6034K2220o633k2658j6440J0882K6103N419j6443
1445C913p160N099L64n246j589O530J0702k752k2762j3214J8356K1822m305j9067
1459i309j1747M361J9304J0629j4548j3739J4616J8266q667j6970j064J3927J4447
1472A9506l587k5281j6977J6284K4112j3j6641j2383O97J2879Q759m858k107P455
1486G845l581j5421k22J8249J4297k545k0364k2198O789L4669J4306k6789k8873
$$ plain form
1499 -23838 -24393 -6378 9632 8397 -9874 -19244 -7838 1474 -2275 -3448 4304 9483 6733 -2710
1513 -2710 -10341 959 19957 14606 -8623 -15188 -2419 6239 4838 -2266 -10387 -4819 7569 1293
1527 1293 -17469 -14129 8272 16699 2539 -16125 -19458 745 23835 18966 -5969 -16342 -6510
1540 -6510 5303 9386 2872 -9054 -10598 -5957 -11659 -14901 468 12906 470 -17639 -18060 -2715
1554 -2715 17653 22428 400 -22378 -12915 13838 20977 6861 -9068 -11587 27 10001 818
1567 818 -9416 -3171 4463 -2817 -12680 -13102 -4953 6878 8349 -7653 -16261 -609 14013 7880
1581 7880 -1573 -810 3078 5734 1171 -9447 -8778 7834 12975 -6345 -22052 -14237 5949 18330
1595 18330 8732 -14316 -19632 2091 17602 11007 -100 -3384 -754 5439 8737 3374 3521 11988
$$ packed form
1499b3838n55J8015J6010j235j8271r370J1406R312l749j173P752N179k750r443
1513b710p631J1300J8998n351k3229o565J2769Q658j401p104q121N568J2388o276
1527A293j8762L340K2401Q427j4160j8664l333K0203K3090m869k4935j0373R832
1540f510J1813M083o514j1926j544M641n702l242J5369J2438j2436j8109m21J5345
1554b715K0368M775k2028k2778R463K6753P139j4116j5929k519J1614R974r183
1567H18j0234O245P634p280r863m22Q149J1831J471j6002q608J5652J4622o133
1581G880r453P63L888K656m563j0618O69J6612N141j9320j5707P815K0186J2381
1595A8330r598k3048n316K1723J5511o595j1107l284K630O193L298n363J47Q467
$$ plain form
1609 11988 6506 -11987 -12743 4778 13908 4615 -12857 -22589 -10753 11811 14194 -4821 -13919
1622 -13919 -3704 8659 11616 3474 -5534 263 13577 7833 -9531 -9246 5859 11054 3242 -7251
1636 -7251 -12564 -2786 10479 5631 -9474 -8895 2460 4613 -1498 -4518 -818 9563 14059 189
1650 189 -12988 -2119 17469 16112 -2602 -16855 -14084 2497 12966 -915 -18466 -13521 436
1663 436 2593 -1796 -3399 -2485 2406 5048 -3759 -8490 5255 17067 6124 -9810 -9558 2944
1677 2944 14226 10520 -7233 -15292 -865 10077 900 -10299 -9811 -2007 5211 3380 -8677 -9797
1691 -9797 7416 16358 3875 -8399 -4055 5982 11171 4904 -8993 -10480 2113 6735 -5303
1704 -5303 -11462 -3545 3888 2728 -4995 -11765 -4230 11975 11317 -6608 -13055 899 13583 14039
$$ packed form
1609A1988n482j8493p56J7521R130r293j7472r732J1836K2564K383j9015r098
1622a3919J0215J2363K957q142r008N797J3314n744j7364K85J5105N195p812j0493
1636g251n313R778J3265m848j5105N79J1355K153o111l020L700J0381M496j3870
1650A89j3177J0869J9588j357j8714j4253K771J6581J0469j3881j7551M945J3957
1663D36K157m389j603R14M891K642q807m731J3745J1812j0943j5934K52J2502
1677B944J1282l706j7753q059J4427J0942r177j1199M88P804P218j831j2057j120
1691i797J7213Q942j2483j2274M344J0037N189o267j3897j487J2593M622j2038
1704e303o159P917P433j160p723o770P535J6205o58j7925o447J3954J2684M56
$$ plain form
1718 14039 3092 -8195 -3112 12770 12999 -3020 -8416 271 4315 -154 -7122 -10360 -2642 8227
1732 8227 2441 -11645 -8833 6758 12391 3928 -5451 -7146 3315 13500 4715 -10503 -7428 6315
1746 6315 7606 -1737 -8463 -7300 2060 8591 -1367 -14410 -7708 7464 7305 -2802 -7488 -2750
1760 -2750 7764 13086 2691 -6918 1367 12527 7040 -4917 -7189 -1837 5407 4036 -8863 -15974
1774 -15974 -3699 8743 2460 -9710 -9490 -927 7783 7561 -4931 -10142 2787 12419 3665 -6598
1788 -6598 -3811 4734 8662 3843 -7454 -8663 4572 9221 -3076 -12830 -6392 3166 6041 744
1802 744 -8223 -5779 9156 13654 977 -6122 1356 9100 7875 190 -8072 -4887 7614 6838 -7422
1817 -7422 -11679 -1847 5379 2976 -4489 -9080 -3003 8499 6811 -6151 -7235 5033 10775 6167
$$ packed form
1718A4039j0947j1287N083J5882K29j6019n396Q687M044m469o968l238P718J0869
1732H227n786j4086K812J5591N633q463r379j695J0461J0185q785j5218L075J3743
1746F315J291r343o726J163R360O531r958j3043O702J5172j59j0107m686M738
1760b750J0514N322j0395r609Q285J1160n487j1957k272N352P244j371j2899p111
1774a5974J2275J2442o283j2170K20Q563Q710k22j2492n211J2929R632q754j0263
1788f598K787Q545L928m819j1297j209J3235M649j2297r754O438R558K875n297
1802G44q967K444J4935M498j2677p099P478P744j225p685q262L185J2501p76j4260
1817g422m257R832P226k403p465m591O077J1502j688j2962j084J2268N742m608
$$ plain form
1831 6167 -474 -2757 4522 13767 7793 -6131 -6136 5321 7881 40 -7327 -7711 659 9266 2553
1846 2553 -8695 -3993 8738 9932 1548 -3443 -1338 6505 11217 1949 -8703 -2508 9141 6660
1860 6660 -3345 -7235 -3427 3452 5845 -4276 -12272 -3544 7507 3409 -5677 -6204 1185 8760
1874 8760 9693 54 -5726 4395 12999 5381 -5271 -5048 129 4548 2077 -7676 -11303 -378 6931
1889 6931 -1446 -9735 -5851 1783 5600 1404 -7433 -7532 4343 9052 -752 -7968 -2251 4450 5460
1904 5460 -282 -8059 -7017 3508 5020 -7190 -12800 -4853 2840 2953 -2672 -8764 -4378 7576
1918 7576 9052 -2149 -4920 3020 7376 3858 -1782 -5607 -1352 7010 3527 -9183 -10189 1500
1932 1500 6607 432 -7695 -9844 -2043 8016 4046 -7402 -6526 4314 7795 3159 -868 -1169 5077
$$ packed form
1831F167o641k283P279R245n974j3924nJ1457K560p841p367l84Q370Q607o713
1846B553j1248M702J2731J194q384m991K105P843M712r268j0652O195J1649k481
1860F660j0005l890L808O879K393j0121p996Q728J1051m098r086n27P389P575
1874H760R33r639n780J0121Q604p618j0652K23N177M419k471r753l627J0925P309
1889F931q377q289L884P634L817m196q837r9J1875M709r804p216N717O701J010
1904E460n742p777J042J0525J512j2210n610P947P693J13n625o092M386J1954
1918G576J476j1201k771P940M356l518n640l825M255Q362l483j2710j006J1689
1932A500N107o175q127k149P801J0059l970j1448Q76J0840L481m636m027l01O246
$$ plain form
1947 5077 10667 4190 -7253 -3497 7331 7132 -2681 -7544 -4531 3027 7675 632 -6999 -846 9076
1962 9076 7404 -392 -2303 2511 8831 9359 -844 -7704 1391 12168 7119 -3962 -7034 -2392
1976 -2392 4976 6440 -2473 -9661 -2585 4762 982 -4184 -590 4282 6175 3618 -2175 -1979 9211
1991 9211 14566 3144 -8057 -4858 4787 9457 3545 -7130 -8899 2258 7363 -918 -6032 -1519
2005 -1519 3421 3497 -88 -5116 -3037 7775 9952 -1810 -8533 -260 7626 6441 -170 -6667 -4112
2020 -4112 3384 1902 -7667 -7814 878 3193 -2283 -7395 -7207 1890 12141 7316 -7633 -9243 3421
2035 3421 11126 7398 -1502 -6831 -3642 4930 4207 -3743 -3594 2420 -158 -6486 -6783 -1548 4178 4236
2051 4236 -4847 -12678 -4618 8542 9307 172 -6816 -4945 4274 9602 2037 -7616 -2693 5009 352
$$ packed form
1947E077N590o477j1443L756J0828j99r813m863L013P558M648p043p631O153R922
1962I076j672p796j911M814O320N28j0203o860R095J0777n049j1081l072M642
1976b392P368J464q913p188P076P347l780n166L594M872J893k557n793J96J1190
1991I211N355j1422j1201L199R645M670n912j0675j769J1157N105q281n114M513
2005a519M940P6l585n028K079J0812K177j1762o723Q273P886j185o611o497K555
2020d112P496j482r569j47Q692K315n476n112J88R097J0251m825j4949j610J2664
2035C421P705l728q900n329L189Q572p23p950J49O014k578o328k97N235N726N8
2051D236r083p831Q060J3160P65r135o988J871R219N328p565r653M923P702m657
$$ plain form
2066 352 -7712 -6614 -1279 3189 2988 -4715 -10598 -2343 8845 6364 -2155 -5103 -1061 3611 3950
2081 3950 -587 -2376 3930 4923 -4295 -8911 -1843 5367 5512 -2914 -13947 -14147 1124 10592 820
2096 820 -11375 -10183 -1958 4511 5515 49 -3397 296 2191 -2874 -3788 2805 4806 -411 -7933
2111 -7933 -10518 -3539 7031 5872 -6887 -11630 -3607 3207 3360 -443 -5085 -3345 3913 3584 -4923
2126 -4923 -4729 4916 8339 408 -6937 -8066 -1727 6020 3946 -6808 -11215 -5510 -196 528 -561
2141 -561 -2652 -1436 1207 -1915 -4778 3281 11857 6106 -6181 -8844 -2050 7960 12106 2050
2155 2050 -11958 -10029 3292 7928 1878 -3841 -6204 -3427 411 -652 -2593 1987 5114 -156
2169 -156 -5889 -2788 4079 8064 5821 -4475 -10142 -1945 6217 1747 -5972 -5597 -2602 -1116 -1915
$$ packed form
2066C52q064J098N335M468k01p703n883Q255J1188k481q519k948M042M672L39
2081C950m537j789O306R93r218m616P068P210J45q426j1033k00J5271R468r772
2096H20j2195J192Q225O469J004n466l446L693J895n065r14O593K001n217p522
2111g933k585O979J0570j159j2759m743Q023O814J53l803m642J740P258l29q507
2126d923J94R645L423p931p345j129O339P747k074j0754m407N705N314P24j089
2141e61k091J216K643l122k863Q059Q576n751j2287k663O794J0010M146j0056
2155B050j4008J929J3321M636o050n719k363K777L838j063j941M580L127n270
2169a56n733L101O867L985k243j0296n667Q197Q162m470p719L75K995J486p99
$$ plain form
2184 -1915 -5177 -5115 2511 6774 -1926 -9672 -5679 4244 8729 4815 -5250 -9397 -999 6710 3792
2199 3792 -1551 -3402 -3942 -4404 -3886 -3645 -2440 1878 -1961 -12320 -12318 604 8557 3937 -4926 -10933
2215 -10933 -6863 5292 9636 -475 -8613 -6365 -1621 -225 -2161 -4545 -4054 -653 -3623 -9098
2229 -9098 -6563 1634 3149 -2084 -6512 -7951 -2698 5207 4603 -3953 -5451 1531 2430 -2820 -3733 -1160
2245 -1160 1396 810 -6041 -12469 -7055 3026 4285 -3961 -10656 -9778 -597 7188 3938 -5420 -5602
2260 -5602 126 579 -755 1263 2047 505 -1763 -5316 -5662 2411 8205 724 -9487 -9402 -1518 5098
2276 5098 5438 -2310 -8802 -3815 4790 4512 202 126 1662 3018 1984 -2401 -3471 3583 6247 -2085
2292 -2085 -8273 -4956 472 2654 1674 -3058 -5798 -610 4124 332 -2426 1765 4848 2717 -1720
$$ packed form
2184a915l262O2P626M263q700p746L993R923M485l914j0065m147Q398P709k918
2199C792n343j851n40m62N18K41J205M318l839j0359KJ2922P953m620q863o007
2215a0933M070J2155M344j0111q138K248M744J396j936k384M91L401k970n475
2229i098K535Q197J515n233m428j439N253P905o04q556j498O982Q99n250r13K573
2245a160K556n86o851o428N414J0081J259q246o695Q78R181P785l250r358j82
2260e602N728M53j334K018P84j542k268l553l46Q073N794p481j0211Q5P884O616
2276E098L40p748o492M987Q605k78m310p6J536J356j034m385j070P054K664q332
2292b085o188L317N428K182r80m732k740N188M734l792k758M191L083k131m437
$$ plain form
2307 -1720 -3733 906 9265 7941 -2403 -7591 -1128 5850 6347 1186 -5826 -7293 158 4309 -481
2322 -481 -2483 966 2085 -851 -1811 1107 4657 7197 2054 -6318 -5442 3889 7507 2058 -4415 -6401
2338 -6401 -2079 3905 2906 -4273 -4478 1149 1995 -1796 -2969 -983 2874 5746 1588 -5048 -1748 7039
2354 7039 7220 737 -2423 -2057 723 3473 172 -4477 -2916 1833 -2 -4876 -3760 1178 4546
2369 4546 2794 -3543 -6845 1005 8425 5031 -2818 -4066 -730 3575 4778 1231 -3467 -784 3504
2384 3504 -256 -3915 -1530 2216 2458 -1166 -4925 -3228 4255 8342 1532 -3635 -410 4976 6162
2399 6162 3404 -1092 -2305 2461 4709 -1448 -4827 -593 2705 1447 -1729 -4608 -2239 4353 5046
2414 5046 -2273 -5250 687 4948 3563 580 -880 786 4793 4462 -1708 -1613 3855 4679 632 -3859
$$ packed form
2307a720k013M639Q359j324j0344n188O463O978M97n161p012j467P451M151m790
2322d81k002L449J119k936r60K918L550K540n143q372Q76R331L618n449o473j986
2338f401M322N984r99p179k05N627Q46l791j173J986L857K872m158o636L300Q787
2354G039J81o483l160L66K780K750l301m649J561M749j835m874J116M938L368
2369D546j752o337l302P850P420l394p849j248L336M305J203l547m698K683M288
2384C504l760l659K385L746K42l624l759J697P483M087o810n167L225N386J186
2399F162k758m496j213M766K248o157l379M234L298j258l176k879K369O592O93
2414E046p319k977N937M261j385k983j460J666M007l31o170R5N468Q24m047m491
$$ plain form
2430 -3859 -3481 249 5033 2441 -5302 -5022 2554 5499 2176 -650 -974 1845 5154 3088 -2104 -1204
2446 -1204 3992 3289 -1884 -3202 -980 1901 3126 -1180 -6255 -3151 3790 2840 -2727 -3837 -1088
2461 -1088 2103 4151 941 -2261 1006 6719 4090 -1000 -794 2498 4101 3106 -1559 -4619 90
2476 90 5038 1630 -3291 -2036 1689 3221 2526 -255 -1604 3336 6611 2141 -2217 753 4709 4889
2492 4889 2527 -798 -1120 3982 6615 1278 -3190 -104 2993 2958 1486 -659 -392 4523 6693 2030
2508 2030 -132 4555 7510 5596 2870 957 2217 6909 6380 121 -2376 2682 5320 2887 313
2523 313 -1224 852 4989 4616 -1026 -1723 3546 5723 2268 146 351 2860 6199 4433 -1079 -1257
2539 -1257 4091 4790 237 -1787 -1454 852 2587 578 -3969 -2069 3633 3185 -684 -1743 322 2624
$$ packed form
2430c859L78L730M784k592p743K80P576K945l323k826l24K819L309k066n192R00
2446a204N196p03n173j318K222K881J225m306n075L104O941r50n567j110K749
2461a088L191K048l210l202L267N713k629n090K06L292J603r95m665l060M709
2476I0M948l408m921J255L725J532o95k781j349M940L275m470m358K970L956J80
2492D889k362l325l22N102K633n337m468L086L097l5j472k145K67M915K170m663
2508B030k162M687K955j914k726j913J260M692n29o259k497N058K638k433k574
2523C13j537K076M137l73n642o97N269K177l455k122K05K509L339j766n512j78
2539a257N348O99m553k024L33K306J735k009m547J900N702m48l869j059K065K302
$$ plain form
2555 2624 3956 1089 -3364 -1242 3835 2482 -2321 -3607 -1414 357 758 -2332 -5703 -2616 1596
2570 1596 -726 -4999 -4527 -1320 371 705 -2497 -4533 41 4117 1361 -3300 -2311 623 1034 -60
2586 -60 -3557 -5131 -825 2016 -1693 -5473 -2591 1076 1355 -161 -2865 -3257 1466 3883 -217 -3569
2602 -3569 -126 3228 2493 289 -1652 -1168 2774 3660 -1849 -4583 -283 2537 1112 -1237 -2343 -787
2618 -787 3561 4560 -385 -1132 3407 6398 3984 1369 834 2401 5727 4599 -1284 -1423 3587 4827
2634 4827 1690 2 -22 1471 4043 3529 -1356 -1035 4415 4793 994 -12 1547 4148 5466 2732
2650 2732 -1810 -254 5045 4393 -458 -2067 -809 949 2633 158 -3378 -728 3449 2476 -1376
2665 -1376 -681 1820 3190 3140 130 -2817 463 5046 2372 -2414 -2536 237 1227 481 -2271 -3982
$$ packed form
2555B624J332k867m453K122N077j353m803j286K193J771M01l090l371L087M212
2570A596k322m273M72L207J691L34l202k036M574M076k756m661R89K934M11j094
2586f0l497j574M306K841l709l780K882L667K79j516k704l92M723K417m100l352
2602c569L443L354p35k204j941M84L942Q86n509k734M300K820j425k349j106J556
2618g87M348R99m945p47M539K991k414k615n35J567L326j128n883j39N010J240
2634D827l137j688k4J493K572n14m885L21N450L78l799j006J559K601J318k734
2650B732m542J556N299o52m851j609J258J758J684k475l536K650M177r73l852
2665a376O95K501J370n0l010k947L280M583k674m786j22K773R90p46k752j711
$$ plain form
2681 -3982 -1150 1843 -1693 -5367 -2921 745 1413 -158 -3433 -3689 1427 4328 46 -3992 -2215
2696 -2215 222 395 -729 -2342 -3662 -1246 228 -3159 -4632 -1208 1368 -342 -3077 -4238 -1899
2711 -1899 3100 3257 -2018 -4875 -393 2319 1051 -252 -1832 -1819 801 965 -3369 -4390 -83 1232
2727 1232 -2265 -4410 -3692 -1152 2112 1883 -3128 -3589 1343 3222 757 -509 -161 709 1751 -43
2743 -43 -2843 -1093 3389 2229 -2721 -3924 -1581 1313 3539 737 -4866 -4036 2086 2787 -309 -683
2759 -683 188 571 1131 245 -648 1248 2952 -471 -3830 -3146 -106 1536 523 -3402 -6068 -1787 2838
2776 2838 1259 -2791 -1723 106 179 507 -451 -1205 1287 2981 -841 -4325 -1649 2393 2208 -473
2792 -473 -3615 -4328 -1235 1718 -906 -3440 -1982 -832 -1739 -1727 -1211 -286 2391 1774 -3660 -4608 1017
$$ packed form
2681c982K832K993l536l674K446L666O68j571l275k56N116K901m282m038J777
2696b215K437J73j124j613j320K416J474l387j473L424K576j710k735j161K339
2711a899M999J57n275k857M482K712j268j303j580J3K620J64m334j021M307J315
2727A232l497k145P18K540L264k29n011m61M932J879k465j266L48Q70J042j794
2743d3k800J750M482j160m950j203K343K894K226k802n603Q30O122P01l096l74
2759f83Q71L83N60q86q93J896J704l423l359O84L040J642j013l925k666M281M625
2776B838j579m050J068J829P3L28r58p54K492J694l822l484K676M042j85k681
2792d73l142p13L093K953k624k534J458J150r07J2N16R25K677o17n434r48N625
$$ plain form
2809 1017 3806 1241 -2213 -4749 -3772 267 2982 -1458 -4141 -2621 -795 -1418 -1355 -732 -584 646
2825 646 -726 -3638 -2296 3323 3405 -401 -2938 -2685 -396 2710 1723 -3432 -4327 -1309 -411 -2990 -2760
2842 -2760 -1157 -693 -808 -2127 -4467 -2141 2975 2491 -1996 -3791 -2730 99 2270 719 -2950 -3126
2858 -3126 -744 -1632 -2427 -873 -246 -1532 -2428 -3958 -4355 -241 3705 309 -5346 -4779 -420 2435
2874 2435 2591 -500 -4068 -2991 331 -17 -1995 -1579 -1541 -2393 -2844 -3562 -3038 414 1692 -3090 -6103
2891 -6103 -2772 931 1513 458 -1939 -3591 -755 1784 -515 -2195 -35 1151 -1245 -3080 -2831
2906 -2831 -1055 1527 1370 -3496 -6215 -2438 1286 1355 -384 -2278 -3205 -198 1792 -161 -478 1391
2922 1391 14 -3011 -2646 -337 591 1103 -915 -5379 -5030 398 2916 -103 -2981 -3740 -2325 1168
$$ packed form
2809A017K789k565l454k536R77M039K715m440k683J520J826o23O3O23J48J230
2825F46j372k912J342N619Q2l806k537K53K289L106r87n155q95L018Q98k579K30
2842b760J603M64j15j319k340K326N116m84m487j795J061K829K171j551l669j76
2858c126K382q88p95J554O27j286q96j530l97M114L946l396n655N67M359K855
2874B435J56l091l568J077L322l48j978M16L8q52m51p18N24L452J278m782l013
2891f103L331L703N82j055k397j652K836K539k299j680K160J186k396j835K49
2906b831J776K582j57m866k719L777L724O9j739j894r27L007J990j953l17J869
2922A391j377l025L65K309R28N12k018m464L49N428K518l019k878p59J415L493
$$ plain form
2938 1168 1569 -1027 -1192 539 90 -1593 -896 843 1451 1087 -969 -4378 -2813 1837 1730 -2306 -3611
2955 -3611 -2462 -1300 -96 51 -1941 -1031 1283 -593 -2814 -952 1638 2070 534 -2785 -4122 -683
2971 -683 3452 1445 -3037 -3459 -2212 -555 947 146 -2342 -1292 370 -1072 -2017 1337 3252 1257
2987 1257 -570 -1747 -978 2307 4437 554 -3550 -2211 444 1413 958 -1151 -2272 -187 917 -1345
3003 -1345 -1817 1383 2454 141 -1071 -1048 -78 2647 3575 -300 -2734 198 2583 1315 440 -435 -783
3020 -783 146 603 -1713 -1214 1906 1983 -769 -1988 -744 1401 3762 2969 -1741 -2427 1384 3184 1354
3037 1354 -119 -506 -1190 437 587 -1357 -805 1567 406 -2997 -2646 -211 1403 2094 -679 -3054
3053 -3054 -1228 2226 2735 -19 -782 15 539 1098 203 -1489 -259 1446 -221 -3213 -1952 478
$$ packed form
2938A168M01k596j65J731m49j683O97J739O08l64k056l409J565M650j07m036j305
2955c611J149J162J204J47j992R10K314j876k221J862K590M32j536l319j337L439
2971f83M135k007m482m22J247J657J502q01k488J050J662j442r45L354J915j995
2987A257j827j177P69L285K130l883m104J339K655R69m55k109j121K085J104k262
3003a345m72L200J071k313j212K3R70K725R28l875k434K932K385j268q75q75l48
3020g83R29M57k316M99L120P7k752j219J244K145K361p93m710o86L811J800j830
3037A354j473l87o84J627J50j944N52K372j161l403L51K435J614O91k773k375
3053c054J826L454N09k754p63P97N24N59q95j692J230J705j667k992J261K430
$$ plain form
3069 478 628 59 -1533 -2938 -721 2795 1455 -1299 -1240 706 402 427 -471 -599 419 1407 -1328 -3213
3087 -3213 -833 1426 658 -918 -2499 -2969 171 2584 295 -2070 -584 1310 1049 497 775 125
3103 125 1553 1844 -610 -1924 1211 2104 168 -1487 -1571 -637 1715 2148 -1308 -2298 268 1685 550
3120 550 89 373 127 1609 1560 -823 -772 2268 2789 -63 -1140 -651 513 1734 1282 -2141 -1919 1050
3138 1050 1470 -331 -62 844 1059 1685 1353 -635 412 3201 2209 -671 -775 525 1453 2073 871
3155 871 -1398 -748 1694 1343 -839 -648 164 403 1162 575 -805 889 2972 1314 -743 383 2462
3172 2462 2213 1616 363 -911 706 2659 1345 -1314 -553 1033 1224 501 336 -325 1190 3165 672
3189 672 -790 1168 2277 1883 972 575 -53 1492 2413 656 -1154 311 1813 476 -407 -575 -510
$$ packed form
3069D78J50n69j592j405K217L516j340k754N9J946l04K5q98j28J018R88k735j885
3087c213K380K259p68j576j581m70L140K413k289k365J486J894k61n52K78o50
3103A25J428K91k454j314L135Q93j936j655q4R34K352M33l456r90K566J417j135
3120E50m61K84k46J482m9k383N1L040N21k852j077M89J164J221m52l423K22K969
3138A050M20j801K69R06K15O26l32j988J047K789r92k880j04J300R28O20j202
3155H71k269O50K442l51k182J91Q12K39P59n87j380J694K083j658k057J126K079
3172B462k49n97j253j274J617J953j314k659P61J586J91p23j65o61J515J975k493
3189F72j462J958J109l94r11l97o28J545R21j757j810J465J502j337q83j68O5
$$ plain form
3206 -510 1069 1444 -849 -1616 1026 2520 1149 -15 77 520 2061 2255 -246 -1160 979 1679 -37
3223 -37 -653 -187 -362 756 594 -1322 -1119 1356 1879 -585 -1131 -345 766 1545 849 -1366 -874 1399
3241 1399 1406 -943 -905 -210 -443 -188 -350 -2329 -1624 924 294 -1434 -1622 -118 548 863 -76 -1537 -655
3260 -655 1641 1135 -1503 -842 599 250 -78 -548 -1683 -440 1055 2 -2159 -1522 617 28 -121
3277 -121 -555 -1827 -54 1961 865 -1187 155 1707 780 395 21 -598 481 1789 -92 -1424
3293 -1424 -141 1633 1087 455 -85 -520 1168 2390 533 -720 847 2480 1375 818 853 598 2016
3310 2016 2450 5 -896 1145 2185 777 -183 -304 -246 1225 1407 -567 -1125 1642 2241 482 -173
3327 -173 849 1055 2074 1552 -761 -786 1220 1791 -433 -540 -78 431 856 546 -1275 -1151 1228 1001
$$ packed form
3206e10J579L75k293p67K642J494j371j164R2M43J541J94k501r14K139P00j716
3223c7o16M66j75J118j62j916K03K475N23k464n46P86J111P79o96k215M92K273
3241A399Pk349L8O95k33K55j62j979P05K548o30j728j88J504O66L15r39j461Q82
3260f55K296n06k638O61J441l49l28m70j135J243J495j053k161O37K139n89j49
3277a21m34j272J773K015j096k052J342J552r27l85l74o19J079J308j881j332
3293a424J283J774n46o32n40m35J688J222j857j253J567J633j105n57L5k55J418
3310B016M34k445r01K041J040j408r60j21N8J471J82j974n58K767N99j759o55
3327a73J022K06J019n22k313k5K006N71k224j07M62N09M25l10j821J24K379k27
$$ plain form
3345 1001 -849 -1078 419 523 916 493 -1085 -520 1658 1233 -855 -843 109 -32 -66 -924 -2166 -1322
3363 -1322 864 -356 -2351 -1295 71 21 53 -899 -1229 -324 1294 553 -1133 -761 810 -34 -74 -227
3381 -227 -1227 -252 977 -259 -2119 -683 932 89 -731 -809 -1336 139 1530 57 -1259 -13 1315
3398 1315 386 -64 -190 -369 513 918 -1167 -2009 288 1540 -243 -1139 -896 -488 583 1865 -18
3415 -18 -873 807 1512 255 454 915 1047 1361 1142 -554 -266 1903 1729 -768 -1314 -199 -353 912
3433 912 1109 -907 -807 1211 1391 -165 143 1031 878 855 464 -560 -53 1816 1388 -426 -1141 132
3451 132 383 806 419 -1205 -717 1070 462 -740 29 1080 592 224 257 -372 589 2420 966 -1573
3469 -1573 -567 755 831 667 52 -1445 -612 794 283 -1022 -109 389 98 -527 -190 -93 1271 1955
$$ packed form
3345A001j850k29J497J04L93m23j578N65K178m25k088J2R52j41l4q58j242Q44
3363a322K186j220j995J056J366n0L2r52l30R05J618p41j686L72J571q44m0j53
3381b27j000R75J229j236j860J436J615q43q20p8n27J475J391j473j316J246J328
3398A315r29m50j26j79Q82M05k085q42K297J252j783q96K43M08J071J282j883
3415a8q55J680P05j257J99M61J32L14k19j696K88K169j74k497n46J115j54J265
3433I12J97k016J00K018J80j556L08Q88j53k3l91j024N07J869m28j814p15J273
3451A32K51M23l87j624M88J787o08j202P69J051m88l68L3o29R61J831j454k539
3469a573J006J322P6j64o15j497Q33J406n11j305R13M98k91o25L37R7J364O84
$$ plain form
3487 1955 -53 -1558 194 1552 1042 477 -220 -1114 -327 1163 93 -846 332 581 -349 -860 130
3504 130 168 902 1281 -568 -1078 671 1583 1066 515 -100 -718 477 974 -228 -647 800 454 -1098
3522 -1098 -818 -124 260 821 458 -1354 -1316 1425 2074 466 -343 124 53 974 1447 503 -435 638 492
3541 492 -911 -508 399 594 196 -198 -1537 -827 1573 1615 -294 -428 224 133 845 1103 248 -37 626
3560 626 213 -876 -306 1273 630 -134 -855 -1415 -212 1601 922 -1286 -567 89 480 939 875 337 62
3579 62 1015 418 -763 1028 1672 196 -898 -689 -571 603 1714 288 -1694 -529 869 616 440
3596 440 390 -191 -245 835 78 218 783 1363 92 -558 -422 154 798 1468 -651 -2086 -189 711 -95
3615 -95 -499 303 -457 -488 488 -324 -173 1233 1104 -261 -1079 -219 482 1085 467 -1374 -1816 35 632
$$ packed form
3487A955k008j505J752J358n10n65o97q94P87J490j070r39J178K49r30n11R90
3504A30L8P34L79j849n10J749R12n17n51o15o18J195M97j202m19J447l46j552
3522a098K80O94L84N61l63j812L8K741O49j608q09M67p1R21M73r44r38J073j46
3541D92j403M03R07J95l98l94j339P10K400M2j909j34O52r1P12K58q55k85O63
3560F26m13j089N70J579o43p64p21n60J203J813o79k208P19O56L91M59o4n38k75
3579F2R53n97j181J791O44j476j094K09J18J174J111j426j982J165J398k53j76
3596D40n0n81n4J080p57J40N65N80j271o50J36N76O44O70k119j435J897R00q06
3615i5m04Q02p60l1R76q12J51J406j29j365q18Q60P01O03o18j841m42J851N97
$$ plain form
3634 632 -147 -388 -260 -922 -566 129 -243 -220 531 199 -1217 -1250 718 1030 1119 61 -1368 -766 1015
3653 1015 1030 -200 -478 -434 -265 -165 237 -394 54 1052 -28 -1060 86 1127 1252 541 34 -633 -204
3672 -204 1564 1035 -327 0 857 35 114 395 304 63 278 -478 -1023 373 1445 1241 225 -149 -412
3691 -412 1173 2315 1329 32 72 894 296 442 800 522 190 477 -442 -803 1024 1548 175 -637 -563
3710 -563 241 1346 1859 -8 -418 196 931 340 421 487 56 -200 -19 -603 -473 766 843 -946 -1084 -308
3730 -308 -56 347 431 -486 -798 479 937 -248 37 651 147 -278 -352 -898 -425 1003 110 -1568 -1285
3749 -1285 -157 -239 196 -194 -1322 -1139 160 450 -697 -234 497 -41 -212 46 -171 289 912 -150
3767 -150 -1565 -887 368 284 32 -564 -1123 -453 993 437 -568 270 528 68 132 596 377 700 853
$$ packed form
3634F32p79k41J28o62L56O95l72K3P51l32j416l3J968L12Q9j058j429O02J781
3653A015J5j230k78M4J69J00M02o31M48R98j080j032J146J041J25p11n07o67M29
3672b04J768n29j362L27Q57q22P9K81r1k41K15p56n45J396J072k04j016l74k63
3691d12J585J142r86j297M0Q22n98J46L58k78l32K87r19l61J827N24j373q12P4
3710e63Q04J105N13j867m10O14P35n91Q1O6m31k56J81n84J30J239P7j789j38P76
3730c08K52M03Q4r17l12J277M58j185K85O14n04m25p4n46M73J428q93j678K83
3749a285J128q2M35l90j128J83J299K90j147M63P31n38j71K58k17M60O23j062
3767a50j415O78J255q4k52n96n59O70J446n56j005Q38K58m60O4M64k19L23J53
$$ plain form
3786 853 97 -931 157 1366 630 13 -100 -402 -36 776 452 -993 325 990 -42 -115 608 790
3804 790 683 1217 17 -669 1295 1563 689 110 89 262 448 1125 480 -656 381 930 182 417 662
3823 662 765 504 722 -65 -50 1579 1353 102 113 235 164 562 744 -344 -630 32 252 -503 -281 562
3843 562 329 -47 189 -429 275 1513 1037 -215 -329 558 546 756 721 -296 -536 393 354 -867 -420 425
3863 425 -171 -245 -177 -415 -99 890 -25 -807 -56 668 717 232 280 -205 109 767 376 -111 86 622 -231
3884 -231 -525 126 -254 419 684 -49 -815 243 738 769 365 583 -301 179 1190 446 -352 329 819 -177
3904 -177 -107 422 10 -17 609 -131 -982 575 1011 135 -290 294 29 288 639 -44 -498 477 677 -270
3924 -270 -467 141 219 97 262 -217 -403 693 851 -309 -524 139 -97 657 815 103 -326 326 587 -351
$$ packed form
3786H53p56j028J088J209p36o17j13l02L66Q12l24j445J318O65j032p3P23J82
3804G90j07N34j200o86J964K68q74n79k1J73J86O77o45j136J037N49p48K35K45
3823F62J03k61K18p87J5J629k26j251J1J22p1L98J82j088k86O62K20p55K22Q43
3843E62k33l76K36o18P04J238m76j252j14Q87j2K10l5j017k40R29l9j221M47Q45
3863D25n96p4O8k38L16R89r15p82P51P24M9m85M8m85L14O58l91m87J97N36q53
3884b31k94O51l80O73K65p33p66J058M95L1m04K18q84M80J011p44p98O81M90r96
3904a77P0N29m12k7O26p40q51J557M36q76m25N84k65K59L51o83m54R75K00r47
3924b70j97O08P8j22J65m79j86J096J58j160k15O63k36P54J58p12m29O52K61r38
$$ plain form
3944 -351 -63 672 200 -92 -89 -443 -458 788 446 -831 -264 448 -83 51 422 -433 -333 662 621 3 -17
3965 -17 1017 634 -138 370 -9 310 1129 605 -656 -338 561 270 29 290 -137 -218 623 416 -684 573
3985 573 1291 518 116 589 35 373 1177 127 -712 0 594 30 -339 -38 -338 -296 483 87 -389 100
4005 100 936 280 -219 596 484 444 493 -99 -819 698 654 18 -554 -42 -139 -320 31 -337 -549 222 979
4026 979 -360 -201 150 294 306 710 -139 -475 584 716 -615 -457 155 -123 -156 437 -384 -426 823 564
4046 564 -646 -270 555 30 226 319 -504 -94 734 976 -60 32 612 326 -205 166 -502 29 426 82
4066 82 -1090 -424 392 -57 -103 148 -235 71 1040 701 -395 317 687 291 72 456 44 425 515 74
4086 74 -795 307 772 -105 -196 334 -289 116 762 509 -388 245 554 111 75 196 119 -78 551 -199 -776
$$ packed form
3944c51K88P35m72k92Ll54j5J246l42j277N67P12n31J34L71q55J00R95m1o18k0
3965a7J034l83p72N08l79L19Q19n24j261L18Q99k91k41K61m27q1Q41k07j100J257
3985E73P18p73m02M73n54L38Q04j050q39P12N94n64l69L01l00M2P79l96m76M89
4005A00Q36o56m99Q15j12m0M9n92p20J517m4o36n72N12r7j81L51l68k12P71P57
4026I79j339J59L51J44J2M04q49l36J059J32j331J58O12k78l3N93q21m2J249k59
4046E64j210L76Q25n25J96R3q23M10Q28K42j036R2N80k86n31L71o68N31L97l44
4066H2j172O66Q16m49m6K51l83L06R69l39j096P12L70l96k19L84m12L81R0m41
4086G4q69J102M65q77r1N30o23M05O46k53q97O33L09m43l6J21p7j97O29p50n77
$$ plain form
4107 -776 268 558 -281 -419 135 -103 -102 357 -234 -743 361 373 -383 -182 155 124 100 493 -56 -46 612
4128 612 482 -349 -484 -290 -30 -238 471 -298 -590 363 332 -731 -519 352 356 -200 57 -504 -705 768
4148 768 340 -714 -671 12 -417 4 61 -644 -421 210 160 -692 -366 748 -119 -567 193 133 -82 373 399
4169 399 -252 -323 308 158 72 525 -235 -279 200 46 -651 358 559 -189 -77 384 -219 -73 850 628 -743
4190 -743 -143 582 358 139 593 116 -94 632 203 -370 304 509 -320 -591 -6 258 52 461 248 -317
4210 -317 512 850 277 1 847 -90 -62 498 220 -213 401 344 -787 -411 281 295 213 231 -493 -570 -42 434
4232 434 -54 133 244 16 -111 417 -75 -68 581 642 -801 -424 543 -38 -164 17 -140 -614 632 890
4252 890 -184 -321 241 -232 -290 413 -138 -203 354 381 -176 -105 659 142 -405 -293 -447 -252 531 467 -863
$$ packed form
4107g76J044K90q39j38N54k38JM59n91n09J104J2p56K01L37l1k4L93n49J0O58
4128F12j30q31j35J94K60k08P09p69k92R53l1j063K12Q71Mn56K57n61k01J473
4148G68m28j054M3O83m29M21N7p05K23O31n0q52L26J114q67m48P60o0k15M55K6
4169C99o51p1O31j50q6M53p60m4M79j54o97J009K01p48J12M61o03J46R23k22j371
4190g43O00P25k24k19M54m77k10P26m29n73O74K05q29k71N85K64k06M09k13n65
4210c17Q29L38n73k76Q46r37K8N60k78m33O14n7j131L76O92J4q2J8p24p7N28M76
4232D34m88J87J11k28j27N28m92PO49O1j443L77R67n81j26J81j57m74J246K58
4252H90j074j37N62m73n8P03n51o5N57K7n57P1P64n17n47J12j54J95P83o4j330
$$ plain form
4273 -863 -448 345 -385 -355 374 250 -5 387 82 -752 181 993 212 -285 -208 -71 -303 724 362 -568
4293 -568 -381 154 -353 -12 297 -67 -410 103 -38 -572 229 604 -188 -480 -195 236 404 519 15 -754
4313 -754 -289 98 -25 -292 531 -83 -390 93 -94 -341 707 717 -306 -144 633 168 375 255 -61 -806
4333 -806 233 470 -505 205 193 -138 -554 405 -145 -392 602 891 -440 -341 478 580 117 316 -180 -197
4353 -197 482 522 -376 163 451 -167 -304 -48 -74 90 850 124 -751 -155 592 877 122 228 -152 -390 838
4374 838 324 -220 30 488 -186 -331 639 318 11 175 210 -206 -280 703 157 -297 -22 -160 127 510 331
4395 331 -255 18 784 -227 -124 391 -10 30 195 -111 -605 213 666 274 -913 -50 36 -425 727 371
4415 371 -519 -36 331 -525 -71 419 350 -92 69 -482 -313 424 258 -3 -383 143 179 -173 257 313 -366
$$ packed form
4273h63M15P93p30L0P29j24k55L92l05q34R33Q12p81m97P7J37k32J027l62r30
4293e68J87N35n07L41L09l64l43N13j41n34Q01L75p92k92K85M31J68J15n04p69
4313g54M65L87j23k67Q23o14l07M83j87k47J048J0j023J62P77m65K07j20l16p45
4333h06J039K37r75P10j2l31m16R59n50k47R94K89j331R9Q19J02m63J99m96j7
4353a97O79M0q98N39K88o18j37K56k6J64P60p26q75N96P47K85p55J06l80k38J228
4374H38n14n44K50M58o74j45R70l21l07J64L5m16p4R83n46m54K75j38K87L83j79
4395C31n86K73P66j011J03N15m01M0J65l06m94Q18M53l92j187Q63Q6m61J152l56
4415C71q90M83L67q56M54M90o9m42J61n51J69P37j66k61l80N26L6l52M30N6o79
$$ plain form
4436 -366 4 444 -207 -179 647 313 -434 134 11 190 599 338 -294 -529 246 128 62 549 -53 -555 119
4457 119 459 42 149 765 172 -26 792 659 387 996 466 -288 -70 536 386 182 250 39 -501 375
4477 375 472 -231 102 528 -251 -143 486 315 78 537 357 -744 24 941 21 -97 103 178 -582 584
4497 584 474 -378 169 437 -300 -313 69 44 -2 164 128 -665 -17 935 101 -413 10 -89 -301 245 -173 -82
4519 -82 -254 472 -363 -15 603 -21 29 241 -193 -484 -84 693 -32 -224 254 -82 -238 433 226 -738 -99
4540 -99 173 -172 87 440 38 -428 -236 24 -238 370 592 87 -354 384 97 24 663 236 -224 356 230
4561 230 14 112 665 245 -263 52 -66 -488 738 526 -563 -395 344 468 -18 326 129 -161 387 453
4581 453 -169 83 629 -140 -552 202 15 233 289 235 -446 -474 674 195 205 591 303 -211 321 320 -41 230
$$ packed form
4436c66L70M40o51K8Q26l34p47N68j23J79M09k61o32k35P75j18o6M87o02n02O74
4457A19L40m17J07O16n93j98Q18j33k72O09n30p54K18O06j50k04O8k11n40Q76
4477C75R7p03L33M26p79J08O29j71k37M59j80j101P68R17r20j18K00P5p60J166
4497E84j10q52N47K68p37j3L82k5m6J66l6p93O48R52q34n14M23r9k12N46m18R1
4519h2j72P26q35L48O18o24N0K12m34k91M00P77p25j92M78l36j56O71k07r64O39
4540i9K72l45K59L53m02m66J92K60k62O08K22n05m41P38k87p3O39m27m60N80j26
4561B30k16R8N53m20n08L15j18m22J226k12j089J68P39J24m86L44j97k90N48O6
4581D53o22K52N46p69m12P54j87K18N6n4o81k8J148m79J0L86k88n14N32jl61K71
$$ plain form
4603 230 518 -47 -455 296 263 -164 6 142 -1022 23 911 31 -15 174 12 -449 402 169 -7 169
4623 169 346 -157 -524 212 412 -131 145 101 -485 149 299 -38 -202 219 -13 -259 561 279 -394 2
4643 2 261 -54 -148 286 322 -120 -15 -104 -12 298 700 -148 -456 -184 -368 -220 241 352 -232 132 69 -329
4665 -329 -384 623 -162 -485 48 -239 -379 187 314 -397 -405 101 117 -215 144 -100 -206 294 169 -314 -196
4686 -196 384 -8 -270 159 -211 -270 525 240 -378 -172 488 -270 -299 97 -143 -553 -177 98 -483 55 268
4707 268 -262 -561 96 109 -2 469 245 -271 160 974 -21 -291 238 105 -410 250 220 -324 303 406 -331
4728 -331 -629 409 297 -268 391 471 -288 388 434 -264 155 282 353 74 263 577 -117 388 472 -210 -70
4749 -70 471 355 2 398 494 19 489 654 66 -140 450 348 -316 258 494 -130 206 549 -512 68
$$ packed form
4603B30K88n65m08P51l3m27J70J36j164J045Q88q80m6J89j62m61Q51k33j76J76
4623A69J77n03l67P36K00n43K76m4n86O34J50l37j64M21k32k46Q20k82o73L96
4643BK59l15r4M34L6m42J05q9R2L10M02q48l08K72j84J48M61J11n84L64o3l98
4665c29n5J007p85l23N33k87j40N66J27p11qN06J6l32L59k44j06N00j25m83J18
4686a96N80l92k62M29l70n9P95k85o18K06O60p58k9L96k40m10L76K75n81N38K13
4707B68n30k99O57J3j11M71k24n16M31Q14r95k70N29j33n15O60l0n44O27J03p37
4728c31k98J038j12n65O59Q0p59O76M6o98M19J27P1k79J89L14o94N05Q4o82J40
4749g0N41j16l53L96R6m75M70J65n88k06N90j02o64N74K36o24L36L43j061N80
$$ plain form
4769 68 736 -80 -88 436 175 -54 400 659 -251 -7 249 106 -278 451 162 -212 129 264 -368 -232 389
4790 389 -262 -805 -136 -144 -289 -84 -35 -555 -226 -83 -22 -327 122 113 -285 -36 -15 -609 -297 583 -291 -542
4812 -542 -8 -132 -493 166 24 -619 -53 135 -519 -609 118 129 -111 -164 -84 -593 91 504 -298 -809 -205
4833 -205 -87 -190 250 -16 -639 -66 385 -140 -593 850 394 196 25 31 -107 222 410 -157 -175 273 567
4854 567 -143 182 224 -337 -128 446 -109 105 -15 264 -365 172 320 -23 368 531 -236 -129 605 505
4874 505 80 100 432 10 185 683 -120 53 419 -28 29 496 228 -7 442 188 -150 47 724 423 34
4895 34 339 624 -213 4 472 -127 134 399 -25 -84 43 446 -144 238 330 -177 151 638 235 -221 273
4916 273 85 -286 508 551 -186 115 105 -497 -173 526 340 -5 65 165 -269 226 574 321 -338 248 -83
$$ packed form
4769F8O68q16qN24k61k29M54K59r10K44K56j43l84P29k89l74L41J35o32J36O21
4790C89o51n43O69qj45K05M9n20L29J43O1l05M49rl98K49K1n94L12Q80q74k51
4812e42N34j24l61O59j42o43N66J88o54r0P27J1k40n3Q0n09O84M13q02n11O04
4833b05J18j03M40k66o23N73M51n25m53J443m56j98j71Oj38L29J88n67j8M48K94
4854E67p10L25M2n61K09N74n55K14j20K79o29N37J48l43L91J63p67J07P34j00
4874E05m25K0L32m22J75M98q03J73L66m47N7M67k68k35M49k54l38J97O77l01l89
4895C4L05K85q37K17M68n99K61K65m24n9J27M03n90L82R2n07L28M87m03m56M94
4916B73j88l71P94M3p37L01j0o02L24O99j86l45P0J00m34M95L48k53o59N86l31
$$ plain form
4937 -83 -225 188 228 -190 120 643 -93 -258 291 464 -26 159 259 -33 125 329 -235 -558 454 4
4957 4 -42 446 344 -208 106 365 -196 -67 457 229 -256 76 -119 109 228 330 41 -284 384 414 50
4978 50 220 -58 -173 -64 543 -45 26 965 329 -248 203 643 241 219 365 -171 -512 345 -50 -483 350
4999 350 281 -362 335 513 74 70 562 94 -323 187 265 1 129 238 -295 98 569 -97 -327 423 66
5020 66 -339 215 -40 68 -95 281 -342 -440 352 217 -334 -239 -28 -746 -113 6 -24 -490 326 -264 -907
5041 -907 -148 164 -294 222 116 -544 -357 257 97 -181 250 -92 -406 17 479 55 99 232 270 -443 19
5062 19 269 -158 164 289 50 -193 403 173 -267 129 138 -313 349 464 -78 -227 343 186 16 223 160
5083 160 231 106 479 -346 150 950 144 21 215 234 -339 419 787 26 -66 380 263 31 636 470 -47
$$ packed form
4937h3j42M13M0m18L10N23p36j65N49J73m90J85J00k92J58K04n64l23J012m50
4957Dm6M88j02n52L14K59n61J29N24k28m85L32j95K28J19J02k89l25O68L0l64
4978E0J70k78j15J09O07n88P1R39o36n77M51M40m02k2J46n36l41Q57l95m33Q33
4999C50o9o43O97J78m39mM92m68m17N10P8k64J28J09n33L93M71o66k30P50l57
5020F6m05N54k55J08j63L76o23r8P92j35n51R5K11p18O33J19l0m66Q16n90o43
5041i07P59L12m58N16j06o60J87O14j60k78M31l42l14M23M62m24M4J33L8p13M62
5062A9K50m27L22J25k39k43N96k30m40L96Rm51O62J15n42j49N70j57j70K07o3
5083A60P1j25L73q25M96Q00q06j23J94J9n73P58L68p61r2M46j17k32O05j66n17
$$ plain form
5104 -47 -211 450 -300 296 552 130 -49 -40 291 211 253 290 -441 -206 373 -54 -90 452 408 -362 -173 2 -248
5127 -248 -39 616 -376 -839 -64 -201 -342 470 319 -450 -405 44 -299 -458 204 66 -761 -400 -5 -297
5147 -297 -170 213 -694 -563 -153 -87 -388 -122 -328 -691 -568 -107 -53 -368 51 -191 -1122 -222 89 -335 167
5168 167 -141 -528 -972 -61 131 -248 -182 -102 -721 -261 217 -705 -355 365 -133 -568 118 329 -204 -106 150
5189 150 -286 -523 398 -76 126 91 -191 -415 -170 387 -261 -157 73 -18 -502 122 411 -111 187 92 -185
5210 -185 -38 666 104 50 84 74 -240 275 464 196 142 507 4 -409 620 516 39 247 25 -133 123
5231 123 677 317 -491 303 32 -217 88 226 -22 -309 165 -171 -88 534 266 -188 -226 61 -52 209 486
5252 486 -210 -497 154 -138 -359 277 447 -489 -279 83 -473 -200 281 67 -400 -165 -183 -702 119 140 -615
$$ packed form
5104d7j64O61p50N96K56m22j79RL31q0M2L7p31K35N79m27l6N42m4p70J89J75k50
5127b48K09O55r92m63P75j37j41Q12j51p69M5M49l43j59O62j38q27L61L95k92
5147b97J27L83r07J31M10O6l01K66k06l63J23M61N4l15M19k42r31R00L11m24N02
5168A67l08l87m44R11J92l79O6Q0o19M60M78r22L50P20m98m35O86K11n33R8K56
5189A50m36k37R21m74K02l5k82k24K45N57o48J04K30r1m84O24K89n22K98r5k77
5210a85J47P04n62n4L4j0l14N15J89k68n4L65n03m13J029j04m77K08k22j58K56
5231A23N54l60q08P94k71k49L05J38k48k87M74l36Q3O22k68m54l8K87j13K61K77
5252D86o96k87O51k92k21O36J70r36K10L62n56K73M81k14m67K35j8n19Q21K1p55
$$ plain form
5273 -615 -287 24 -53 -374 -14 -35 -387 -151 179 -449 -232 422 -287 -623 -329 187 -306 277 234 -677 -652
5294 -652 -60 181 -525 257 318 -627 -506 482 -335 -246 230 -63 -806 -198 153 -83 52 556 -631 -417
5314 -417 -114 -283 -440 79 468 -507 -273 0 -103 37 433 -228 -251 29 233 -201 141 -43 -597 -302
5334 -302 251 -519 -681 -36 -124 -748 -138 136 -98 -152 404 -222 -524 316 307 96 204 206 -538 -155 556 -21
5356 -21 -212 174 201 -612 154 320 -140 38 326 -341 -317 137 341 -506 -168 -309 -174 -78 270 -153 -293
5377 -293 221 -127 -564 -20 145 -254 -255 112 -425 -137 306 -108 19 -39 48 -141 53 761 -342 -227 394
5398 394 97 -119 128 310 -101 204 47 -289 -136 551 172 -152 160 197 30 -70 768 39 -70 395
5418 395 43 -124 455 310 -184 20 373 -39 48 693 84 -492 -5 417 -25 36 580 139 90 689 372
$$ packed form
5273f15L28L11p7l21L60k1l52K36L30o28K17O54p09l36K94N16m93N83m3r11K5
5294f52N92K41p06P82O1r45J21R88q17Q9M76k93p43O08L51k36J35N04j187K14
5314d17L03j69j57N19L89r75K34K73j03J40L96o61k3K80K04m34L42j84n54K95
5334c02N53p70j62O45q8o24O10K74k34n4N56o26l02Q40rk11J08Kp44L83P11n77
5356b1j91L86K7q13P66J66m60J78K88o67K4M54K04q47L38j41J35R6L48m23j40
5377b93N14l48m37N44J65l99jL67n37K88M43m14J27n8Q7j89J94P08j103J15O21
5398C94k97k16K47J82m11L05j57l36J53O87l79l24L12L7j67j00Q38p29j09M65
5418C95l52j67N79j45m94K04L53m12Q7O45o09n76M87M22m42O1N44m41m9N99l17
$$ plain form
5439 372 -110 577 224 -129 143 131 -125 -35 525 -40 -389 527 259 -528 -26 351 -618 1 347 -79 -200
5460 -200 327 123 -526 40 228 -120 -135 219 -301 -493 283 76 -260 254 51 -413 -24 271 -175 -114 210
5481 210 277 -282 181 370 48 -10 310 17 -164 384 241 -238 -72 -109 -448 -231 145 -261 -124 63 145
5502 145 -180 141 226 -211 -45 290 -21 140 444 319 -228 127 176 -534 -61 475 -626 -231 149 -75
5522 -75 -460 410 344 -364 69 226 -201 -166 647 -163 -579 191 156 -230 174 638 -241 -327 329 259 -345 429
5544 429 366 103 -42 370 -169 231 578 118 -269 468 357 227 169 607 -614 159 565 148 -300 465
5564 465 314 -209 65 395 224 339 476 326 -329 578 417 243 424 454 -87 -174 958 356 2 612
5584 612 25 -358 179 463 479 222 435 -64 -54 287 308 -97 437 190 -377 147 619 198 125 480 303
$$ packed form
5439C72m82O87l53l53K72j2k56R0N60n65l49R16k68p87N02L77r69O19L46m26j21
5460b00N27k04o49N66J88l48j5L54n20j92P76k07l36N14k03m64L89K95m46O1L24
5481B10O7n59M63J89l22n8L20k93j81N48j43m79J66l7l39K17L76m06J37J87Q2
5502A45l25L21Q5m37J66L35l11J61L04j25n47L55M9p10M73N36j101L95L80k24
5522g5l85Q70o6p08M33J57m27L5Q13q10m16P70l5l86M04M64q79q6O56p0o04P74
5544D29o3k63j45M12n39M00L47m60l87P37j11j30n8M38j221P73M06m17m48P65
5564D65j51n23K74L30j71J15J37j50o55R07j61j74J81L0n41q7J132o02l54O10
5584F12n87l83N37K84J6k57K13m99J0L41K1m05N34k47n67N24M72m21p3L55j77
$$ plain form
5605 303 -405 306 415 226 196 431 -171 -105 602 600 -160 187 432 -350 639 1046 279 403 421 -121 -270 392
5627 392 444 -78 34 -25 -170 220 649 277 -142 18 -25 -460 508 337 260 -156 134 -166 -129 204 448 -130
5649 -130 -267 -161 -258 -54 456 232 -509 165 -176 66 -124 483 -352 -160 176 110 -39 697 396 -456 -75
5670 -75 -35 -172 296 401 -55 -577 -122 181 -335 405 644 -370 -257 49 90 -63 569 532 -303 59 255
5691 255 44 232 935 -223 -436 228 402 -43 330 83 -281 -465 304 84 57 759 -46 -548 -132 436
5711 436 53 247 160 -462 -332 228 374 -226 141 436 -451 -640 449 111 -86 229 -254 -821 -7 406
5731 406 -121 115 416 -118 -254 416 189 60 41 189 -540 -10 434 544 153 -9 -314 -273 560 427 223
5752 223 367 175 -56 -230 284 218 -217 346 100 -467 -228 396 76 100 146 -166 -124 420 516 -34 -183 -44
$$ packed form
5605C03p08P11J09j89l0K35o02O6P07kp60L47K45p82R89M07p67J24J8n42j49O62
5627C92N2n22J12n9j45L90M29l72m19J60m3m35R68j71p7m16K90l00L7L33K44n78
5649a30j37J06r7K04N10k24p41O74l41K42j90O07q35J92L36o6j49P36l01q52L81
5670g5M0j37M68J05m56n22M55L03n16P40K39j014J13L06M1j53O32l7q35L62J96
5691B55k11J88P03j158k13O64J74m45L73k47l64j84P69k20k7P02q05n02M16N68
5711D36l83J94q7o22J30N60J46o00L67K95q87j89J089l38j97L15m83n67Q14M13
5731D06n27K36L01n34j36O70k27j29j9J48p29N30M44J10l91j62l05M1Q33j33k04
5752B23J44j92k31j74N14o6m35N63k46n67K39O24l20K4M6l12M2N44R6n50j49J39
$$ plain form
5774 -44 -107 36 602 326 -106 -52 -126 -243 251 514 -82 -273 -48 -279 -145 762 473 -269 12 -53 -417 -56
5796 -56 298 -16 -503 -197 -351 -664 -10 715 -253 -382 90 -534 -320 489 203 -647 -279 11 -557 -121
5816 -121 94 -236 -649 26 -287 -520 113 285 -554 -297 -121 -257 -273 400 -150 -790 -393 102 -194 165
5836 165 121 -219 -746 -137 -178 -328 183 130 -359 -671 -24 26 108 262 233 -809 -211 178 -169 320 -49 -397
5858 -397 -615 -6 -316 -262 534 -43 -261 -114 195 -99 252 398 -228 -227 13 626 209 181 233 -116 -207 153
5880 153 294 -88 281 -41 -233 -238 342 502 312 343 -131 -630 734 372 294 724 174 -95 229 657 239
5901 239 -97 456 90 -210 308 360 132 243 169 -357 -170 456 565 93 395 517 -137 55 413 -140 33
5922 33 160 -16 -384 136 428 -279 -78 127 -207 -228 593 -1 -3 85 -8 -388 -213 696 57 -126 75 -420
$$ packed form
5774d4o3J43N66k76m32N4p4j17M94K63n96j91K25k31J34R07k89p42K81o5l64L61
5796e6L54l14m87L06j54l13O54P25r68j29M72o24K14Q09k86q50L68K90n68M36
5816a21K15l30m13O75l13k33O33J72q39K57J76j36j6O73n50o40L97M95k96L59
5836A65m4l40n27O09m1j50N11n3m89l12O47N0Q2J54k9j042N98L89l47M89l69l48
5858c97k18O09l10N4P96n77k18J47L09k94L51J46o26JK40O13m17k8N2l49r1L60
5880A53J41l82L69l22j92nN80J60j90L1m74m99J364l62p8M30n50k69L24M28m18
5901B39l36N53l66l00N18N2k28J11p4n26J87O26J09m72L02J22o54J92L58n53J73
5922C3J27j76l68N20K92p07K01K05l34k1Q21n94kQ8r3l80J75R09o39j83K01m95
$$ plain form
5944 -420 -563 273 492 -162 -263 -160 -350 -101 778 119 -373 -72 -107 -267 48 375 -145 -282 -145 97
5964 97 -183 224 107 -284 -251 142 -528 -111 427 -56 -249 -153 -46 -591 -119 507 -536 -192 217 -292 -150
5985 -150 516 406 -428 93 -23 -125 -212 220 6 -130 -321 16 -410 382 416 -560 -202 132 16 -355 482
6006 482 231 -371 106 28 77 182 461 -250 -338 198 296 -227 383 100 -244 -243 290 -49 -146 524 136 -500
6028 -500 147 255 -67 -146 256 144 -151 409 64 -328 323 151 -265 -165 191 111 -13 211 -57 -238 379
6049 379 462 227 -101 293 -484 -369 319 219 -397 10 20 -327 -233 382 30 -185 308 -313 -415 159 204
6070 204 -4 133 153 -465 -112 195 -166 -379 135 233 -573 -230 391 15 -249 114 9 -443 480 516 -346
6091 -346 70 447 -228 -76 343 10 -93 16 -204 -152 148 224 -69 112 -91 -91 -115 432 348 -149 18 -24
$$ packed form
5944d20j43Q36K19o54j01J03j90K49Q79o59m92L01l5j60L15L27n20j37J37K42
5964I7k80M07j17l91L3L93o70M17N38m83j93R6J07n45M72O26j043L44M09n09J42
5985a50O66j10q34N21j16j02q7M32k14j36j91L37m26P92L4r76L58L34j16l71Q37
6006D82k51o02M77p8M9J05K79p11q8N36R8n23O10k83l44JN33l39r7O70l88o36
6028e00O47J08l22p9M02j12k95N60l45l92O51j72m16J00L56q0j24K24k68j81O17
6049C79Q3k35l28L94p77J15O88j00o16M07J0l47R4O15l52k15M93o21j02N74M5
6070B04k08J37K0o18L53L07l61k13N14R8q06L43O21l76k64L63j05m52R23L6q62
6091c46M16L77o75J52M19l33j03J09k20N2L00P6k93J81k03%k4N47q4m97J67m2
$$ plain form
6113 -24 -269 39 408 42 -107 124 86 -463 277 347 -236 -258 89 -336 -72 273 259 -243 -31 402 -14 -78
6135 -78 400 -475 -13 208 174 -124 339 477 -268 -93 29 -162 201 425 334 80 -196 -34 -140 295 110
6156 110 -63 -213 250 -37 -329 346 352 -165 -60 368 -48 79 314 -139 -477 224 397 -18 135 349 -278
6177 -278 -200 420 6 -512 161 -191 -603 -175 381 -11 -203 388 -273 -401 45 -99 -206 -21 85 -706
6197 -706 -315 439 -185 -121 32 -3 -689 -173 181 -364 -235 -26 -391 -411 161 223 -192 -136 124 -307 -90 381
6219 381 -110 -389 -39 89 -237 153 158 41 -379 198 -156 -380 563 200 -170 -154 94 -393 32 331 147
6240 147 -262 20 -41 -5 787 137 -122 -146 446 -65 -52 496 131 -50 312 227 -99 321 448 27 -275 210
6262 210 -37 -141 366 457 -109 -151 201 -94 771 302 355 -489 19 209 55 381 361 -190 -293 53 95 101
$$ packed form
6113b4k45L08L69l66j49K31l8n49P40P0n83k2L47m25K64L45j4n02K12M33m16o4
6135g8M78q75M62K21l4k98M63J38p45J75J22j91L63K24r1k54k76J62j06M35j85
6156A10j73j50M63k87k92O75On17J05M28m16J27K35m53l38P01J73m15J53K14o27
6177b78P8O20m14n18O73l52m12M28N56l92j92N91o61j28M46j44j07J85J06p91
6197g06L91P54o24O4J53l5o86N16L54n45J29K09l65k0N72O2m15N6K60m31K17M71
6219C81m91k79L50J28l26L90Nj17m20N77l54k24R43l63l70J6K48m87M25K99j84
6240A47m09K82o1L6P92o50k59k4N92n11J3N48l65j81L62q5l26M20J27m21l02M85
6262B10k47j04N07R1n66m2L52k95Q65m69N3q44N08J90j54L26k0n51j03L46M2O
$$ plain form
6284 101 513 199 -373 -405 319 -239 -169 649 -159 -370 -25 119 11 265 31 -292 -361 125 83 -89 -37 31
6306 31 -807 -416 149 -114 18 47 -484 -465 -170 45 -372 216 -232 -452 -437 238 33 -169 -38 -346 -792
6327 -792 -129 187 -54 -259 -244 -430 -559 147 314 -218 -232 -36 -750 -289 393 -1 -261 -247 -467 -308 81
6348 81 205 -331 -275 -40 -339 -275 451 313 -280 -169 -150 -819 -263 373 50 -98 -454 -270 -153 332 353 -134
6370 -134 -472 -46 128 -165 220 154 -149 -135 -167 -400 -110 316 99 -422 69 -44 191 346 388 -325 -497
6391 -497 74 145 47 589 54 -214 -183 157 -177 301 505 -196 -498 33 -112 71 359 205 -365 -178 -48
6412 -48 270 95 282 -6 -736 -98 643 325 254 470 -189 -220 86 17 -119 343 117 -466 -113 29 71 164
6434 164 623 -124 -385 163 -46 92 -176 33 -752 -485 44 485 293 394 24 -631 -265 221 322 251
$$ packed form
6284A01M12l14n72l2P24n58P0Q18q08k11L45J44j08K54k34l23o9M86m2j72N2O8
6306C1q38L91N65k63J32K9n31J9K95K15m17N88m48k20J5O75k05k02J31l08m46
6327g92O63L16k41k05J5j86j29P06J67n32j4J96p14M61O82l94k60J4k20J59L89
6348H1J24n36N6K35k99O4P26j38n93J11J9o69N56O36l23j48l56J84J17M85K1m87
6370a34l38M26J74k93L85o6l03J4l2k33K90M26k17n21M91j13K35J55M2p13j72
6391d97N71P1r8N42n35k68L1L40l34M78K04p01l02N31j45J83K88j54n70J87J30
6412d8L18j75J87k88p30O38P41l18p1K16o59l1L06o9j36M62k26n83L53J42M2R3
6434A64M59p47k61N48k09J38k68K09p85K67N29M41j92J01l70o55L66M86J01p1
$$ plain form
6454 251 178 -169 -314 28 185 36 -100 -23 -793 -397 -5 92 -139 -28 -339 -768 73 438 224 -49 270
6475 270 -485 -537 240 271 -95 237 -315 -308 94 358 44 -35 -398 -601 -512 120 405 -351 -290 -20 -627 -300
6497 -300 366 99 -255 -117 -419 -380 -13 446 258 -299 -37 -522 -316 602 542 -63 -143 98 -165 -319 546
6518 546 197 26 -98 -382 -293 267 295 17 -322 -116 -141 39 849 292 -137 -296 -68 -7 220 366 -86
6539 -86 -38 -280 161 -116 397 580 -301 -268 20 -95 -10 865 386 -405 -94 -40 -71 299 447 298 -155 -168
6561 -168 160 398 248 458 -337 -277 -163 72 86 99 299 -695 -64 357 -74 78 405 -317 -419 -207 -296
6582 -296 430 162 94 -360 -376 -49 -74 8 708 -250 -443 74 20 -221 -123 135 -490 -445 -5 223 -156 245
6604 245 4 -491 -427 108 248 99 20 -507 -476 77 114 -206 -203 17 -457 -577 -63 103 162 285 -232 -478
$$ packed form
6454B51p3l47j45L42J57j49j36P7p70L96L92R7k31J11l11m29Q41L65k14k73L19
6475B70p55n2P77L1l66L32n52PM02K64l14p9l63k03Q9O32K85p56O1K70o07L27
6497c00O66k67l54J38l02L9L67M59j88n57K62m85K06R18o0o05q0K41k63j54Q65
6518E46l49j71j24k84Q9N60K8k78l39K06k5J80Q10n57m29j59K28O1K27J46m52
6539h6M8k42M41k77N13J83q81L3K88j15Q5Q75m79p91L11N4l1L70J48j49m53j3
6561a68L28K38j50K10p95O0J14K35J4J3K00r94O31M21m31J52L27p22j02K12q9
6582b96P26k68o8m54j6L27k5Q2P00r58j93N17n4k41R8K58o25M5M40K28l79M01
6604B45k41m95O4N35J40j49p9n27L1N53L7l20LK20m74j20N14J66N9J23n17k46
$$ plain form
6626 -478 -56 523 130 88 256 43 -392 37 233 65 113 212 -450 -304 383 -72 -193 81 -62 -566 32
6647 32 557 185 12 21 -55 -359 290 321 -49 -41 -125 -625 -396 284 18 302 66 -78 -287 -156 257 9 -246
6670 -246 134 -78 -275 271 62 -67 169 93 -202 -178 457 -166 -12 49 -335 -250 243 394 -670 -385 242
6691 242 -266 -233 395 305 -367 -197 175 -98 31 22 -142 -249 -198 -228 -90 194 210 -266 -250 199 157 -276 179
6714 179 -105 -384 -167 -61 -254 -119 64 -45 -535 -10 183 -209 256 183 -276 -44 116 -152 -106 133 -121
6735 -121 -4 83 34 -392 137 42 -176 -340 17 -2 -74 22 205 -119 -80 60 81 -228 488 -87 -25 -65 360
6758 360 38 34 16 -74 -204 2 72 -98 154 -24 -692 -193 152 -284 47 248 147 16 -170 5 -139 -3
6780 -3 145 -126 -77 171 26 185 123 -41 -522 276 266 66 323 4 -328 -56 150 260 82 307 366 -419
$$ packed form
6626d78M22N79l93m2J68k13m35M29J96j68M8R9o62J46O87m55j21K74j43n04N98
6647C2N25l72j73Rp6l04O49L1l70Qq4n00K29O80k66K84k36j44k09J31M13k48k55
6670b46L80k12j97N46k09j29K36p6k95K4O35o23J54O1l84Q5M93J51j064K85O27
6691B42n08L3O28r0o72J70L72k73J29rj64j07N1l0J38K84J6m76J6M49m2m33M55
6714A79k84k79K17J06j93J35J83j09m90N25J93l92M65p3m59K32J60k68M6K39k54
6735a21J17Q7m9m26N29r5k18j64L57j9p2R6J83l24L9J40K1l09P16n75O2m0M25
6758C60l22mj8r0j30K06P0j70K52j78o68M99L45m36L31K01j01j31j86J75j44J36
6780cJ48k71M9K48j45J59o2j64m81P98j0k00K57l19l32K72K06J10j78K25N9p85
$$ plain form
6802 -419 -199 243 -247 -170 154 86 -342 400 392 -87 -77 -42 -254 -124 289 68 -240 445 159 -382 -236 49
6824 49 -51 -45 272 -42 132 160 25 -214 233 -60 -269 72 244 99 -46 23 128 -285 63 397 -298 6
6846 6 274 97 194 191 -141 -343 -22 18 -79 -230 61 -43 -37 -26 185 -101 14 312 -239 -225 558 113 -204 49
6870 49 2 -635 -46 -64 -81 -123 -141 106 -345 -67 -437 192 391 52 -78 -268 335 -134 2 173 75 -300
6892 -300 -12 234 -43 -50 270 18 -276 220 283 -144 34 204 -291 -186 191 270 114 261 -84 -43 -84 -30
6914 -30 185 131 745 2 -113 276 511 153 85 424 188 108 346 219 224 163 -41 -30 336 616 -54 439 305
6937 305 -44 -167 471 646 125 -309 -104 -228 250 884 190 -275 393 8 38 526 159 -6 264 23
6957 23 -258 -61 322 586 81 210 -3 -110 532 498 140 -280 47 -152 -81 353 252 159 352 250 -77
$$ packed form
6802d19K20M42m90P7L24o8m28P42qm79J0L5k12J30M13k21l08O85k86n41J46K85
6824D9j00OL17l14J74K8j35k39M47k93k09L41J72j45j45O9J05m13L48L34o95L04
6846FK68j77R7ll32k02L21M0r7j51K91j04OJ1K11k86J15K98n51J4P83m45l17K53
6870D9m7o37N89j8j7m2j8K47m51K78l70O29J99l39j30j90O03m69J36J71r8l75
6892c00K88K46k77pL20k52k94M96O3m27J78J70m95J05L77P9j56J47l45M1m1N4
6914c0K15n4O14p43j15L89K35l58o8L39k36q0K38j27No1k04J1L66K80o70M93j34
6937C05l49j23O38J75n21m34K05j24M78O34o94m65O68l85L0M88l67j65K70k41
6957B3k81J97L83K64n05J29k13j07O42l4l58m20L27j99P1M34j01r3J93j02l27
$$ plain form
6978 -77 387 38 328 -442 -53 -59 42 390 458 -199 -167 138 -353 89 252 102 -277 -103 250 -190 -188 54
7000 54 -157 -249 -12 115 -40 347 209 69 -282 -10 54 -49 119 226 -284 55 -46 296 149 353 -192
7021 -192 -6 48 295 144 255 309 -327 -430 -44 301 241 374 16 -195 280 264 176 107 315 -189 -77 97
7043 97 401 248 204 81 -204 -60 474 400 46 344 -237 -218 -173 332 510 189 93 -322 48 340 430 -43
7065 -43 63 -160 -212 77 209 86 49 282 -116 -175 301 587 174 57 211 -137 -166 553 88 64 198 -277
7087 -277 -187 321 517 133 -398 19 -143 52 391 480 68 -173 -103 -238 192 500 156 -232 -110 -62 18 326
7109 326 362 15 -265 159 -379 24 665 40 -182 -333 -55 107 615 959 128 7 196 -55 207 140 329
7130 329 -232 -570 -106 114 46 456 145 -334 -437 -123 -11 733 508 249 -467 -236 -29 215 535 234
$$ packed form
6978g7M64l49K90p70L89oJ01L48O8o57L2L05m91M42J63j50l79J74L53m40KK42
7000E4k11r2K37J27j55L87j38j40l51K72O4j03J68J07n10L39j01L42j47K04n45
7021a92J86N4K47j51J11N4o36j03L86L45o0J33l58k11M75j6q8o9K08n04J12J74
7043I7L04j53m4j23k85J44N34p4l54K98n81J9M5N05J78l21r6m15L70K92R0m73
7065d3J06k23n2K89J32j23l7K33l98n9M76K86m13j17J54l48k9P19m65k4J34m75
7087b77R0N08J96l84n31M17j62J95L39Q9m12k41P0j35M30L08l44l88J22M8Q0L08
7109C26L6l47k80M24n38M03O41o25k22j51K78J62N08L44q31j21J89k51K62o7J89
7130C29n61l38M64K20o8M10l11m79j03L14J12P44k25k59p16K31K07K44L20l01
$$ plain form
7150 234 122 -176 -117 21 253 320 33 -161 109 41 222 287 130 93 -273 46 369 -151 525 -58 -542 -274
7172 -274 521 138 175 413 107 -261 -53 303 339 500 173 -190 -654 -177 620 113 86 -41 -483 -107 514
7193 514 629 51 381 41 -254 39 511 -59 410 -122 -405 -186 327 151 62 302 -33 -257 296 591
7213 591 217 290 166 -80 -18 293 463 274 199 -70 -341 -111 464 347 -112 333 -15 -375 190 583 -31
7234 -31 -351 -264 158 -253 487 94 -10 -118 -236 -326 -131 593 247 -179 -160 -351 -37 92 615 -14 -408
7255 -408 -106 -57 33 295 285 -13 -140 -141 -216 -32 349 51 -315 -173 133 -80 299 257 -459 -200 -379 -546
7277 -546 -132 243 136 -514 104 -277 -79 78 305 -178 -500 -193 -209 -18 565 457 -270 -356 72 -24 -242
7298 -242 107 -305 -502 -476 43 113 484 598 -427 -351 260 275 130 67 56 -183 -97 400 118 140 319 -191
$$ packed form
7150B34j12k98N9J38K32O7k87j94K70o8J81O5j57l7l66L19L23n20O76n83m84K68
7172b74P95l83L7K38l06l68K08L56L6J61l27l63m64M77P97n07k7j27m42L76O21
7193E14J15n78L30l40k95K93M72n70M69n32k83K19N13j76q9K40l35k24N53K95
7213E91l74P3j24k46O2L11J70j89p5k69k71K30N75j17m59M45l48l60N65L93o14
7234c1l20Q7M22m11P40l93j04j08j18r0J95P24l46m26J9j91L14J29N23o29l94
7255d08L02M9R0K62j0k98j27jp5J84L81k98l66J42L06k13L79m2p16K59j79j67
7277e46M14L75j07o50O18l81J98J57K27m83l22L07j6J91N83j08p27q6M28r6k18
7298b42L49m12j97K6N19P0L71J14j025P6O11J5j45o3j1k39Q6M97k82K2J79n10
$$ plain form
7320 -191 -97 -97 -9 -58 184 -54 -109 171 68 427 595 135 64 -414 79 55 130 72 219 -21 -314 10 372
7343 372 375 203 100 -179 -209 296 24 -79 128 -97 -319 61 315 61 -131 342 -243 -393 271 152 78
7364 78 175 80 -64 -219 153 -44 68 160 -246 -217 80 -40 -16 -32 97 -235 -293 426 211 -174 65 100 -192
7387 -192 165 334 -194 -430 -228 -304 -367 -82 114 -242 -187 59 -162 -204 227 36 -128 -312 -135 -343 14
7408 14 218 -38 -154 -130 125 -135 -12 185 -85 -191 113 -454 250 335 -31 -241 -197 -14 -481 400 76
7429 76 -341 -74 -46 -231 -56 378 350 -181 -130 29 -93 97 388 116 -351 -153 167 -120 265 177 -227 -249
7451 -249 404 -30 -75 79 1 -282 254 286 -192 -39 41 -90 -356 193 202 -2 120 22 17 -391 -13 -154 86
7474 86 -30 -17 -95 -297 294 71 5 235 -168 -95 109 1 -374 -80 156 -402 219 287 -55 76 244 -25
$$ packed form
7320a91R4%Q8m9K42k38n5K80j03L59J68m60p1m78M93k4P5n8J47k40k93L24L62
7343C72Lj72j03k79l0N05k72j03K07k25k22L80K54k54j92M73n85j50O64j19p4
7364G8R7r5j44j55L72j97J12R2m06K9K97j20K4j6J29l32n8P19k15l85K39L5k92
7387a92L57J69n28k36K02p6o3K85J96l56N5K46k21m2M31j91j64j84J77k08L57
7408A4K04k56j16K4K55k60J23J97k70j06L04n67P04Q5l66k10M4J83m67Q81l24
7429G6m17K67K8j85J75M34k8n31N1J59j22J90K91k72m67J98L20k87L85q8m04k2
7451b49O53m34m5J54p8k83N36L2m78J53Q0j31k66N49Rk04J22r8nm08L78j41K40
7474H6j16J3p8k02N91k23o6K30m03P3K04j08l75K94K36n58O21O8l42J31J68k69
$$ plain form
7496 -25 -37 -146 172 26 -21 271 -186 -379 -92 -2 -187 115 -158 -199 -179 260 58 -105 39 -24 9 -19 84
7519 84 112 130 -300 -169 -43 -272 67 -455 99 108 -178 -150 41 -180 -213 369 -107 12 -120 171 388 411 74
7542 74 -124 -99 59 356 -427 -246 -163 -71 -79 40 -34 -292 169 -22 -77 171 117 51 282 -252 -53 -3 638 80
7566 80 -559 32 74 -78 269 412 -357 242 307 -265 -314 79 -34 -111 -100 39 -130 216 220 298 -323 259 316
7589 316 -47 -141 -174 -300 -87 152 223 43 -120 -64 -206 81 -101 -93 92 149 -84 -267 -152 2 -47 323 29
7612 29 7 -19 251 -203 40 470 -122 -89 170 306 64 224 -6 7 6 224 93 199 86 123 -110 -101 -97 189
7636 189 -362 85 -266 -311 -99 91 -49 -283 -78 -207 -290 194 224 -3 -30 61 -202 -221 242 35 -193 286
7658 286 102 -438 59 243 -226 169 80 -5 -159 233 -17 -169 -31 -353 -103 99 316 -191 -13 70 -70
$$ packed form
7496b5j2j09L18j46m7K92m57j93K87R0j85L02k73m1K0M39k02j63J44o3L3k8J03
7519H4K8J8m30J31J26k29L39n22N54Rk86K8J91k21l3N82m76J19j32K91K17K3l37
7542G4j98K5J58K97p83J81Q3R2qJ19p4k58M61j91n5K48n4o6K31n34J99N0O41n58
7566H0o39N91M2j52L47J43p69N99O5n72m9L93j13p7J1J39j69L46MP8o21N82N7
7589C16l63r4l3j26K13K39P1j80j63N6j42K87j82QJ85N7k33j83J15J54m9L70k94
7612B9k2k6K70m54K43M30n92L3K59J36k42J60k30J3jK18j31J06j13L7k33RMK86
7636A89n51M47l51m5K12J90j40k34K05j29q3M84L0k27k7R1k63j9M63k07k28M79
7658B86j84n40M97J84m69L95q9q5j54L92k50j52J38l22K50K02K17n07J78Q3j40
$$ plain form
7679 -70 -229 263 27 15 162 -343 -218 -211 -18 -179 -15 -9 -80 -145 -50 398 -402 -389 -39 -219 25 154 119 -411
7703 -411 -174 58 -170 -233 -59 -87 -436 240 -36 0 86 176 -152 -348 -182 -224 36 275 158 -145 -160 69
7725 69 -85 75 493 154 102 121 87 80 -18 251 -480 -61 -169 -36 -163 217 -22 -404 -78 -154 130 238 132
7748 132 -46 -263 32 204 -89 289 164 -476 -140 82 -62 18 58 -113 -369 -227 189 42 230 -14 -329
7769 -329 -254 -2 -88 -270 -21 275 -406 -1 315 156 -45 -47 -174 -389 -69 49 91 323 6 -528 38 179
7791 179 178 219 50 -310 -473 192 483 231 -132 -118 -92 -379 172 398 99 303 -279 -332 -439 264 150 -233
7813 -233 -178 -16 -247 212 80 -244 107 -291 -298 -350 408 136 -125 -88 -20 -355 221 614 132 235 93 -88
7835 -88 -102 419 413 221 28 -32 -502 38 98 224 -365 -127 -44 -13 199 231 11 -100 -151 -126 112 139 648 -164
$$ packed form
7679g0j59M92k36j2J47n05J25PJ93j61J64Op1o5R5M48q00J3L50j80K44J29l5n30
7703d11K37K32k28o3J74k8l49O76k76L6Q6R0l28j96J66m2K60K39j17l03j5K29
7725F9j54J60M18l39n2J9l4pr8K69p31M19j08J33j27L80k39l82L26p6K84J08j06
7748A32j78k17K95J72k93L78j25o40L36K22j44Q0M0j71k56J42M16j47J88k44l15
7769c29P5K52q6j82K49K96o81M05L16j59k01kj27k15L20J18M2K32l17n34N66J41
7791A79jM1j69l60j63O65K91k52l63J4K6k87N51K26k99K04n82n3j07P03j14l83
7813b33N5J62k31M59j32l24L51l98pn2P58k72k61L7O8l35N76L93m82J03j42j81
7835h8j4N21oj92j93o0m70N40O0J26n89K38Q3L1K12L2k20j11n1K5K38K7N09q12
$$ plain form
7859 -164 -297 10 35 80 556 -129 -427 -158 33 -345 73 699 -282 -108 -233 38 -148 405 476 -365 -442
7880 -442 34 -143 44 524 336 -209 -35 3 -112 327 -44 -383 -194 212 -193 59 368 -77 -373 -118
7900 -118 -2 121 55 -17 -21 -625 -45 -2 115 -122 -8 -255 21 -36 -53 11 -88 -116 -366 -221 389 7 -54 27
7924 27 -187 -296 211 116 4 -9 -276 -410 -131 381 120 17 203 -95 -597 140 185 11 35 -629 -24 -36
7946 -36 230 102 -1 -105 283 -279 -241 192 271 -146 169 -311 81 153 197 100 42 215 -217 32 406 392 9
7969 9 114 18 123 13 474 -21 -274 -76 23 0 200 -137 179 -145 115 -51 -48 379 335 -70 -296 -14 35
7992 35 203 260 31 193 -64 -123 106 160 297 -119 -543 -26 6 293 572 258 -70 -49 51 18 307 395 -103
8015 -103 -182 -112 -109 144 182 27 -60 -176 59 -144 150 329 -213 -111 -13 -10 -84 184 106 -63 -44 -162 -115 -373
$$ packed form
7859a64j33L07K5M5M76o85k98K69J91l78M18O26r81J74j25K71j86N53P1q41p7
7880d42M76j77J87M80j88n45J74L8j15M39l71l39J89M06m05K52L09m45k96K55
7900a18J16J23o6p2mo04N80M3J17k37J14k47K76n7j7O4r9k8k50J45O10l82o1Q1
7924B7k14j09N07r5j12j3k67j34K79N12k61j03J86k98n02P37M5j74K4o64O05j2
7946c6K66j28j03j04L88n62L8M33P9m17L15m80L92P2M4r7n8J73m32K49L74j4l83
7969IJ05r6J05j10M61m95k53J98R9k3K00l37L16l24K60j66LM27m4m05k26K82M9
7992C5J68N7k29J62k57n9K29N4J37m16m24N17L2K87K79l14l28K1J00l3K89Q8m98
8015a03p9P0LK53L8j55q7j16K35k03K94J79n42J02R8Lp4K68p8j69J9j18M7k58
$$ plain form
8039 -373 155 100 -344 -36 42 -329 172 109 -136 -124 -55 23 126 414 85 -191 -114 -260 -100 -35 26 -113 -455
8062 -455 -419 263 188 -230 -6 -453 -106 113 5 168 160 146 -27 -59 68 133 -84 176 -8 -234 30 39 10
8085 10 36 38 -116 18 502 -164 -369 356 -24 -282 276 114 217 109 132 167 -168 -1 219 193 170 -7 -36
8108 -36 139 48 -65 9 -243 64 -346 364 225 -306 -27 -39 101 116 128 430 -73 -14 183 -168 160 400
8130 400 9 -194 81 85 -239 24 44 -140 -69 143 -183 -311 75 285 -101 -68 21 -6 -210 -231 -184 -279 -58
8153 -58 -102 -137 73 198 -77 -58 68 9 -54 434 11 -327 85 57 -259 -56 -70 33 -266 179 -171 139 45
8176 45 151 219 45 226 -142 -83 -144 -158 -203 -275 154 -175 -3 -160 -282
$$ packed form
8039c73N28n5m44L08P8l71N01o3k45J2O9P8J03K88l29k76P7j46J60O5O1j39l42
8062d55L6O82p5m18K24m47L47K19j08J63qj4j73l2J27O5k17K60j84k26K64Rk9
8085A0K6Kj54J34M84o66k05P25l80k58N58j62J03j08K3L5l35J67K20k6k3j77k9
8108c6J75r1j13P4k52L07m10P10j39n31K79j2J40J5J2L02n03N9J97l51L28K40
8130D00l91k03K75Ml24K63K0j84P1K12l26j28L86K10l86L3Q9k7k04k1M7r5K21
8153e8m4l5K10J25k75J9J26n9o3M88m23l38M12k8l16K03j4J03k99M45l50L10r4
8176D5J06O8j74J81l68N9o1j4m5p2M29l29J72j57j22
8191b82
$$ Imaginary data points
##PAGE= N=2
##DATA TABLE= (X++(I..I)), XYDATA
$$ plain form
0 0 0 0 0 8 -8 0 -8 8 -8 16 -16 24 -28 33 -40 49 -59 70 -84 98 -115 133 -153 178 -203 230 -263 302 -338
29 -338 382 -431 483 -540 607 -677 751 -835 928 -1029 1139 -1263 1397 -1546 1713 -1899
45 -1899 2106 -2343 2614 -2926 3291 -3722 4246 -4894 5722 -6821 8355 -10653 14480 -22023
59 -22023 42609 -216064 -707337 -309616 150329 223259 -34259 -210365 -233845 -91601 36114
70 36114 39432 -51283 -76469 -69880 -82220 -125571 -102564 30981 145039 5128 -228453 -175151
82 -175151 120027 218655 50949 -89013 -48329 91513 198772 133720 -21358 6634 207434
93 207434 240625 34398 -131586 -78844 99440 196464 53708 -199958 -234517 -13000 144390
104 144390 81199 -45294 -83847 -34194 20853 16082 23588 114377 131013 -52005 -205239 -99902
$$ packed form
0@%%%Qj6QqJ6j6K4l2M0n2O1p3Q9j08J29j54J82k13K48k86L31l81M33m93N65o40
29c38P20q13R14j023J147j284J428j586J763j957K168k402K660k943L259l612
45a899M005m449M957n540O217p013P968r140J0616j2543J5176j9008K5133l6503
59b2023O4632k58673m91273L97721M59945P2930k57518j76106k3480J42244J27715
70C6114L318r0715k5186O589j2340m3351K3007J33545J14058j39911k33581N3302
82a75151K95178R8628j67706j39962M0684J39842J07259o5052j55078K7992K00800
93B07434L3191k06227j65984N2742J78284R7024j42756k53666l4559K21517J57390
104A44390o3191j26493l8553M9653N5047m771P506R0789J6636j83018j53234J05337
$$ plain form
116 -99902 122208 210789 87024 -174126 -315897 -110490 202464 173782 -139397 -295931
126 -295931 -161752 27501 71932 -22892 -107549 -63629 20422 7306 -42334 -18403 38784
137 38784 47965 -22470 -143859 -169862 -26328 60038 -87831 -239188 -166733 -32548 -37523
148 -37523 -123710 -165724 -110361 9468 27516 -129418 -229976 -88322 111372 115523 -57677
159 -57677 -206358 -161577 42751 150925 21762 -149513 -163464 -84401 -36737 -40299 -74700
170 -74700 -85672 -58847 -87788 -158847 -88652 98661 131832 -36891 -162297 -108056 50148
181 50148 166080 97159 -116224 -202428 -47989 107753 63355 -79414 -134020 -54452 40714
192 40714 8865 -94429 -79327 37278 59865 -23735 -67286 -23940 63607 131389 86854 -25023
$$ packed form
116i9902K22110Q8581j23765k61150j41771K05407L12954k8682l13179j56534
126b95931J34179J89253M4431r4824q4657M3920Q4051j3116m9640K3931N7187
137C8784R181p0435j21389k6003J43534Q6366j47869j51357P2455J34185m975
148c7523q6187m2014N5363J19829J8048j56934j00558J41654J99694M151j73200
159e7677j48681M4781K04328J08174j29163j71275j3951P9063M7664l562l4401
170g4700j0972K6825k8941p1059P0195J87313L3171j68723j25406N4241J58204
181E0148J15932o8921k13383q6204J54439J55742m4398j42769n4606P9568R5166
192D0714l1849j03294J5102J16605K2587q3600m3551M3346Q7547O7782m4535j11877
$$ plain form
204 -25023 -12492 110774 123232 11132 -31532 32294 76197 27323 -81065 -126171 -11954
215 -11954 129845 82652 -92007 -148273 -24339 128398 151222 16117 -112282 -56425 87762
226 87762 103477 15560 -20385 1337 14586 8729 -19991 -30783 31695 65019 -41437 -148145
238 -148145 -79445 61526 87189 -5461 -100203 -83149 54679 152139 79485 -36516 -22015
249 -22015 72679 106810 47661 -39171 -47107 46076 83072 -27575 -117560 -50937 50643 50133
261 50133 -16949 -70897 -54023 33294 72740 -4493 -57403 15923 89277 51948 -18639 -18437
273 -18437 59012 130515 83229 -52894 -84825 37845 123253 54417 -65377 -103512 -27091
284 -27091 83641 84132 -25154 -57468 42420 105404 58649 10973 26814 71391 93662 43696
$$ packed form
204b5023J2531J23266J2458j12100m2664O3826M3903m8874j08388m5106J14217
215a1954J41799m7193j74659n6266J23934J52737K2824j35105j28399N5857J44187
226H7762J5715q7917l5945K1722J3249n857k8720j0792O2478L3324j06456j06708
238a48145O8700J40971K5663r2650r4742J7054J37828R7460p2654j16001J4501
249b2015R4694L4131n9149q6832p936R3183L6996j10647q9985O6623J01580n10
261E0133o7082n3948J6874Q7317L9446p7233n2910P3326P3354l7329p0587K02
273a8437P7449P1503m7286j36123l1931J22670Q5408o8836j19794l8135P6421
284b7091J10732M91j09286l2314R9888O2984m6755m7676J5841M4577K2271m9966
$$ plain form
296 43696 -38065 -20739 84022 98834 -8472 -82551 -42212 44282 73928 -3080 -97944 -64340
308 -64340 49687 61773 -29101 -65019 -5218 69324 86790 23040 -42046 10335 114892 98655
320 98655 -15068 -57135 -416 53921 39928 -35945 -87372 -29535 54784 22395 -65917 -57312
332 -57312 27865 67635 26228 -46175 -57691 31326 100579 31625 -72102 -53464 38387 70993
344 70993 17592 -62532 -78813 -1462 51282 -22921 -109141 -72828 11009 18551 -35612 -73311
356 -73311 -39730 51447 84559 3701 -56960 8054 92141 74607 -6599 -54009 -20036 56561
368 56561 58273 -40645 -91602 -15384 55447 19839 -51015 -67247 -15440 51928 40575 -49137
380 -49137 -72646 20353 84308 35666 -31242 -27817 34523 85502 47666 -45224 -55509 31427
$$ packed form
296D3696q1761J7326J04761J4812j07306p4079M0339Q6494K9646p7008r4864L3604
308f4340J14027J2086r0874l5918N9801P4542J7466o3750o5086N2381J04557j6237
320I8655j13723m2067N6719N4337j3993p5873n1427N7837Q4319l2389q8312Q605
332e7312Q5177L9770m1407p2403j1516Q9017O9253o8954j03727J8638R1851L2606
344G0993n3401q0124j6281P7351N2744p4203q6220L6313Q3837P542n4163l7699
356g3311L3581R1177L3112q0858o0661O5014Q4087j7534q1206m7410L3973P6597
368E6561J712r8918n0957P6218P0831l5608p0854j6232N1807O7368j1353q9712
380d9137k3509R2999O3955m8642o6908L425O2340N0979l7836r2890j0285Q6936
$$ plain form
392 31427 61728 -12722 -75203 -55314 8128 45395 6617 -62845 -39988 62502 89349 14818
404 14818 -30972 8394 70781 84271 22731 -44141 -11280 75377 69021 -21601 -56943 -7009
416 -7009 43721 35606 -30387 -80355 -31846 50955 31415 -54339 -62780 11405 66287 49520 -9702
429 -9702 -32659 33971 100124 52660 -37908 -34904 32221 55713 11783 -49557 -59069 10487 64422
442 64422 10840 -62521 -33606 47469 65860 16874 -31406 -18545 54019 85309 16649 -44671
454 -44671 1176 70776 62063 1350 -39416 -21454 36272 45260 -32916 -85708 -31376 34396
466 34396 15713 -41386 -56988 -9536 57871 59363 -14740 -42243 31431 87692 47061 -19624
478 -19624 -33297 7958 54518 35992 -38850 -57582 10051 46269 -2376 -50791 -38803 8388
$$ packed form
392C1427L0301p4450o2481J9889O3442L7267l8778o9462K2857J02490K6847p4531
404A4818m5790L9366O2387J3490o1540o6872L2861Q6657o356r0622l5342M9934
416g009N0730q115o5993m9968M8509Q2801j9540q5754q441P4185N4882j6767n9222
429i702k2957O6630O6153m7464r0568L004O7125K3492m3930o1340r512O9556N3935
442F4422n3582p3361K8915Q1075J8391m8986m8280J2861P2564L1290o8660o1320
454d4671M5847O9600q713o0713m0766J7962N7726Q988p8176n2792N4332O5772
466C4396j8683n7099j5602M7452O7407J492p4103k7503P3674N6261m0631o6685
478a9624j3673M1255M6560j8526p4842j8732O7633L6218m8645m8415J1988M7191
$$ plain form
490 8388 36781 2256 -60845 -45662 41735 65436 -4448 -51567 -17801 42822 62177 11944
502 11944 -56586 -48421 20364 27862 -38535 -76501 -47695 -4179 4481 -34539 -70067 -28633 43404
515 43404 32981 -35439 -44981 10686 50393 35490 -15046 -45717 -4373 53622 28382 -43003
527 -43003 -47520 7360 31099 -3663 -60146 -73042 -13366 38737 -4050 -76566 -65243 6088
539 6088 44404 22990 -23348 -36537 11747 53234 17366 -33030 -15192 21289 5472 -35184
551 -35184 -50571 -25067 23921 30435 -37105 -81923 -22605 57478 52272 -13998 -54001 -24175
563 -24175 46570 68537 10778 -32401 2943 46516 34772 -60 -15831 -1810 27674 16795
575 16795 -47234 -71091 -11889 29659 -7831 -54492 -47725 -4235 31010 18694 -25164 -23475
$$ packed form
490H388K8393l4525o3101J5183Q7397K3701o9884m7119L3766O0623J9355n0233
502A1944o8530Q165O8785P498o6397l7966K8806M3516Q660l9020l5528M1434P2037
515D3404j0423o8420r542N5667L9707j4903n0536l0671M1344N7995k5240p1385
527d3003m517N4880K3739l4762n6483j2896N9676N2103m2787p2516J1323P1331
539F088L8316k1414m6338j3189M8284M1487l5868n0396J7838L6481j5817m0656
551c5184j5387K5504M8988O514o7540m4818N9318Q0083n206o6270m0003K9826
563b4175P0745K1967n7759m3179L5344M3573j1744l4832j5771J4021K9484j0879
575A6795o4029k3857N9202M1548l7490m6661O767M3490L5245j2316m3858J689
$$ plain form
587 -23475 32847 50802 -1560 -42550 -18959 33849 51715 -1941 -74155 -59995 27717 59552
599 59552 128 -59321 -58127 -15504 25328 18423 -26419 -33141 7563 14902 -15502 -8698 35892
612 35892 49409 13576 -36151 -47493 6967 62654 26689 -65711 -94467 -36967 27233 28274
624 28274 -31200 -75074 -33971 32276 24133 -26298 -24239 17647 33117 14472 -15865 -25463 15021
637 15021 58713 28931 -34161 -33957 14636 31393 2096 -30228 -28592 3844 10396 -34830 -55662
650 -55662 -41 55415 34951 -27986 -56019 -11669 70683 91035 6130 -74542 -48195 27559
662 27559 51489 15952 -34834 -55855 -26413 7256 -5269 -18791 7734 17813 -25028 -55266
674 -55266 -20554 40666 62678 16361 -51340 -48159 29704 77631 40845 -22501 -44636 -11932
$$ packed form
587b3475N6322J7955n2362m0990K3591N2808J7866n3656p2214J4160Q7712L1835
599E9552n9424n9449J194M2623M0832o905m4842o722M0704P339l0404O804M4590
612C5892J3517l5833m9727j1342N4460N5687l5965r2400k8756N7500O4200J041
624B8274n9474m3874M1103O6247q143n0431K059M1886J5470j8645l0337r598M0484
637A5021M3692k9782o3092K04M8593J6757k9297l2324J636L2436O552m5226k0832
650e5662N5621N5456k0464o2937k8033M4350Q2352K0352q4905q0672K6347P5754
662B7559K3930l5537n0786k1021K9442L3669j2525j3522K6525J0079m2841l0238
674e5266L4712O1220K2012m6317o7701L181P7863M7927l6786o3346k2135L2704
$$ plain form
686 -11932 34806 21478 -46797 -64857 -6184 19267 -31676 -70772 -42442 6566 26941 520
698 520 -46436 -48676 1815 30537 3034 -27620 -26138 -12184 -12594 -32547 -39936 -3141 27524
711 27524 -18934 -91331 -83075 -3373 47697 18592 -63650 -113102 -55518 49683 66800 -8446
723 -8446 -59053 -37617 5647 29466 19456 -7422 -16651 -12310 -31182 -51506 -25820 14560 7649
736 7649 -41587 -77943 -54239 16086 47885 -5258 -61443 -36976 19996 33159 5867 -21524
748 -21524 -17892 24667 48996 2185 -47269 -12878 53524 50923 -9773 -52805 -37123 15065
760 15065 43593 15234 -22393 -18907 4508 16451 23763 33178 40863 41014 12054 -29215 -10470
773 -10470 68408 90298 11332 -67593 -58367 14836 74867 57043 -27011 -73382 -24168 42847
$$ packed form
686a1932M6738j3328o8275j8060N8673K5451n0943l9096K8330M9008K0375k6421
698E20m6956k240N0491K8722k7503l0654J482J3954m10j9953p389L6795L0665
711B7524m6458p2397Q256P9702N1070k9105q2242m9452N7584J05201J7117p5246
723h446n0607K1436M3264K3819j0010k6878r229M341j8872k0324K5686M0380o911
736G649m9236l6356K3704P0325L1799n3143n6185K4467N6972J3163k7292k7391
748b1524L632M2559K4329m6811m9454L4391O6402k601o0696m3032J5682N2188
760A5065K8528k8359l7627L486K3415J1943P312R415P685J51k8960m1269J8745
773a0470P8878K1890p8966p8925R226P3203O0031j7824q4054m6371M9214O7015
$$ plain form
785 42847 44927 7666 -13568 -5615 14760 19492 8114 18646 48962 43404 358 -16754 10530
798 10530 43774 44832 2345 -44723 -29712 24096 26234 -23781 -36917 -160 25316 13460
810 13460 -17415 -32590 2747 56376 46646 -23721 -59753 -20389 37473 48451 2817 -48461
822 -48461 -43747 -3922 7375 -8228 -10257 -9198 -28225 -42927 -35761 -9490 27292 34535 -19915
835 -19915 -68725 -28125 55216 74718 19578 -42656 -50682 2443 49495 25680 -33681 -47575
847 -47575 -17411 1712 -6339 -22359 -21336 1639 10050 -20531 -39242 -4872 31095 20068 -11415
860 -11415 -23669 -9355 20879 30895 60 -19642 9042 30685 -949 -36948 -26583 11828
872 11828 34081 8829 -44244 -55435 2727 57438 44440 -4422 -28746 -6049 40195 54684
$$ packed form
785D2847K080l7261k1234P953K0375M732j1378J0532L0316n558m3046j7112K7284
798A0530L3244J058m2487m7068J5011N3808K138n0015j3136L6757K5476j1856
810A3460l0875j5175L5337N3629r730p0367l6032L9364N7862J0978m5634n1278
822d8461M714L9825J1297j5603k029J059j9027j4702P166K6271L6782P243n4450
835a9915m8810M0600Q3341J9502n5140o2234q026N3125M7052k3815n9361j3894
847d7575L0164J9123q051j6020J023K2975Q411l0581j8711L4370L5967j1027l1483
860a1415j2254J4314L0234J0016l0835j9702K8684K1643l1634l5999J0365L8411
872A1828K2253k5252n3073j1191N8162N4711j2998m8862k4324K2697M6244J4489
$$ plain form
884 54684 21683 -4437 5883 10913 -3966 -1813 18691 22533 5433 -22057 -39522 -13299 38982
897 38982 41250 -18809 -55593 -24288 28495 45931 15712 -23485 -16712 27911 43414 15605
909 15605 -3143 7696 23235 21391 -4302 -29508 -11438 27778 21202 -22363 -31814 -1117 20282
922 20282 17618 3223 -5852 8386 27961 13471 -15786 -4660 32076 36803 1808 -31900 -26805
935 -26805 19297 48963 11247 -45771 -45901 -1801 23227 10230 -20183 -34973 -12266 17745
947 17745 11311 -7464 7137 28695 17926 -3884 -5269 13992 34424 27703 -15313 -41154 -8706
960 -8706 31538 22059 -16008 -34098 -15451 17353 22948 -10556 -29101 -112 27934 13038 -14334
973 -14334 -16630 5470 30525 26849 -10183 -26749 4633 29374 8541 -21379 -22669 -7086 4264
$$ packed form
884E4684l3001k6120J0320N030j4879K153K0504L842j7100k7490j7465K6223N2281
897C8982K268o0059l6784L1305N2783J7436l0219l9197O773M4623J5503k7809
909A5605j8748J0839J5539j844k5693k5206J8070L9216o576m3565r451L0697K1399
922B0282k664j4395r075J4238J9575j4490k9257J1126L6736M727l4995l3708N095
935b6805M6102K9666l7716n7018j30M4100K5028j2997l0413j4790K2707L0011
947A7745o434j8775J4601K1558j0769k1810j385J9261K0432o721m3016k5841L2448
960h706M0244r479l8067j8090J8647L2804N595l3504j8545K8989K8046j4896k7372
973a4334k296K2100K5055l676l7032j6566L1382K4741k0833k9920j290J5583J1350
$$ plain form
986 4264 -4776 -27056 -22198 12512 23107 -7300 -25945 -2645 32168 40298 10670 -26200 -17525
999 -17525 29482 41823 2046 -28076 -15784 8839 17442 397 -24471 -19436 9184 8168 -23381
1012 -23381 -30179 -2389 17616 8162 -15697 -25369 1654 36801 25711 -15070 -21026 9207 25641
1025 25641 9547 -18136 -28869 -6448 18664 1938 -32319 -26013 9344 22314 5082 -16262
1037 -16262 -16534 10995 34809 14655 -18835 -10661 21378 26047 3602 -13733 -8031 13810 21709
1050 21709 -7479 -33083 -13636 15464 7015 -23172 -34649 -17009 13492 21442 -8524 -28899
1062 -28899 -1354 32252 24455 -4182 -12388 3009 22497 18527 -13058 -26689 1558 23319
1074 23319 2702 -24036 -20151 3309 19913 8557 -21148 -24284 10519 28817 4358 -19101
$$ packed form
986D264r040k2280M858L4710J0595l0407j8645K3300L4813Q130k9628l6870Q675
999a7525M7007J2341l9777l0122J2292K4623Q603j7045k4868N035K8620j016l1549
1012b3381o798K7790K0005r454k3859r672K7023L5147j1090m0781n956L0233J6434
1025B5641j6094k7683j0733K2421K5112j6726l4257O306L5357J2970j7232k1344
1037a6262k72K7529K3814k0154l3490Q174L2039M669k2445j7335N702K1841P899
1050B1709k9188k5604J9447K9100q449l0187j1477J7640L0501P950k9966k0375
1062b8899K7545L3606p797k8637q206J5397J9488l970l1585j3631K8247K1761
1074B3319k0617k6738L885K3460J6604j1356k9705l136L4803J8298k4459k3459
$$ plain form
1086 -19101 -8993 15674 26801 11831 -14859 -13590 17934 25622 -6901 -28925 -16057 4741
1098 4741 6900 -12918 -33273 -21701 12679 17754 -10922 -21584 1039 22283 20452 1058 -14101
1111 -14101 -746 27135 22130 -11565 -19471 5032 20734 9955 -12087 -22238 -4760 18781
1123 18781 7215 -24552 -24273 4133 16536 4189 -12178 -13604 9066 30237 14478 -15083
1135 -15083 -9423 17965 21833 89 -19143 -18064 2738 15939 -5886 -30569 -15858 14462
1147 14462 15275 -5454 -15498 -5256 17312 25748 2009 -18053 1833 29738 23018 -1568 -10155
1160 -10155 2891 21695 20634 -7605 -24639 -3151 17474 2033 -21842 -21958 -4610 12073
1172 12073 9120 -13319 -19010 9015 28775 10675 -11425 -7292 9651 19519 8470 -15665 -18901
$$ packed form
1086a9101J0108K4667J1127j4970k6690J269L1524P688l2523k2024J2868K0798
1098D741K159j9818k0355J1572L4380N075k8676j0662K2623K1244j831j9394j5159
1111a4101J3355K7881n005l3695p906K4503J5702j0779k2042j0151J7478K3541
1123A8781j1566l1767K79K8406J2403j2347j6367j426K2670K1171j5759k9561
1135a5083N660K7388L868k1744j9232J079K0802J3201k1825k4683J4711L0320
1147A4462Q13k0729j0044J0242K2568Q436k3739k0062J9886K7905o720k4586q587
1160a0155J3046J8804j061k8239j7034K1488K0625j5441k3875j16J7348J6683
1172A2073k953k2439n691K8025J9760j8100k2100M133J6943R868j1049k4135l236
$$ plain form
1185 -18901 7288 18440 -5015 -23776 -12685 6930 12822 -773 -21476 -17065 11923 21084
1197 21084 -2391 -16929 -2604 15670 19799 6255 -9902 -4050 18449 15842 -13568 -22929 -3588
1210 -3588 8810 -887 -20771 -30261 -13068 14552 10235 -19589 -24578 1205 18837 12268 -6169
1223 -6169 -15590 111 20652 10871 -14188 -12248 10456 15315 -68 -15141 -15790 2077 16309
1236 16309 -513 -26648 -18713 8350 13041 -2970 -12606 -6189 12624 22111 4487 -14600 -1000
1249 -1000 21969 16332 -8692 -22104 -12873 8654 15281 -9656 -31459 -15476 9964 8411 -6539
1262 -6539 -10868 -5595 5755 10058 -2708 -9038 9313 23901 6776 -13166 -6444 14867 26729
1275 26729 12999 -17432 -25457 2303 21436 3793 -20353 -20986 -4836 9542 7043 -10045 -12228
$$ packed form
1185a8901K6189J1152k3455j8761J1091J9615N892j3595k0703M411K8988R161
1197B1084k3475j4538J4325J8274M129j3544j6157N852K2499k607k9410r361J9341
1210c588J2398r697j9884r490J7193K7620m317k9824m989K5783J7632o569j8437
1223f169r421J5701K0541r781k5059J940K2704M859j5383j5073o49J7867J4232
1236A6309j6822k6135P935K7063M691j6011r636O417J8813R487j7624j9087J3600
1249a000K2969n637k5024j3412R231K1527O627k4937k1803J5983K5440j553j4950
1262f539m329N273J1350M303j2766o330J8351J4588j7125j9942O722K1311J1862
1275B6729j3730l0431q025K7760J9133j7643k4146o33J6150J4378k499j7088k183
$$ plain form
1288 -12228 10467 20929 1779 -12376 -1203 13981 15816 1830 -17462 -16048 9043 16398
1300 16398 -6417 -20580 -7176 6550 3183 -9936 -16629 -3080 17797 10276 -17071 -19573 7719
1313 7719 28403 23262 -908 -19391 -5673 25604 26345 -4400 -19167 -7618 787 -2518 -6883
1326 -6883 -8265 -2748 2967 -7604 -20990 -6922 19607 20309 -3335 -21413 -14680 12907 29656
1339 29656 9341 -20744 -16031 9551 16144 2774 -10264 -11911 578 9392 -5973 -23790 -10399
1352 -10399 13948 11927 -7462 -15407 -5485 13389 22489 7804 -8973 -1189 13098 6029 -8202
1365 -8202 -7055 3864 7687 -5448 -26794 -24904 7500 24581 338 -29642 -29181 -4398 20891
$$ packed form
1288a2228K2695J0462j9150j4155J1173J5184J835j3986j9292J414K5091P355
1300A6398k2815j4163J3404J3726l367j3119o693J3549K0877p521k7347k502K7292
1313G719K0684n141k4170j8483J3718L1277P41l0745j4767J1549Q405l305m365
1326f883j382N517N715j0571j3386J4068K6529P02k3644j8078O733K7587J6749
1339B9656k0315l0085M713K5582O593j3370j3038j647J2489Q814j5365j7817J3391
1352a0399K4347k021j9389p945R922J8874R100j4685j6777P784J4287p069j4231
1365h202J147J0919L823j3135k1346J890L2404J7081k4243k9980M61K4783K5289
$$ [...]
8191b70
##END NTUPLES=NMR FID
##END=
