##TITLE=1H_ANY-165A
 CDCl3, 8 sc, 
 8.4.2019
##JCAMPDX= 6.0         $$ Bruker NMR JCAMP-DX V2.0
##DATA TYPE= NMR FID
##DATA CLASS= NTUPLES
##ORIGIN= UXNMR, Bruker Analytische Messtechnik GmbH
##OWNER= root
$$ XWIN-NMR		Version 3.5
$$ Mon Apr  8 14:26:25 2019 Russian Standard Time (UT+4h)  she@DPX200
##.OBSERVE FREQUENCY= 200.1315
##.OBSERVE NUCLEUS= ^1H
##.DELAY= (6, 6)
##.ACQUISITION MODE= SIMULTANEOUS
##.ACQUISITION SCHEME= undefined
##.AVERAGES= 8
##.DIGITISER RES= 18
##SPECTROMETER/DATA SYSTEM= spect
##.PULSE SEQUENCE= zg30
##.SOLVENT NAME= CDCl3
##.SHIFT REFERENCE= (INTERNAL, CDCl3, 0, 15.7039)
##AUDIT TRAIL= $$ (NUMBER, WHEN, WHO, WHERE, WHAT)
$$ ##TITLE= Audit trail, XWIN-NMR		Version 3.5
$$ ##JCAMPDX= 5.01
$$ ##ORIGIN= Bruker BioSpin GmbH
$$ ##OWNER= she
$$ F:/spectra/data/she/nmr/H-F/1/audita.txt
$$ ##AUDIT TRAIL=  $$ (NUMBER, WHEN, WHO, WHERE, WHAT)
(   1,<2019-04-08 14:25:22.29 +0400>,<she>,<DPX200>,
      <created by zg, POWCHK disabled, PULCHK disabled
       configuration hash MD5:
       00 E9 B6 7A A2 85 ED C7 34 08 36 98 17 FE 4E 26
       data hash MD5: 16K
       58 B3 67 44 4F 77 34 AF 80 AD 05 7E 42 A2 E9 BA>)
$$ ##END=
$$ 
$$ hash MD5
$$ 96 09 3B 21 EE 3F 27 DA 9D 3D CA CD D7 D1 77 92
##$RELAX= 
##$RELAX= 
##$RELAX= 
##$RELAX= 
##$RELAX= 
##$RELAX= 
$$ Bruker specific parameters
$$ --------------------------
##$DU= <F:/spectra>
##$EXPNO= 1
##$NAME= <H-F>
##$PROCNO= 1
##$TYPE= <nmr>
##$USER= <she>
##$AMP= (0..31)
100 100 100 100 100 100 100 100 100 100 100 100 100 100 100 100 100 100 
100 100 100 100 100 100 100 100 100 100 100 100 100 100 
##$AQSEQ= 0
##$AQ_mod= 1
##$AUNM= <au_zg>
##$AUTOPOS= <>
##$BF1= 200.13
##$BF2= 200.13
##$BF3= 200.13
##$BF4= 200.13
##$BF5= 200.13
##$BF6= 200.13
##$BF7= 200.13
##$BF8= 200.13
##$BYTORDA= 1
##$CFDGTYP= 0
##$CFRGTYP= 5
##$CHEMSTR= <none>
##$CNST= (0..31)
1 1 145 1 1 1 1 1 1 1 1 1 1 1 1 1 1 1 1 1 1 1 1 1 1 1 1 1 1 1 1 1 
##$CPDPRG= <>
##$CPDPRG1= <>
##$CPDPRG2= <>
##$CPDPRG3= <>
##$CPDPRG4= <mlev>
##$CPDPRG5= <mlev>
##$CPDPRG6= <mlev>
##$CPDPRG7= <mlev>
##$CPDPRG8= <mlev>
##$CPDPRGB= <>
##$CPDPRGT= <>
##$D= (0..31)
0 1.2 0 0 0 0 0 0 0 0 0 0.03 0 0 0 0 0 0 0 0 0 0 0 0 0 0 0 0 0 0 0 0 
##$DATE= 1554719121
##$DBL= (0..7)
120 120 120 120 120 120 120 120 
##$DBP= (0..7)
150 150 150 150 150 150 150 150 
##$DBP07= 0
##$DBPNAM0= <>
##$DBPNAM1= <>
##$DBPNAM2= <>
##$DBPNAM3= <>
##$DBPNAM4= <>
##$DBPNAM5= <>
##$DBPNAM6= <>
##$DBPNAM7= <>
##$DBPOAL= (0..7)
0.5 0.5 0.5 0.5 0.5 0.5 0.5 0.5 
##$DBPOFFS= (0..7)
0 0 0 0 0 0 0 0 
##$DE= 6
##$DECBNUC= <off>
##$DECIM= 24
##$DECNUC= <off>
##$DECSTAT= 4
##$DIGMOD= 1
##$DIGTYP= 9
##$DL= (0..7)
0 120 120 120 120 120 120 120 
##$DP= (0..7)
150 150 150 150 150 150 150 150 
##$DP07= 0
##$DPNAME0= <>
##$DPNAME1= <>
##$DPNAME2= <>
##$DPNAME3= <>
##$DPNAME4= <>
##$DPNAME5= <>
##$DPNAME6= <>
##$DPNAME7= <>
##$DPOAL= (0..7)
0.5 0.5 0.5 0.5 0.5 0.5 0.5 0.5 
##$DPOFFS= (0..7)
0 0 0 0 0 0 0 0 
##$DQDMODE= 0
##$DR= 18
##$DS= 0
##$DSLIST= <SSSSSSSSSSSSSSS>
##$DSPFIRM= 0
$$ [...]
##$SUBNAM2= <"">
##$SUBNAM3= <"">
##$SUBNAM4= <"">
##$SUBNAM5= <"">
##$SUBNAM6= <"">
##$SUBNAM7= <"">
##$SUBNAM8= <"">
##$SUBNAM9= <"">
##$SW= 24.9337058887773
##$SWIBOX= (0..15)
0 0 2 0 0 0 0 0 0 0 0 0 0 0 0 0 
##$SW_h= 4990.01996007984
##$TD= 16384
##$TD0= 1
##$TE= 0
##$TE2= 300
##$TE3= 300
##$TEG= 300
##$TL= (0..7)
0 120 120 120 120 120 120 120 
##$TP= (0..7)
150 150 150 150 150 150 150 150 
##$TP07= 0
##$TPNAME0= <>
##$TPNAME1= <>
##$TPNAME2= <>
##$TPNAME3= <>
##$TPNAME4= <>
##$TPNAME5= <>
##$TPNAME6= <>
##$TPNAME7= <>
##$TPOAL= (0..7)
0.5 0.5 0.5 0.5 0.5 0.5 0.5 0.5 
##$TPOFFS= (0..7)
0 0 0 0 0 0 0 0 
##$TUNHIN= 0
##$TUNHOUT= 0
##$TUNXOUT= 0
##$USERA1= <user>
##$USERA2= <user>
##$USERA3= <user>
##$USERA4= <user>
##$USERA5= <user>
##$V9= 5
##$VALIST= <valist>
##$VCLIST= <CCCCCCCCCCCCCCC>
##$VD= 0
##$VDLIST= <DDDDDDDDDDDDDDD>
##$VPLIST= <PPPPPPPPPPPPPPP>
##$VTLIST= <TTTTTTTTTTTTTTT>
##$WBST= 1024
##$WBSW= 4
##$XGAIN= (0..3)
0 0 0 0 
##$XL= 0
##$YL= 0
##$YMAX_a= 414844
##$YMIN_a= -460004
##$ZGOPTNS= <>
##$ZL1= 120
##$ZL2= 120
##$ZL3= 120
##$ZL4= 120
##$ABSF1= 10
##$ABSF2= 0
##$ABSG= 5
##$ABSL= 3
##$ALPHA= 0
##$AQORDER= 0
##$ASSFAC= 0
##$ASSFACI= 0
##$ASSFACX= 0
##$ASSWID= 0
##$AUNMP= <proc_1d>
##$AZFE= 0.1
##$AZFW= 0.1
##$BCFW= 1
##$BC_mod= 2
##$BYTORDP= 1
##$COROFFS= 0
##$CY= 11.3945322036743
##$DATMOD= 1
##$DC= 2
##$DFILT= <>
##$DTYPP= 0
##$F1P= 18.9103706918063
##$F2P= -1.10871071338519
##$FCOR= 0.5
##$FTSIZE= 0
##$FT_mod= 4
##$GAMMA= 1
##$GB= 0.15
##$INTBC= 1
##$INTSCL= 1
##$ISEN= 128
##$LB= 0.24
##$LEV0= 0
##$LPBIN= 0
##$MAXI= 10000
##$MC2= 0
##$MEAN= 0
##$ME_mod= 0
##$MI= 1.114404
##$NCOEF= 0
##$NC_proc= 0
##$NLEV= 6
##$NOISF1= 3.799351
##$NOISF2= 2.8
##$NSP= 1
##$NTH_PI= 0
##$NZP= 0
##$OFFSET= 15.70392
##$PC= 1
##$PHC0= -8850.354
##$PHC1= 10.00026
##$PH_mod= 1
##$PKNL= yes
##$PPARMOD= 0
##$PSCAL= 0
##$PSIGN= 0
##$REVERSE= no
##$SF= 200.130013532006
##$SI= 16384
##$SIGF1= 3
##$SIGF2= 2
##$SINO= 400
##$SIOLD= 16384
##$SREGLST= <1H.CDCl3>
##$SSB= 0
##$STSI= 0
##$STSR= 0
##$SW_p= 3612.71676300578
##$SYMM= 0
##$S_DEV= 0
##$TDeff= 0
##$TDoff= 0
##$TI= <>
##$TILT= no
##$TM1= 0
##$TM2= 0
##$TOPLEV= 0
##$USERP1= <user>
##$USERP2= <user>
##$USERP3= <user>
##$USERP4= <user>
##$USERP5= <user>
##$WDW= 1
##$XDIM= 8192
##$YMAX_p= 0
##$YMIN_p= 0
$$ End of Bruker specific parameters
$$ ---------------------------------
##NTUPLES= NMR FID
##VAR_NAME=  TIME,          FID/REAL,        FID/IMAG
##SYMBOL=    X,             R,               I
##VAR_TYPE=  INDEPENDENT,   DEPENDENT,       DEPENDENT
##VAR_FORM=  AFFN,          ASDF,            ASDF
##VAR_DIM=   8192,          8192,            8192
##UNITS=     SECONDS,       ARBITRARY UNITS, ARBITRARY UNITS
##FACTOR=    0.0002004,     1,               1
##FIRST=     0,             0,               0
##LAST=      1.6414764,     0,               0
##MIN=       0,             -460004,         0
##MAX=       1.6414764,     414844,          0
$$ Real data points
##PAGE= N=1
##DATA TABLE= (X++(R..R)), XYDATA
0 0 0 0 0 -8 8 -8 8 -16 16 -24 30 -32 46 -55 65 -80 96 -113 135 -158 185 -216 250 -288 335 -383 435
27 435 -495 561 -633 714 -803 900 -1007 1123 -1253 1392 -1548 1718 -1903 2106 -2334 2583
43 2583 -2860 3170 -3517 3908 -4349 4860 -5451 6150 -6985 8011 -9303 10986 -13284 16628
57 16628 -21963 31869 -56579 249490 314454 -54534 220915 414844 338677 150966 189661
68 189661 243121 273985 249128 234815 176751 150523 170711 243626 206011 81691 70465 230931
80 230931 254078 103825 60706 186132 211551 128418 90198 104636 110789 129010 96975 16830
92 16830 15695 95249 106588 59920 31553 -103 -3611 79453 108978 -3884 -64116 39287
104 39287 120303 70923 13582 35604 86217 86231 27542 13278 87855 107219 21864 12806 97511
117 97511 78053 -1816 46996 113401 46692 15225 111344 139022 54336 39765 114192 142788
129 142788 108309 79104 92531 133483 136981 99822 110069 144137 96771 50483 116489 158613
141 158613 76408 25821 76385 99574 81553 94682 92536 63454 84201 122857 108694 90883
153 90883 88890 68939 84003 140722 122558 54196 80996 145667 115930 61299 74092 91133
165 91133 74381 63549 61596 70312 90639 75166 46643 82421 118530 73514 48533 94365
177 94365 86409 39529 83573 131609 60007 5793 77084 127948 70947 13279 22176 59890
189 59890 73915 30863 -17176 14795 66369 42573 9063 27564 27871 14310 48718 52490 -14219
202 -14219 -13554 72951 80438 1105 -22904 17606 49057 47310 784 -45165 -2786 65520 30809
215 30809 -38370 -22730 20326 27400 32257 16377 -29587 -12523 62075 63575 1479 -9056 32801
228 32801 64110 58956 8624 -26011 32334 86595 19719 -46191 8653 61696 26905 -153
240 -153 8690 3883 17581 50381 22082 -29906 -6854 49194 54451 23177 -6743 1346 60117
253 60117 76672 -1179 -41612 27296 62465 8271 -18960 1826 5413 13507 28967 -1470
265 -1470 -28666 10330 39953 9301 -15270 -6479 6934 30053 34290 -7522 -14362 44600 54533
278 54533 -5917 -16626 24560 26374 4907 501 -10182 -10068 16659 13585 -15238 -3786 18929
291 18929 3558 -1185 11576 -7389 -13559 25412 23172 -24069 -8391 40860 23249 -12838 -50
304 -50 14265 5395 -1023 -13344 -23644 -1648 5819 -23977 -21722 11422 3266 -15965 3624 2489
318 2489 -23581 -3157 22256 -10427 -28695 10847 24342 -3130 -9079 -920 533 11835 2616
331 2616 -34493 -28283 10511 -2729 -35795 -19892 -666 -10004 -2501 3456 -23721 -21080 19150
344 19150 13479 -25171 -20202 5175 9637 7347 -8231 -28381 -1858 34706 -1326 -47041 -18355
357 -18355 13213 -11385 -28651 -21360 -24193 -12706 9758 -8778 -35081 -10652 15982 958
369 958 -14053 -17523 -20931 773 16751 -20722 -41873 6937 30752 -11501 -29005 -4655 -2142
382 -2142 -10026 -7201 -23933 -31720 707 13804 -13116 -15966 6185 7876 7729 8187 -18875 -24979
396 -24979 13993 15523 -30994 -28195 15946 15401 -9809 -12204 -13698 -13235 1799 -9903 -39437 -24618
410 -24618 5278 -5897 -16003 -2072 -4597 -6837 16080 7467 -31130 -17926 19957 2934 -26616
423 -26616 -11812 7307 6852 5063 -10885 -25569 -2412 12816 -20820 -35992 -6157 1599 -12408
436 -12408 -5839 -6757 -22491 -2933 17848 -13283 -35792 -7753 8828 -7863 -15971 -16443 -13148
449 -13148 7544 6204 -32716 -33791 8245 7029 -27506 -23828 -4300 -6282 -943 124 -25510
462 -25510 -25128 12519 13721 -20282 -22457 -1642 9377 14458 -1682 -31318 -12086 31620 9757
475 9757 -38791 -23900 14765 11798 -1526 -6494 -15802 -606 26389 5505 -31300 -15408 16109
488 16109 13690 2532 -5751 -13983 11354 39769 6420 -36489 -7797 30464 9634 -19382 -17394
501 -17394 -6620 12212 21058 -10050 -33286 -1560 21902 -4861 -24597 -17351 -10223 6168 19112
514 19112 -11941 -35448 3008 31308 -3177 -29964 -13451 1930 5016 1315 -19189 -23333 8283
527 8283 15069 -17846 -25136 -5146 -6549 -10535 -1602 -13057 -21326 6889 17746 -15103 -23217 2567
541 2567 5465 -5868 -5990 -10171 -7219 14368 10717 -18914 -11159 13991 -977 -19396 -5956 -3463
555 -3463 -14691 -3472 3091 -9866 -2335 13005 -3582 -17401 -2246 416 -10557 -5748 -6723
568 -6723 -15150 6318 24117 -5814 -24247 2430 11008 -13196 -16402 -6859 -10366 -3232 7713
581 7713 -2461 -2818 16637 10455 -8337 3989 14736 213 -446 10680 4163 9064 31102 16920
595 16920 -12287 5130 32382 16643 -7761 -12802 -8718 10122 24390 -2110 -26819 3973
607 3973 32039 8478 -13271 -7166 -3571 3287 12381 -5720 -23034 5470 29942 3945 -21084
620 -21084 -13528 1569 14110 9414 -25497 -36952 8001 28019 -16639 -40813 -9692 13648
632 13648 8742 -5741 -26902 -25321 14653 26260 -17298 -38853 -10988 12361 10155 -5517 -27884
645 -27884 -20967 20137 20720 -29345 -36641 8050 20298 -7402 -24095 -22510 -1849 27822 16630
658 16630 -26538 -22455 23956 34062 6780 -13379 -18089 1405 34422 21438 -29212 -24543 30416
671 30416 41745 2483 -23115 -19715 3141 26168 8475 -30500 -20348 20640 21520 334 -928
684 -928 -95 2314 18995 15915 -13223 -8561 22336 15986 -9173 -3573 12466 15401 14327 1123
698 1123 -14580 1105 20252 -376 -19166 -1624 10274 4737 10697 9378 -7766 1121 24473
711 24473 10655 -13151 -3823 10501 9015 9051 2147 -10254 2037 18519 1326 -13870 2366
724 2366 5468 -8752 -2815 5641 -6124 -4478 12387 5772 -5909 5690 12440 8237 13183 7475
738 7475 -12225 -2934 22031 13735 -4107 1724 2114 -3919 10205 14372 -12164 -17508 8407 15469
752 15469 1152 -5269 -6475 522 20575 17080 -10879 -7882 20003 18086 896 590 -3195 -8670
766 -8670 8822 15991 -10705 -19146 3547 6421 -11111 -15168 -10515 -2428 9357 -2006 -26921
779 -26921 -11262 24595 15931 -14269 -12845 2299 8798 13527 2759 -17866 -3815 24881 10016
792 10016 -22577 -17508 4717 12668 8904 -11723 -26500 3580 38685 14494 -23292 -7823 25592
805 25592 28686 14569 -1042 -6781 19429 42022 15924 -14299 1311 27307 26558 11344 -10887
818 -10887 -20824 9251 35249 4134 -27707 -2258 28096 16944 -1950 -5814 193 17701 22239
831 22239 -5543 -19103 9847 26258 5471 -10447 -9067 -4331 9017 9995 -20940 -33074 -892
844 -892 14226 -9988 -22552 -10203 -571 7274 5751 -14610 -16172 13341 19053 -7772 -12764 1811
858 1811 5244 6113 5531 -11633 -17141 6293 10798 -13276 -18615 -3401 1209 1315 -1634 -13926 -9248
873 -9248 15220 13772 -7940 -1664 15960 10998 8590 16891 6179 -5769 6360 11092 -1448
886 -1448 -411 5985 -2787 -3730 6851 45 -9180 -1106 -359 -10009 -2343 3533 -9287 -5297 15825
901 15825 11646 -4047 795 5828 -485 1857 -351 -15148 -10167 8957 397 -14991 -3241 6604
915 6604 -1814 -3726 -2842 -13380 -7129 10816 3238 -12095 729 16732 13904 9818 4431 -4891
929 -4891 4302 15655 -4184 -21236 -3432 10303 -2295 -7965 -5046 -9666 -3240 8269 -7196
942 -7196 -24106 -7507 9291 501 -5408 -1151 2250 13481 18962 -1641 -13061 8506 18176
955 18176 -3229 -11906 -1866 2051 4460 4999 -11396 -15591 6608 10915 -12009 -15233 953 4101
969 4101 3893 4810 -6493 -7299 16251 18233 -8488 -11489 9225 11315 1593 -3122 -8572 -3534 11613
984 11613 2633 -20008 -11987 9116 5952 -3362 -1753 -4248 1261 19015 11383 -13801 -5144 20473
998 20473 14319 -4244 -3218 3140 10181 15323 -204 -18946 -6066 12172 -3035 -19613 -11932
1011 -11932 -3959 -793 5272 -2945 -15324 896 17337 670 -14312 -2509 6967 6005 6901 -504
1025 -504 -7891 8763 18369 -3380 -15314 -80 3401 -8817 -7830 -5248 -7865 1951 8334 -6047
1039 -6047 -9603 6949 8005 -3341 -1944 814 -752 8133 10271 -5436 -3210 15494 7654 -13178
1053 -13178 -7145 3364 -2675 -5517 -3460 -9222 -4197 9806 1218 -12562 -1485 10159 2614
1066 2614 -726 1359 -1682 7239 19017 3347 -12788 4526 17880 1792 -10028 -5780 -3354
1079 -3354 2984 7367 -8012 -16314 3953 13701 -3433 -10389 -656 2409 6099 10558 -1664 -7627
1093 -7627 13407 22220 827 -7418 4053 6617 3006 418 -9301 -9252 9011 9239 -11611 -11116 5244
1108 5244 4113 -2222 -434 -5388 -6015 11340 13185 -5972 -4537 14415 13532 1350 -251 -1954
1122 -1954 -546 8864 2096 -14463 -6959 8652 -268 -9694 -2217 -1218 -5891 1908 1111 -11004 -3029
1137 -3029 11233 1636 -8488 1875 6943 2077 3340 -741 -8207 1654 9359 -7320 -15338 -100
1151 -100 1925 -8883 -5606 -2021 -8049 -1466 6958 -3883 -8553 4229 5316 -3298 709 4175
1165 4175 -1282 3506 6878 -4491 -3919 11716 4252 -13306 -6281 4420 -3497 -7355 -3735 -7753
1179 -7753 -4551 7413 2392 -8359 -611 6738 52 69 2879 -4716 -1467 11377 2663 -10513
1193 -10513 2606 12704 -2428 -10799 -1862 -35 -2063 -2693 -11292 -13013 4815 10100 -7355 -11328
1207 -11328 1698 4796 5456 5478 -9233 -14562 8446 18521 -4972 -15777 804 10447 6010 -915
1221 -915 -11718 -10027 7618 7003 -13819 -13647 4459 4303 -2066 152 -3771 -3476 12992 12601 -11563
1236 -11563 -12864 10487 14434 -1945 -10019 -8315 4110 17291 4821 -18601 -9533 12216 4591
1249 4591 -11716 -9057 -5546 -3564 8158 5603 -12550 -8068 12923 9333 -7600 -7994 -1593 3131
1263 3131 4789 -6504 -16547 948 15917 -3326 -20336 -5947 4718 -1863 -4824 -10046 -18640
1276 -18640 -6738 10806 2152 -13219 -7695 3151 6288 5723 -6280 -16285 -137 14223 -2342
1289 -2342 -15081 -303 6534 -3941 -3502 -599 -8330 -7392 629 -4615 -9287 -1349 -795 -6395 -2323
1304 -2323 -1809 -7050 2707 8713 -8254 -13759 5595 8708 -7305 -7316 1145 -2767 -3478 2241 -2777
1319 -2777 -8214 -3059 -3519 -3870 2859 -980 -12294 -2453 10760 -2013 -12143 487 5111 -2889
1333 -2889 2097 6712 -3922 -5204 5996 4391 -4773 -6147 -5809 -2101 7737 899 -14870 -3981
1347 -3981 14248 2118 -14255 -5092 4810 2107 3911 705 -9812 -1595 16122 10655 -6840
1360 -6840 -8823 -932 7928 12476 -4741 -23591 -5110 20687 6243 -17934 -9755 5931 5422
1373 5422 699 -6676 -13585 -2711 12557 4469 -8712 -4102 3153 5610 6430 -5040 -16159 911
1387 911 16653 -3772 -21759 -2750 13787 1671 -12063 -12498 -7452 4639 7978 -10014 -18004
1400 -18004 -1455 9512 3245 -2657 -9059 -10854 6865 15457 -9486 -23509 1188 16984 313
1413 313 -13059 -8585 -377 7149 3715 -14041 -15392 2704 6321 -5352 -5272 -556 -1641 5807 9571
1428 9571 -9120 -16106 4772 12453 -5839 -13109 -2717 5212 7436 1374 -11409 -8441 7476
1441 7476 2704 -11729 -6067 3032 -2075 -569 5920 -1866 -4505 11190 11069 -7258 -7853 5782
1455 5782 7498 2647 -1518 -4388 3298 13807 3450 -10542 -712 7890 -2887 -6465 1315 -3106
1469 -3106 -5523 7186 7283 -6295 -4842 5595 3862 1307 706 -4974 -1651 9551 4956 -6058
1483 -6058 1301 7865 -2150 -2577 7007 339 -6992 2606 7331 -2632 -4081 -12 -478 3633 5991
1498 5991 -4677 -6905 5829 6135 -3377 214 2511 -6123 -2134 8661 -1484 -12897 -1895 7728
1512 7728 -878 -5600 -3120 -1651 3205 3395 -9447 -10444 5395 7576 -4520 -3012 3748 1491 4557
1527 4557 8713 -3199 -9119 6033 10837 -4830 -9340 -389 5000 6977 2567 -10817 -8176 10089
1541 10089 7192 -12712 -11442 2748 3617 1751 1226 -4941 -2656 12668 10420 -8063 -8721 5046
1555 5046 7401 2642 -3228 -9243 163 17016 7356 -14419 -7741 9960 5414 -4782 -4802 -4424 327
1570 327 10164 4700 -9283 -2449 11964 7315 -1277 -3055 -3319 3594 11765 297 -13049 150
1584 150 14181 2694 -8185 -1272 2531 2596 5126 -1381 -8909 2814 13179 2876 -4281 2157
1598 2157 5889 6682 8853 1201 -5745 6328 14432 -118 -7404 3411 6786 2055 1365 -2090 -4380
1613 -4380 5641 8847 -3808 -6340 5323 5172 212 3405 1718 -2724 5872 10080 -1442 -3715
1627 -3715 7414 6136 -2877 -345 1928 -1581 1434 2244 -5140 -2671 5804 286 -6105 2238 4280
1642 4280 -3105 177 4113 -2421 -964 7639 2280 -4248 3522 6450 -1528 -1771 2683 -1480 -842
1657 -842 3390 -3375 -6569 3398 4344 -6053 -3469 4297 350 -379 4059 -1272 -3122 6552 7055 -3697
1673 -3697 -1491 6073 2861 309 3024 -1937 -2602 6637 4244 -8245 -4464 5905 1251 -3529 18
1688 18 -507 -24 7252 4243 -5708 -114 10123 4802 -1233 1671 1158 2284 8371 3084 -7209 977
1704 977 10896 1495 -5730 91 2153 328 4392 722 -6108 1978 10552 1989 -3290 3806 5458
1719 5458 3660 5648 1525 -4312 5143 10905 -1245 -6943 2524 4632 -495 586 -1690 -5639 2120
1734 2120 6324 -4250 -6600 3352 3798 -1739 1477 2337 -1041 4717 7684 -2317 -3552 6543 4273
1749 4273 -3942 -1680 943 -2013 1219 2355 -5000 -3741 5556 394 -7848 -2045 1932 -2576 -279
1764 -279 3127 -2632 -877 8248 3640 -4309 1891 5526 -1457 -2774 -18 -2449 204 5481 -2004
1779 -2004 -7169 3756 7395 -3439 -5338 834 304 852 4220 -1989 -3847 7399 10082 -799
1793 -799 -2255 3758 2281 277 1639 -4783 -6539 4406 5026 -7308 -6252 3651 1378 -3536 -2778
1808 -2778 -4985 -3075 5388 2811 -7722 -2622 8434 5007 -658 320 -989 -1041 7035 2364 -10437
1823 -10437 -5367 6575 1650 -6706 -4848 -3030 -1870 2359 -2590 -10550 -2265 6507 -1606 -7573
1837 -7573 -1022 1633 -299 1973 -1010 -6479 827 8046 -1930 -9507 -1839 2400 -1112 -2287 -6238
1852 -6238 -8621 1640 7251 -4810 -8865 2842 6137 -665 -911 -520 -2169 3908 7283 -2352 -4969
1867 -4969 4642 5885 -1204 -1943 -2069 -3857 1287 1968 -9017 -8811 4656 4505 -4640 -2997 1968 1174
1883 1174 3223 4114 -3433 -3405 5824 5480 -710 2206 3113 -727 3345 4852 -4735 -6627 2631 752
1899 752 -6431 -2683 1294 -3026 -1699 2275 -1778 -2804 1937 -500 -4088 1860 2245 -4266 -920
1914 -920 4617 -2108 -5268 1504 -432 -7313 -3537 -1173 -6803 -5483 220 -3504 -5501 -1203 -1793
1929 -1793 -3238 1299 -1017 -7834 -758 7649 -821 -6455 904 3332 -1676 -1158 -1949 -6386 -1884
1944 -1884 3429 -3206 -7472 -1904 68 -1338 900 -3338 -7693 2135 9721 -1428 -8565 2099
1958 2099 8629 3246 -137 -1240 -2482 4199 6912 -3410 -8849 240 3520 340 -1107 -4146 -6116
1973 -6116 3475 8772 -4693 -11459 1542 8711 1352 -3005 -1094 1468 6945 6461 -4945 -5483 5389
1988 5389 5223 -3046 -3573 -1624 -1511 3776 4373 -7527 -8472 5466 8432 -3374 -6132 506 4779
2003 4779 6234 1785 -6026 -526 11446 7014 -5055 -2115 4304 3121 3520 2149 -5799 -4095 8456
2018 8456 7255 -6412 -6262 3091 5873 4460 -1181 -5337 1845 11998 4809 -6811 -1121 6664
2032 6664 2811 1193 2627 -2474 -1745 6362 3747 -6115 -4617 1411 -123 -1289 -1715 -4447 -339
2047 -339 6586 245 -6314 1511 6797 -419 -1767 2990 983 -746 3808 3106 -2277 848 3708
2062 3708 -68 -481 255 -3318 -1597 3392 -737 -6158 1904 5655 -1280 -1192 4700 1549 -2434 2955
2078 2955 4450 -233 462 2015 1076 3824 4365 -2580 -2168 6139 3050 -5016 -1432 3436 -275 392
2094 392 3908 -1035 -2410 6499 8010 697 -451 3373 4338 6581 4847 -2543 -73 10645 7761
2109 7761 -2360 295 6708 3984 2857 3525 -1257 -933 8293 8311 182 557 5775 7010 8333 6054
2125 6054 -532 3246 12812 7789 -3398 1600 10517 6461 2065 2481 1741 3635 8310 2857 -4671
2140 -4671 18 6933 4105 1173 433 -674 4637 10704 2779 -6735 2040 11273 4422 -3244 -1321
2155 -1321 1119 3707 5532 -1086 -6907 549 6227 199 -4043 -1674 -1740 1106 4894 -1392 -7547
2170 -7547 2579 10245 1693 -4458 603 4111 4867 4336 -1138 -3836 4064 7417 -868 -3091 2349
2185 2349 2165 1874 4473 293 -3605 4279 8614 598 -2404 4482 6282 3974 4298 2166 1429 7256
2201 7256 7758 -383 400 6610 4108 408 3398 2272 -420 4608 6628 -383 -1075 5456 4585 1124
2217 1124 2862 2615 1259 5389 6212 111 1704 7241 3197 -671 4070 4128 -790 1152 3825 -822
2233 -822 -634 4227 1517 -1238 2812 1742 -2032 1497 3910 -51 1006 4788 863 -753 4861
2248 4861 4333 -2227 377 4171 537 -1108 1821 -378 -1152 3379 850 -4381 -165 3599 -676
2263 -676 -1813 1516 152 -490 4161 2631 -2952 1014 5734 658 -1844 1244 1341 1178 3445 -222
2279 -222 -4059 2421 5849 -1818 -4475 520 1221 101 2134 -641 -3294 3193 6940 -677 -3734
2294 -3734 2090 3165 968 734 -1937 -2749 4422 5519 -3689 -5230 2453 2841 -1612 -1680 -2765 -3041
2310 -3041 2924 3280 -4547 -4165 3995 4053 -977 -1110 -1381 -1761 3475 2859 -5846 -4588 4226 3086 -3566
2327 -3566 -2637 -1797 -2331 721 -173 -6932 -5002 2536 442 -4699 -2306 -396 -1184 1388 987 -4695
2343 -4695 -2242 4718 1356 -3968 -873 1582 -553 -34 635 -3418 -1415 3433 -1174 -4803 183
2358 183 2142 -2331 -970 870 -1884 -785 3377 -73 -3106 1881 2710 -2491 -1396 1273 -1588
2373 -1588 -2323 428 -2960 -4529 1319 836 -4961 -2634 1523 -2101 -3662 -945 -2402 -3028 1610 707
2389 707 -4391 -1471 3528 -306 -2768 -551 -2475 -2813 963 -1458 -6849 -2439 2337 -2752 -4785
2404 -4785 -1236 -1626 -3039 -667 -2127 -5845 -954 3341 -1793 -3438 1423 1327 -67 1671 -313 -4080
2420 -4080 433 3678 -2759 -4681 1088 1336 -1583 -356 -1146 -3979 661 2616 -3732 -4870 1107
2435 1107 1029 -2496 -813 -380 -2924 684 1845 -4992 -5120 1439 -91 -5221 -4089 -2390 -3645 -1003
2451 -1003 -1185 -6689 -5144 986 -1266 -6030 -3224 -883 -2605 -461 112 -5210 -3543 2913 647
2466 647 -5156 -2593 94 -1477 -746 -1012 -4863 -2760 2521 -847 -5208 -1471 1134 -1603 -735 593
2482 593 -2608 -1216 3748 658 -3840 -413 2801 -243 -290 684 -2195 -952 2892 -1441 -5015 -178
2498 -178 1096 -3540 -2391 378 -2650 -3238 903 -1097 -4184 -665 241 -3046 -1879 319 -2453 -2622
2514 -2622 600 -1916 -3663 509 -492 -5675 -2577 1556 -2604 -4549 -779 -711 -3024 -525 -468 -3080
2530 -3080 -158 2621 -1188 -2083 2480 999 -788 2062 801 -2223 1499 4754 -1254 -3898 2288
2545 2288 3149 -321 -690 -102 -672 2616 3245 -3051 -2453 3710 3113 -1369 385 992 -1108 2351 3716
2562 3716 -2800 -4106 2997 3349 -2524 -3458 -1349 -714 1628 -615 -6078 -3893 3081 303 -5818 -3316
2578 -3316 -416 -1867 -472 364 -4906 -4049 2748 1604 -5060 -4164 -782 -440 -434 -2495 -6085 -2442 3338
2595 3338 -1415 -7707 -2090 1618 -2232 -2304 -1170 -3063 -1793 2740 276 -4461 -596 3061 1043
2610 1043 180 -115 -2309 1229 4837 -1118 -5613 1419 5126 -347 -1767 1239 617 704 3598 1281
2626 1281 -1876 1972 4391 1720 2014 2897 856 3623 7163 2030 -1827 4215 6782 413 -235 3806
2642 3806 2292 470 3211 2491 289 2449 3078 396 1938 3046 -414 761 4936 1953 -1884
2657 -1884 2937 4249 -1064 -747 2938 70 -1903 510 -68 -2279 -693 -296 -2458 -362 704 -3776
2673 -3776 -2610 2689 -268 -4715 -610 2570 -1920 -1813 1556 -755 -1921 1023 152 -2689 -883
2688 -883 -226 -1837 -425 355 -4242 -2093 3671 89 -5306 30 4192 401 -1326 1115 403 743
2704 743 3598 1378 -1488 1708 3751 1680 1516 1567 -1138 977 5882 908 -4818 1188 6337 1508
2720 1508 -1227 1386 1726 2626 4600 1631 -1183 3090 4879 1143 978 2045 618 1894 5549 616
2736 616 -4280 1775 5845 -306 -3308 208 2127 2119 2253 -809 -1612 4003 5015 -1023 -1005 2556 1563
2753 1563 2013 3895 -94 -3306 3379 6148 -1260 -3700 771 2423 1049 -161 -2642 -1834 4210
2768 4210 3255 -3160 -1891 3166 1720 128 2413 -265 -2177 3171 5036 -1168 -2470 2598 3022
2783 3022 210 -100 -1622 -1028 3731 1910 -3816 -1093 4373 1072 -1357 2285 1612 -1080 2647 4295
2799 4295 -288 -138 3523 2134 440 1824 933 -45 2738 2132 -2444 189 3864 165 -2018 2578
2815 2578 1947 -1560 883 3303 -271 -235 2685 1152 610 2586 1143 -651 2522 2456 -1846 -565
2831 -565 2956 -186 -1583 1894 403 -3024 282 2944 -533 -1606 770 -142 511 2285 -153 -1959
2847 -1959 2710 3865 -1584 -899 2790 806 -423 2078 249 -3036 952 3269 -1042 -2478 736
2862 736 1139 20 1471 -1155 -1792 3237 3720 -2397 -1343 4060 2280 -210 1279 549 -1053 2547
2878 2547 3221 -2139 -1751 2058 1349 -694 224 -1192 -1203 2629 2433 -3046 -1438 4440 2059 -1488 640
2895 640 1183 193 2290 2127 -2414 -862 3588 1455 -1167 169 -171 -955 2196 833 -3799 -947
2911 -947 4086 1247 -2558 138 1981 625 1776 1595 -1824 95 3681 499 -1724 1018 1349 -604
2927 -604 1285 703 -3219 -453 2939 -721 -3724 114 1188 -1015 -39 403 -1711 -97 2876 -710
2943 -710 -2317 1455 1299 -1193 -247 854 -1717 -169 2507 -1264 -3543 173 984 -2584 -1442 -162
2959 -162 -2145 -876 1394 -1568 -2246 1888 909 -2100 43 1389 -1531 -935 1472 -958 -2264 1172
2975 1172 321 -3310 -1132 146 -2122 -1839 427 -1586 -2427 743 -55 -2611 41 2055 -1592 -1131
2991 -1131 1856 95 -1679 966 153 -2088 454 1804 -2111 -1689 1196 -528 -2094 374 -381 -2155
3007 -2155 950 1576 -2183 -1494 2478 845 -1408 1102 978 -1003 1454 1715 -2206 -1185 2524 394
3023 394 -2500 24 655 -1172 747 612 -3031 -1210 2732 389 -3199 -305 1166 -566 735 517
3039 517 -2245 -336 3289 -155 -2817 212 1142 -858 -394 -219 -2896 -1076 2234 -1010 -3590 114
3055 114 986 -1306 -941 -198 -1709 290 2478 -722 -2887 1268 1964 -909 -391 581 -1054 -164 2134
3072 2134 -1246 -3225 1021 1705 -1771 -1002 487 -937 342 1891 -1213 -2418 2149 1961 -1461 -165
3088 -165 2141 -25 -180 1752 -656 -1522 1609 1219 -2178 -596 1582 -869 -1046 1004 -1159 -1652
3104 -1652 1590 921 -2067 135 2379 -823 -1151 1790 355 -1016 1117 717 -2255 477 1497 -1378
3120 -1378 -1575 1182 -628 -2280 552 -245 -2439 196 1321 -1895 -2008 1529 551 -1743 350 349 -1203
3137 -1203 634 1202 -2178 -1294 2141 -169 -2388 556 744 -1597 -60 955 -2240 -868 2325 403
3153 403 -2037 716 1891 333 1503 1244 -1072 618 3978 916 -1753 1392 3326 631 694 2036
3169 2036 -672 454 3203 562 -1962 1183 2507 562 923 1001 -679 1261 3903 307 -2055 1910
3185 1910 3040 -597 -287 816 -692 27 1524 -955 -2707 223 1045 -1849 -1627 -650 -2318 -803
3201 -803 1023 -1917 -3782 675 1253 -2499 -1907 58 -1489 -1375 372 -1498 -2958 294 170 -2974
3217 -2974 -1664 -124 -1909 -1590 1001 -1581 -3376 617 1268 -2244 -1316 952 85 -485 1039 -168
3233 -168 -827 2004 1364 -1696 226 1735 -669 -748 1813 -120 -1610 1370 1648 -1577 -634 2406 16
3250 16 -463 1228 500 -558 1606 1306 -1009 1404 2112 -1370 -1042 1961 402 -1994 882 1304 -1656
3267 -1656 -285 1262 -685 -1128 1022 45 -1449 765 856 -1250 555 1880 -1147 -374 3029 672
3283 672 -2127 841 2231 -1177 -829 998 -386 -533 1444 -329 -1612 1017 1255 -1197 84 1237
3299 1237 -1132 -276 2708 272 -2658 1439 2689 -717 -1264 584 254 200 642 -1441 -1826 1634 986
3316 986 -2378 -1317 859 -515 -684 1375 -1114 -2582 1107 2319 -1455 -2149 789 653 -176 442
3332 442 -1502 -1300 2190 1018 -2779 -1437 1510 -709 -1201 633 -964 -1784 1046 1921 -2125 -1420
3348 -1420 1675 744 -162 -179 -815 -586 2337 833 -2899 -671 2403 -424 -1730 500 -107 -1531 673
3365 673 1228 -1861 -857 1497 247 -622 405 -655 -345 1847 718 -2509 53 2962 -232 -1685
3381 -1685 1321 728 -857 508 1320 -1325 -747 1240 -346 -592 867 -356 -709 1617 988 -2024
3397 -2024 107 2210 -355 -1322 1706 1109 -1012 493 1396 -738 -484 1083 -440 -713 801 -710
3413 -710 -1319 1140 883 -2031 -531 1954 -848 -1243 1039 541 -1799 441 1005 -508 -564 769 -586
3430 -586 -414 769 -712 -1584 1195 528 -2290 -933 1751 -748 -1900 730 202 -1272 487 997
3446 997 -1213 -548 1502 -196 -161 843 -887 -969 1738 875 -2707 -1033 2033 -4 -1844 -135 40
3463 40 -939 234 340 -1780 -731 1203 -424 -990 645 -288 -702 1419 484 -2678 -732 1976 -249
3480 -249 -2373 -382 144 -919 115 -34 -2285 -534 1540 -983 -1790 250 -437 -861 736 327 -2257
3497 -2257 -705 2259 -479 -2258 5 479 -819 -232 -594 -1793 -65 1442 -1274 -2006 357 319
3513 319 -986 336 120 -1755 295 2627 -565 -1669 900 1464 -529 110 559 -772 766 1817
3529 1817 -1125 -1382 1636 948 -1164 600 973 -906 452 1594 -303 -1023 1448 1293 -498 452
3545 452 997 -289 905 1565 -973 -1009 1789 631 -1411 149 802 -1336 -677 1236 -334 -1327 623
3562 623 662 -1322 210 377 -1032 21 914 -1020 -1092 956 28 -1717 159 637 -1640 -1091 523
3579 523 -824 -1664 293 -54 -1280 189 289 -1623 -311 1268 -443 -1173 947 654 -1222 643
3595 643 996 -1535 -322 1751 -93 -1353 675 408 -644 490 171 -1242 148 1661 -365 -1393
3611 -1393 1073 924 -570 520 866 -1355 -25 1936 -151 -1599 686 1018 -537 224 -63 -1580
3627 -1580 -63 1470 -1051 -1826 946 857 -1118 -387 312 -847 -51 1172 -810 -1415 968 974 -767
3644 -767 270 669 -993 -5 1317 -1046 -1441 1404 722 -1647 -124 707 -720 172 1256 -821 -1160
3661 -1160 1465 800 -846 -13 941 -129 137 1548 -624 -793 1801 1182 -1567 -26 997 -688
3677 -688 -343 903 -885 -765 1373 742 -1311 136 823 -375 -142 1607 -320 -678 1610 620 -1348
3694 -1348 290 1476 -621 -107 897 -389 -879 1124 545 -940 438 1242 -814 -541 1170 38
3710 38 -798 1368 336 -929 473 1264 -583 -243 974 -542 -981 798 561 -1357 265 391 -1215
3727 -1215 -519 1213 -373 -1179 845 652 -1197 50 733 -772 -227 1038 -37 -675 1084 516 -1090
3744 -1090 349 459 -1283 -398 1393 -678 -1300 524 617 -991 48 822 -860 230 1296 -333
3760 -333 -1075 1157 1086 -672 184 769 -422 84 1516 -419 -1267 1267 926 -1219 -196 774 -535
3777 -535 -136 1038 -410 -927 1440 1205 -934 42 947 -159 -23 1161 -487 -917 1432 852 -1180
3794 -1180 -182 1067 -315 -195 756 -274 -598 1203 480 -1041 587 1472 -73 46 1339 -32 -385
3811 -385 1441 904 -1125 695 1202 -379 -230 671 -251 -486 901 134 -1078 787 1569 -587 -404
3828 -404 1218 189 -462 1063 864 -931 436 1313 -288 -148 822 -119 -466 614 4 -1067 322
3845 322 726 -1214 -1078 874 -372 -1115 588 618 -915 -97 530 -863 -387 591 -378 -1203 861 -31
3863 -31 -1431 -89 296 -1268 -678 714 -559 -1768 642 -167 -1509 -464 317 -386 -594 656 -901
3880 -901 -828 660 -120 -1544 -236 590 -966 -812 601 -186 -1188 500 503 -1265 -540 279 -177 -372
3898 -372 480 -549 -767 1058 488 -1199 433 1459 -332 172 1194 106 -784 1209 1027 -726 135
3915 135 1354 279 554 819 -389 -91 1832 477 -810 702 1893 -251 -355 885 223 -88 883
3932 883 1041 -883 -144 1177 -117 -577 461 -533 -459 738 -133 -1895 305 1114 -917 -1082 493
3949 493 -37 -840 488 -35 -1260 -566 868 -861 -1042 129 -999 -1061 483 -630 -2072 -246 943
3966 943 -1069 -1281 435 93 -1293 -81 324 -942 13 472 -840 -531 703 -62 -364 697 -104
3983 -104 -1615 113 1023 -877 -1001 735 217 -1045 34 246 -855 385 596 -566 -292 940 -303
4000 -303 -447 729 272 -1134 112 1430 -859 -978 750 416 -696 -26 246 -504 -212 364 -362 -307
4018 -307 835 -401 -832 1034 460 -1249 -287 1590 -211 -519 811 303 -469 772 568 -909 236
4035 236 456 -545 -178 533 -535 -794 977 354 -1662 -42 1584 -547 -940 411 318 -206 480 346
4053 346 -875 373 988 -382 -413 1042 -96 -540 1267 485 -1400 -25 1670 -404 -1022 753 990
4070 990 -72 415 256 -680 918 883 -510 -256 1038 384 -333 847 255 -1064 87 1684 -409
4087 -409 -850 543 620 -99 281 308 -555 527 908 -609 -225 1419 326 -895 877 755 -840 35
4105 35 1363 -537 -903 669 34 -954 7 79 -643 292 489 -1224 -586 1042 114 -1029 769 818 -855
4124 -855 -80 838 -416 -421 735 213 -697 40 311 -624 261 358 -726 55 1253 104 -770 768 570
4143 570 -898 -146 1130 6 -733 709 51 -255 497 430 -773 114 521 -530 -590 681 201 -767
4161 -767 853 955 -746 286 1532 -128 -210 756 -36 -341 837 549 -481 662 1285 -462 -468 1043
4179 1043 341 -450 677 711 -606 19 1360 -251 -504 835 414 -141 1088 465 -484 768 1286 -606
4197 -606 -495 969 253 -431 259 631 -806 456 654 -425 -585 846 291 -579 432 254 -719 243
4215 243 802 -665 -590 1084 425 -1186 191 631 -632 -64 715 -676 -539 551 -113 -900 25 268
4233 268 -675 227 501 -612 -790 879 280 -747 219 893 -300 -132 559 -161 -371 853 5 -1069
4251 -1069 270 297 -615 -178 529 -687 -732 708 133 -1220 510 822 -431 5 679 -245 -225 838
4269 838 -83 -667 471 795 -385 -86 600 -635 -443 1120 -158 -785 243 801 -347 -320 750 -24
4287 -24 -93 718 -2 -570 551 836 -414 -284 840 -295 -339 819 -177 -1067 215 315 -700 -97 412
4306 412 -267 -464 636 23 -687 230 652 -763 2 495 -587 -729 788 206 -950 150 380 -775
4324 -775 -68 580 -556 -793 495 -18 -676 582 455 -826 263 913 -434 -303 986 347 -767
4341 -767 204 357 -564 143 719 -574 -731 824 102 -811 263 441 -665 57 554 -800 -727 961
4359 961 68 -672 394 490 -697 176 429 -698 -684 492 -291 -983 163 361 -916 -554 179 -1008
4377 -1008 -759 352 -269 -1123 -34 727 -794 -435 345 -455 -391 612 -210 -948 -94 444 -842 -588
4395 -588 511 -689 -1006 469 -153 -884 285 461 -484 -400 354 -273 -358 514 -302 -672 161 211 -849
4414 -849 -327 617 -294 -713 337 -447 -755 28 287 -1055 -333 668 -540 -356 596 -2 -871 187
4432 187 156 -919 -273 717 -25 -501 293 -51 -870 -41 351 -785 -355 487 -277 -558 651 170 -568
4451 -568 305 413 -755 -73 626 47 -408 832 36 -810 797 445 -179 -170 835 -369 -739 481 191
4470 191 -699 108 139 -1114 -564 725 -287 -958 198 53 -635 -78 507 -883 -360 467 -777 -690 339
4489 339 -179 -1177 91 179 -659 -557 217 -294 -969 409 -28 -752 45 140 -621 -249 290 -477 -606 518
4509 518 36 -1078 106 219 -928 -500 198 -438 -628 202 -288 -1108 -126 220 -772 -342 493 -372 -490
4528 -490 474 -71 -1313 473 691 -781 -129 673 16 -719 437 -143 -508 499 409 -750 -446 463
4546 463 -188 -165 671 -134 -673 243 574 -676 -245 848 -84 -241 -58 269 -172 491 540 -488 93 892
4566 892 -257 -630 929 35 -428 245 597 -422 6 1006 337 -291 491 474 -497 511 635 -427
4584 -427 78 632 -413 -674 777 67 -384 11 523 -562 -60 734 -243 -388 340 248 -211 127 130 -440
4604 -440 164 511 -241 -591 521 -16 -939 157 643 -497 -559 791 -214 -476 243 140 -365 281 329
4623 329 -813 94 749 -153 -170 754 -121 -397 163 609 -727 -581 574 -123 -363 100 -8 -424 51
4642 51 439 -783 -352 695 -416 -415 670 359 -728 137 639 -324 -210 608 77 -446 604 -276 -590
4661 -590 765 327 -691 -380 917 32 -423 713 163 -517 323 671 -164 -433 475 296 -400 580 204
4680 204 54 228 357 -868 -249 1023 -226 -512 674 231 -579 130 790 -268 -188 572 222 -215 476
4699 476 170 -177 188 757 -358 169 1157 -149 -692 623 416 -523 521 664 -325 162 399 199 -71
4718 -71 329 553 -279 376 582 -294 180 1057 -94 -665 794 359 -63 37 482 -496 -111 763 -178 -337
4738 -337 501 116 -453 161 312 -788 -436 872 -355 -423 355 373 -803 -55 381 -304 -254 379 52 -526
4758 -526 65 -349 -871 118 377 -508 -431 715 158 -455 532 554 -325 369 500 222 273 926 38 -483 615
4779 615 76 -461 320 653 -148 -319 918 202 -245 342 612 -160 177 553 -130 21 617 176 -338 481
4799 481 94 -226 496 958 -461 149 975 159 -328 620 -16 -242 56 413 310 -56 536 -32 -15 377
4819 377 327 -272 357 623 -105 142 894 443 -732 277 474 -219 103 533 -242 -56 624 295 -339 496
4839 496 456 -287 536 630 -155 87 799 165 -409 716 497 -547 2 387 -114 -67 539 149 -457 624
4859 624 147 -603 128 403 4 127 577 -236 -621 404 707 -167 279 544 -282 -65 246 349 -452 320
4879 320 342 -577 387 306 -148 -41 606 65 -233 504 537 -514 92 438 -264 184 608 -139 -221 755 728
4900 728 -249 41 510 -399 -343 439 -11 -335 633 262 -411 15 280 -95 275 509 -132 -408 540 66
4920 66 -442 -80 495 -1 -101 660 51 -637 410 252 -207 65 700 -177 143 602 -18 -91 492 582 -348
4941 -348 333 698 -312 103 770 112 -325 602 378 -362 173 610 -237 31 649 25 -212 590 561 -364
4961 -364 337 619 159 52 215 77 73 258 457 -206 259 11 -436 -55 483 46 -470 625 191 -396
4981 -396 19 406 -237 -222 152 102 -133 424 229 -597 -235 325 205 28 509 -168 -389 331 76 -327 258
5002 258 85 -445 -96 161 -129 -380 113 358 -354 -217 435 -643 -129 181 -380 -437 244 178 -648 49
5022 49 68 -138 -333 118 167 -412 304 3 -432 -116 353 -41 -334 342 2 -344 274 -28 -911 41 39 -309
5044 -309 -61 29 70 -232 291 -36 -684 58 484 -578 -145 336 17 -571 214 232 -392 77 249 -41 -167
5065 -167 728 -113 -656 518 286 -273 -190 482 -203 -337 309 -231 -318 218 51 -347 -328 236 233 -87 221
5086 221 -250 -532 190 118 -428 173 219 107 -310 74 -59 -501 219 352 -474 -25 235 -325 -132 220 -71
5107 -71 -230 282 159 -773 79 410 -380 -250 35 -330 -177 141 -20 -315 -73 123 -126 -267 327 53
5127 53 -330 109 296 -505 -137 277 -142 -202 315 -12 -547 221 352 -599 -528 157 -17 -580 359 119 -234
5148 -234 123 -77 -488 -114 249 -379 -619 18 -168 -638 207 171 -147 -447 15 -290 -330 -25 -244 -516 1
5169 1 41 -446 -475 320 -403 -534 348 76 -415 -270 49 -324 -176 2 -71 -255 283 -62 -615 435 204
5190 204 -527 9 257 -287 -40 764 382 -397 48 541 -644 -11 96 -155 -9 60 325 -208 371 456
5210 456 -203 283 358 -244 -295 417 84 -186 124 216 -287 -287 765 76 -435 501 292 -68 112 56 -274 69
5232 69 484 -197 -124 224 306 -541 350 145 -488 152 290 -383 -217 21 169 -17 102 165 -779 55 473
5253 473 -228 -356 52 204 -514 407 64 -286 -73 152 -265 -274 390 82 -301 402 107 -100 -151 410 -342
5274 -342 -142 405 -131 -155 48 22 -157 126 182 -371 -214 402 -67 -265 65 185 -358 50 169 -161 -417
5295 -417 464 171 -291 265 430 -199 163 241 -240 170 648 10 -61 142 276 143 244 454 -224 11 384
5316 384 386 75 220 323 -11 99 -62 172 111 445 260 -315 427 117 -170 102 552 145 -13 289 275
5337 275 -301 180 232 75 52 288 -23 -168 380 -15 85 463 304 -94 -22 585 -98 -215 241 433 -592
5358 -592 26 -45 5 43 201 89 75 290 -214 -88 26 268 -571 -55 579 -119 -346 633 178 -121 325
5379 325 105 202 -275 215 -225 -14 275 -180 -123 259 335 -459 -28 498 -169 -279 19 185 -82 264 100
5400 100 -271 109 81 -357 -316 133 -55 37 113 86 -469 117 550 -214 -65 259 9 -133 80 123 -515 140
5422 140 121 -226 41 351 -116 -450 -111 282 -99 -80 551 -84 -350 94 33 -204 -62 223 -349 305 -87
5443 -87 79 33 546 34 -426 211 318 271 -181 558 -83 -169 470 -202 -285 276 -152 -148 -100 404 85 -134 294
5466 294 -68 -422 77 6 -105 -196 75 33 -38 465 199 -185 414 45 -167 133 376 -296 -313 273 82 -225
5488 -225 8 213 -425 128 471 78 -261 234 -6 -230 50 -5 -104 -172 454 -68 -389 263 -146 110 266
5509 266 110 -315 -211 5 -67 -212 241 446 -520 85 161 -610 141 582 135 -447 401 127 -156 -137 319
5530 319 -389 -150 99 -334 -88 268 65 -233 181 28 -43 -52 448 -171 -390 145 -84 -303 283 157 -325
5551 -325 -273 282 -7 -434 141 -171 -39 -55 180 -352 263 301 -251 79 148 327 -203 125 485 -355 -128
5572 -128 273 -430 -248 399 303 -499 164 -69 -142 -71 -59 -185 50 679 147 -157 -73 329 -321 449 347 -241
5594 -241 -13 733 -180 -200 -44 267 -67 -118 486 -7 -123 435 393 -5 114 443 -467 -74 -17 -374 -287 57
5616 57 -2 -104 -3 54 -534 -128 202 -320 -164 95 -183 -84 -473 76 -375 10 38 -493 -174 43 148 -637
5638 -637 -60 3 -630 -96 335 -96 -231 116 -170 -303 150 273 -155 -129 583 140 -92 273 -63 -367 -152
5659 -152 138 -225 148 320 121 -126 309 184 -305 336 324 48 -195 30 -287 7 569 -104 -76 173 222
5680 222 -77 -283 -13 -75 -483 406 135 -240 120 -153 -255 -117 -191 -186 -133 -6 21 -286 -148 217 -104 -361
5702 -361 -7 -105 -61 157 115 -172 66 151 77 -198 435 -215 -16 480 43 -151 54 85 -42 23 -42 -213 -88
5725 -88 306 -132 124 -67 280 19 82 293 -154 8 158 314 -73 169 345 -456 -5 373 -1 108 306
5746 306 324 -396 -74 221 289 -9 191 -283 166 327 -150 -201 43 342 -425 119 -156 -102 -350 193 175 -99
5768 -99 107 152 -318 -211 179 -60 -205 168 -302 -453 -101 375 43 -249 -137 -50 -323 281 -51 -77 57
5789 57 -110 -279 30 315 -49 -453 -30 -75 -417 50 19 -364 -113 -67 -91 -257 -29 96 -224 48 202 -276
5811 -276 84 -10 -116 92 192 2 -113 142 1 -474 -109 99 193 -243 301 90 -72 -128 203 87 -145
5832 -145 173 17 195 253 -98 -206 303 463 -92 118 315 -115 -164 150 -204 -178 224 369 -120 95 185
5853 185 -107 -154 -73 -76 -279 139 37 -137 -133 301 -379 -190 180 -66 -10 5 176 -263 14 242 244 -168 -69 -284
5877 -284 -94 114 -91 -223 7 321 -87 -347 236 292 11 272 322 -272 271 270 -167 29 245 548 -204
5898 -204 139 16 -184 -315 134 195 -17 119 398 -111 197 181 -250 173 -16 -3 -281 86 268 -429 157
5919 157 227 88 -100 -185 -165 24 264 200 -249 -276 185 -231 145 377 8 -22 39 1 -223 -1 130 -286 -179
5942 -179 178 -137 26 426 26 -129 247 54 36 485 -47 66 -111 252 195 -125 -21 107 -76 92 246
5963 246 224 123 27 -7 139 318 362 -204 87 169 -191 -38 144 -47 -21 178 338 139 -49 395 -75 -5
5985 -5 133 61 51 78 405 -197 46 -59 -257 71 160 130 -258 316 -13 28 72 136 -119 -3 139 43 -214 -236
6009 -236 416 -13 85 191 108 -95 288 17 -29 195 259 -104 -266 -4 -118 -19 265 374 83 12 325 -6
6031 -6 -116 260 -78 -112 41 241 -269 118 365 -197 -44 -142 -194 -141 37 -210 107 79 187 -7 12 116 -335
6054 -335 -86 155 -30 -313 -139 -18 160 5 -88 10 15 -14 -142 -331 265 -2 -131 -16 215 -353 -130 319
6076 319 38 -30 23 33 -29 148 321 364 15 -114 -156 -278 194 251 132 61 201 -64 168 471 -38 -245 -230
6099 -230 187 -271 79 201 105 43 80 -54 40 262 375 -110 47 224 27 -309 235 51 -138 227 204 20
6121 20 -12 36 274 -48 292 -78 140 500 203 -296 -10 275 40 -67 -74 -18 -203 38 129 162 182 -46 -81
6144 -81 45 241 258 -270 234 -12 -184 58 113 -287 -206 262 52 -276 94 72 -32 231 -85 -372 -21 45
6166 45 -155 -349 378 154 -486 -195 82 6 -88 -163 77 -454 150 21 -21 305 265 70 11 264 38 62 135
6189 135 223 -228 -170 -191 8 107 174 133 -15 121 86 222 120 129 -177 -243 48 162 -53 44 372 -66 26 103
6213 103 153 -71 -61 -43 28 104 192 -106 76 -30 -132 -254 506 116 -155 -29 93 25 -37 -193 235 97 206
6236 206 -25 -190 -111 55 -366 -115 127 -141 -42 -35 -190 -365 256 73 -18 -58 -38 -115 -205 113 -106 112 187
6259 187 135 38 148 -289 -132 229 -5 -258 -145 200 341 -305 51 -220 -286 -394 240 88 97 -37 118 -36
6281 -36 -547 139 -62 -163 262 203 -28 141 203 -100 -14 319 -150 -79 430 119 -46 -141 63 16 210 177 -41
6304 -41 -230 406 130 -221 13 54 -263 29 228 -88 -144 123 -76 -232 25 -23 375 331 222 -163 -213 27
6326 27 80 -130 -137 109 32 -262 329 -134 27 31 -26 -316 -260 28 -144 -98 261 11 -173 330 -71 -9 159 -158
6350 -158 -53 -224 -41 200 -98 144 92 -88 201 345 -57 123 -110 -119 -1 291 45 -186 -25 284 -13
6371 -13 -248 262 -232 -194 -91 -124 -318 264 102 -87 172 8 -214 62 215 -86 256 105 30 -58 -3 60
6393 60 -29 -182 40 354 -107 -312 -29 -315 96 272 84 27 -147 -218 -59 -17 197 -240 -204 -18 -117 -232
6415 -232 294 -357 -70 417 81 98 57 10 -78 7 267 233 -93 -196 22 248 205 253 -147 -190 4 64 -401
6438 -401 -142 75 -187 21 81 111 -52 135 -103 -296 106 -26 -109 31 -14 -51 -99 27 -21 130 -66 157
6460 157 98 202 -51 132 -31 -80 -45 -206 216 14 -53 89 112 -83 215 -200 -5 -171 -265 -55 44 84 173
6483 173 -262 65 11 -8 -36 49 -24 -57 18 37 252 263 61 -143 -203 89 62 -87 124 393 155 -9 199 87
6507 87 110 -34 264 -53 -60 143 62 366 -143 -63 -211 -128 208 -97 -91 2 -112 -150 -35 -23 -183 270 267 101 -54
6532 -54 55 -208 -95 113 -197 -215 -120 -129 34 -123 -176 48 -211 -68 344 62 159 -82 -62 -129 -38 210 -22
6555 -22 100 31 -85 -104 200 -166 30 264 -333 182 -83 -139 22 24 -223 -86 -62 48 -122 -300 -73 83
6577 83 1 -319 130 138 140 210 94 212 -144 274 -47 88 56 -64 55 -187 -34 60 -41 -11 -245 293 280 -293
6601 -293 125 -19 390 134 -173 85 39 113 161 -36 338 83 -136 101 3 58 -42 176 194 -100 58 328
6623 328 66 165 55 -320 -329 -287 -306 77 132 24 169 -149 29 120 -89 112 303 114 157 18 -29 179 160
6646 160 250 -186 261 -326 409 3 -16 -109 -180 268 -185 -108 170 130 76 50 30 230 101 102 -365 60 30 70
6670 70 37 -35 119 -321 -120 -95 87 129 -73 -100 71 -290 -139 -218 -105 29 229 135 91 381 275 -220 -102
6693 -102 -173 -88 -220 -331 -129 142 210 -174 52 212 -250 56 -113 62 -208 70 0 -41 -282 342 56 -170
6715 -170 176 -30 208 246 301 -52 280 149 -60 86 -16 11 91 -110 -88 134 -166 144 -19 -162 -4 -417
6737 -417 16 228 334 -85 -185 -187 -84 -80 104 127 -10 6 25 -144 -58 168 51 288 -7 2 -91 75 352 -140
6761 -140 -24 -233 -103 284 177 -59 -87 113 -170 175 214 246 321 -3 29 -285 -119 164 45 -104 149 -120
6783 -120 -144 163 263 165 -198 43 152 25 68 -16 -35 219 -7 123 153 112 -18 7 319 -218 -459 40 225
6806 225 76 -242 329 46 -53 -131 -119 76 -91 370 -76 -26 -158 203 106 246 33 -249 143 147 -32 -54 137
6829 137 -137 -227 433 -122 -256 -2 -91 121 -20 176 33 58 133 -276 -60 -32 96 -202 -11 -57 234 67
6851 67 -10 38 133 -163 -109 48 42 383 237 146 70 -26 52 82 177 -102 -380 -66 -187 -235 77 232 -94 -32 259
6876 259 -410 142 -59 243 154 -55 87 -241 -129 79 -100 83 127 0 -40 -95 135 122 10 42 -229 -214
6898 -214 -65 122 -140 -45 178 376 177 -67 -76 -276 214 316 -61 -129 136 111 -128 51 36 -180 65 -140
6920 -140 -41 -288 43 -126 31 -118 -299 -369 343 -95 -207 297 254 -166 -145 -25 91 197 32 -48 -205 152
6942 152 -16 15 -45 50 -107 -46 54 -222 -107 -236 -21 72 -133 147 -32 13 71 392 175 -283 261 179 -192
6965 -192 138 193 48 182 182 -99 97 1 -13 -35 188 66 -87 86 -3 61 100 170 114 -58 94 18 -44 -101 272
6990 272 143 72 133 264 -287 -75 -7 -69 -128 -214 166 217 -47 31 -16 172 -152 20 -31 121 -45 -151 183
7013 183 -14 92 42 -156 -16 166 33 -42 258 111 -225 -143 -125 95 155 50 278 -193 7 -94 -17 -194
7035 -194 -67 -187 -135 -297 -279 -27 -198 -74 -200 -234 -422 -374 -57 -47 -85 150 -274 151 -41 294 291 -87 -130
7058 -130 -217 -70 -206 101 12 -124 -90 248 72 -51 620 117 -182 183 36 -78 86 -165 198 83 -131
7079 -131 -116 -171 284 51 -29 -93 -25 -317 -39 53 257 -49 -22 263 14 -89 221 172 96 -143 9 230 307
7102 307 -70 152 -84 -136 222 308 -141 -108 -9 12 60 -99 55 -105 152 102 321 126 -137 -196 237 236 104
7125 104 274 238 241 16 -237 -259 350 290 -20 -164 -25 -174 -117 263 -151 -261 -75 -120 -198 105 43 137 -335
7148 -335 217 286 -193 -6 5 -86 -113 116 -51 102 199 -7 -84 134 265 161 -28 117 -138 172 52 126
7170 126 78 181 171 -185 97 -35 119 -182 359 -80 -47 298 -58 -12 97 -69 161 57 339 -103 84
7191 84 -249 352 154 124 34 -230 286 16 223 -205 104 346 -184 162 -73 121 94 -27 232 -7 -23 351
7213 351 278 -64 -130 8 47 146 -84 -84 132 -83 -182 37 266 -43 -439 4 29 -210 -11 -181 60 42 320
7236 320 -168 -124 -31 -146 76 -72 102 14 -154 -212 367 -253 314 128 -393 -148 97 120 48 307 109 -354
7258 -354 37 16 47 106 -64 -202 -383 288 36 152 150 170 22 139 143 133 56 -80 -281 -113 -50 83 264 -209
7282 -209 95 -173 44 199 122 64 -156 -319 13 -36 -121 148 144 -193 -317 -3 166 -42 -165 320 -117 -67
7304 -67 -187 11 48 -153 196 -152 -123 53 -141 22 -400 -117 70 -189 82 -93 -298 285 -87 -292 225
7325 225 104 86 75 118 -296 -142 -33 85 -149 119 251 -156 -43 62 -8 -139 -249 -144 -348 198 -130
7346 -130 -253 288 329 47 -250 256 -202 40 -174 -146 174 45 -68 -8 -126 -58 -107 85 217 69 209 -176
7368 -176 -177 62 -130 243 -138 237 -443 -403 -319 0 108 -44 -138 152 61 261 7 23 77 -81 -71 -105 114
7391 114 147 -102 -218 56 2 -77 -354 28 45 -85 -128 126 26 238 45 123 14 -299 -159 -193 257 61
7413 61 -84 193 -61 -47 39 220 -152 -127 208 68 -169 -217 123 -13 -18 242 -55 -322 217 -6 -95 46 162
7436 162 -119 193 308 59 8 161 -43 -300 129 29 -311 -221 152 8 -174 26 221 -39 8 179 -50
7457 -50 -29 99 -85 -272 8 -165 -7 -120 113 -65 -174 140 -45 -97 -158 -163 -85 -109 251 -43 86 -67 226
7480 226 36 67 249 -146 -1 142 92 -28 58 66 -111 44 289 -245 -129 329 -35 -25 25 -189 437 220
7502 220 116 -31 130 236 -122 -20 -36 -31 235 143 207 -183 309 146 73 28 106 -6 221 -165 -48 -107 -104 145
7526 145 -257 9 197 246 -93 293 36 -625 -85 214 -301 -78 278 72 166 -223 31 -483 47 61 52 128
7548 128 111 37 -381 185 -119 -221 94 62 -237 69 -72 -277 -251 2 -61 -239 -47 213 -223 -343 202 -461
7570 -461 -186 142 -275 -179 -59 125 35 64 123 -31 43 -49 68 -142 126 41 -366 -52 238 1 -5 179 167
7593 167 -440 105 493 270 246 -52 413 -292 24 -60 5 57 33 -211 -188 85 -154 -80 35 -144 -12 -6 -219
7616 -219 -36 -90 98 41 61 -134 -21 54 -203 235 72 -254 130 57 48 -137 -87 -153 -133 259 -64 -273 69
7639 69 105 -68 -194 -209 -119 -210 149 64 -345 45 199 -164 -166 -149 -308 158 175 -103 67 259 60 157 -67 39
7663 39 -78 -22 114 350 211 210 -394 40 86 -62 37 297 122 167 164 -110 -99 -288 23 68 -307 -115 238 -184
7687 -184 -66 35 -204 -180 -203 188 73 -57 237 -89 -2 -52 24 -230 297 13 -241 111 345 176 97 -96
7709 -96 -5 216 143 94 -99 -239 -103 -3 193 96 114 -67 -52 -71 -82 -137 206 70 -12 258 17 95 178 -80
7733 -80 -118 -9 355 -96 -295 338 204 197 -85 208 -100 -189 126 119 -228 -37 461 7 134 238 -376 -48
7755 -48 159 40 74 215 121 15 -103 -170 -350 361 449 90 -298 164 -162 -310 12 119 100 19 109 -136 -215
7778 -215 2 -5 117 53 190 -61 -125 -45 151 -171 155 38 -79 -38 308 188 239 145 -186 -33 33 -308 51
7801 51 334 -168 -300 -6 182 -208 190 70 432 265 -59 115 -1 -181 -30 85 142 97 28 -216 265
7822 265 28 112 -43 -117 16 16 -173 164 -6 -26 235 205 -254 459 159 -12 237 126 28 -260 -17 -155
7844 -155 -113 52 6 36 15 163 -32 84 21 -207 -104 66 -137 -257 77 -82 -182 -10 45 -70 41 93
7866 93 -233 95 -19 46 -89 -196 94 11 -72 41 13 -140 204 -56 -143 159 104 -185 -97 190 -134 -348 236
7889 236 228 -203 221 94 -63 -126 124 44 190 -214 -42 21 96 266 227 187 172 -23 -88 5 372 77 -99 91
7913 91 -5 -60 156 -111 26 -72 11 -364 -158 266 -389 202 44 -233 137 -84 192 93 187 364 -44 -1 64
7936 64 -28 -71 42 315 -65 332 464 68 -67 29 -32 149 80 176 -395 297 162 150 -152 145 -50 -179 115
7959 115 32 228 381 46 134 -324 -113 50 37 87 14 126 -126 326 -97 -171 -110 52 144 535 58 -12 222
7982 222 11 -280 -125 32 -165 -14 -259 -40 -98 68 -29 -85 -248 12 -75 -33 -189 -161 179 174 57 -34 -38 125
8006 125 -338 50 22 23 -114 98 224 -203 -645 176 32 -130 210 82 -65 269 -162 -141 177 -126 -129 57
8028 57 11 240 -72 231 237 38 237 121 104 -364 -23 131 227 -2 -98 44 42 93 -408 114 -32 -68 -153 -131
8052 -131 102 -212 -151 188 -295 -273 149 -64 32 -18 3 76 -149 64 105 -256 -103 -32 72 118 -71 -73 -350 249
8076 249 -209 44 129 -50 -62 101 69 -75 -16 285 118 -67 57 -148 -271 -100 -1 -148 -221 -54 -6 -159
8098 -159 70 -111 -7 172 -84 -174 -18 -85 27 59 183 306 128 65 -267 -185 145 203 -37 -86 247 -10
8120 -10 103 -87 445 -379 -205 117 89 -48 395 -112 -380 -114 -215 -560 -58 54 286 -102 85 212 93
8141 93 94 160 -118 -203 -163 -91 85 -54 235 -36 -201 9 151 -56 7 -65 26 88 -48 353 8 174 -57 46
8165 46 64 71 -64 94 -176 -227 10 -141 -289 -227 195 -322 -237 -45 126 -313 -318 -6 73 -145 22 42 -40 -29
8189 -29 93 -33
8191c3
$$ Imaginary data points
##PAGE= N=2
##DATA TABLE= (X++(I..I)), XYDATA
0 0 0 0 0 0 0 0 -8 8 -8 8 -13 16 -16 24 -24 32 -40 47 -53 64 -73 85 -98 114 -130 148 -168 191 -215 244
30 244 -274 310 -345 386 -431 479 -532 590 -656 724 -804 889 -984 1090 -1208 1340 -1491
47 -1491 1664 -1863 2097 -2375 2711 -3130 3666 -4378 5378 -6885 9404 -14401 28085 -141107
61 -141107 -460004 -122195 144057 15765 -177325 -97932 22607 40238 2024 -18279 -44657
72 -44657 -43254 -5101 47887 15199 -79177 -64624 87671 108276 -44550 -76584 70375 108428
84 108428 7942 -21243 32731 56508 62461 43699 -6184 9642 91892 91092 13584 -21371
96 -21371 -24937 -22073 27459 33202 -77542 -129939 -21320 49884 -28942 -100918 -66785 -13435
108 -13435 -20543 -69527 -72491 -1932 19722 -59153 -75162 11061 6523 -79079 -46428 25414 -35860
121 -35860 -87911 -8910 15970 -78600 -99498 -17145 6791 -44121 -67327 -38003 4702 10325
133 10325 -22536 -16572 23638 -381 -37186 23236 68467 -10054 -59365 8434 46222 9830
145 9830 2127 5796 -20808 -10132 23905 3157 -27445 -18432 -14352 378 46625 35693 -24136
158 -24136 2131 73319 44609 -16676 4402 38549 22262 9198 15604 21547 29753 15958 -12632
171 -12632 9408 40933 -2039 -35110 12700 25966 -16191 15352 68139 13335 -32614 46275
183 46275 101997 36721 -16965 16515 63731 65427 24130 -10641 24207 74100 43353 -5998
195 -5998 10661 24832 6351 21953 30575 -19646 -18512 63281 66955 -17611 -31366 31751 61224
208 61224 39619 139 -24075 20317 77697 35087 -40122 -17874 37051 29957 6147 -9738
220 -9738 -37990 -20573 44062 37045 -32270 -35710 20704 43600 22384 -15818 -28545 29766 78165
233 78165 16965 -43911 19095 80996 34117 -9141 10824 19257 19294 36795 12575 -31758 -2850
246 -2850 55360 47083 3373 -12243 10031 57537 64083 -4336 -32688 45193 86768 24916 -7612
259 -7612 30527 45147 37285 41384 17325 -9125 23673 50313 10340 -19110 1533 21877 29888
272 29888 27551 -3885 -8932 44690 55361 -5249 -14213 39525 47109 15700 13102 18353 20251
285 20251 39905 36995 4882 9675 33643 16179 -1018 12723 4493 -5465 25710 29623 -12677
298 -12677 -768 51294 35521 -6887 9148 35652 23782 14188 12092 8914 26281 35334 7259
311 7259 1962 32486 23901 -6870 3709 11016 -13740 -3179 24306 -1720 -21886 18092 36086
324 36086 2830 -5031 14429 17963 19420 14028 -11378 -3687 35398 25358 -13012 1256 27164
337 27164 11755 3255 9051 -10326 -12336 22400 18178 -21420 -13565 22428 23751 11401 3565
350 3565 -4195 17788 47317 13669 -29975 2403 40861 11653 -14828 201 6383 6716 19254
363 19254 2488 -24979 -3345 23756 2467 -18368 -10818 -3109 12535 25614 -1516 -18863
375 -18863 27487 51180 3783 -19102 13485 21694 3775 3244 -2226 -8327 17402 28197 -4001
388 -4001 -13556 11613 12160 -1107 -1843 -14526 -17286 18809 25702 -15501 -12151 36193 34170 -2037
402 -2037 -4243 5268 4952 12645 5854 -17923 -3671 27901 14685 -6607 5581 9175 -531 11613
416 11613 7534 -23529 -11190 30239 16651 -16197 1918 26864 17945 6732 -3103 -11913 6754
429 6754 21202 -9512 -25775 6915 18404 -4517 -6111 -499 -12548 -2355 15764 -10069 -31873
442 -31873 519 21709 -496 -11796 -2293 3179 13774 11031 -20244 -21581 19496 19225 -21829
455 -21829 -19818 6604 1984 -6879 -6863 -24354 -25588 7338 7723 -29686 -30680 -1402 5259 -3344 -16346
470 -16346 -34587 -16284 21990 1725 -45558 -25508 20849 12022 -14934 -16570 -15739 -6024 12233
483 12233 -7113 -40355 -20126 16645 8685 -13165 -14666 -12459 5298 24840 -5391 -42099 -8827
496 -8827 34462 10137 -23039 -10133 11603 20668 19522 -7166 -25673 6121 29798 -977 -23753
509 -23753 -6022 8755 13589 16865 -8716 -28060 8039 34448 -3799 -32070 -5603 16819
521 16819 10697 2125 -10249 -11827 14791 19904 -15013 -24016 3314 5826 -6658 -960 -5280 -14859
535 -14859 5496 14376 -17550 -27465 3337 10672 -7584 -7512 -2156 -12 14211 10819 -16045 -10556
549 -10556 17520 4932 -18548 -4529 5899 -6892 -2301 6511 -7726 -9521 3621 -11120 -27373
562 -27373 -11086 -2320 -15241 -12742 -5138 -10449 1679 14978 -12376 -32300 -3581 9937 -16179
575 -16179 -21702 -4109 -3922 -4066 3563 -6596 -14405 -424 -5537 -26304 -17205 -1820 -15165 -18965
589 -18965 -3153 -4285 -6244 8928 -993 -26926 -9922 19055 1512 -25428 -18282 -2467 11270
602 11270 17735 -5537 -26007 3448 30301 1475 -25027 -9788 4190 5714 10774 407 -11747
615 -11747 13754 35558 7409 -18870 -691 20110 21934 10910 -13953 -18451 21663 36496
627 36496 -11095 -35181 2450 25844 6328 -14860 -24956 -16999 14165 19411 -24096 -41124
639 -41124 -2891 21972 7509 -11867 -21945 -10580 22382 19140 -28522 -32562 15180 24146 -14030
652 -14030 -28780 -13251 6052 20335 3581 -34904 -27395 19045 22362 -16048 -32330 -18910
664 -18910 3115 24643 9285 -32464 -22215 33091 35821 -14423 -35087 -13949 11560 22460
676 22460 1408 -31221 -17407 24563 20398 -12372 -15081 -3701 -1920 7338 5346 -17704 -12323
689 -12323 20056 16506 -11194 -3582 18789 16494 6757 -2680 -12094 2295 19716 371 -19569
702 -19569 -200 15648 3248 -801 588 -12439 -7586 13319 2157 -21791 -7488 13767 9232
715 9232 3101 1185 -5856 3877 19256 3110 -14418 1207 10305 -6904 -6161 4353 -6167 -9969
729 -9969 4333 -906 -15907 -6049 4065 -4452 -5294 -5444 -16107 -6108 19039 10831 -10970 -3526
743 -3526 5930 23 6146 10260 -11806 -17121 9772 15023 -7150 -14460 -7567 -919 11062 6345
757 6345 -18108 -13880 17137 16091 -6276 -4085 4585 3117 15701 22723 -766 -8873 15010 19448
771 19448 -2705 -7039 2797 6961 8868 -1918 -21690 -8330 22974 10601 -23680 -18360 6569
784 6569 10812 7413 -741 -13171 49 25627 9940 -22156 -11623 16090 15906 1007 -15287
797 -15287 -21488 3140 27813 -1374 -39728 -19198 18462 13284 -9695 -18241 -11796 13179 30163
810 30163 5216 -21088 2285 32587 23996 2327 -9160 -6856 20476 38617 6113 -25267
822 -25267 2596 33858 14183 -11971 -8107 4987 16303 17645 -4539 -11637 19805 36823 12232
835 12232 -4316 7161 17686 23293 19746 -4634 -13242 17766 30354 -1244 -18138 -1440 7988
848 7988 4791 -2684 -18307 -18866 7344 11752 -16439 -20728 2053 8307 2128 517 -8890 -11017
862 -11017 9709 14409 -11220 -17084 2174 5308 -4610 -9019 -16389 -13316 5903 3538 -20161 -15320
876 -15320 6523 2988 -5878 2168 -799 -9551 4156 15013 3086 1213 11354 5134 957 9142
890 9142 3993 -8778 -2778 1336 -8382 -5772 2674 -6755 -6631 12011 8711 -10102 -4279 8092
904 8092 3508 3037 7358 261 5037 23690 17005 -1795 6888 18289 4806 -3744 -1228 -7559
918 -7559 -5151 9553 2169 -14216 -2469 14167 5723 -4484 -4796 -6926 1566 13855 374 -12653
932 -12653 8046 24787 8580 -2220 4377 3016 2874 9472 -4074 -19653 -2965 14625 1673
945 1673 -9208 -1584 3949 7784 9898 -5899 -14123 8797 21432 -636 -9731 7153 13386 8460
959 8460 5476 -6581 -11205 6428 9384 -16212 -21421 -1740 702 -8066 -8780 -13809 -13977 5743
973 5743 7818 -16399 -17004 9357 12920 -1917 -4012 -1986 2278 12779 5371 -15438 -8081 14087
987 14087 7112 -10171 -8717 -6204 -5138 4620 -2433 -24336 -14966 13150 6695 -14438 -9012 5220
1001 5220 9637 9410 -2290 -15421 -1125 17979 2394 -15727 -4894 7232 4234 2643 -5093
1014 -5093 -15721 -4381 10779 -5861 -21849 -5421 9306 4577 1997 34 -3246 9582 18401
1027 18401 -1419 -13535 5396 12399 -1757 -3325 3197 559 2848 5599 -7673 -14153 933
1040 933 3073 -10997 -9892 -1160 -1085 3805 7845 -3345 -2481 16148 10979 -9413 -1931 13979 6773
1055 6773 -441 3296 416 890 9435 832 -14852 -5820 7122 -2847 -9849 -3839 -2376 2124 11314
1070 11314 -122 -14078 3904 20029 3054 -9591 1034 7897 8489 8725 -3301 -12009 4872
1083 4872 13421 -7915 -18098 -3728 1224 -1634 -538 -8256 -12378 6364 14587 -6598 -14551 2901
1097 2901 9926 2162 258 -2854 -1625 12443 11735 -10121 -11524 6600 4004 -9208 -7736 -7046
1111 -7046 -8086 3789 5930 -12221 -11674 9723 9195 -6102 -5374 759 2960 8997 5423 -7866
1125 -7866 -1461 15560 5451 -8731 -1969 2046 -4805 -2246 -1039 -11861 -7147 6981 -1097 -12934
1139 -12934 -1313 7388 512 -224 1399 -2419 4822 13359 -684 -8633 7417 11984 -1928 -2448
1153 -2448 3595 -2380 -1699 4788 -4623 -11871 161 3503 -7428 -4715 3117 -1175 374 6629 -420
1168 -420 -1773 12869 8528 -8686 -1100 12833 4853 -3222 2023 1646 867 8392 3632 -9448 -2945
1183 -2945 6570 -1012 -4384 1520 -1382 169 12105 7106 -6044 5765 17932 2751 -6884 5805
1197 5805 10290 2963 1649 -2860 -3867 9312 12355 -7078 -12556 2912 6657 -177 -2264 -9696
1211 -9696 -11615 9469 18768 -4973 -14907 6120 16542 5319 -3566 -7644 -4216 9972 8400
1224 8400 -12481 -12272 7568 6913 -6259 -5820 -3983 -5183 5146 4561 -15950 -15056 10339 13510 -5746
1239 -5746 -10585 -659 10295 16733 3488 -16057 -6527 16950 7879 -12478 -7887 2105 2095 6496
1253 6496 3532 -12419 -8950 10840 6463 -12824 -10464 2122 5428 3979 -3024 -8458 6477 20029
1267 20029 853 -16372 455 14236 2883 -5053 -5332 -7986 1117 15217 4358 -13943 -6737
1280 -6737 7290 5668 -280 -7875 -12302 3116 17513 1241 -12658 3938 14058 950 -1959
1293 -1959 3381 -1627 -2393 5325 1510 -5548 1365 3665 -3894 -1952 1484 -3167 1437 7345 -5594
1308 -5594 -11228 8365 13820 -4536 -5407 7804 5655 1324 6349 2646 -3494 1667 4160 231
1322 231 3126 1008 -9057 -2788 10205 -2119 -14557 -1142 7392 -2873 -2344 4504 -3737 -6522
1336 -6522 5643 5133 -5127 -4753 758 3432 8105 1946 -11943 -3787 13517 790 -17944 -6678
1350 -6678 6735 482 -3687 -3372 -9384 -2933 12783 5185 -13271 -11202 2785 8783 7213 -5722
1364 -5722 -17832 224 23650 6509 -19951 -9245 10586 5478 -5693 -9439 -10860 -1173 11460
1377 11460 1702 -13308 -6715 4309 3038 635 -6059 -12118 2944 17373 -1224 -19160 1594
1390 1594 19105 1541 -14580 -9075 396 7062 5882 -10119 -16349 1791 11805 100 -8515
1403 -8515 -8787 -6092 6988 12920 -8620 -19446 6751 22240 746 -14260 -3393 6741 7612
1416 7612 1136 -12686 -12392 6441 9647 -5858 -8335 -200 -1392 -171 1973 -11186 -16252 4507
1430 4507 13437 -6477 -12984 2968 10897 6114 -1309 -9550 -5446 9107 4987 -10444 -4984 7058
1444 7058 1514 -2922 3205 -2089 -7171 4364 5661 -12019 -12127 4866 7119 -2240 -4455 -3437
1458 -3437 2862 9825 330 -13449 -3498 7996 -2789 -9193 184 330 -5001 3475 4532 -9149
1472 -9149 -8876 3882 2293 -4247 -3415 -4091 -2108 7372 4124 -7057 -1047 8053 -1019 -4798 5164
1487 5164 1335 -7588 419 5849 -5209 -8208 -1472 -869 -1467 74 -7706 -10523 1741 3433 -8132
1502 -8132 -6250 177 -5422 -4352 6332 -590 -12165 -682 10543 80 -7357 -2060 661 1092
1516 1092 115 -8854 -10072 5316 7012 -7823 -8086 1944 -40 -2388 540 -6908 -12100 2555
1530 2555 8537 -6900 -11023 2152 7384 3465 -2387 -10558 -7250 8883 5323 -14339 -12133 5469
1544 5469 6285 -2247 -2558 -4740 -3469 8036 5581 -11787 -10319 7220 8985 356 -3463 -3848 4494
1559 4494 16476 5737 -14903 -7451 12579 6273 -8565 -6643 -1183 1022 5982 812 -11917
1572 -11917 -4986 9245 3224 -8558 -6504 -1470 3481 8129 -359 -11356 1278 15643 2292
1585 2292 -10834 -1742 4993 1477 645 -3430 -9361 323 9629 -2297 -11433 -2430 3590 690 777
1600 777 -3395 -8164 2715 11172 -2138 -10226 3084 8551 517 -1739 -1226 -2866 3550 6324 -6384
1615 -6384 -9882 2810 3914 -4439 -2974 -596 -4450 1182 6302 -3829 -6751 5630 6194 -4196
1629 -4196 -1835 4284 782 1076 3112 -3004 -2410 5009 629 -7390 -752 2867 -5358 -4828 1299 -3542
1645 -3542 -4626 3531 395 -6950 373 5754 -2386 -3412 2971 1141 -1086 3303 -674 -4855 3355
1660 3355 5098 -6585 -5681 3677 319 -4501 -928 -2495 -5643 2498 4168 -6572 -4534 5790
1674 5790 3228 -1803 2001 739 -1187 6391 4848 -6970 -3569 7779 2769 -5468 -1109 819
1688 819 -1242 2772 1000 -8411 -3500 7484 2268 -5640 -438 2465 1897 6338 3574 -5393 1767
1703 1767 12225 2860 -6140 1569 5511 1174 1926 778 -5226 924 8529 -318 -7638 632 4798
1718 4798 117 997 430 -3183 4070 10413 -101 -5889 5450 9388 1839 756 1424 -1588 2496
1733 2496 7170 -3165 -7312 3254 4710 -3582 -1895 1853 -1666 777 4345 -3464 -5477 5231
1747 5231 4982 -4143 -1628 4350 779 1108 2830 -3343 -4082 4268 -364 -10149 -4808 1798 -3870 -4626
1763 -4626 -310 -4561 -4656 3230 209 -8259 -2380 4140 -2660 -4502 1395 927 1481 4945 -604 -6322
1779 -6322 2277 6079 -6037 -9535 -983 -346 -2791 -444 -3951 -6239 2892 5658 -5909 -7649 1758
1794 1758 2081 -1227 869 -1220 -2008 6975 8391 -3962 -3915 6720 4583 -3599 -2420 -1167 -736 4987
1810 4987 2912 -7410 -3178 9109 4675 -3565 -978 1296 1625 6720 4237 -6152 -1153 11816
1824 11816 6327 -4892 -1870 2436 1509 2138 -1797 -8357 -1901 7117 -1715 -9752 -1522 3274 -1077
1839 -1077 -450 -478 -4192 1979 9398 11 -7732 1713 7471 981 -2518 -2819 -3945 2701 6235 -6000
1855 -6000 -11824 -692 3144 -6671 -8658 -4530 -4859 -1324 1881 -5458 -8145 2730 4756 -4320 -5311
1870 -5311 -1663 -2156 -109 1010 -7366 -7814 4004 3458 -8642 -8307 -1152 -2767 -4453 -3192 -7778
1885 -7778 -7806 2355 3104 -4234 -1965 1580 -1542 110 2774 -4511 -6497 3509 3457 -5900 -3437 2230
1901 2230 -2615 -4289 -696 -3646 -7167 -2151 -2514 -6160 -1246 1668 -3983 -1984 4492 -268 -4324
1916 -4324 3016 2845 -4051 -1390 2922 -2427 -3498 2220 -1150 -6027 -2249 -2112 -5598 -3072 -3168 -8747
1932 -8747 -3227 4654 -2472 -9510 -1065 3497 -2521 -3561 -1178 -3581 -784 4634 -1495 -7211 -1488
1947 -1488 1692 -2860 -3757 -5328 -8584 -1756 4847 -5687 -12812 -1313 6217 -1417 -5700 -3820 -1943
1962 -1943 2050 4663 -4065 -8222 2261 6555 -150 -3356 -3391 -4636 1278 4542 -7662 -14092 -164
1977 -164 7162 -3545 -8938 -3831 -711 1996 426 -7913 -7836 3821 4917 -5496 -5519 -371 -732 741
1993 741 817 -9220 -10931 2496 4355 -9877 -13164 -3605 179 -2066 -6107 -10807 -5205 5785 820
2008 820 -11102 -7399 2785 1281 -1887 -2389 -6760 -5061 5348 3576 -10529 -10208 1706 2569 -3839
2023 -3839 -7661 -9070 -3049 4982 -2484 -13258 -6020 4450 214 -4309 -1288 -2901 -3190 3783 1935
2038 1935 -7488 -5352 2509 906 -2750 -2852 -4246 -2223 2514 -3002 -10248 -3237 3041 -4225 -7419
2053 -7419 -906 -483 -3783 522 1601 -3953 -1795 2563 -1325 -3405 -1169 -2747 -3242 1837 -1187
2068 -1187 -7234 -870 3476 -4298 -6666 -316 -2292 -6922 -1598 1363 -3451 -3448 809 126 507 1931
2084 1931 -3203 -3661 4126 1750 -6629 -3786 2797 -1301 -3787 -564 -4007 -6315 643 1853 -7074
2099 -7074 -7952 -2051 -710 -1162 -1725 -6255 -4033 5429 3096 -7720 -5063 3686 679 -3498 -2440
2114 -2440 -4582 -4673 2405 2270 -7022 -6939 285 672 -1427 -2932 -6107 -3292 5384 1614 -8259 -2571
2130 -2571 7948 3838 -3108 -716 1247 1816 4341 686 -6318 -1649 5928 1980 -3300 -2239 -878
2145 -878 1471 5554 -1383 -9207 -427 9530 1617 -6819 -1743 3756 3896 3831 -1189 -5448 1215 6888
2161 6888 -367 -6021 -2091 -375 -548 1248 -3996 -8916 -442 6757 -2915 -10044 -2398 2718 366
2176 366 -1533 -4029 -5108 2408 5606 -2882 -5793 827 1740 -1519 -198 -2305 -5947 -69 3938
2191 3938 -4363 -7882 172 3033 -1586 -1862 -1541 -1994 2810 4057 -2841 -2504 4981 3782 -1206 1700
2207 1700 3319 407 2987 5345 -1257 -2842 3982 4116 -1309 55 1759 467 3228 4466 -611
2222 -611 138 6290 3491 -1047 3638 5896 976 2480 6114 2274 984 5287 3329 -219 2546
2237 2546 3114 -934 822 4320 251 -173 3725 1633 -1422 3843 4826 -1946 300 5734 2362 -248
2253 -248 2846 2453 888 3716 2413 -3131 182 4710 -55 -2854 1522 985 -1447 2353 1266 -4017
2269 -4017 -785 4888 398 -3242 1511 3085 1177 2562 817 -2672 2241 5888 -1562 -5288 1300
2284 1300 3126 101 311 -332 -3056 1635 5025 -2431 -5626 1813 4060 445 243 424 73 5573
2300 5573 7009 -1431 -3144 5455 6530 -169 -621 1132 1262 4783 4882 -1988 -2372 5565 5365 -1303
2316 -1303 -1280 1256 1095 4798 4945 -2036 -1258 7867 7199 -731 -341 3532 2760 3539 3049 -1996 -759
2333 -759 6829 4225 -2688 -162 3208 1586 2017 2292 -2205 -355 6610 3892 -2502 1249 5602 2350
2349 2350 1653 3537 581 1242 5614 2033 -2724 1871 4529 -700 -793 2129 167 -87 3615 1111
2365 1111 -2396 2354 4563 -446 -265 4194 2404 928 3798 2542 167 4975 5411 -1014 22
2380 22 4794 1456 -1875 1529 927 -794 2201 1886 -2763 -834 4551 756 -2801 -216 -42 -1426
2396 -1426 2050 1119 -3967 -239 4749 -287 -4284 -378 377 -2933 -1165 -1475 -4898 -976 2847 -1725
2412 -1725 -4550 581 1537 -1674 -656 -594 -3328 560 4137 -1116 -3498 3118 4041 -558 -571 -75 -2002
2429 -2002 761 2905 -2794 -4092 2402 2887 -2008 -616 1685 -510 1499 3334 -1409 -1917 5167
2444 5167 4789 -1558 -341 3527 1685 2008 2185 -2351 -1706 4135 1959 -4233 -1649 2313 -504 -381
2460 -381 626 -3199 -2233 3484 1878 -4506 -1805 2782 113 -987 169 -2296 -1791 3121 326 -4507
2476 -4507 -1004 2302 -1310 -2055 124 -2334 -2331 2733 407 -4432 -472 3419 411 -902 1365 133
2492 133 1 3545 624 -3271 1178 3885 -978 -1725 2402 -420 -2233 1358 342 -3768 -997 1536
2508 1536 -2358 -2310 807 -1489 -2461 701 -549 -3207 146 551 -4372 -2959 1712 -2084 -5595 -1487
2524 -1487 -611 -4198 -3274 -2531 -5381 -3737 -771 -4722 -6548 -1880 -1556 -4851 -2668 -1606 -4945 -2298
2540 -2298 1836 -3642 -6427 30 2141 -3315 -3769 -1664 -1904 -230 263 -4862 -4912 1866 1717 -3911
2556 -3911 -2635 121 -1720 241 2413 -2574 -3864 3715 4444 -2330 -2853 1352 2473 2335 614 -3706
2572 -3706 -1797 4900 2078 -5183 -2605 2224 -157 -749 478 -2946 -2845 3387 2437 -4925 -3622 1878
2588 1878 1418 -412 -1547 -3807 -514 4340 -624 -7033 -2216 2572 -1860 -4593 -2066 -2884 -3370 -29
2604 -29 -1524 -6481 -3540 1046 -1503 -3913 -2982 -3541 -1757 1479 -2783 -7056 -959 3326 -3155 -6005
2620 -6005 -1582 -1680 -3493 -1422 -2792 -6035 -2911 623 -2773 -3735 -1610 -2515 -1700 1677 -2262 -5602
2636 -5602 -89 3745 -2352 -3934 1327 976 -1489 400 608 -2213 -747 588 -1711 -1728 785 -1556
2652 -1556 -1617 2618 538 -3456 699 3748 -1390 -1549 3248 1672 -1344 1675 2324 -625 391 1583
2668 1583 -681 249 1441 -2301 -2452 2144 -92 -5439 -1462 2490 -1977 -3018 615 -418 -2803
2683 -2803 229 109 -3475 -1689 148 -2081 -1673 -569 -4058 -3358 1439 -1509 -7461 -2896 1959 -2805
2699 -2805 -5744 -2257 -1805 -2678 -81 -1220 -4054 -1035 1978 -715 -1752 -251 -2169 -720 3250
2714 3250 -300 -6043 -671 5230 -209 -4426 -764 880 -271 608 -1290 -3409 700 3665 -668
2729 -668 -1340 1651 996 1466 4119 898 -3729 1872 6531 127 -3803 1128 3536 1715 699 -1297
2745 -1297 -1457 3051 3467 -2663 -2786 2265 2208 519 2456 389 -2439 3270 6453 -848 -4029 1872
2761 1872 3756 443 -910 -1671 -1217 3174 2666 -4312 -3414 2418 1012 -2635 -78 -500 -2774 1630
2777 1630 3459 -2416 -3894 2226 2672 -1109 -1700 -1207 -807 2267 703 -4710 -2810 2606 -588 -4236
2793 -4236 -1019 -453 -3110 -887 1369 -2532 -3442 1352 668 -1809 -536 134 -1118 680 1218 -2777
2809 -2777 -913 3486 193 -3205 1004 1412 -2646 -1275 1792 -988 -2054 1444 1009 -1035 1287
2824 1287 883 -1466 1844 2949 -1149 -200 4033 1338 -1168 2356 2452 -1786 625 3993 -335 -2148
2840 -2148 997 879 119 1214 88 -1676 1680 3612 -1837 -1601 2988 2182 -414 1962 1811 -1254
2856 -1254 1923 4619 -360 -2297 1766 2140 138 -162 -494 -1279 2368 3221 -2775 -2100 3783 2512
2872 2512 -1439 537 1195 15 2269 3637 -765 -1604 3910 3202 -463 341 586 -248 2233 2552 -2969
2889 -2969 -1924 3672 1688 -2739 -868 1499 37 1220 1537 -1911 -786 4192 2117 -1935 53
2904 53 1380 -124 1734 1240 -2640 -917 4006 909 -3959 -795 2128 -132 -323 223 -2322 -680
2920 -680 3304 689 -2728 978 2455 -84 601 1044 -1947 -242 3370 251 -3309 797 2725 -963
2936 -963 -946 536 -1140 -561 2259 -686 -2494 1425 2310 -918 -151 2025 71 348 3040 -298 -2311
2953 -2311 1737 3043 -999 -605 1745 -229 -303 1782 -329 -2005 1543 1955 -1850 -301 2391 -69
2969 -69 -594 2321 863 -1215 2245 2676 -1076 238 2939 282 -789 1858 180 -1657 995 1254
2985 1254 -2380 70 2255 -996 -1330 1839 729 -1521 952 1865 -898 805 2771 -322 -985 2524
3001 2524 1097 -1750 478 727 -1393 199 1576 -1950 -1969 1845 916 -2457 -30 1365 -750 372
3017 372 1559 -1295 -817 3292 1012 -1971 702 2105 -157 352 1123 -2201 -1083 2653 451 -3272
3033 -3272 -298 1977 -670 -617 354 -1943 -592 2890 -74 -3222 11 2704 -456 -630 272 -1605
3049 -1605 -612 2268 -155 -3502 -543 1892 -2197 -2050 -397 -1463 -822 1215 -1535 -3829 150 1945
3065 1945 -1402 -1675 411 -816 -773 1738 -674 -2601 1159 2632 -1937 -1957 1083 -523 -1076 609
3081 609 -1282 -2828 581 1697 -2287 -1291 2012 -8 -901 1360 382 -1186 1671 2031 -1476 -264
3097 -264 2569 512 -559 1663 231 -1251 1701 1527 -1903 -159 2542 -332 -1188 1460 1218 -676
3113 -676 1574 1897 -636 985 3183 -40 -566 2605 1535 -590 1618 2029 -1060 581 2392 -800
3129 -800 -1518 2332 981 -1500 95 1095 -720 94 1543 -793 -1433 2248 1042 -2457 208 1417
3145 1417 -909 -824 694 -1741 -1973 1417 -492 -3428 -1234 901 -1695 -1446 -440 -2310 -1529 1759
3161 1759 -653 -3699 -182 1998 -568 -1404 959 -585 -448 2094 214 -2588 339 2251 -730
3176 -730 -1020 631 -610 133 2541 116 -2679 1463 3226 -332 -1020 1956 1427 851 2584 1009
3192 1009 -1043 1887 3107 -319 -611 1535 445 277 2037 1 -2331 1424 2986 -1457 -1658 1315
3208 1315 800 -563 1201 -159 -1474 1400 1977 -1715 -1183 1145 -670 -1241 1285 -1025 -2981 379
3224 379 1141 -2645 -2439 956 -515 -1626 -62 -328 -1505 602 822 -1869 -574 1922 -369 -1172
3240 -1172 1850 625 -2097 974 1954 -1544 -1227 1722 120 -1474 955 547 -1063 867 1297 -854
3256 -854 470 1975 -478 -974 2410 1315 -1054 973 2546 -803 -537 1994 -155 -1060 912 536
3272 536 -1608 140 767 -1211 -37 1256 -1090 -1313 1919 457 -2596 146 2282 -1100 -1605 994
3288 994 330 -661 832 -377 -1974 43 968 -1619 -1211 841 -1296 -1275 1372 -469 -3022 390 2737
3305 2737 -1233 -2266 941 963 -465 851 -792 -1456 1386 1209 -2106 -1799 1279 -215 -1430 486
3321 486 -875 -2578 405 1918 -2154 -3087 895 1060 -730 -499 -1225 -1099 1798 1083 -2828 -1296 2128
3338 2128 122 -1802 243 -228 -2025 451 1422 -2190 -2509 1237 497 -1391 -841 -720 -548 1779 664
3355 664 -2569 -478 3034 744 -2122 958 1081 -809 561 1294 -1811 -865 1835 674 -1253 -137
3371 -137 -15 -683 1074 619 -2106 -362 3216 -18 -1849 1004 1456 -460 598 1346 -663 -655 1756
3388 1756 426 -906 746 277 -815 1067 885 -1858 -461 2230 -160 -1909 1176 1523 -1026 138
3404 138 1450 -135 -463 1145 431 -372 1052 141 -968 797 1266 -1763 -828 1881 -365 -2024 743
3421 743 797 -1666 -218 1031 -811 -1141 762 -336 -710 651 -120 -1640 838 989 -2063 -1381 1913
3438 1913 -308 -2568 -126 89 -1843 -392 705 -1640 -1498 1051 65 -1311 115 -104 -1132 1222
3454 1222 1124 -2008 -828 2722 203 -2045 86 767 -717 -72 797 -1384 -586 1557 -31 -1415
3470 -1415 512 700 -295 1128 1064 -1825 -359 2819 741 -1546 551 1579 46 209 553 -865
3486 -865 310 1660 -538 -1421 723 1137 -893 531 622 -1769 -25 2542 232 -1721 508 1891
3502 1891 -15 35 498 -633 390 1935 -390 -1750 1070 898 -1219 -168 537 -1433 -359 1844
3518 1844 -735 -2349 524 1658 -535 -598 471 -473 351 1533 -1098 -1218 1543 1403 -1116 -503 858
3535 858 -1072 -671 1359 -563 -1591 634 1256 -764 -278 979 -31 348 1310 -455 -787 1859 1452
3552 1452 -1359 414 1822 -562 -754 1580 -114 -1375 836 745 -1526 -480 743 -715 -432 936
3568 936 -777 -1403 1013 639 -1513 295 1250 -899 -865 1171 105 -1587 453 434 -1213 -373 244
3585 244 -1212 -1108 472 -949 -1810 468 397 -1749 -75 667 -1199 -889 1288 144 -1590 128 681
3602 681 -234 -66 590 -1066 -200 1412 -320 -1596 719 1413 -711 -656 1041 -449 -37 1675 362
3619 362 -1068 1214 2030 93 426 1174 -214 566 1907 41 -1365 1327 1689 -828 -333 652 72
3636 72 -113 1461 -350 -1128 1231 1423 -720 19 1095 116 263 1431 37 -975 1532 1572 -979
3653 -979 -533 1640 -172 -270 601 -798 -1291 1044 772 -1415 -422 994 -157 -357 991 -249 -752
3670 -752 1335 916 -1395 -426 1399 -394 -714 409 -236 -1100 701 184 -2082 -439 978 -698 -658
3687 -658 708 -672 -1149 489 779 -1380 -263 1458 -476 -1089 515 -249 -1009 612 198 -1724 -297
3704 -297 979 -957 -1130 781 -347 -1295 547 428 -1204 83 1250 -324 -423 1411 686 -631 1075
3721 1075 851 -750 344 1086 -617 -486 1038 -130 -1402 650 695 -996 -162 857 -247 -834 1010
3738 1010 -39 -991 1036 1183 -534 341 1134 -647 -99 1897 -334 -1107 947 1257 -582 -386 764
3755 764 -397 39 1254 -232 -1070 1307 1616 -616 -33 1550 263 327 1708 -259 -967 1560 1669
3772 1669 -516 205 1136 229 -113 767 31 -688 1301 1307 -1047 -487 1217 189 125 1361 -39 -853
3790 -853 1455 1488 -773 -346 1426 358 -519 557 -512 -662 757 346 -1600 -159 1105 -670 -1106
3807 -1106 628 -104 -1122 689 712 -1185 -342 1305 -81 -589 715 187 -347 888 429 -1118 129
3824 129 1251 -362 -730 545 53 -881 452 785 -904 -1 1526 144 -339 1252 483 -299 653
3841 653 907 -415 833 1726 -424 -437 1563 778 -827 400 1335 -447 -45 1262 -248 -11 1447
3858 1447 569 -404 781 1365 -539 576 1443 105 -144 1488 668 -624 587 1408 -401 -34 919
3875 919 -115 -117 882 -133 -500 1010 621 -1121 -59 1556 -272 -435 924 470 -889 937 1208
3892 1208 -745 -439 911 35 -699 287 19 -946 784 357 -1372 -424 1219 -454 -588 1087 -84
3909 -84 -975 733 891 -818 -329 1083 230 -703 409 -137 -313 1179 519 -1501 -162 1902 -127
3926 -127 -775 692 1098 -377 717 1356 -486 2 1609 283 -99 882 218 258 1191 599 -1197 276
3944 276 1957 -350 -1106 552 622 -746 298 426 -595 -195 1050 -485 -665 573 104 -579 673
3961 673 8 -1239 -8 1477 -826 -1699 299 295 -1301 -734 -28 -931 -205 679 -1098 -1156 -17 -483
3979 -483 -1092 407 216 -1390 -338 1343 -615 -1273 467 483 -1292 -57 646 -812 -412 195 -635
3996 -635 -932 775 50 -1117 478 667 -1200 -70 1470 -59 -984 798 630 -495 -4 750 -201
4013 -201 -171 935 -175 -522 712 127 -821 896 722 -1158 -230 1247 44 -768 676 694 -110 772
4031 772 618 -556 367 912 22 -240 910 -119 -529 537 824 -1340 -388 1474 -104 -1007 331
4048 331 724 -888 -6 579 -702 118 770 -218 -774 523 106 -1158 358 152 -1556 -414 1002
4065 1002 -668 -1798 -246 -22 -563 -618 -85 -1107 -386 947 -1042 -1117 689 461 -1329 339 449
4082 449 -1159 -433 862 -378 -1411 425 804 -316 -299 39 -625 235 496 -1143 -840 974 64 -1258
4100 -1258 304 471 -729 12 1112 -387 -838 773 538 -883 117 322 -324 224 890 -607 -744
4117 -744 1468 263 -1175 257 1011 -629 19 1052 194 -512 838 531 -186 105 492 -62 330 532
4135 532 -356 -457 1074 254 -1341 293 967 -622 -245 1235 2 -865 1008 558 -153 507 704 -278
4153 -278 577 1272 -130 -423 1083 471 -663 431 795 -483 -339 1160 -24 -973 296 469 -371
4170 -371 397 560 -306 -11 1467 53 -587 975 418 -584 87 1064 -593 -455 919 -19 -800 353
4188 353 525 -500 100 513 -365 386 1243 -366 -343 865 930 -683 125 970 -400 27 880 -301 -603
4207 -603 648 274 -848 -8 284 -734 103 538 -647 -867 881 429 -597 335 787 -176 -230 812
4225 812 -78 -405 967 594 -607 202 703 -733 -12 522 -529 -825 1062 263 -783 72 1109 -234
4243 -234 -440 1000 49 -339 833 587 -785 228 1313 -364 -259 1072 -502 -398 1178 528 -947
4260 -947 451 853 -162 -311 924 21 -137 954 303 -563 524 1198 -336 167 967 455 -219 1065
4278 1065 327 -759 499 1298 -274 -488 1033 95 -12 910 718 -480 989 1135 -312 58 1422
4295 1422 344 -325 1163 926 -230 493 881 -58 10 947 23 -330 721 546 -578 430 993 -523
4313 -523 48 944 -170 -305 822 482 -483 26 771 -481 -98 595 -181 -743 464 150 -634 137 667
4332 667 -456 -367 737 -494 -821 501 488 -833 174 621 -392 -146 855 -266 -406 840 336
4349 336 -1006 236 982 -336 -278 713 -149 -332 620 622 -829 483 669 -26 -80 831 -81 110 1326
4368 1326 366 -364 375 1034 -318 -385 571 -36 -311 657 512 -530 156 1308 0 -218 813 383
4386 383 -138 741 382 -413 386 1112 -41 238 1173 507 -43 942 365 -237 629 975 -331 -56 1041
4405 1041 160 -137 903 629 -611 363 1030 -198 -159 1178 393 -249 932 713 -417 718 924 -489
4423 -489 -457 720 137 -640 751 525 -612 87 720 -620 -312 757 337 -373 406 410 -355 450 785
4442 785 -275 16 915 76 -727 465 542 -726 2 557 -739 -345 978 -179 -655 606 192 -534
4460 -534 241 805 -592 -174 886 -376 -409 698 678 -519 67 783 -494 -49 786 -76 -740 471
4478 471 393 -411 66 779 -186 -32 778 -97 -435 775 374 -385 216 853 -347 -558 759 64 -633
4497 -633 243 438 -744 -102 580 -301 -75 166 145 -434 413 243 -352 345 1001 -165 -417 518 159 -255
4517 -255 716 475 -736 179 508 -556 -232 493 19 -212 633 317 -845 372 819 16 -243 549 748
4536 748 -360 454 402 -489 163 972 -582 -294 618 -171 -500 735 277 -777 284 540 -724 -733 1049
4555 1049 201 -221 250 182 -100 352 799 -284 75 731 215 -305 451 508 -621 -146 660 -468 -502 1088
4575 1088 -86 -523 134 83 -483 -112 462 -582 62 807 27 -845 742 377 -554 235 482 -435 -765
4594 -765 709 -16 -717 299 402 -469 -37 57 -667 -219 535 -194 -1128 292 387 -863 -338 806 -597
4613 -597 -332 301 105 -983 108 190 -480 -5 367 -593 -324 354 -330 -418 72 672 -721 29 809 -351
4633 -351 -721 439 200 -537 -242 -24 -703 278 344 -560 -390 800 -57 -459 266 453 -620 191 918
4652 918 -433 -470 523 310 -527 375 318 -225 267 498 -564 -37 922 -26 -653 387 501 -691 37
4671 37 831 -298 -675 731 38 -560 129 146 -367 355 287 -495 -273 999 59 -611 506 589 -388 -11
4691 -11 681 -221 -338 402 182 -844 261 234 -442 126 579 -880 -137 760 62 -902 127 709 -488
4710 -488 -222 490 -459 -744 284 -268 -515 -279 413 -318 -104 124 -473 -475 796 -95 -502 31 816 -437
4730 -437 -270 612 -169 -209 94 -50 -579 275 127 -259 35 197 -952 -574 486 -258 -710 195 400 -682
4750 -682 -90 476 -284 -462 1 -251 -408 294 80 -824 27 293 -412 -505 563 -365 -1000 178 52 -754
4770 -754 -98 349 -113 -276 406 254 -365 444 147 -534 -17 572 -332 -305 776 -63 -364 334 436 -312
4790 -312 -181 249 -25 -13 667 344 -233 475 392 -539 330 649 -100 -476 721 362 -552 397 494 -503 -210
4811 -210 449 99 1 422 53 -413 305 92 -514 -151 583 -212 -300 641 66 -722 161 463 -91 -327 -48
4832 -48 -62 -171 488 -37 -764 463 114 -453 -100 217 -319 -371 563 -341 -675 178 350 -544 -154 -40 26
4853 26 -227 149 -209 -537 315 306 -681 -241 365 -333 -403 665 -48 -498 159 451 -552 -513 234 -370 -404
4874 -404 499 -60 -691 -81 293 -706 -212 817 -75 -388 435 -253 -640 235 487 -282 -85 238 -148 -179
4894 -179 436 125 -331 363 321 -344 171 737 -101 -179 860 214 -342 280 751 -172 96 384 303 -42 941
4915 941 304 -335 339 381 -218 66 729 251 -214 658 299 -485 320 233 -539 -12 302 -6 -131 557 -157
4936 -157 -415 417 107 -209 -26 758 -147 -138 841 251 -556 -33 618 -344 326 368 51 -7 477 33 -314
4957 -314 138 537 -486 -239 375 110 -325 283 40 -338 298 514 -174 -82 562 84 -122 639 50 -329
4977 -329 648 715 -406 -48 233 150 -116 304 -20 -341 112 143 -457 3 340 46 -196 427 -11 -587 151
4998 151 208 -510 -86 296 -186 -309 380 -39 -290 369 256 -402 161 189 -141 -268 326 223 -433 519 484
5019 484 -471 165 645 -121 -88 726 125 -217 254 741 -385 -83 594 -234 -67 411 210 -178 -62 202
5039 202 -203 236 364 187 -145 119 307 -263 325 602 -260 -2 566 4 -72 441 337 -230 455 644
5059 644 -71 -36 413 203 -213 724 264 -528 449 416 -155 -31 454 -48 -153 308 44 -335 550 424 -324
5080 -324 113 333 -174 137 232 -37 -287 238 405 -171 -162 524 4 -82 506 -183 -550 296 533 -795 -87
5101 -87 567 116 -306 312 125 -301 123 79 -487 -210 228 -257 -203 121 179 -211 170 287 -569 -95 358
5122 358 -259 -642 186 10 -433 132 55 -344 -228 179 -332 -473 151 40 -261 175 359 -508 -73 197
5142 197 -98 -402 401 577 -175 287 2 -253 -248 416 -67 -165 717 509 -114 71 595 -524 -381 458 82
5163 82 -181 224 207 -507 126 361 -403 76 277 -123 -497 181 -92 -471 169 467 -515 -240 218 -186 -382
5184 -382 494 -86 -189 224 251 -73 66 247 -54 -490 106 -29 -845 -16 409 -186 -254 156 -268 -59 235
5205 235 198 -319 252 -75 -447 -261 310 -302 -87 395 53 -603 -102 178 -376 109 153 10 -163 -14 -307
5226 -307 -380 116 -495 -503 8 -15 -278 -448 149 43 -369 1 316 -487 -77 76 -26 -486 35 -85 -344
5247 -344 -144 -67 -526 -236 453 -447 -440 295 -249 -546 272 326 -243 -496 398 -263 -165 411 207 -223 47 71
5269 71 -355 226 261 -188 -459 211 65 -3 -265 189 -54 -59 227 -51 -384 -6 101 -701 -3 368 -320 -166
5291 -166 462 161 -509 420 254 -457 -47 319 -236 -184 208 -358 -500 30 80 -235 137 133 -343 -286 296 -109
5313 -109 -323 419 278 -191 -217 518 -323 -19 185 54 -141 260 203 -278 90 374 -359 -358 356 188 -413
5334 -413 62 261 -234 267 280 -206 -278 113 -247 -242 308 -59 -535 223 534 -238 -99 538 164 -364 41
5355 41 166 -166 61 465 -247 -49 224 36 -138 247 272 -411 183 129 -375 -207 189 -121 -359 -207 77
5376 77 -66 146 397 -333 114 206 104 -377 -135 52 -526 127 215 -317 -399 441 -216 -408 167 392 -292
5397 -292 -28 159 -87 -79 364 -147 -232 352 286 -706 141 151 -7 -195 410 45 -118 107 96 -228 -51 116
5419 116 -85 -81 385 79 -267 108 -9 -413 321 623 44 -349 198 -11 -205 175 -39 -194 -125 354 137
5440 137 -93 178 -32 -242 397 197 -217 331 366 147 168 410 -137 123 177 116 -102 -201 -10 212 -103 490
5462 490 -203 -179 503 239 -263 -151 270 2 -283 144 -217 -480 367 118 -47 38 199 -211 19 236 -174
5483 -174 -222 373 215 -349 86 254 -517 6 39 93 -229 -72 157 43 92 -100 -121 -335 273 -37 -197 127
5505 127 -160 -460 89 31 -199 -200 269 220 -583 187 216 -56 -257 184 55 -211 239 -82 -298 367 300 -297
5527 -297 123 319 -375 -378 212 -11 -95 -14 278 -82 -243 311 79 264 478 -226 -158 352 -65 -355 147 385
5549 385 -291 -163 492 -77 29 170 135 -454 57 433 -93 66 138 -120 -171 102 175 -267 262 466 -109
5570 -109 -23 92 75 -250 18 119 -68 357 560 -195 -312 47 15 -187 460 346 -127 0 306 27 14
5591 14 420 8 -53 170 292 -146 3 61 -154 -203 5 -132 -262 -25 1 -173 113 242 -408 84 114 131
5613 131 -348 53 124 -111 268 203 -619 44 300 -201 -18 121 -189 -131 -3 377 -236 60 270 -153 -405
5634 -405 -36 151 -344 164 247 -488 -372 104 -296 -126 9 -163 -314 -179 121 -281 -210 -107 -117 -126 256 269
5656 269 -357 -154 20 -189 53 115 80 -468 178 182 -40 -63 131 -34 -123 72 226 -136 453 248 -425 -26
5678 -26 486 -120 91 93 -42 -116 149 375 -51 323 627 -47 -19 368 -247 183 449 306 -176 -72 321 0
5700 0 -321 206 -220 -196 116 106 -311 166 188 -351 -22 260 -18 -304 114 72 -221 -1 89 -337 -68 50
5722 50 69 -257 71 88 -216 102 -38 -173 -283 189 343 -277 245 75 -435 130 -20 -540 -129 -104 -145 -357
5744 -357 224 51 -479 206 384 -146 -191 458 -136 -49 88 136 -189 -61 116 -62 -96 176 218 -50 72 169
5766 169 -116 268 224 -108 -82 39 -30 -211 258 -180 -319 17 279 -354 -247 256 -48 -75 274 96 -368
5787 -368 160 96 -316 -183 108 116 -15 283 182 -391 -8 -24 -281 -34 353 95 -69 242 90 -256 42
5808 42 96 -248 -9 163 -102 -73 90 368 -279 -10 224 -90 -396 246 -165 -147 194 94 -343 98 348
5829 348 -177 -23 27 255 140 341 95 -364 2 430 -72 123 385 -155 -157 208 95 94 -19 215 11 -33
5851 -33 154 44 -98 -15 74 -191 281 42 -304 -106 167 -110 37 -51 -13 -181 -38 213 -40 -54 150 -87
5873 -87 -222 323 166 -149 -295 62 -411 -203 189 232 -121 107 26 -87 35 51 -129 -46 287 -274 -435 110
5895 110 -13 -288 91 169 -39 113 152 -10 -117 9 135 -73 123 300 -52 -133 305 -12 20 138 195 -388
5917 -388 -32 494 176 -121 -56 -25 -64 65 191 27 153 119 27 -14 171 -72 -72 216 171 -216 101 368 -93
5940 -93 -192 390 25 -157 -162 87 -153 129 70 -153 166 134 24 -207 205 241 -38 41 217 -45 130 110 50
5963 50 -315 415 8 47 192 433 123 -72 425 -40 -94 301 180 -115 15 361 105 248 31 26 -205 12
5985 12 -22 -15 -125 72 -108 -125 368 141 -158 163 -138 73 -7 -52 36 -278 -77 -108 -237 -199 171 -19 -9 147
6009 147 -291 -77 339 -73 -272 44 -92 -207 -208 120 -207 -340 228 -135 -131 37 -71 -397 51 286 -195
6030 -195 22 240 33 5 160 120 38 241 345 -71 200 360 -53 46 180 198 -99 -101 236 -383 127 246
6052 246 155 -206 202 142 -175 72 64 203 -316 52 -58 -76 79 146 -229 -87 318 144 -28 321 -238 -382
6074 -382 75 -131 -226 -71 -28 118 -52 167 -3 -340 364 -40 -58 151 196 -78 -313 156 -65 -144 0 45
6096 45 68 68 -82 204 -69 3 205 127 322 73 -235 124 294 12 50 124 -23 -100 143 -108 -212 234 156
6119 156 227 -51 39 212 45 209 317 -290 -109 303 -292 97 -31 -251 -405 253 141 -99 -173 375 130
6140 130 -83 179 -30 73 -34 -37 -209 285 2 146 -89 59 -252 -50 107 10 -66 -317 173 -246 -306 189
6162 189 123 -40 144 106 6 164 -83 160 43 116 68 -287 229 10 -451 91 120 -173 -14 -68 -122 130
6184 130 23 49 -119 141 -37 -11 -73 7 -203 -91 17 -102 -242 -169 341 207 -95 348 135 -353 161 144
6206 144 -332 145 -141 31 7 280 -69 -164 221 270 -291 29 151 77 143 436 90 173 275 102 -282 365
6228 365 436 51 327 88 148 56 111 -4 -88 -50 177 -89 -41 276 -78 -36 128 64 -43 32 10 -152 -19 -56
6252 -56 -185 -70 -37 197 -256 -11 29 33 -189 87 -176 -212 50 11 -211 -84 302 -391 -149 219 -137 -163 175
6275 175 477 7 117 67 -77 54 -2 146 -297 -210 -45 -92 -29 253 48 -36 63 10 -128 293 367 -288 -50
6298 -50 203 -50 -136 113 111 -26 -78 204 -216 1 196 110 -6 208 -230 -35 -19 182 3 -99 487 160
6320 160 106 130 -168 -21 280 -32 148 -10 143 -208 148 317 -9 252 -94 -109 1 261 67 -105 -224
6341 -224 301 -21 -87 36 168 -256 -122 152 -104 137 -257 118 -249 323 263 -329 -204 -16 -89 189 60
6362 60 44 147 151 207 -293 2 108 -95 -288 -9 312 244 -4 -217 -55 48 246 103 -163 177 49 -193
6384 -193 -57 4 -186 157 91 29 -113 -14 -10 35 277 28 -276 140 311 119 167 -7 -171 -92 578 117 -58
6407 -58 -243 148 82 -232 175 -116 -195 -85 156 -16 77 376 -180 134 81 -93 40 -29 272 -271 -259 385
6429 385 91 241 -90 -203 -120 338 144 -197 181 16 -201 47 -248 -54 -171 -125 2 -124 83 -21 182
6450 182 128 276 -447 13 241 -246 -155 -91 -10 -168 -194 87 375 93 124 102 -330 66 66 -8 -131 -140 -387 -226
6474 -226 72 -119 -10 -264 -74 -239 16 -17 -38 -31 187 -192 44 103 -2 -36 6 -158 -140 -193 -175 -78 -351 125
6498 125 69 127 40 26 72 -157 252 156 -161 -72 308 118 -101 136 -50 87 198 -228 87 -47 291 -302
6520 -302 -194 331 52 -228 -176 -108 38 94 -101 -23 -30 -14 -237 113 12 8 -208 96 154 -238 141 57 -399 -203
6544 -203 49 -64 32 72 -42 -50 -183 42 -261 -135 -59 79 -425 183 271 -191 -533 130 237 -1 215 31
6566 31 -164 -121 207 -53 -188 62 -187 147 -43 -85 -74 114 160 65 -146 99 -82 -236 -55 -151 62 46 220
6589 220 -24 127 312 -149 92 -211 342 250 66 -42 27 260 -134 -154 -144 -211 -222 66 252 211 74 139 -18
6612 -18 -368 2 278 -1 -113 15 178 -241 46 -28 -63 14 25 -38 146 192 118 -183 -172 -194 -1 157 46
6635 46 -228 114 -61 -17 56 91 -268 82 -282 -172 213 -99 201 74 70 170 -132 21 -37 -49 6 -258 54
6658 54 27 -208 218 248 -108 -121 95 -2 -103 89 291 239 -143 321 -116 297 190 -354 -264 211 12 -157
6680 -157 -83 257 73 151 31 97 3 -106 -97 163 125 234 -99 281 12 -36 177 -108 9 -104 -249 -33 -157
6703 -157 -1 -130 158 81 231 -195 -280 1 -60 -155 -28 76 214 91 -263 134 -277 -233 113 127 -22 -134
6725 -134 81 152 -2 -134 -17 109 -164 63 43 261 26 -276 -120 172 -102 -33 -177 -34 -180 283 211
6746 211 -61 228 80 46 55 -43 104 -27 25 -67 97 403 190 107 67 157 51 -95 -41 -261 -207 -83 -121 -205
6770 -205 75 -161 -297 80 -183 178 -118 212 -154 23 -28 54 10 -218 174 -15 -4 327 57 -80 151
6791 151 257 167 3 -51 -194 116 99 234 154 -78 140 -70 -140 67 10 88 -99 -226 1 48 159 -15 -83
6814 -83 354 -96 19 151 277 -42 33 -5 -32 99 -33 291 72 131 -93 -36 258 -70 -121 -115 71 -40 -77
6837 -77 -88 171 -49 114 269 -377 -183 -222 -146 -33 -92 -283 93 187 8 275 2 -70 178 322 93 220
6859 220 -31 -57 560 -354 -40 -86 62 -165 34 88 -166 152 -62 10 -1 14 27 -188 248 -14 5 140 -159
6882 -159 -271 -239 140 181 -427 -60 81 -313 -22 156 38 -124 -146 33 373 35 5 25 181 -6 -306 -149
6904 -149 -33 -103 -382 261 108 -139 -31 440 -74 -99 134 -74 -172 57 94 43 138 161 141 -276 124 12 -205
6927 -205 87 23 -274 96 -429 66 -267 176 -22 77 217 -66 -383 39 -92 -164 37 -206 -263 65 117 -339
6949 -339 107 -329 47 -154 27 -152 45 181 117 -175 -48 85 53 -36 -131 405 -183 187 -124 -163 50 -97
6971 -97 243 -176 -4 39 -16 -66 155 212 70 54 -26 168 311 -45 -244 265 198 -154 43 11 277 274 112 -14
6995 -14 -107 265 149 -55 267 32 -53 -143 124 24 -412 -51 64 -10 141 2 80 -210 -4 324 -134 -88
7017 -88 -56 172 217 -91 -74 -101 -158 168 -233 -173 351 63 -130 -292 83 -213 -254 109 94 29 272 22 -286
7040 -286 36 168 -297 -7 233 -191 -293 -203 27 45 328 116 214 -186 144 -185 -29 -44 -4 135 119 187
7062 187 84 -51 58 135 -47 -4 18 -50 -6 383 65 64 -62 149 131 51 -22 -58 -16 -110 -409 193 345 164
7086 164 -220 -204 -351 92 154 156 44 53 -19 -5 148 219 33 24 -67 -220 181 163 169 -38 41 13 -34 -33 151 15 96
7113 96 -211 44 98 -104 -9 285 -38 254 52 23 162 249 247 -131 122 -77 100 177 -28 -22 -307 202 76
7136 76 44 -174 -619 8 -51 41 32 -234 234 233 -43 239 -97 -418 23 19 -39 -61 -237 -179 -88 -4 80 -85 -91 -44
7162 -44 85 63 166 -130 145 -7 56 229 92 37 -285 249 -7 -283 136 111 160 -22 201 21 -78 -51 -210
7185 -210 170 49 97 109 -190 -42 136 16 -175 149 -128 210 197 -208 210 218 -7 21 30 -58 -82 32 95 38
7209 38 157 137 -202 -47 -72 165 -49 -65 -204 -112 -157 218 20 -267 109 -146 171 61 166 -84 -55 -148 -131
7232 -131 -78 26 207 204 -40 153 418 -4 -203 26 191 104 57 98 158 -282 192 -51 -24 454 196 -45 -84
7255 -84 -44 -2 -129 215 -26 44 -92 -1 296 332 27 -137 -51 160 197 243 317 -113 -57 35 298 259 25 61 36
7280 36 86 -228 28 -84 365 96 188 129 328 272 179 -107 42 311 -58 164 207 234 -78 -145 38 -17 -248
7303 -248 -261 388 -111 -147 36 -325 83 -62 190 32 156 120 -60 -86 -91 -171 -11 265 131 -263 -36 124
7325 124 191 51 -184 55 -29 -230 153 -85 88 182 -209 431 289 108 4 46 178 -87 -180 11 -190 132
7347 132 77 -54 184 -25 329 47 -27 367 46 454 -120 49 158 -71 -62 -157 -33 166 159 -60 -33 399 57
7370 57 -130 479 140 8 43 96 -65 216 151 -119 -32 -94 76 -71 60 70 -346 34 -60 185 -172 -368 62
7393 62 -53 -121 -259 -68 -167 -115 107 88 127 -180 12 192 241 4 269 -107 442 7 -185 52 56 181 -135
7416 -135 -227 105 -39 -295 253 -94 -73 -145 -10 264 -187 -75 181 305 -9 246 20 -31 114 -113 112
7437 112 112 109 213 -106 75 105 -192 292 139 62 61 119 -316 441 3 44 -68 -163 -314 -197 -16 -118 40 -52
7461 -52 82 3 151 202 126 124 -168 -151 -358 13 112 -37 4 -229 47 -107 -136 214 -129 14 32 26 84 205 -121
7486 -121 172 392 -31 -8 -86 -141 -82 -92 44 56 -139 99 24 167 103 440 -74 -120 255 16 -76 -98 -32 -3
7510 -3 -53 216 120 -7 80 -124 -149 -116 -125 71 -17 20 -6 -42 137 304 -63 -83 -49 -127 -94 175 -165 -82 55 -202
7536 -202 -144 -107 12 -10 -419 229 -133 38 206 -188 -163 -168 -113 12 345 53 -61 -309 -117 13 -200 -35
7558 -35 56 58 -86 89 -359 -38 334 -107 -2 51 -182 -192 -188 73 -145 -382 218 91 -239 -11 -189 -44 142
7581 142 -94 65 -150 18 248 -124 -85 -225 -29 -71 -83 -173 -261 105 67 83 8 46 -160 33 -44 317 39
7604 39 458 27 -165 229 -111 0 -289 -131 -151 -91 62 353 -74 84 -171 112 2 67 -219 -117 594
7625 594 -79 19 224 -238 -170 130 -72 -59 153 255 -135 3 -204 -197 -66 -49 -15 -173 35 174 -12 -58 -145
7648 -145 -51 -321 -337 -53 -56 215 34 -190 27 202 22 227 20 22 26 12 234 -110 -72 -95 23 -206 109 197
7672 197 -435 -155 58 -156 377 -204 -134 148 -99 -162 13 -35 -59 58 34 247 163 -57 271 345 -29 -58 221
7695 221 104 65 -76 13 -70 -145 -109 -97 -316 124 -50 -180 350 -41 -172 368 -84 75 -38 321 58 -61
7717 -61 -293 -285 -154 -110 -5 -220 8 -147 68 147 110 18 -39 -59 190 -82 -19 334 7 138 241 -41 -204
7740 -204 -197 110 8 60 -18 -376 -38 -64 26 -117 386 -97 -215 332 -94 -52 -375 166 143 210 -144 181 -273
7763 -273 -42 146 208 -301 193 6 59 116 81 -204 -84 302 292 -160 42 140 154 -55 -43 111 -106 4 100
7786 100 -168 163 -121 200 41 45 -99 -89 115 -312 -9 -24 103 51 -59 14 -234 207 204 -159 -387 -156 166
7809 166 11 75 92 -28 -58 -236 -248 -315 9 250 -362 -55 152 -87 -80 464 -37 40 220 -107 119 268 205
7832 205 107 -123 212 -92 41 194 149 -60 -150 165 -116 31 135 -27 -153 172 159 35 96 227 197 146
7854 146 -196 -52 -77 119 44 -132 -55 377 -2 98 -50 -24 -119 72 -32 -42 156 126 -45 -110 52 -88 -131
7877 -131 -36 134 -119 -290 19 94 61 464 57 -265 200 -57 -118 -66 39 -55 -128 38 145 114 215 -169 -153
7900 -153 -255 -55 -325 -345 323 -148 -166 32 177 2 66 260 -131 -229 55 -96 123 484 -52 -215 172
7921 172 127 -45 -58 360 158 -155 -6 -262 -339 -77 -218 201 146 197 58 -111 121 -172 -56 -112 135 172
7943 172 -86 283 318 -119 318 -92 21 -106 157 38 -190 195 65 -87 220 14 293 56 13 50 -33
7964 -33 -71 -249 -87 -104 101 31 -172 142 -19 -217 121 -78 189 244 363 -60 253 194 -136 250 -200 -193 130
7987 130 -56 -62 146 -53 22 -29 -12 112 -187 -77 -204 125 68 -57 14 -36 -37 240 -18 -22 61 174 87 -71 -178
8012 -178 105 -169 367 67 -170 60 117 -117 65 -90 -261 -77 394 -12 -137 145 143 -263 -166 138 11
8033 11 -41 111 -112 -17 -1 167 -11 156 270 -306 -146 212 -136 151 -117 -27 -136 -256 -419 -151 -268 175
8055 175 107 -291 -120 -164 363 155 45 -62 19 113 -252 -336 -99 294 -23 -266 -178 -320 -401 -24 4 156 35
8078 35 -62 -330 -218 101 58 -40 248 70 -207 83 51 66 -43 110 -113 -232 41 -75 -46 150 152 203 -76
8101 -76 57 -111 -357 -47 417 -202 -7 117 -306 22 -58 -121 159 133 233 -246 120 210 -70 93 455 40
8123 40 -219 334 109 -148 -79 21 -55 132 56 -38 -412 322 -56 -162 -155 -151 -136 -106 358 104 -232 -122 -86 -108
8147 -108 2 -158 -38 158 145 -112 -229 180 123 -492 86 -153 -53 318 80 304 -118 52 -269 -454 127
8168 127 36 58 -34 25 -153 142 285 220 -192 313 47 251 -156 168 -217 12 26 -255 -114 20 -80 -144
8190 -144 81
8191H1
##END NTUPLES=NMR FID
##END=
