##TITLE=1H_ANY-165B-1
 CDCl3, 8 sc, 
 4.4.2019
##JCAMPDX= 6.0         $$ Bruker NMR JCAMP-DX V2.0
##DATA TYPE= NMR FID
##DATA CLASS= NTUPLES
##ORIGIN= UXNMR, Bruker Analytische Messtechnik GmbH
##OWNER= root
$$ XWIN-NMR		Version 3.5
$$ Thu Apr  4 14:16:44 2019 Russian Standard Time (UT+4h)  she@DPX200
##.OBSERVE FREQUENCY= 200.1316
##.OBSERVE NUCLEUS= ^1H
##.DELAY= (6, 6)
##.ACQUISITION MODE= SIMULTANEOUS
##.ACQUISITION SCHEME= undefined
##.AVERAGES= 8
##.DIGITISER RES= 18
##SPECTROMETER/DATA SYSTEM= spect
##.PULSE SEQUENCE= zg30
##.SOLVENT NAME= CDCl3
##.SHIFT REFERENCE= (INTERNAL, CDCl3, 0, 15.7039)
##AUDIT TRAIL= $$ (NUMBER, WHEN, WHO, WHERE, WHAT)
$$ ##TITLE= Audit trail, XWIN-NMR		Version 3.5
$$ ##JCAMPDX= 5.01
$$ ##ORIGIN= Bruker BioSpin GmbH
$$ ##OWNER= she
$$ F:/spectra/data/she/nmr/H-F/1/audita.txt
$$ ##AUDIT TRAIL=  $$ (NUMBER, WHEN, WHO, WHERE, WHAT)
(   1,<2019-04-04 14:15:24.81 +0400>,<she>,<DPX200>,
      <created by zg, POWCHK disabled, PULCHK disabled
       configuration hash MD5:
       00 E9 B6 7A A2 85 ED C7 34 08 36 98 17 FE 4E 26
       data hash MD5: 16K
       14 44 87 5C 80 DE 9A EE 61 9B EE 92 20 7C 9B 34>)
$$ ##END=
$$ 
$$ hash MD5
$$ D1 E2 D9 FB 50 20 62 C3 01 21 3D F7 BD 57 BB B7
##$RELAX= 
##$RELAX= 
##$RELAX= 
##$RELAX= 
##$RELAX= 
##$RELAX= 
$$ Bruker specific parameters
$$ --------------------------
##$DU= <F:/spectra>
##$EXPNO= 1
##$NAME= <H-F>
##$PROCNO= 1
##$TYPE= <nmr>
##$USER= <she>
##$AMP= (0..31)
100 100 100 100 100 100 100 100 100 100 100 100 100 100 100 100 100 100 
100 100 100 100 100 100 100 100 100 100 100 100 100 100 
##$AQSEQ= 0
##$AQ_mod= 1
##$AUNM= <au_zg>
##$AUTOPOS= <>
##$BF1= 200.13
##$BF2= 200.13
##$BF3= 200.13
##$BF4= 200.13
##$BF5= 200.13
##$BF6= 200.13
##$BF7= 200.13
##$BF8= 200.13
##$BYTORDA= 1
##$CFDGTYP= 0
##$CFRGTYP= 5
##$CHEMSTR= <none>
##$CNST= (0..31)
1 1 145 1 1 1 1 1 1 1 1 1 1 1 1 1 1 1 1 1 1 1 1 1 1 1 1 1 1 1 1 1 
##$CPDPRG= <>
##$CPDPRG1= <>
##$CPDPRG2= <>
##$CPDPRG3= <>
##$CPDPRG4= <mlev>
##$CPDPRG5= <mlev>
##$CPDPRG6= <mlev>
##$CPDPRG7= <mlev>
##$CPDPRG8= <mlev>
##$CPDPRGB= <>
##$CPDPRGT= <>
##$D= (0..31)
0 1.2 0 0 0 0 0 0 0 0 0 0.03 0 0 0 0 0 0 0 0 0 0 0 0 0 0 0 0 0 0 0 0 
##$DATE= 1554372924
##$DBL= (0..7)
120 120 120 120 120 120 120 120 
##$DBP= (0..7)
150 150 150 150 150 150 150 150 
##$DBP07= 0
##$DBPNAM0= <>
##$DBPNAM1= <>
##$DBPNAM2= <>
##$DBPNAM3= <>
##$DBPNAM4= <>
##$DBPNAM5= <>
##$DBPNAM6= <>
##$DBPNAM7= <>
##$DBPOAL= (0..7)
0.5 0.5 0.5 0.5 0.5 0.5 0.5 0.5 
##$DBPOFFS= (0..7)
0 0 0 0 0 0 0 0 
##$DE= 6
##$DECBNUC= <off>
##$DECIM= 24
##$DECNUC= <off>
##$DECSTAT= 4
##$DIGMOD= 1
##$DIGTYP= 9
##$DL= (0..7)
0 120 120 120 120 120 120 120 
##$DP= (0..7)
150 150 150 150 150 150 150 150 
##$DP07= 0
##$DPNAME0= <>
##$DPNAME1= <>
##$DPNAME2= <>
##$DPNAME3= <>
##$DPNAME4= <>
##$DPNAME5= <>
##$DPNAME6= <>
##$DPNAME7= <>
##$DPOAL= (0..7)
0.5 0.5 0.5 0.5 0.5 0.5 0.5 0.5 
##$DPOFFS= (0..7)
0 0 0 0 0 0 0 0 
##$DQDMODE= 0
##$DR= 18
##$DS= 0
##$DSLIST= <SSSSSSSSSSSSSSS>
##$DSPFIRM= 0
$$ [...]
##$SUBNAM2= <"">
##$SUBNAM3= <"">
##$SUBNAM4= <"">
##$SUBNAM5= <"">
##$SUBNAM6= <"">
##$SUBNAM7= <"">
##$SUBNAM8= <"">
##$SUBNAM9= <"">
##$SW= 24.9336934301222
##$SWIBOX= (0..15)
0 0 2 0 0 0 0 0 0 0 0 0 0 0 0 0 
##$SW_h= 4990.01996007984
##$TD= 16384
##$TD0= 1
##$TE= 0
##$TE2= 300
##$TE3= 300
##$TEG= 300
##$TL= (0..7)
0 120 120 120 120 120 120 120 
##$TP= (0..7)
150 150 150 150 150 150 150 150 
##$TP07= 0
##$TPNAME0= <>
##$TPNAME1= <>
##$TPNAME2= <>
##$TPNAME3= <>
##$TPNAME4= <>
##$TPNAME5= <>
##$TPNAME6= <>
##$TPNAME7= <>
##$TPOAL= (0..7)
0.5 0.5 0.5 0.5 0.5 0.5 0.5 0.5 
##$TPOFFS= (0..7)
0 0 0 0 0 0 0 0 
##$TUNHIN= 0
##$TUNHOUT= 0
##$TUNXOUT= 0
##$USERA1= <user>
##$USERA2= <user>
##$USERA3= <user>
##$USERA4= <user>
##$USERA5= <user>
##$V9= 5
##$VALIST= <valist>
##$VCLIST= <CCCCCCCCCCCCCCC>
##$VD= 0
##$VDLIST= <DDDDDDDDDDDDDDD>
##$VPLIST= <PPPPPPPPPPPPPPP>
##$VTLIST= <TTTTTTTTTTTTTTT>
##$WBST= 1024
##$WBSW= 4
##$XGAIN= (0..3)
0 0 0 0 
##$XL= 0
##$YL= 0
##$YMAX_a= 481619
##$YMIN_a= -605149
##$ZGOPTNS= <>
##$ZL1= 120
##$ZL2= 120
##$ZL3= 120
##$ZL4= 120
##$ABSF1= 10
##$ABSF2= 0
##$ABSG= 5
##$ABSL= 3
##$ALPHA= 0
##$AQORDER= 0
##$ASSFAC= 0
##$ASSFACI= 0
##$ASSFACX= 0
##$ASSWID= 0
##$AUNMP= <proc_1d>
##$AZFE= 0.1
##$AZFW= 0.1
##$BCFW= 1
##$BC_mod= 2
##$BYTORDP= 1
##$COROFFS= 0
##$CY= 11.3945322036743
##$DATMOD= 1
##$DC= 2
##$DFILT= <>
##$DTYPP= 0
##$F1P= 18.9103706918063
##$F2P= -1.10871071338519
##$FCOR= 0.5
##$FTSIZE= 0
##$FT_mod= 4
##$GAMMA= 1
##$GB= 0.15
##$INTBC= 1
##$INTSCL= 1
##$ISEN= 128
##$LB= 0.24
##$LEV0= 0
##$LPBIN= 0
##$MAXI= 10000
##$MC2= 0
##$MEAN= 0
##$ME_mod= 0
##$MI= 1.114404
##$NCOEF= 0
##$NC_proc= 0
##$NLEV= 6
##$NOISF1= 3.799351
##$NOISF2= 2.8
##$NSP= 1
##$NTH_PI= 0
##$NZP= 0
##$OFFSET= 15.70392
##$PC= 1
##$PHC0= -8852.969
##$PHC1= 13.60025
##$PH_mod= 1
##$PKNL= yes
##$PPARMOD= 0
##$PSCAL= 0
##$PSIGN= 0
##$REVERSE= no
##$SF= 200.130013532006
##$SI= 16384
##$SIGF1= 3
##$SIGF2= 2
##$SINO= 400
##$SIOLD= 16384
##$SREGLST= <1H.CDCl3>
##$SSB= 0
##$STSI= 0
##$STSR= 0
##$SW_p= 3612.71676300578
##$SYMM= 0
##$S_DEV= 0
##$TDeff= 0
##$TDoff= 0
##$TI= <>
##$TILT= no
##$TM1= 0
##$TM2= 0
##$TOPLEV= 0
##$USERP1= <user>
##$USERP2= <user>
##$USERP3= <user>
##$USERP4= <user>
##$USERP5= <user>
##$WDW= 1
##$XDIM= 8192
##$YMAX_p= 0
##$YMIN_p= 0
$$ End of Bruker specific parameters
$$ ---------------------------------
##NTUPLES= NMR FID
##VAR_NAME=  TIME,          FID/REAL,        FID/IMAG
##SYMBOL=    X,             R,               I
##VAR_TYPE=  INDEPENDENT,   DEPENDENT,       DEPENDENT
##VAR_FORM=  AFFN,          ASDF,            ASDF
##VAR_DIM=   8192,          8192,            8192
##UNITS=     SECONDS,       ARBITRARY UNITS, ARBITRARY UNITS
##FACTOR=    0.0002004,     1,               1
##FIRST=     0,             0,               0
##LAST=      1.6414764,     0,               0
##MIN=       0,             -605149,         0
##MAX=       1.6414764,     481619,          0
$$ Real data points
##PAGE= N=1
##DATA TABLE= (X++(R..R)), XYDATA
$$ [...]
3252H16K604l752J827k869m115Q199J935j1428K991P477n623j042L411l983K500
$$ 816 3420 -332 1495 -1374 -5489 2710 4645 -6783 -3792 3685 -1938 -2980 431 -3552 -1052
3267a052M558p942j399R552l001n891L905l30l83N539o178m975J0278J511j0094
$$ -1052 3506 -4436 -5835 3717 716 -5175 -1270 -1600 -1983 3556 -2622 -7597 2681 4192 -5902
3282e902L139M854m611J679O75n312M763L656q387l18P609l190j997L161m814
$$ -5902 -2763 2091 -2520 -841 -166 -5478 -715 2941 -5446 -5764 1845 -1345 -3342 -181 -4995
3297d995J944P907p443n778J0092J034p314K271J710j929M095k191n959P963L332
$$ -4995 -3051 4856 -2587 -8365 1727 2761 -4553 -2282 -572 -2501 1594 -597 -6556 1407 4739
3312D739q441J663N521l573K946K537p398L041Q970p312m560P775j45l733J828
$$ 4739 -3702 -2039 3482 -91 2855 5392 -2006 1035 10005 2693 -1867 5908 5763 2030 3858
3327C858k894L41O543n841o690Q820J837p192K094J779l950M568J194q690L693
$$ 3858 964 1305 7848 2007 -4683 4137 5974 -1218 876 2655 -1295 3273 4467 -4223 -530
3342e30O580o897l027M422j826L67J646p713K017R431o276o473Q366R94m998M177
$$ -530 6050 -847 -3874 548 -1278 -911 735 -6978 -4961 4470 -1806 -8279 87 1081 -3917 260
3358B60p87l165O032L19p513M428M392n088k24J022k976N219J865j0828K643J0009
$$ 260 -527 -3692 2340 2659 -4854 -426 3966 -1122 -1346 -324 -3300 1919 3784 -7044 -4401 5608
3374E608n839n319O386r13k106L924l284k231P058k299o305M976J649l454L070
$$ 5608 -231 -5550 836 -77 -2183 1741 -1543 -3774 3284 985 -5320 -344 1305 -2149 921
3389I21k394n563Q898K987j0898J658Q815m322k226L886j914J230L175n859M30
$$ 921 -1473 -7036 1862 4849 -6049 -4391 4424 102 -2124 1762 -152 1078 4253 -1606 -1176
3404a176P909l842n076M829j355r54O396n157o831Q982L569r241J284N032l412
$$ -1176 6733 2891 -2185 2644 1289 335 6731 1574 -5257 3725 7294 -1947 -663 4369 957
3419I57K55O09k797M526J231q583K073P821m747k921L736m435K02Q524n792p141
$$ 957 1212 1821 -976 3550 4781 -3802 -1729 6092 1345 -1576 2160 -2275 -2073 6451 659 -6482
3435f482P549K182n704J627Q64j366K712k787m198P751J636j0089K424O001m460
$$ -6482 1067 3249 -2455 -828 36 -1330 1382 -1405 -5603 2148 3784 -6305 -3881 2120 -2340
3450b340J393K899p145P61Q308m245m121N158p38k860K895k513N69N704o067n431
$$ -2340 -947 1952 -5193 -4432 3876 -369 -4490 668 -70 -2930 -35 -2548 -1979 3725 -2342 -7773
3466g773J0188L252q765J276L177l059M418K542p529J129N550l271r23L492l551
$$ -7773 2415 5667 -3098 -1822 1355 -1704 2714 5256 -2273 -1144 4406 1135 212 3704 153
3481A53L92K433n659J825P801p354p399R456K034n420K264r58l561N867Q58o234
$$ 153 545 2978 -2681 -856 6945 -409 -7808 1648 3682 -1738 526 -432 -3993 1874 2732 -3502
3497c502K923J791m744K399K056m669L320J945q943K303J0496n313o185M768R18
$$ -3502 -579 1212 -3532 -1133 923 -3746 -426 1519 -7424 -5121 5375 62 -6123 -1355 -437
3512d37j08L831l443k744O418j063l995N678p7o038L754P16m099O566J360j0889
$$ -437 -545 3286 -157 -2901 3517 2454 -1541 4137 4060 -1978 1776 2492 -1607 4959 6319 -4570
3528d570J628R366k997l367J126k751K675M219n863j295N644m288k995O189j573
$$ -4570 -2942 6424 3427 60 1186 -1565 1110 5329 -534 -1829 3815 -473 -3468 2721 1148
3543A148m391L965k787m461P955K226r617M79N290j313J781l94n031M130L940
$$ 1148 -3243 722 -2065 -6526 1429 3655 -5962 -5483 -193 -1506 275 -119 -5150 -1020 2920
3558B920n925J740O251n843k471N615j884QM973n246n301Q508K768n734P69o71
$$ 2920 -3005 -1265 4986 -857 -3328 2287 403 411 5384 138 -5163 3345 6113 379 1148 477
3574D77j257N813p23o097M286J899p802L326O223n141l018K264l310K254N955
$$ 477 -780 5033 4310 -1787 2499 4398 -3404 -78 6145 1004 -2014 250 -3060 -806 5149
3589E149p136m563N418N54q90K194m396k303P215j656n293N791J256p222K812
$$ 5149 -1987 -6550 -1132 -578 -1468 726 -3670 -5973 1242 -414 -5707 84 1340 -5882 -3070
3604c070M688k672J876o29n605M403O624n250j808K791k334J615M836o006r91
$$ -3070 1618 -1054 822 193 -5412 -1009 5615 365 -1443 1348 -986 629 5465 -541 -1532
3619a532O126l771m596P324J164o145O55L01n45N896k183q308L577M760l746J283
$$ -1532 4594 823 -3773 3551 4715 -1430 -775 -474 -1019 4877 2694 -5614 -2037 2723 -1023 260
3635B60O70n938K823M708n390L0N545n111l654O592O73j531J496m075m97R299
$$ 260 930 -5008 -2185 2523 -2867 -2837 2708 -2403 -6057 535 1208 -323 1173 -2902 -3399 5900
3651E900j536p549L806K003l061L715O19n574K975K454n786K735M728m706k482
$$ 5900 4364 -3185 621 2624 -437 3278 3897 -1677 1298 3752 -2034 701 5429 723 -1759
3666a759L126j063K236L050p450j597Q164j608m715L758j352l481M305l54m046
$$ -1759 1367 304 2540 5590 -1860 -3457 4707 3099 -1616 2142 790 -2691 1614 1260 -2786
3681b786M890r62o428L861M567l603N6l63l771N246N229p704k280N592k001j371
$$ -2786 2104 1142 -5286 -1425 3142 -461 -405 -768 -4539 707 5936 -1768 -4048 1544 -457 -1828
3697a828L888l340k597M088k785k257O327j628o457L529J841j582L450j814o512
$$ -1828 2060 -1280 -3877 211 -2574 -4831 1496 -132 -6589 -3060 -1219 -2801 649 -1165 -7677
3712g677N963M945n337o20L341l034R66L986m099J004L872m937j092P363j239
$$ -7677 -1714 3231 -2106 -2726 615 -2419 -1453 2533 -1566 -562 3310 -1627 -2719 4644 3405
3727C405m076L056j543r59O333j825o643M599K990m561J861J525m775K082J288
$$ 3405 -671 2385 842 -117 6216 4391 -2252 2347 5337 776 2637 4162 -613 1469 2757
3742B757m614L348L784p172j715N614j225j218K333n135o05P538k134n316M009
$$ 2757 -1857 1491 5275 -1897 -3612 2002 777 -441 1892 -3243 -3848 3690 1556 -3760 249
3757B49J25l120L941j47l015L870p35n335N371M191o595j89L357k580K338K785
$$ 249 374 -2746 1195 1048 -1967 1903 1168 -4167 1204 5395 -1200 -1389 1968 -612 1726 4511
3773D511o560n26O684l223k499L551j971k146L950k912j923N905k539o406N210
$$ 4511 -2049 -2575 4109 886 -1613 1938 -33 -2179 1771 -1141 -3064 2841 302 -6104 -894
3788h94K636m512J118m1l794M411K478o418R13M395m198L19L655l103L43L497
$$ -894 1742 -2770 -1652 -1693 -5487 -1076 1402 -5016 -4103 292 -3906 -3587 68 -3035 -2692 805
3804H05m165m45P569k995n059M221J220k133L634j907m202N544J600m947K287
$$ 805 -3360 -3805 3764 769 -4290 -69 1151 -982 2652 745 -3457 2087 3687 -1260 1027
3819A027K421m177J754K948m147K101L506n759k42O344k252l212K491j863m78
$$ 1027 3448 -729 1025 3973 -174 1927 5433 -326 -568 5776 3524 312 2803 940 462
3834D62M664l891l924N345l70m156L314J61l674L211L72m725M272K845o727L76
$$ 462 5126 1235 -2689 2656 2286 -1870 1444 1605 -2069 1142 1514 -3211 1061 3906 -2821 -2445
3850b445M881k647l89J801m440J223M800l950k672N236j715k648L917p98k266
$$ -2445 2436 -211 -600 1201 -3239 -2016 2784 -1166 -3838 1398 -317 -2965 952 154 -2112
3865b112M352j142m752N337K553n620J046K065k692L048J068n968K218M670n077
$$ -2112 2240 1098 -3654 1683 4236 -1384 -338 1727 -965 2083 3151 -2817 -599 4071 -1006
3880a006n36M461l040j672L987k880j079N012k848m283N205J223m226K150j058
$$ -1006 -1542 2919 -121 -1793 2194 -686 -1765 3247 399 -3884 1321 2544 -1682 468 -590
3895e90k859M895Q0o102L055L382m798O78L486l574N62K700m030J75N728l577
$$ -590 -3449 1446 1526 -4576 -1521 1861 -2937 -2259 1227 -2347 -1785 915 -3115 -2940 2788 -789
3911g89l254M542q71j621L659l268k876O352l55n121L767J988m482K275J876l524
$$ -789 -4043 499 -372 -1993 1666 -1602 -4478 1874 1519 -3602 165 2153 -2329 -54 1822 -1702
3927a702L059J692n500J470N065l583r98L025l360R77M521m568k558N924j399
$$ -1702 1357 3049 -2451 -981 4084 501 -497 2528 -832 145 4666 98 -2460 3464 2065
3942B065m108M024K28l323K755n89l635M525L61o048K456L164l519J375J561m518
$$ 2065 -2043 1981 2209 -1114 1641 1052 -2583 1942 2303 -3745 -1289 1875 -1644 -269 1292 -3226
3958c226K098M478n127j052N346k194k383L220n37j409L472k854k569N951l00
$$ -3226 -1128 3350 -1777 -2829 2517 323 -2060 1160 623 -786 2686 -168 -2737 3214 2914
3973B914n391L972R61l167L240R85n451L127L444m619j03L739k677m40J764l591
$$ 2914 -2477 1495 2456 -711 2529 3514 -1937 1190 4634 15 -88 3651 974 534 2298 -1293
3989a293J077L977n358k373N984j498l940L374j174k639M517o61m695L479K259
$$ -1293 -216 3761 -1597 -3970 2014 516 -3424 -50 -1224 -3863 654 -7 -4702 -1223 1036
4004A036m432J781J672k771K341Q21n103L128M551n504j542N432k064j550M012
$$ 1036 -3396 -1615 57 -2714 -373 448 -4655 -1527 3024 -2480 -4022 1410 -654 -2204 1808
4019A808k526j413M415j275l286M260L0l375L355o93l147M580j47o027L269M302
$$ 1808 -718 -2131 2284 1009 -2277 1983 2013 -1362 1993 1300 -1847 2733 2586 -3441 -172 4130
4035D130n130p76L422k424M45K575l668L58L929l135j642M431k185j810M034k465
$$ 4130 -1000 -1776 1646 -778 -333 2242 -1426 -1068 2861 -274 -1916 2515 330 -1480 2554 89
4051H9l246N804M4o490L798K270l314J226Q40k639K419J487m411J902L682m366
$$ 89 -3157 2647 2691 -3799 -1 2269 -1045 181 1021 -1618 801 2288 -2123 -221 3461 -905
4067i05k99L854l113p51M803l780k974N592m60m266K885P45k168K268r31k811
$$ -905 -1204 2650 -463 -1214 3589 -191 -3165 2427 1967 -2299 586 1331 -837 1431 500 -2311
4083b311M312N70n732L231K882m465J208K803m531Q33M650m248j951M773j230
$$ -2311 2001 2571 -3161 70 2952 -1513 -305 2498 -2033 -1200 3450 -798 -2749 2024 794
4098G94k540K514j264o38L415l439k661O223r17n333L582J595m177K731J459m506
$$ 794 -1746 768 -496 -1134 2281 -1158 -3819 2404 1487 -3846 -264 1331 -2846 -115 1344 -3162
4114c162K177L006l809L09K954k941O89J900l460J165M592m951k529O557j489
$$ -3162 -985 2021 -1788 -1479 1475 -1466 -777 1123 -2337 -1172 3420 -1531 -4060 2497 1008
4129A008l720L259k90k540L299N65l876L120J101l431K142J279l278K599J457
$$ 1008 -2712 547 257 -2283 1016 1581 -2295 825 1926 -1505 637 1916 -1362 1237 2694
4144B694n079K174M669m956k117N238j727j606K493j543j692L785j538k811M354
$$ 2694 -2385 -211 4458 -498 -2615 2623 896 -710 1783 240 -1452 2333 795 -2016 2338
4159B338j028l156L314nl857M319Q04o566K646M364m536n59K580k121K22K966
$$ 2338 1310 -1846 1468 1463 -2394 1925 2729 -3837 -1191 3173 -1363 -1922 658 -1463 -1241 1725
4175A725l186l85M129l649j033M997j986k845M244j550l562N478L98n922L069
$$ 1725 -1461 -1846 2283 -1366 -2399 2598 612 -2233 2011 461 -3101 2377 2775 -3147 -78
4190g8K623k915J324P76l365K724J768m626J731L754m799n48M318k901j214L793
$$ -78 2545 -370 954 1730 -1635 1089 2857 -1769 -38 3716 -1083 -1631 2687 -214 -1428 2365
4206B365l299k490N168p62m015K284r7k003L483j007l333L914Q80n044L031L738
$$ 2365 -934 -3424 1744 982 -3033 -749 -846 -2849 634 -373 -3706 208 1088 -3956 -925 2813
4222B813m947L35L570l027N06L901m319j106M300j366j301K723k542j297M147
$$ 2813 -2134 -1799 1771 -1256 -750 3151 -1168 -2274 2026 660 -641 2082 -460 -1757 2390
4237B390j599l581N336o83m872L548K012l370J280Q39m099K776L160m349L3K584
$$ 2390 791 -2790 2546 1863 -3009 539 2551 -819 461 1300 -2799 -23 3137 -1212 -1179 1405
4253A405k969R61L206m266m80M795l540k021N368j029m047K974K71j858L359j096
$$ 1405 -1564 -603 2603 -1663 -2143 2652 -888 -2909 2459 1430 -2617 357 628 -1230 2129 1033
4269A033l673L550J616l950J879J766m621K541K647m156O35L779m476j376N126
$$ 1033 -2640 910 2526 -1424 455 2221 -2400 141 2788 -1368 -733 3046 -1430 -2806 2320
4284B320j611k224K475k090p76M702j899l594M104j91l205L932K34m493K715J905
$$ 2320 709 -1515 960 -1130 -1906 2796 897 -2697 1407 1216 -1989 1943 2177 -2316 399 2304
4300B304m223K096L334m601l21L294k168Q44J610m110J77M561k815j884L967k077
$$ 2304 -1919 177 3511 -1090 -1411 1883 -285 559 2169 -1941 -1764 2797 -18 -1902 2065 -12
4316a2k716M445j143l396L575l53m007L062J941l688Q32J581l345L278K163n409
$$ -12 -2728 1717 574 -2822 753 400 -3607 -545 1396 -2292 -1460 121 -3224 54 2217 -3192
4332c192R96M110k979o51M156k792j348L448j778j653L958j380l739L784R7j944
$$ -3192 -2196 1914 -1065 -1716 2440 -352 -1700 1748 -30 -1683 2275 895 -2844 940 1037 -907
4348i07K707j068l979M597K010n136J413K687l757J016K937l214oK758l616k12
$$ -907 1800 732 -3247 1350 3360 -1776 -363 2324 -1433 -417 2520 -694 -700 2058 -1558 -1770
4364a770M759l105k146L109j234j518M461k115m052M895N93l727K429J359l819
$$ -1770 2989 -116 -2262 847 -387 -1905 2556 441 -3611 1284 1877 -1850 579 1938 -1881
4379a881K121J776l418K193J925m788J049L799k965m89K771l251j45M532k750
$$ -1881 240 2016 -1402 791 2716 -2072 -1023 2776 -189 -678 2093 -1158 -1303 3229 479
4394D79k660L780k37l087L753o80k874K785l90l394L998J319n376J330K773k890
$$ 479 -2181 1599 1362 -1725 2028 1348 -1526 1259 869 -2525 1473 2792 -2584 -1254 1519 -1371
4410a371J285K232m436L4M296k948q57L428k623j798L911j820j451L933k012l360
$$ -1371 -86 2146 -2290 -2256 2040 -908 -1765 1663 -960 -2758 1153 -667 -2118 1815 -197 -3557
4426c557M584N18l918K099Q57k898L157J251m323J450K935l467R53K882l394q1
$$ -3557 1027 1545 -2373 -274 583 -2315 842 2093 -2230 -780 2155 -1312 -359 2523 -871 -952
4442i52K956l032j31M760l116k894L971l99j988K372j286k740L564O51l904K330
$$ -952 2004 -1028 -1159 3601 485 -2409 1562 1163 -825 1547 261 -2479 1085 1736 -2168 162
4458A62Q82l759K253J955l300J354J805m207J044M369l314j555L398k036o55L785
$$ 162 1044 -2715 -462 1493 -1807 -453 1352 -2855 -1811 2558 -756 -2311 1087 -949 -1604 2181
4474B181k539k140M068q09k896L873m69l306L167P89l329L299Q72m812J791L632
$$ 2181 -358 -2498 1570 761 -2135 1738 1269 -2037 1130 1919 -1410 1889 2761 -2051 -260 3372
4490C372l207J28K121l447O66L675l321j124L681k591k190M548j844k631L219
$$ 3372 165 293 2414 -1033 -367 3308 -13 -1137 2544 -47 -2237 2311 467 -2164 1055
4505A055j166k642M240K43l971J885J630l011K330J078m195J967K936m279N68
$$ 1055 -111 -2753 1487 1730 -2241 -356 1274 -1737 593 1671 -2524 -557 2379 -1900 -1332
4520a332L660l907l49L568k475n88L567k866j785L975n98k850K905q65k469L466
$$ -1332 2328 -1579 -1928 1640 -835 -1423 2144 -722 -2507 1468 870 -1980 925 60 -2409 1057
4536A057L76l902K831J236l825K064K377l780M91K511l206J032L549l508j526
$$ 1057 1433 -2469 362 1598 -2227 -163 2214 -1566 -1075 1436 -1770 -738 2811 -697 -2223
4551b223M316k162n98L001k576j995M479j173k955L148J37l805K664J257l299
$$ -2223 2093 -69 -667 2334 -242 -2237 2242 1069 -1886 1262 1399 -2406 258 1515 -1784
4566a784K268Q41l873K048K901l580k7K269k349K77L470l292j004L845k273j818
$$ -1784 484 1325 -2548 -500 2401 -1179 -1206 1063 -1286 -1009 2461 -831 -1835 2010 -263 -2081
4582b081L897o69l235L237l97k489L734m45l838L022J822l380J436J238l956J792
$$ -2081 1816 1147 -2088 1149 752 -1737 1997 1552 -2286 736 2558 -822 614 1852 -2104 -312
4598c12K949l412RL391l454j114L831j786j434K889k341j422M132j550l230L136
$$ -312 2637 -775 -766 2625 -829 -1943 1888 102 -1332 1557 -784 -2206 1926 376 -2854 282
4614B82K37k863L021N07m194K371J938l515J365K675l360K99K669k514Q53K721
$$ 282 519 -2344 677 1184 -3010 -639 1299 -2216 -851 1824 -1536 -1237 1432 -1082 -229 2492
4630B492l492n70M160j937j957L639k185j890L802l07l402K918P03l497K357J507
$$ 2492 -1000 -1570 2590 653 -1304 2335 150 -1740 2062 1755 -1647 1271 1974 -1523 834 2341
4646B341l144J417R51l293K497K050m075N0L287k672r05L391k429j943L901k101
$$ 2341 -803 614 1565 -1728 769 2819 -1256 -1206 2081 -591 -1496 1895 -534 -2477 1424 -677
4662f77j821L673j550k270K921k96k296L105j91m224L373K257m528J455K274l312
$$ -677 -2498 1175 -375 -2645 276 -20 -2316 789 598 -3626 -253 2004 -2524 -1069 1205 -2107
4678b107J078K428k913J22L096l022n70L764j905j163L002j912j471M246j317
$$ -2107 -1029 1399 -1514 -1392 1704 -1318 -1888 1876 -29 -1192 1810 -102 -1573 2673 1356
4693A356l864L213J294l367J903J346l208J485J710l495K051J612l404O65L299
$$ 1356 -2508 705 1999 -1368 535 1881 -1327 158 1868 -1627 424 2036 -1368 -703 2596
4708B596l119m79L532l399j045M427j644k718K998n85k219K692l58k290K722j77
$$ 2596 -523 -1002 2530 -869 -1914 2513 869 -1849 1149 564 -1655 1037 679 -1611 1111 934
4724I34l074K963J529m003J788J745l225J321K731l427n32L253k178q89K578k148
$$ 934 -2140 823 2352 -1651 137 1882 -1343 -22 2709 -718 -1250 2003 -175 -1064 1514 -634
4740f34p04K706j779j677L626j498l513L970L16l481K284J010l746K107J990l063
$$ -634 -1338 1368 -411 -2088 1538 40 -3473 497 813 -2668 -384 626 -3120 -1013 977 -2086
4756b086Q49J771k386P79K021k574L58K966l241l03L912k054k430L736o61k245
$$ -2086 -1237 534 -1852 -1073 948 -1626 -1268 1698 -1543 -1846 2066 12 -2418 1318 657 -1588
4772a588K962l69k639K862M46k645J985O48l000K589J001l423J620K315l932K29
$$ -1588 1374 1005 -1634 1228 1674 -971 1014 1662 -1338 1251 2252 -1171 449 2764 -1168 -939
4788i39L651k380j363K964j624j173L119j902j459K998j017j859K871o56k752
$$ -939 2712 332 -1031 1933 309 -864 2255 353 -1106 1892 875 -984 1887 1231 -1521
4803a521L038M97l460K256J922m067P27K805k906L79J832k667K13K235k236j028
$$ -1521 1517 2014 -1446 810 2732 -1335 -608 2197 -709 -330 1502 -1165 -952 1283 -953 -1981
4819a981L411k539j218L363j468k308L330n36l047L108Q96l461J755O41k000J973
$$ -1981 1430 -1109 -2327 1036 -432 -2740 590 54 -2993 115 1011 -2450 -695 -54 -2054 -81
4835h1J140l455J639K406l464J068K965l322l64L466j992j637L622j364k414K757
$$ -81 1059 -2396 -757 1649 -1815 -747 2218 -1104 -1468 1998 6 -1631 1991 627 -1787 970
4851I70o2j851K238r90k306K934J17l692K521J612l691J984J899k891L24K547
$$ 970 908 -943 1295 305 -2001 933 1050 -2642 -121 1491 -2200 -216 1683 -1208 -884 1663
4867A663k782k95L208j647j323K298j339l17K977k078j902L665q53k886L145N55
$$ 1663 -1119 -1414 1794 147 -1176 1122 -217 -534 2443 365 -1537 2128 1275 -1611 1534 2089
4883B089k882J455J626k940J695J114k942J223J852k792P13J575k634N8K828k650
$$ 2089 -793 662 2288 -652 1043 2157 -785 438 2290 -502 211 1786 -848 -790 2038 -612
4899f12j343L958j953k565L177o57j899J904l81j553K197O4k834K256P80k640
$$ -612 -1955 2003 50 -2515 662 5 -1894 10 -371 -1924 273 337 -2497 -241 539 -2101
4915b101J414K022l393P60L013k905p66L582k088q36K108j312n69K340j542j379
$$ -2101 -687 1335 -2058 -1298 1715 -1190 -1956 1626 -462 -1298 810 -502 -1071 1269 -273 -1652
4931a652L320j026k043K777k42k858K695J312l584J527J841k981J018J989k493
$$ -1652 1668 642 -1401 1376 1134 -1724 971 2283 -1301 226 2067 -914 104 2093 -400
4946d00L02K056k554M25K752l156k99K749j693j434K879j002k492K798j36l037
$$ -400 -98 1958 -596 -171 2581 -575 -874 1875 182 -1252 1627 625 -1867 931 795 -2242
4962b242K885L64k926J672Q45k640J736P78l459J653K546l121J64K830k323m31
$$ -2242 643 1007 -1919 -247 598 -2042 -306 472 -2987 -1334 1212 -1909 -1745 1085 -1238 -1669
4978a669K999j671j272K804j172j220K543q1k390K489j49k280K775O58l369J658
$$ -1669 1330 -341 -1613 1191 19 -1201 1342 1261 -1129 1360 1211 -1069 1706 2364 -1005 653
4994F53J886k585R64J568l172R40J801k077J32K321k665j091K910j648j111K398
$$ 653 2539 -46 918 2486 -686 254 2055 -22 110 2431 -234 -1325 1585 -63 -1174 1224
5010A224j779j535L233m10k931K244L95k676K244J074k722J047J262k648J034
$$ 1224 -555 -2090 1143 733 -2198 46 441 -2235 9 1083 -1639 -592 670 -1978 -944
5025i44K428l005L26J928j805l69K680k121j305K970j030j536K447o49j927K609
$$ -944 1484 -1521 -1195 733 -1072 -1441 1239 -882 -2187 783 -247 -1783 664 15 -1912 697
5041F97j54k305K497J61k792J961J478k781J178J183k326R20K356k581j78K404
$$ 697 543 -1762 735 896 -1896 65 1543 -1238 -60 1123 -1203 -283 2073 -508 -686 1718
5057A718k072m01K632j600j316K877j263j529K925o80k651K045O27k323J901N94
$$ 1718 -354 -755 1877 277 -1039 1838 575 -954 1971 1291 -1360 685 1312 -1011 890 1484
5073A484l409J767J932k554P30J519k848N58K298k316K37J919k093q73L394r78
$$ 1484 -1925 -158 1774 -780 -50 1469 -1379 -821 1477 -839 -602 1317 -776 -1649 1745 767
5089G67k010K083m78j791L003l62k610K012L33j785J701P38k739J089J548k813
$$ 767 -1243 840 362 -1429 1574 1212 -1398 614 947 -838 863 1601 -1138 -49 1499 -1314
5105a314J013K224l144n9K098j142p86K084j789r89K533r24j475K003j044j911
$$ -1314 -301 1923 -1221 -1280 818 -324 -1110 974 -815 -1804 729 -195 -1670 333 -711 -2622
5121b622K334M43k478J831M80k532J798J930k690N55J477j936O58K191j804o67
$$ -2622 -288 155 -2323 -492 -12 -2544 -746 1184 -1506 -951 526 -1410 -752 1439 -365 -1032
5137a032K352j422q02L175j665j616K323l62j690K898n83k426K022R15k262J639
$$ -1032 1320 -102 -904 2271 606 -1010 1313 951 -739 2159 1576 -850 1172 2087 -175 1464
5153A464O17k533R33J624j988N62J421k752M04K714j960o02J728j480j206K684
$$ 1464 2081 -452 481 2105 117 679 2100 -652 -248 2466 506 -96 1632 152 -1054 1630
5169A630r86j846K157q40j787K552k05k431J922L54k163J701Q01k863L70J832
$$ 1630 644 -1202 955 115 -1672 880 675 -1756 166 520 -1643 58 859 -2004 -1634 198
5185A98j835O02J714k764P4K285j412p22K350j729j157K917p69j778K481n24k090
$$ 198 -1637 -1035 679 -2085 -2011 274 -1138 -1860 490 -1239 -2396 521 -248 -2026 455 -69 -2159
5202b159K699M07k322J124J219k402J796J536k636M46J826j786J37K473k168p48
$$ -2159 540 947 -1375 -251 968 -1434 362 1898 -738 -292 1534 -252 -115 2358 190 -558
5218e58K180q85q21K414j532j636K098k14j480J869m34k300J998P63k157J044
$$ -558 1622 737 -84 2330 798 -838 1260 1046 -434 1435 1001 -1299 699 1462 -695 349
5234C49N63k082J124J809k494J94J706k040J6K381j513r22J682j415l65K477j245
$$ 349 912 -1170 -46 1763 -731 -537 1169 -871 -855 1526 13 -909 773 -642 -1007 1470 225
5251B25j977K310k22j663K413j99k395K041O97k426J483Q79k451O14K005k014
$$ 225 -1752 558 336 -1327 1086 887 -1508 533 1230 -1196 287 1166 -1285 -671 1334 -680
5267f80M55J873k536mK306j407o72J589j350j102K604o48j765J562J01k089K064
$$ -680 -225 1648 -888 -892 1414 7 -665 924 -426 -1528 1076 428 -1337 225 326 -1763 301
5284C01O97k413J377O07k235J548J455k691K27K081j958L44K308k372q11K385
$$ 301 998 -1415 -38 569 -1666 -118 1337 -1354 -1127 954 -1004 -660 1648 -724 -1535 850
5300H50j110o39K156j090j872K479k57j345J934o17k250K360J159k460J012P48
$$ 850 -260 -899 1257 167 -1705 774 517 -828 1106 489 -1761 599 1758 -702 310 1058
5316A058j782N97J955k157j07J912k293J66K316j517q20J611j052r31K588r69
$$ 1058 -724 -127 1828 -329 -436 1476 -817 -651 1665 148 -672 939 -113 -1044 1544 575
5332E75k315K315J58j599J576K86k015Q60O72j541J303J030k622N29K104k070
$$ 575 -1740 575 733 -866 710 996 -1019 -159 513 -1028 275 1305 -1317 -788 1316 -754
5348g54N9J858k471k60K555j141j612K522r06j440K314k20j949J961n74j560K328
$$ -754 -695 1163 -1308 -1568 987 -154 -1766 756 -150 -1590 724 504 -1445 516 -58 -1618 710
5365G10O49k753J258J216j794R41J835k424L1K295j784k98J956j398n08J481p40
$$ 710 1359 -1394 -136 1080 -714 227 2062 -362 -331 1964 180 -118 1838 440 -68 1413 673
5382F73r54J943j103j748K251k2k149J720L86k579J171J524k604Q76J071k236
$$ 673 -281 1662 559 -1189 1062 1040 -1109 611 997 -1582 -411 1113 -1491 -615 456 -1780
5398a780J118J121k079K47J552k088J90K706k060r80K297o14j400K341p24j675
$$ -1780 -662 459 -1620 -1373 179 -1909 -1719 987 -1073 -2053 244 -370 -1770 571 -153 -1828
5414a828K305L38j682J528N5j812J634J067k067J199J411k648N63K450j982n61
$$ -1828 477 815 -867 661 716 -1096 538 1605 -462 737 2148 -500 63 2513 531 -30
5430c0J805j291n04J842q33j156J591p37j151K152n78k134J667L82k164J870M99
$$ -30 1775 484 -20 1822 989 -167 1424 687 -464 1688 1110 -1024 643 1025 -1139 731 1230
5447A230k521O48J563j987L78J221j903L11J694j888o2K060k137m96K197j200
$$ 1230 -1291 -643 920 -1067 -689 532 -1371 -1060 634 -1254 -1316 744 -1393 -1889 308 -892
5463h92j422K533o85j971K501N74k396J439M69j590J335J142k311Q53J488k253
$$ -892 -2314 219 -466 -2437 64 638 -1758 -319 150 -1440 -105 1037 -1274 -421 1067 -1186
5479a186J239J941k428N3K484j965m12K431j588j615K482m74j136J802o89j371
$$ -1186 53 1994 -434 -381 2103 138 -274 2157 569 -1046 1436 962 -174 1628 939 -432
5495d32J691R3k279J397L70k144J488J179k422O13J288j828Q4K212j983k82J777
$$ -432 1259 1352 -927 470 840 -1304 184 1363 -1059 -446 842 -986 -902 1310 -673 -955 822
5512H22j532k55J955j561j006K595r12j125K029k32k327J914R04j916J099Q40
$$ 822 -710 -965 990 -571 -1577 1018 106 -1019 1010 778 -1549 365 1269 -647 452 1292
5528A292k118Q31J480j847Q30J043k372O22J969k021o92J970j232j081K542r21
$$ 1292 -826 5 1485 -362 468 1511 -861 -239 1730 -291 -983 987 -245 -1326 1216 295
5544B95j963J709k51j111J612j68k355J837O99k030J782M27k531J112J826j688
$$ 295 -1668 41 -210 -1321 291 123 -2232 -395 304 -1726 56 483 -2048 -936 890 -798
5560g98k2J890k485mK295j281l66J517j003p76K162j143j053J990p47j550K475
$$ -798 -820 1070 -1415 -1419 876 -405 -771 746 -257 -1033 1129 -14 -1067 923 176 -1374 1101
5577A101K58k540J386R32j851J400J114k163L47J864j669M69J623k171j52K020
$$ 1101 1359 -1181 205 1137 -714 686 1800 -363 -16 1848 179 648 2271 100 -52 1968
5593A968j313o61J871j345j406K248l59j543J267L01k393J595P59j948Q25N34
$$ 1968 655 -6 1865 520 -886 1362 1003 -540 727 1028 -1365 230 989 -959 -134 400
5609D00j866J128J162k361p9J574j684K44K008j631q51K028p68j013J980o20j575
$$ 400 -1466 -338 824 -1537 -1616 -42 -1726 -1482 526 -1105 -1956 72 -696 -1709 271 -349 -1924
5626a924J900l40j051J811%k095J118J840k104J072P62j967P86J613j176k81J209
$$ -1924 -24 -364 -1415 396 396 -1699 -581 1259 -845 227 989 -978 -192 1421 245 -36 1173
5643A173j653k1K223j471o18J472j566m64K631q01k000J646L16j917J754M77j954
$$ 1173 -480 -501 1722 251 -367 1105 -461 -925 1706 905 -1095 551 867 -1050 704 1181 -773
5660g73R43P96j908J272J086k502P42J634j365J07J205j695n78K332q96j088J734
$$ -773 170 966 -942 330 1416 -1086 -344 1290 -75 32 1237 -458 -1036 1296 400 -688 1046
5677A046j244j199J812J60j580J136r0j574J856O72k461Q29J169j625Q50J473
$$ 1046 -198 -1397 415 575 -1005 131 41 -1533 323 995 -1466 -637 532 -1093 -243 1230
5693A230k268Q5J355p69j28J787j719q00K111o95p96J876o81j776J913M93j527
$$ 1230 -1038 -953 402 -367 -495 1292 -427 -1227 884 189 -607 1269 588 -1188 725 1218 -309
5710c09J137M05k302J534J335j950K54Q16j746J007J493j951m60J496j835M19
$$ -309 828 1233 -1069 465 1800 -150 104 920 -826 181 1674 -277 -737 759 -1076 -657
5726f57K391j491j593J769q16q84K375q64j842J513L48j245J650l17j728R29J253
$$ -657 1734 243 -1350 419 -397 -1281 1094 230 -1612 -99 249 -996 654 337 -1391 -462 791
5743G91j522Q68P84j795m71K399j042k59Q86j517n13K444p76j253J385o68r32
$$ 791 -731 137 921 -874 -1345 1054 12 -247 639 -878 -1391 1053 277 -976 409 -259 -1191
5760a191K207k06j836J198L20j625J699Q90k348L72J199j430Q50J554k174k14
$$ -1191 1016 810 -1026 172 492 -1133 566 1456 -892 -520 679 -751 99 1653 -521 -735
5776g35J840j338k75K004j244j189K064n53j206J654p59j710J929N67j396Q14
$$ -735 1105 -233 -508 1496 252 -937 1127 574 -632 1022 263 -1447 482 1049 -347 467
5792D67O3j872J604J386j989K98Q72j877P00J595j309m44J123q51n42K240j264
$$ 467 530 -1342 262 1648 -341 -43 829 -1048 -348 1247 -62 -506 617 -234 -776 1464 200
5809B00j569J984n77n03J725j174j358J500M17j817J467M54j792N11J143j144
$$ 200 -1369 615 38 -465 1260 86 -1272 228 645 -1172 295 749 -1043 -532 611 -533
5825e33K14J115k034R7J983j229n09J486j714k48K181r12j453J342j72j326K530
$$ -533 -319 796 -1238 -1141 842 -387 -896 590 -1124 -1372 809 -103 -1556 -214 -386 -1712 818
5842H18l00k271J200P04j251J400O82k107Q16J446j547M77J274k234J89J930j044
$$ 818 518 -1753 -553 151 -1100 300 982 -1125 -309 1137 -410 67 1341 -893 -704 1226 182
5859A82o31K213j778j136K250l72o86J119m99j516J832N17k042R24L40j435J403
$$ 182 -449 1764 -14 -1150 1100 728 42 1161 662 -854 978 1495 -547 377 717 -718 685
5876F85J150k260N03J171j703M15J593j534m30J231p65m43J546p84j636J764k78
$$ 685 1835 -425 78 1249 -454 -39 1554 20 -410 821 56 -387 1159 375 -1261 503 225
5893B25j194J790k08k181J492P39j590P77Q61k330O82J422j351L11J139j988K00
$$ 225 -969 821 613 -1568 -76 663 -927 -150 711 -1619 -937 485 -866 -555 584 -1404 -1204
5910a204K056j172r13J593r65q22K179p37j141J498m66j219J777L60k015J004
$$ -1204 852 -320 -1233 360 -605 -1427 752 15 -1126 372 -94 -1313 464 824 -1191 -187
5926a87Q00j615J358M64j767L71J636j700L7J613j689k18J961p83p84J182r29
$$ -187 613 -1002 356 820 -947 -576 1060 -640 -603 1010 -679 -897 1064 281 -503 679 -250
5943b50o97J704K6j591J492k5j655J928M44j796O28J017k090J013J417k061J41
$$ -250 -947 757 783 -808 684 659 -996 932 1376 -420 208 1225 -865 148 1565 -496 -355
5960c55J453j439K05J474j682k92J603r41o15J742j083j403J894j87j301J598
$$ -355 1098 -341 -136 1338 -344 -636 967 26 -589 1153 70 -1333 561 374 -927 671
5976F71n22j560J257P14j586J114L59j638P52J603j699O9J126j893N75J751j122
$$ 671 149 -1411 -154 560 -1026 88 447 -1191 -439 1164 -535 -466 660 -1233 -658 1093 -29
5993b9j003J791q36p81J915o64j135J352l03j164J671k8j650R97O62j214Q34O05
$$ -29 -1032 759 -77 -858 1057 393 -742 610 307 -857 814 786 -864 133 795 -419 415 1020
6011A020j571J53J474j323J87J225j314p35J728p64q37J690j028j126K231j75
$$ 1020 -551 -398 1076 -247 -60 1165 -149 -884 844 80 -757 933 -95 -1221 1010 835
6027H35j766J475l28j471J604Q43j958N06J120j704Q62Q53j578M34P48j027j82
$$ 835 -931 544 216 -1255 349 1192 -766 -260 860 -844 18 871 -707 -273 475 -552 -734
6044g34J836j602q36J988r48n22J505q16j266J899j35j523J397j3j264J226P37
$$ -734 1102 -500 -1336 652 -296 -818 687 -129 -1395 504 369 -1154 243 230 -1034 192 929
6061I29j721R50P75k052J127J319j668l81J849j722J14J714j464n09J536o41j107
$$ 929 -792 158 933 -1119 8 1327 -341 -722 1127 -595 -481 1233 -231 -740 796 155 -952
6078i52J878j019q79J174L0j291J612J13k045J025J269j589M60P75j447L82J218
$$ -952 926 -93 -972 202 232 -1059 553 666 -1379 -354 915 -674 -214 561 -886 -504 714
6095G14j086n3J216j512L4J985j204r76J603o40j088J605N6j464J023N83j616
$$ 714 -372 -425 791 -721 -687 1298 94 -882 721 81 -1007 598 654 -810 213 796 -820
6112h20J483J98j555R04M24j446O31J365k271P15J316j387j32J647j424p20J726
$$ -820 663 861 -694 210 634 -812 -181 1184 -1087 -372 944 -443 -575 1072 -352 -1072 654
6129F54n78p77J370n68j187J750k44j168J101L26j729J349Q85j964M28J242j180
$$ 654 76 -701 669 101 -1086 664 420 -748 353 679 -1050 299 1184 -780 -352 890 -290
6146b90Q8J593j702j58J088j076j13J808j575m16J388p52r47J715J03k094J511
$$ -290 -202 1391 -311 -469 619 -457 -570 1238 -337 -753 635 -117 -1064 651 754 -1340 171
6163A71Q3j139Q69N11j588O58J423j677Q41M16j528N10J256j311r1J434j477r3
$$ 171 254 -885 -16 495 -1093 -435 988 -689 152 568 -960 -450 806 -505 -596 838 -639 -732
6181g32J575j002r64J572o05o85J600o64j505J443J99j385J395J96j691P59J324
$$ -732 843 -159 -1123 449 -156 -841 759 95 -1410 33 232 -1153 242 438 -1253 -494 830
6198H30j486K73J664k013K63J577r24m58J146q55m27J949r24o97J213l83j377
$$ 830 -656 -383 1281 -732 -469 1108 184 -274 872 17 -410 1539 615 -82 1131 748 -629
6215f29K022k6j943J280L47j615J100R88j531j64J119j473P68P29j719j37J716
$$ -629 1393 1367 -576 704 1051 -564 536 1524 -7 -171 948 -525 243 972 -747 -884 832
6232H32j053k67J319j157r92J683l41j109J504p50q55J106N70j375J016J45j400
$$ 832 -221 -488 831 -326 -1318 365 24 -1085 419 -331 -1186 -80 490 -885 131 276 -1124
6249a124J121P88j603K76Q74j203L29J421j800l5J288o76p10J452p82n98R07m5
$$ -1124 -3 785 -818 -542 332 -871 -542 879 -921 -956 332 -344 -1054 398 -384 -982 -75 -120
6267a20q98J704m64j742J314Q20j510J041Q8j093P40P19r48L71P84j408L36J267
$$ -120 -1018 686 222 -1520 -206 614 -896 145 233 -860 -120 599 -349 22 806 -602 -266 1001
6285A001r14r25J618q91n38J539m57j628J931l66o33R62K11j455P13Q68r09N00
$$ 1001 87 -838 780 -111 -649 890 433 -1195 736 370 -263 699 910 -545 168 1036 127 627
6303F27Q8j398Q21J031p89k12J061j196l48J750p40q40J347q98p96J539k32j345
$$ 627 715 -683 138 1169 380 168 1229 33 -315 1435 695 -145 1202 304 -492 1047 815 -530
6321e30J131n08r18J513J54j410K93N55j280R18Q67j873j49J225o79m32J615j327
$$ -530 601 93 -825 688 842 -568 -275 280 -1000 -82 785 -1088 -1237 -12 -691 -1123 492 -835
6339h35o65J642p70k91J443j143r86J472L86j169Q53j35q21J144N87j373M03O56
$$ -835 -1500 142 -628 -919 524 -619 -1605 -133 253 -916 -63 -198 -1019 125 712 -661 -258 398
6357C98j052O88J259j568J15P52j101L29J668j280q49J254l09j46J189r66j533
$$ 398 -654 34 1293 -275 -160 592 -509 -180 1488 208 -641 613 304 158 1347 381 -1152
6374a152J344K24j010J351M6j984R85J046j357P79L84j832M23J936j178qM65j277
$$ -1152 192 416 -594 757 803 -1181 -196 850 -507 272 656 -1176 -753 1183 5 -3 462 -815
6392h15K46J946j235p09J059q97l95J774l15j445P98m3r29J588M07k194P49J007
$$ -815 -569 1377 142 -567 492 -405 -800 974 659 -786 12 -31 -960 628 1035 -1159 -410 597
6410E97o52L05R87j865j48J506n79k99J248j491o20K048n96q53J158q28j052J920
$$ 597 -55 250 1237 -628 -776 730 151 -148 1100 -391 -1011 1037 441 -412 746 -82 -1134 786
6428G86R3j302O38J76j666J599R23j901N16L22r28M15J597j597o24J254n23J40
$$ 786 879 -423 215 391 -1275 324 1247 -654 -138 184 -744 -329 1268 -329 -953 301 -222 -82
6446h2J186j105j010J395n2l28R78r18j329J231L98p30J055j39j510Q40J114j027
$$ -82 1104 -1 -1011 384 332 4 982 64 -1265 -34 364 -366 689 550 -960 -120 994 -33
6464c3J74L59j285L05J921j419l80Q65j011J69J737j424j010J096m46p52J746
$$ -33 141 500 -785 -480 1441 22 -358 507 -504 -335 1402 -22 -1032 64 -382 -1134 612
6481F12l41j874J151N90o67O81J73j579Q81P24r85N43N30j551O20J390r87j05
$$ 612 271 -1603 -452 138 -529 152 325 -1254 -373 351 -634 -91 439 -1112 -492 898 -89 -194
6499a94R47j123m27J794q2j373Q31n57k69J789j34j604O03R9q77J332J35j506
$$ -194 753 -370 -797 997 915 -458 373 -184 -453 1336 1202 -402 201 300 -577 755 890 -616
6517f16L90Q49p28M40R50j515m76J261m95j30J079j378n04J196J15r18R06m39
$$ -616 -226 623 -105 335 1285 -230 -706 555 60 -70 1009 -369 -873 323 438 -480 426 -13
6535a3j299J706L21j351J060k98j173R24J055j275J26M64j258P93J096j106o10
$$ -13 -1312 394 715 -636 424 126 -1047 -123 932 -343 -217 247 -1011 -218 878 -228 -838
6552h38J110r36J47J374r02q89J364p39l66J352n86r51Q51L78q96J221j85j641
$$ -838 272 -664 -517 857 -45 -934 430 -309 -675 677 91 -860 -9 369 -527 694 509 -1132
6570a132P18J166r62L66M90j518K51J609j080j31N44r17j12J632m73r97N50l32
$$ -1132 -414 752 -210 156 646 -872 -621 988 -92 -223 321 -596 -708 924 451 -546 4 -328
6588c28l71J304K75j947Q97L45r80O64Q36j495N79P35q34M21J095j804m1J273
$$ -328 -699 605 880 -1067 -170 175 -805 -141 695 -800 -221 514 -320 101 1196 -608 -649 624
6606F24p48q3R50p88p90J815l86j106J090k96r27R22N87q78J23J97q92P39J107
$$ 624 -124 -207 743 -45 -835 980 594 -512 578 282 -645 277 864 -14 109 306 -586 153 1260
6625A260j304J51L15j054Q20P86j070q03J449m19p24J526q69p02Q18k37p20J239
$$ 1260 -44 107 422 -632 188 974 -96 -899 550 131 -593 933 64 -638 180 -57 -777 462
6643D62j23j637J192M89r11M99K67j191O99P29o15j31O24j258J43J258p92k89
$$ 462 339 -1298 -106 383 -528 -29 238 -953 -254 475 -140 -271 353 -905 -762 496 -296 -585
6661e85R78o49n58J356l2j263J229p3r36J287j32j583R95M20j027Q36O34j529
$$ -585 393 -256 -814 542 510 -753 476 403 -533 754 622 -961 34 454 -573 263 897 -632
6679f32N23Q76j001K7J186j135p54J535n60m94O76n28o04J391j84j049P84j16
$$ -632 -109 767 -234 -207 979 -156 -910 625 65 -429 247 -281 -885 506 322 -727 57 -59
6697e9j427J510M84j218O71K43j226J197R96k005K90J186o83O2J031r88m82R52
$$ -59 -1486 24 508 -710 -39 204 -1022 175 1171 -834 -544 642 -41 21 1052 64 -418 534
6715E34o13j65J191m65q25O30J51j019J491l29j276J085N63j346M64N46j220R65
$$ 534 -79 -244 947 482 -343 287 438 -581 910 581 -695 390 953 -393 71 617 -603 362
6733C62M74r74J89O02j106K75P26q35k76J052p32m49J341n49q82J218j36o96Q45
$$ 362 836 -138 51 653 -453 -178 548 -287 -563 489 -243 -692 649 100 -782 436 300 -396 449
6752D49p5j084P70R7o83N58Q52j592L99O52r65m2J202r55m05J776q22p22Q00j32
$$ 449 374 -710 60 157 -526 32 884 -708 -309 343 -622 -664 538 -417 -822 954 132 -590 210 78
6772G8q87J204j84q54R89k02j077J366K21j214O33L14j075P02Q44j097p1R66r10
$$ 78 -809 395 211 -643 346 144 -933 433 654 -560 73 387 -688 14 858 -239 -310 656 -254
6791b54l2J218j173m1R86p09m16R48m22j024J239j43p12O73P4r58O40M34o65K28
$$ -254 -286 932 -241 -282 704 -5 -421 527 105 -919 320 177 -535 138 212 -746 -106 328 -337 -109
6811a09M78r17L85J102j684M94R71j256l13J567l54j175R24n2n25J048k24r43
$$ -109 369 -548 -163 939 -745 -251 720 -536 -849 718 364 -811 113 61 -464 584 360 -583
6829e83R85J46q22P17L88j263N92L01j052R42N60j578K97J078q57NP48p30l99
$$ -583 402 548 -274 443 831 -432 160 461 -591 351 911 -667 -370 708 -149 -144 604 -126 -525
6848e25J661j015n56J023n9j279J220K08j204Q70pj061R04N97j192M04O40j060
$$ -525 1136 121 -435 588 529 -750 470 678 -526 344 337 -724 180 777 -415 -11 629 -431
6866d31L59O99j279L33N62o43k71R16p59k21J031n28l67O65k88j071J182J91n74
$$ -431 -72 627 -652 -319 243 -400 -671 245 -514 -735 296 -232 -599 66 -222 -1293 -111 80 -494
6885d94N20q2o88J045K59j190L83Q41j177P23Q29j263k06J273j050j18J204p18
$$ -494 26 -56 -744 301 560 -630 -247 594 -583 140 969 -294 -500 773 -277 -395 809 91
6903I1n01O82pn73J028q59n52R71N8j268P52M36j056M84P75j406N96R01j346L37
$$ 91 -410 272 265 -308 720 -139 -691 280 338 -930 -178 258 -798 -314 461 -945 -349 552 -794 -457
6923d57J370j191k13R48p81l36J622q10o93J204n1j181R69J72r06L97M92n84N71
$$ -457 913 -278 -491 457 -324 -660 962 152 -541 663 612 -569 400 572 -334 63 555 -29 542
6942E42J45r16L09N37o56K75O07j125J40R47r09L2Q11q56n01J154l55o43L96K36
$$ 542 687 -229 80 617 -39 236 843 -282 -142 805 -104 -72 739 -117 -618 536 181 -462 -66 170
6962A70j048J480l71j270Q60N4q18J165K80j175R6P76n84J58M27q07k77J150o00
$$ 170 -878 602 231 -1039 -179 -125 -943 222 502 -673 -577 199 -385 -227 200 -607 -884 266 -334
6981c34l67Q56p49k05J342j41r11R90n11p21J149L74j279N60M95j102R25P67j051
$$ -334 -701 155 -594 -799 543 402 -509 481 -30 -751 398 772 -507 53 548 -554 371 1138 87
7000H7J7M18p56O77O31j291j09P95p18M0J084p24p28P12j72j58M36k88j001R60
$$ 87 104 522 -234 443 1074 -217 -326 469 -249 -209 875 151 -577 135 -37 -195 241 -47 -1048 -88
7020h8K71p35M67M37j594Q39R80o52k73O62p63J51J171r11n04J055m30p26J608
$$ -88 183 -552 -85 352 -1242 -403 577 -75 -348 314 -449 -298 873 -38 -542 513 83 -643 965
7039I65n58p53Q29m04l14R05M46j683L60R67p26M24K00j250N92N83o40k23J067
$$ 965 407 -346 483 79 -235 670 1116 -567 -207 760 34 458 658 -592 0 583 -57 -280 787
7058G87j379o1J236o63j67O38r96p23K082o36p22M07l35l18J006J79j187O21M46
$$ 787 -592 -653 583 -80 -247 391 -605 -1328 754 118 -604 -197 -532 -850 156 335 -852 -231 215
7077B15q46L47J220j360l30J143p37O1J341j283m53R41l02k15J297j113o14J191
$$ 215 -631 -284 936 -424 -754 389 -348 -287 1054 -229 -682 259 -43 -258 1039 -74 -688 503
7095E03K1o42P68l45j060J093N32q21L64k97p53Q01J115j033o12O11o57M07Q84
$$ 503 524 -118 650 305 -755 338 870 49 413 116 -637 164 1279 246 -366 245 -412 -5 879
7114H79q24q22M90K15k69J200l86j512N54O57n98P56l82j160Q73P65p53K94M04
$$ 879 55 -767 -277 -62 -331 869 483 -1029 -475 182 -416 340 -42 -1202 -329 436 -317 -23 381
7133C81j090J28J239q63P8P63j398M32J353m04q01N58l89n83J367L61j431N53
$$ 381 -709 -581 658 -205 -127 636 -762 -330 1023 619 -182 376 -13 -596 771 1132 -299 254
7151B54J8p52Q56O92j328J36M02l12M20M00r31n65R56n63N09M29r14p74J416k24
$$ 254 272 -480 376 1068 -260 -124 278 -34 386 786 -145 -710 246 -317 192 621 -293 -1067 349 125
7171A25n91R53p99q87J920O2j256M15K03r98Q25J133j310l4L7m40J292M29j180
$$ 125 -466 487 -312 -1199 721 783 -473 -58 145 -853 -28 1105 -205 -239 -202 -642 650 1079 -101
7190a01o87Q75l60P3J073q90j043J251J03m44R73p00r42P43N67o32O41m09j168
$$ -101 -788 87 -273 -200 873 -17 -1060 191 294 -150 823 123 -819 -76 491 -141 500 91 -1077
7209a077J278M09n04k97O0o46N57J245j152l31O16o42nJ546q45o71M51l35j38
$$ -1077 201 610 106 -191 -131 -777 -220 1025 -127 -458 158 -484 -489 1057 212 -459 -8 -343 -481
7228d81J266p15r58O69K88m81Q46N3j537M29Q32p37P68L26j127k89J411l95k34
$$ -481 785 70 -888 -219 69 -412 434 487 -1050 -621 211 -526 242 568 -559 -848 563 168 -66
7247f6N46o67l61J337l00m00L28j00p74J146J51q15K50j68n86P10P99j011m3M93
$$ -66 480 -187 -548 789 489 89 417 317 -457 689 840 25 275 107 -479 231 1030 19 -24 469
7267D69p48M25K70q87r8R75n40R4Q32j038o71R32P8o01Q14o48p36J189L38o55
$$ 469 -279 146 416 -471 -569 406 -134 -40 792 -246 -917 15 93 -508 306 -342 -1078 111 449 -206
7287b06M09k63q47O85J123j260J78M78r83K46J145j020n0P59r52J40Q67M5r76
$$ -206 203 -60 -907 -222 901 -359 -181 297 -686 -440 705 -315 -365 394 -558 -418 449 494 -482
7306d82K67J6m61R91l03j089N01P07p35O51K88r86M76L67k95J58P0o50j38J497
$$ -482 -215 -199 -660 331 28 -1061 -560 147 -588 63 351 -635 -159 208 -87 71 141 -509 -647 850
7326H50n29o66R34q13j92R70r9n93L82k09o07J070J50q26L18J86o21N18N05j133
$$ 850 321 -345 589 -224 -416 554 455 -138 244 35 -572 498 648 -178 140 326 -295 223 728 -405
7346d05r9J042o79J56N82n70m07O39m10m7O33l94m77Q25k03l32R89r58l90J123
$$ -405 -504 538 -141 15 597 27 -380 259 -151 -198 435 41 -436 389 186 -146 843 -115 -505 618
7366F18Q2j035L64O4m52N19M47j063L71N78q68p7J080q19j37L47n72Q3J192p26
$$ 618 700 -335 29 93 -359 160 607 -456 -85 493 -375 -452 628 -191 -328 19 -553 -470 722 -4
7386do76O39J74n72N23l9m88L86J82m80J88N78j422M91J076o05j69O37q06n2J275
$$ -4 -680 -41 133 -439 84 45 -443 -57 125 -355 -167 411 -1011 -520 556 -49 -218 419 -387 -439 836
7407H36m45p58Q25o15k54R06l91q13J030k19o24J022n8q33L13L60n94M85M26j037
$$ 836 391 -367 458 -157 -411 495 104 -709 321 102 -522 500 442 -391 -78 282 -312 173 599 -438
7427d38k9J201j060O80J69m00j90M17k93k61Q75m43p75O29O20j004Q22k64p72
$$ -438 -467 734 -326 354 523 123 -67 350 57 -204 671 228 -547 82 702 -302 520 256 -516
7446e16P90K50q81L28K7n20K56O70o72O9P84r28J0R30q00l04Q57m36l71P11l0
$$ -516 274 524 -357 -29 -2 -522 -266 404 -268 -199 585 -343 -333 597 -203 -507 350 -86 -457 254 224
7467B24p87O59J14p23O72R4q74L64N92p40L94M66j146P38O44r72M4Q71r02q0R16
$$ 224 -563 96 210 -513 159 253 -621 -257 335 -405 -11 455 -691 47 691 -281 -237 634 -268 -348 568
7488E68o46k85J020o69o58J230k85n08P29o1j138J193j5r34J73N72q20L51R84
$$ 568 -78 -363 657 -12 -670 560 275 -233 496 435 -703 490 475 -459 -286 286 -534 -183 801
7507H01j278L26O69n99k60J060q33l36R15n49l29O56k12o84J010j58n97N40j36
$$ 801 -477 -151 518 -81 -341 719 -114 -450 465 -84 -413 243 31 -653 357 199 -398 142 6
7526Fp97J074j36r26O77M51p23K52O64j088K27J060j027nJ054o43o68P81j52k96
$$ 6 -791 283 147 -779 -102 349 -374 -122 542 -546 -319 741 -286 -291 763 120 -548 233 81 -215
7546b15N72l68l72N75M01j063O30L48j212P67L90j016O85R0p10M47P44j135K70
$$ -215 357 -11 -383 192 593 -470 160 508 -704 63 453 -563 122 212 -498 -51 693 -442 -172
7565a72O47q13K36O63o71o71J060j01p28J274m52q98O29N7k63L72N07j191J75
$$ -172 475 -338 -102 561 -110 -781 279 178 -550 724 272 -626 3 60 -203 169 676 -515 -340
7584c40N69o49J79P21j279O66O24r91O2Q27o03m04P76j39n14M27P5o59J307n79
$$ -340 229 -420 -241 480 -799 -133 491 -500 -438 389 -214 -618 158 19 -495 -68 7 -652 655 76
7604G6p02Q82p0n10O93J9p60K5P36p57L97O24j118P2Q33j87m14Q40o21l48O73
$$ 76 -626 256 186 -324 369 388 -372 -347 389 -368 29 653 -465 -393 440 253 -161 679 58 -290 383
7625C83m6m73M54P6r43R36M6j107O94M43j049M05Q00r96M00K87j027O25O10j033
$$ 383 337 -136 318 394 -549 387 433 -674 20 463 -586 -181 619 -377 23 310 -717 -92 518 -515
7645e15L20N08m04r6O78p98l95J077l5j016J198j43r87M04M17p03P34p1r84O82
$$ -515 -195 313 -91 -187 491 -307 -702 375 340 -676 522 379 -608 -204 213 -490 244 173 -811 -129
7665a29P89j200N09R0q26L02J170p68k72O10l75j34P37p22l69O82M7m05J000l89
$$ -129 660 -540 -31 59 -767 -465 705 -63 -335 275 -100 -234 503 -219 -588 94 141 -264 736 347
7685C47r04Q30p1m87O77J41j158N14O95q11L15M46p35J4N88l03j17j43Mm31J135
$$ 347 -557 273 202 -285 392 533 -625 -111 584 -227 88 534 -201 -187 401 98 -19 -162 -158 -589 546
7706E46k73o73O88k88n91R56K97j047L85K22p27N91P20j212R8P75k70r4O45p22
$$ 546 273 -400 288 0 -591 365 662 -385 0 222 -505 86 806 -406 -308 467 197 103 748 26
7726B6n51J029l79j6L8o6q46J093L4m86K97Nq02P59J60n18K91Rp51P54O71j077
$$ 26 -525 504 125 109 147 81 -765 328 362 -124 173 178 -624 135 295 -223 68 77 -674 80 751 -326
7748c26J02J33l46L88R08j107o07J036l73J01P76n19q63O92J40j1M39L0j178L74
$$ -326 -224 -91 -437 -49 859 -248 -855 181 -192 -91 685 166 -697 -5 135 124 563 593 -585 -211
7768b11Q76o69L09J61j197N00Q47p22j10O46p35J66J143q67j43J28j18k15J012
$$ -211 665 -4 305 466 -731 -231 616 -106 -216 430 -305 -139 1004 137 -6 122 4 -211 801
7787H01m17p76N88j81j97O78n3o90K81L23o46P64J18p49k75Q41l26k88N74n94
$$ 801 384 -392 196 15 -182 496 443 -247 34 357 -289 475 593 -156 -431 410 84 -204 370 -224
7807b24n31J265k16n68L00l73j04N45J64n82M84k87o91Q26N34r63J52M36m60L40
$$ -224 -755 510 294 -274 26 -347 -451 94 258 -324 160 -127 -818 8 542 -421 -269 167 -293 47
7827D7O22r53l23J030m91P3N89o69p85R28N3l09P20p67q22J147K65m24M44m07
$$ 47 669 -284 -607 423 -68 5 594 -75 -860 68 121 -188 532 -235 -1057 90 355 -69 375 -32
7847c2r45J150L09p21K64K02p50M13R52r89o9R9j64k01J243o64m84N93l25j01
$$ -32 -977 173 482 -239 25 227 -523 -110 842 -147 -216 -117 -281 -482 761 97 -387 206 -119 -220
7867b20R82k68j455R70m1k96P19jq71M32M65o77O17K75j286j2J012m97L3L71o87
$$ -220 762 494 -961 9 -32 -328 391 390 -481 -49 416 -261 356 631 -655 -667 345 -152 -119 252 -435
7888d35p7J258l97l63K09l75l88J260j29r84O80n6p22J071K82q23l40N46k85M59
$$ -435 -512 746 349 -14 195 -180 -568 692 563 -421 259 203 -519 552 834 11 -329 217 -68 391
7908C91O94j779M7J111o80K87Q47j223j77N12j07j77N82k57o83O66M58q13M00
$$ 391 1085 -694 -647 464 -216 71 918 -305 -482 30 -77 -254 328 71 -612 54 512 -301 99
7927I9k8o71M96P14p09j17K90r48O19R94j005j89N19n56M89O50o50m55O06j45
$$ 99 71 -600 -104 610 -99 -216 74 -874 -255 739 -266 -455 64 -492 -3 647 -3 -458 148 3
7947Ck96O94k2j177P73K47n30O85m87n06O11Q24r33L48N9o55OR47n53j50K29l19
$$ 3 -293 401 379 -798 -25 222 -308 377 -110 -616 -5 819 -114 234 293 -362 -356 591 38 -112 117 -202
7969b02l40J387n53p62Q69l98p7L49M7q61N35J21n57Q39J14j061N17L80o88O83
$$ -202 -542 845 292 -470 399 1 -76 273 320 -541 -6 115 -442 397 511 -550 -33 347 -341 342
7989C42O6n79l67Q13k45m48Q89q70m5N74L61m93K16m58m21J225j8r11N08K36p56
$$ 342 408 -171 -538 275 30 -418 471 -399 -444 130 491 -2 214 -244 -665 560 542 -369 139 375 -381
8010c81O04O44j082J53R8k56L41O13q91m16R76n21J32P35j037k82O22N6k44L12
$$ -381 223 867 -215 -62 36 -220 121 734 -157 -573 403 -118 14 749 -288 -570 52 108 -136 176
8030A76j28r26O47N05n97m2L53q25Q39M00k87m02L09l11j09J093q72j19P94q38
$$ 176 48 -878 -231 274 -323 -365 -12 -837 2 402 115 -287 22 -289 -398 695 -177 -296 498 -340
8050c40J84O74m99j72Q46m37o10P18nq90P06R7o76O46Q6p48M32J71o24L79N45
$$ -340 -156 518 19 -153 693 256 -354 364 359 -531 175 272 -404 242 328 -420 12 183 -441 -62 483
8071D83p01j00J001m36k51L39o47p6O85N9o29M59Q1p81O88L06j164P79L30j131
$$ 483 -218 -318 683 247 -4 335 -312 -388 297 356 -273 186 267 -514 174 480 -684 95 425 -706
8091g06P94L69q53K09rnj00Q54o15m68P52j29o65Q05m8m71O85k80k60K65k44q2
$$ -706 88 457 -396 -187 -196 -201 -301 553 -62 -530 222 93 -572 233 185 -286 399 119 -141 124 -120 -202
8113b02M19J87k24M3n9o85P81L74o30k79M66l42R9P58p16n74Q66n96J1N04m5l00
$$ -202 217 404 180 223 164 -521 260 634 4 -275 191 -151 -52 706 -10 -584 282 -314 -303 201 156 -144
8135a44L09k26p25J183L92j307O73M6m96L47j98j23J85N34n58j00N37l31j59N60
$$ -144 165 -61 -786 397 789 -518 155 201 -295 52 -146 -269 -84 450 -108 -208 329 -2 -161 399
8155C99m97n5J84m8j63M40l20m73O30k26l56P38k0p19O76K48r69L90O78r10L69
$$ 399 -98 -153 31 -17 -180 260 -60 -533 97 -129 -485 253 233 -486 190 438 -531 -141 537 -373 -4
8176dK86m23kM82n49K3M57q1j29L90l01n11L76K58o70
$$ -4 282 -141 -143 339 -210 -187 270 189 60 450 149 -362 14 272 -398
8191c98
$$ Imaginary data points
##PAGE= N=2
##DATA TABLE= (X++(I..I)), XYDATA
0@%%%%lLqJ6j6J6k4L2m0N3o5P6r2J12j33J57j84K15k47K82l24L74m28M86n50O20
$$ 0 0 0 0 0 -3 0 -8 8 -8 8 -16 16 -24 29 -36 40 -52 60 -73 84 -100 115 -132 150 -174 200 -228 258 -292 328
30C28o98P85q81R85j096J222j362J513j677J860k060K279k523K794l096L434l816
$$ 328 -370 415 -466 519 -577 645 -717 796 -881 979 -1081 1198 -1325 1469 -1627 1807 -2009
47b009M252m753N334o022O848p860R138j0810J3100j6443K1798l1760N6387k21747
$$ -2009 2243 -2510 2824 -3198 3650 -4210 4928 -5882 7218 -9225 12573 -19187 37200 -184547
61a84547m20602L58475K23463j55675k22663m9648M8336J30060Q593q8097m8435
$$ -184547 -605149 -246674 -23211 -178886 -401549 -451197 -402861 -272801 -264208 -352305 -400740
72d00740J2213M7087Q5157j9163j9658P9860k8279q4897J91416J72452j80208
$$ -400740 -388527 -341440 -256283 -275446 -295104 -215244 -243523 -328420 -137004 35448 -144760
83a44760j19879K05095J40646p0862p4260L4463J21300M2653j32924l5549J63772
$$ -144760 -264639 -59544 81102 10240 -64020 -29557 91743 134396 1472 -34077 129695
94A29695O9294p5947o5114n1909Q1113K04895o0494k81713J2573K32914K5661
$$ 129695 198989 123042 57928 6019 87132 292027 231533 -50180 -37607 195307 220968
105B20968j31580p3051L034M2866o368l5030N8078o655j74317j9718J87605N2285
$$ 220968 89388 16337 19371 62237 55869 20839 78917 72262 -102055 -121773 65832 118117
117A18117q9930p9966p8825P6849K27329l0083k66936l6615J89975Q5754q3168
$$ 118117 28187 -51779 -130604 -53755 173574 143491 -123445 -160060 29915 115669 32501
128C2501j24030J459J22846r932j08829O9418R2835r4098m7865Q4325M3275L5776
$$ 32501 -91529 -90070 32776 22844 -85985 -16567 76268 -17830 -65695 18630 61905 97681
140I7681J2579j04578o272J63438K4513j25947k4291O0884L8090l0716j00382
$$ 97681 110260 5682 -590 162848 187361 61414 37123 98007 136097 105381 4999
151D999J5914J45970n5958k00054M2582J68949p792j01835q0076j5006J23714
$$ 4999 20913 166883 110925 -89129 -46547 122402 114610 12775 -67301 -82307 41407
162D1407P5041j39320j10239M9090L6011q538k5775o5967n299J7586q2560J1786
$$ 41407 116448 -22872 -133111 -84021 -48010 -56548 -82323 -148290 -153589 -136003 -218563 -206777
174b06777J56607l9725j95679K7365J85479P4242n5424j14789j3826J85627J17481
$$ -206777 -50170 -89895 -285574 -258209 -72730 1512 -53912 -168701 -182527 3100 120581
185A20581j10460q6303N5437Q0944N6532l9173r1017O7996J06065r0808o3607
$$ 120581 10121 -76182 -20745 60199 116731 77558 -13459 54537 160602 69794 6187
196F187J22263M3658q6632k7613K9305M7513L0488q1781o3781Q6872K6607j06975
$$ 6187 128450 172108 85476 57863 87168 134681 165169 83388 19607 106479 133086 26111
208B6111k6243M5861N48k5522q2333o3918J19644R1878j59077j31110J00458J24055
$$ 26111 -132 45729 46277 20755 -61578 -125496 -5852 86026 -73051 -204161 -103703 20352
220B0352N188r7364j03845P6003J56943m3313j13197M0205M7783j4648K3955P195
$$ 20352 25540 -71824 -175669 -99666 57277 13964 -99233 -59028 -11245 -25893 -1938 5257
232E257j4227L2335k4366n1176R1272Q1342r3257p7533M4434P5957M8553o8518
$$ 5257 -8970 23365 -1001 -52177 39095 120437 27180 -50353 -5919 70038 118591 50073
244E0073j25593O1723J43284o2321j17721L6758N7721k24k5113n8234J6678J03213
$$ 50073 -75520 -13797 129487 67166 -50555 -13797 43924 43700 18587 -39647 -22969 80244
256H0244l1497j17199K8819Q7634l054m1387n2174k557R3917L399j17502J5953
$$ 80244 48747 -68452 -39633 48001 44947 3560 -48614 -51171 42746 46145 -71357 -55404
268e5404J02863l7773p0323K9431M8511K7787l2169q9390L7808J37042k9769j30088
$$ -55404 47459 9686 -60637 -31206 17305 45092 12923 -76467 -38659 98383 68614 -61474
280f1474k817O8757M0937j1493j01501m3696J15203L3657j16587j5917P7871K478
$$ -61474 -64291 4466 45403 33910 -67591 -111287 3916 37573 -79014 -94931 -17060 -14582
292a4582l2444j4193J3010P1846O260j04992J0754J22714j008q2135j8539K1168
$$ -14582 -47026 -61219 -48209 23637 29897 -75095 -64341 58373 57365 -24770 -43309 -22141
304b2141N7530K9436r9778m8825J18560M1765r6260k0333O2747M1735N438n8893
$$ -22141 35389 64825 -34953 -83778 34782 76547 -19713 -40046 22701 64436 69874 10981
316A0981k8350J07119M7840j09121l6471P6707K1041k9458m3044m2500N1046N1888
$$ 10981 -17369 89750 137590 28469 -8002 68705 89746 60288 17244 -25256 25790 77678
328G7678r4364o0918Q7992L3174o8102l0684J7880N4296L8142q2639o2479J06599
$$ 77678 -16686 -77604 10388 43562 -24540 -55224 -37344 16952 55094 -27545 -90024 16575
340A6575O6029r0583n2753L6989L6729J9483n0986p2571O2261P9802p3305o0872
$$ 16575 82604 -7979 -60732 -23743 12986 32469 -18517 -91088 -28827 50975 -22330 -83202
352h3202O1860M5565j0539l0014l0110N9453P9859p1748q1804P9235O6480n2102
$$ -83202 -21342 24223 13684 -16330 -46440 13013 92872 21124 -60680 18555 85035 32933
364C2933m9364r501L2876N4150n2976r5212N6565Q2960n6729o1878K1420L7317
$$ 32933 -16431 -25932 6944 61094 8118 -87094 -30529 52431 -4298 -66176 -44756 -7439
376g439L1746l0662p7332M4295R9849n2416q6600M1272N5246k854l0348m9565
$$ -7439 24307 -6355 -83687 -39392 60457 8041 -78559 -37287 17959 15105 -15243 -64808
388f4808K5791R1251l3463r6227M3293Q0229j8419l8491j4728K1644P2141j2995
$$ -64808 -39017 52234 18771 -77456 -34163 46066 27647 -10844 -25572 -3928 68213 55218
400E5218r8527K6579J00162k5841o9418M186L1531L7155j1385q3148P420J02165
$$ 55218 -43309 -16730 83432 57591 -11827 -7641 23890 61045 49660 -33488 -26068 76097
412G6097j8250r3646J0917N2456R065k0564n7630o337Q8752j610j07431L393Q1829
$$ 76097 57847 -35799 -24882 27574 36639 16075 -41555 -47892 40860 39250 -68181 -64788 17041
425A7041J62m1799k7126P086P0153J3881r4585m998J00500L796o7076j1411K3322
$$ 17041 17203 -24596 -51722 -44636 25517 39398 -55187 -60185 40315 44111 -22965 -34376 -11054
438a1054L9022J0714p8615k7493R6798J8958q9592j4330N3721K7272m176m9356
$$ -11054 27968 38682 -39933 -67426 29372 48330 -41262 -55592 -1871 25401 21225 -28131
450b8131k0991Q6103L4427r2996k1956P5744J7381l4886l2891j7675N2626L8401
$$ -28131 -49122 36981 71408 -21588 -43544 32200 49581 14695 -18196 -35871 16755 55156
462E5156q3414m6781Q3205L4287n4785k5574J6860M8493L8125o1915m7126R2438
$$ 55156 -28258 -75039 8166 42453 -12332 -37906 -21046 27447 65572 3657 -43469 48969
474D8969N5106p7056l6583M1209K8458O295m3301n5756N0031N6684o9780n2534
$$ 48969 104075 27019 -9564 31645 60103 66398 23097 -32659 17372 74056 4276 -48258
486d8258M9707K8432j9290k6922k4750M6078N8506o9684o9030P6402N6328n8570
$$ -48258 1449 29881 10591 -16331 -41081 4997 63503 -6181 -75211 1191 57519 -1051
498a051m9666j011L1718M0565m7813p9805M4389O7280m2706m2227K0125K6419
$$ -1051 -50717 -51728 -20010 20555 -27258 -107063 -62674 4606 -38100 -80327 -60202 -33783
510c3783K9988j2946n3497M3028Q6655m3249o7575M8409N4237r424l1811l3479
$$ -33783 -3795 -16741 -70238 -27210 59445 16196 -51379 -2970 51267 41843 10032 -23447
522b3447K5950O7607l5471p5398M0794N7922k8349l1945m082K0462N6041j7541
$$ -23447 2503 70110 34639 -40759 35 57957 29608 -2337 -6419 14043 70084 52543
534E2543r1390K2323R8084j7688p6626j2287K9171L7437r687p4637l792P0950
$$ 52543 -38847 -16524 81560 63872 -12754 -25041 4130 41567 31880 -42757 -46549 24401
546B4401j9304n9186K7068L0090j7456j1159j9515J0110P1710q540r6677Q210
$$ 24401 5097 -54089 -27021 3069 -14387 -25546 -45061 -34951 36759 28219 -68458 -60248
558f0248R2928J5668m8741m4880P204P8711K2808q7619j6399P9134M400m4147
$$ -60248 32680 48348 -393 -45273 -38069 40642 63450 -24169 -40568 38566 42966 -1181
570a181O704J3029J2279R912m6349j7772P2037J3022p3798j7242L7891K3697L75
$$ -1181 5523 18552 30831 40743 -5606 -23378 48659 61681 -12117 -29359 8532 32229 32604
583C2604m8579k9033P0542K6780q7620j4079Q0413P136n6839k8456J2170N7184
$$ 32604 -15975 -45008 25534 52314 -35306 -49385 31028 38164 -18675 -47131 -34961 22223
595B2223K1655q6275m9219P1474M9651k6063l8181k9994L0109P2208k2473o1194
$$ 22223 43878 -42397 -91616 -20142 29509 3446 -34735 -64729 -34620 37588 15115 -46079
607d6079M4777L9035n3394m814O1006R881m1510m3167L603P7656K6573r6625n0790
$$ -46079 -1302 37733 -15661 -20475 40531 50412 8902 -34265 -30662 46994 73567 -23058 -73848
620g3848O2256M7778k535l6364n7205L0987R2586k6962q2051L6070N9876k8915
$$ -73848 -11592 36186 33651 -2713 -59918 -28931 63655 36693 -45358 -9288 50588 21673
632B1673l9220J593L2705K7266n0243n8425N1063M8727m8549k6010K2141n30J2576
$$ 21673 -17547 -15954 16751 44017 -6226 -64651 -13588 35139 -13410 -39420 -17279 -17809 -5233
645e233J3388l1007J5659N4388l7789n5220N2219O6386k0714p5536m6118O7828
$$ -5233 8155 -22852 -7193 47195 9406 -45814 6405 72791 52077 -23459 -69577 -1749
657a749R6345o1363j21101K3991P8567K925j5204k6262l3769L8905M9535k5856
$$ -1749 94596 33233 -87868 -63877 14690 17615 2411 -23851 -57620 -18715 30820 4964
669D964j0868K9272j7033k4909K7606L9815J2716m9587p1780M9622J10580m0369
$$ 4964 -5904 23368 6335 -18574 9032 48847 61563 11976 -59804 -10182 100398 60029
681F0029j07075J9592O6509Q115j2863k9012j1699N3724J8857n8560r694M9850
$$ 60029 -47046 -27454 39055 47170 34307 5295 -6404 47320 66177 7617 -2077 47773
693D7773J1350l1986m5628o862O8434J5063j00343l2460P2626M416m9633N097
$$ 47773 59123 27137 -18491 -25353 43081 58144 -42199 -74659 -2033 2383 -47250 -42153
705d2153R346j6289p522r149K0683M6409l2207p4353J7825P1630L1835k5879q3698
$$ -42153 -32807 -49096 -56618 -65767 -45084 1325 -30882 -105235 -87410 -15780 16055 -9824 -93522
718i3522l0123J19983Q0538r8492p8673N7298N9156O239j1570k0889M721J9163
$$ -93522 -123645 -3662 76876 -21616 -100289 -42991 16165 22404 10834 -10055 -5334 13829
730A3829r998J7096M1907k8034m7354J6878K6521K1550J7781o1499n5904P9271
$$ 13829 3831 20927 62834 34800 -12554 4324 30845 52395 70176 8677 -47227 32044
742C2044O8161p2827n9274M1456M2020j2332m5865j6318N7861K3288p4437l1213
$$ 32044 100205 27378 -31896 9560 51580 39248 -6617 -22935 34926 58214 -16223 -47436
754d7436N6332K8405j0727k3902m6845J8742Q7964m055p4914N091M1738k180k760
$$ -47436 8896 37301 26574 2672 -44173 -25431 62533 58478 -16436 -11345 30393 28213 25453
767B5453J1234M111j1555m6915o843Q9447K5981j11894n7757O5147O0243O213
$$ 25453 36687 40798 29243 -17672 -24515 64932 90913 -20981 -78738 -13591 46652 52865
779E2865m9752p9940J7640J03059J2366p7204l2036K4350L3821M120m0158n046
$$ 52865 3113 -76827 -59187 43872 56238 -20966 -53002 -28652 5169 9289 -30869 -35915
791c5915L5204l6162m8444N7779M3701o0317l8138K7148K7606K3968p417m3839
$$ -35915 -711 -36873 -85317 -27538 16163 -44154 -82292 -55144 -27538 -3570 -10987 -54826
803e4826J5788N7885o225l1077R221K4308K0361k0768n9775K7892R3230l0070
$$ -54826 -39038 18847 12622 -18455 -9234 15074 35435 14667 -45108 -17216 76014 45944
815D5944j05056N726P2386K5280j8737m8741k2518N3089L7472k5191p238K494
$$ 45944 -59112 -53386 19000 44280 25543 -23198 -45716 7373 44845 19654 12416 14910
827A4910k1728J0989K8340k804M46k2434o2192K5480R8387j5581j04175k4636
$$ 14910 -6818 4171 32511 29707 30153 7719 -54473 -28993 69394 53813 -50362 -74998
839g4998O2862O3283m606p6783k6025P3519L5358l5155q855O525l487J9289m546
$$ -74998 -12136 51147 46541 -30242 -56267 17252 52610 17455 8600 15125 11638 30927 26381
852B6381k8375K9202K2122o0157k2318N7314J8613l6848k9488J601L9250J5936
$$ 26381 -1994 27208 49330 -10827 -33145 24169 42782 5934 -23554 -21953 17297 33233
864C3233m9726r792N4490p636n1466Q943L0890J0330m255n2164l5814P0912N6460
$$ 33233 -16493 -26285 28205 20569 -30897 -21954 8936 19266 15011 -37153 -72967 -2055 54405
877E4405o2171o5552J6538N1886L4156l1285n8207K2463N0141j9539j0976L1765
$$ 54405 -7766 -73318 -56780 -4894 29262 -2023 -60230 -37767 12374 -7165 -18141 13624
889A3624j4228l1610J6709K2270J6744O662n0417l2291O5588N1084m0095m8850
$$ 13624 -604 -32214 -15505 6765 23509 30171 -20246 -52537 13051 64135 24040 -24810
901b4810n877M1213N1121l3681p0656L1539N7672l3403l5237K2642J2584l506
$$ -24810 -30687 10526 61647 27966 -42690 -11151 46521 13118 -22119 523 13107 9601
913I601j2231k6380K1233M6847k6267m5486J8666K9012M656o588k8162J191M2891
$$ 9601 -2630 -29010 -7777 39070 12803 -32683 -14017 14995 19651 13063 -15099 -13908 28983
926B8983j7745m8893L6376M2374m2437l8562J7368L5992K6950l0670o2294K6884
$$ 28983 11238 -37655 -1279 41095 -1342 -39904 -22536 13456 40406 9736 -52558 -25674
938b5674P7657o343n0846j2473J3666L3059J5267m7571k2007M2269l669m1326
$$ -25674 51983 45640 -5206 -17679 -4013 29046 44313 -3258 -25265 17004 13335 -27991
950b7991J5317K4684j9293k1432j0436J8727M6507j5576o4800J7303O5340j442
$$ -27991 -12674 12010 -7283 -28715 -39151 -20424 26083 10507 -54293 -36990 28350 26908
962B6908l1438j3911K286L7000J4497n3216j4201N3491K654m4082n245K0764K2434
$$ 26908 -4530 -18441 -16155 20845 35342 -17874 -32075 21416 24070 -20012 -25257 -4493 17941
975A7941M648m2626j2428O2176J8024m9018m984K9771N174q97j5783j7772L0311
$$ 17941 22589 -20037 -32465 29711 47735 -1283 -6267 23504 28678 27781 11998 -5774 24537
988B4537J0302n4958j0735M9291L20l9801j9877N662M1524K0870n9292l1598O1627
$$ 24537 34839 -20119 -30854 18437 18757 -21044 -40921 -35259 6265 27135 -32157 -63755 -2128
1001b128L2845l4888j9541N356J8655K2932k5234l2612L7365K4139m4223j4024
$$ -2128 30717 -4171 -23712 -18356 299 23231 -2003 -34615 2750 26889 -17334 -31358
1013c1358L4213J1276p627k0421j6459M2204L7835m7241l2450M4584K6441j8550
$$ -31358 2855 14131 6504 -13917 -30376 11828 49663 2422 -30028 14556 40997 22447
1025B2447j7986j1494K0780L1577l7025m2815L8374L1023l4688k4994N341J7321
$$ 22447 4461 -7033 13747 45324 8299 -34516 3858 34881 193 -24801 -19460 -2139
1037b139K2455k3208m4382L1106M6508l0978l1783K0079J6553M609j1241k7945
$$ -2139 20316 -2892 -47274 -16168 30340 -638 -32421 -12342 4211 8820 -2421 -30366
1049c0366K0755M3928l1348m1912L3059L3423j3516j9665j4475J7741M4596j9845
$$ -30366 -9611 34317 2969 -38943 -5884 27539 14023 -5642 -20117 -2376 42220 22375
1061B2375n4557K3410M6335j7160k7802k343R629K5569q705m6724J4616N0219
$$ 22375 -32182 -8772 37563 20403 -7399 -9742 -113 25456 16751 -29973 -15357 34862
1073C4862k1606m0169J3971K1370P408r901l5517O225N1430j2824n3557J1559
$$ 34862 13256 -26913 -12942 8428 15836 5935 -29582 -23357 28073 15249 -38308 -26749
1085b6749L5240k391j4479j9135K260M4283Q62n1824R747N0677m470k5836l044
$$ -26749 8491 6100 -8379 -27514 -25254 19029 19891 -31933 -22186 28491 24021 -1815 -4859
1098d859Q324K7448M266m6624n112N0917l265m3440k179J6796J1694J339l4344
$$ -4859 3465 30913 35179 -11445 -16557 34360 31095 -12345 -14524 2272 13966 15305 -19039
1111a9039j0438N0249Q958n0610q03L6132N210j1000j8630j0706L5737J4039n1379
$$ -19039 -29477 20772 29730 -20880 -21683 14449 19659 8659 -9971 -20677 15060 29099 -22280
1124b2280j4763M1906M742k5547j1973j834K6000J9989l9304j9295N2040J8496
$$ -22280 -37043 4863 9605 -15942 -27915 -29749 -3749 16240 -23064 -42359 9681 28177
1136B8177l6255p010J9069J5443J0168k7963k4951L9931K2967m5826j9204K6681
$$ 28177 -8078 -15088 3981 19424 29592 1629 -23322 16609 39576 -6250 -25454 1227
1148A227R866m347j8340k1605L1849L4081m1380k8284M2254K1738k0671j4297
$$ 1227 11093 6746 -11594 -33199 -1350 32731 -8649 -36933 5321 27059 6388 -7909
1160g909m879J9842K5910l2783l5590L5511K5129l1970j6937Q252J1511J8489
$$ -7909 -12788 7054 32964 181 -35409 102 25231 -6739 -23676 -15424 -3913 14576
1172A4576j6480l5365L1346M3238l0306k7749K5187K0396J776j2832k4258J9538
$$ 14576 -1904 -37269 -5923 37315 7009 -20740 4447 24843 26619 13787 -10471 9067
1184I067L7446k9604l7852K7088K2249j6271j3318j2101P622L5518j4478m7576
$$ 9067 46513 16909 -20943 6145 28394 12123 -1195 -13296 -5674 29844 15366 -32210
1196c2210J8160M1023j5082k4960k139R084K1711q943m1190J3926M1531k3732
$$ -32210 -14050 26973 11891 -13069 -15208 -6124 15587 6644 -34546 -20620 20911 -2821
1208b821l4689J8483J7868K04o625k5977O249M8005o578m7128Q424L4817M386
$$ -2821 -37510 -19027 -1159 -955 -7580 -33557 -27308 20697 14119 -33009 -24585 10232 14618
1221A4618j0009k0567q0M1236J377m7695R508M4090j2846k5175N626P970J6169
$$ 14618 4609 -15958 -16038 25198 26575 -21120 -11612 32478 19632 -5543 83 8053 24222
1234B4222K263l7540m560M4031k085l6189l390J1594J0778L491l2485j1794M7527
$$ 24222 26485 -11055 -15615 28416 26331 -9858 -13248 -1654 9124 12615 -19870 -31664 15863
1247A5863M415n2088J510M1323L574j6121j7745n286L6159J8163m3220j6819L2140
$$ 15863 20278 -31810 -30300 11023 14597 -1524 -19269 -24555 11604 29767 -13453 -30272 1868
1260A868Q458r132m976j3414J2643K4252k5874j6144M3919R735m1445k729L1082
$$ 1868 10326 1194 -3782 -17196 -4553 19699 -6175 -22319 21600 31335 -10110 -12839 18243
1273A8243J7123m938l4802j6021M5777K1238m5926k1727J8317P566M549j1142
$$ 18243 35366 30428 -4374 -20395 25382 46620 694 -21033 -2716 4850 9399 -1743
1285a743l0882J5923L6345k8269k9699L3721K2486j9468j6386p57K4246K3417
$$ -1743 -32625 -16702 19643 -8626 -38325 -4604 17882 -1586 -17972 -18729 5517 28934
1297B8934l2132l0554L5384J8256k9247n979J1333l039Q620o297k3188K6789L4943
$$ 28934 -3198 -33752 1632 19888 -9359 -15338 -4005 -7044 1576 -4721 -27909 -1120 33823
1310C3823l3126l2654K7715L4738O839k9727l9111K7634N4524k5703m8451J4992
$$ 33823 697 -31957 -4242 30496 37335 7608 -31503 -3869 50655 24952 -23499 -8507
1322h507J6659j1443L249k877j1472J0700m247j7893K4677K4152k4506k1480P960
$$ -8507 8152 -3291 -42 -2919 -14391 -3691 -7938 -25831 -1154 22998 -1508 -22988 -15028
1335a5028K2511K9939j8161n6325J7464O1178j6388m5196J0176J7937n43k927
$$ -15028 7483 37422 19261 -37064 -19600 41578 25190 -20006 -9830 8107 7564 4637
1347D637j4856K254K8744q882l1461J2133K3742J843o059k4585j0340M3309J2080
$$ 4637 -10219 -7965 20779 11897 -19564 -7431 16311 18154 12095 -12490 -22830 20479 32559
1360C2559n1640n638L6971r703k4600J0127J2806J554j4764k7155K0191M8479
$$ 32559 -19081 -24719 12252 2549 -22051 -11924 882 2436 -12328 -39483 -19292 29187
1372B9187j6743m6014K391K5901K5598J0739m3217l3218M9714L8159l3629j9355
$$ 29187 12444 -33570 -31179 -5278 20320 31059 -12158 -45376 4338 42497 8868 -10487
1384a0487J5396K789l45K124K932J5535j1208l8933J8535M8663j5825l7997l449
$$ -10487 4909 7698 7353 9477 12409 27944 16736 -22197 -3662 45001 29176 -8821 -12270
1397a2270N764K0818K0425l8688l6712L7713K8246k8227j9029J0430J6207L930
$$ -12270 -6506 14312 34737 -3951 -40663 -2950 25296 -2931 -21960 -11530 4677 8607
1409H607k9809j4014M5429J5051m9181j3296K9517O424J553k468k7361M149L4350
$$ 8607 -21202 -35216 10213 25264 -23917 -37213 -7696 -1272 281 -2187 -29548 -25399 8951
1422H951o647j5814J7514K718j5017L613J4936K2085L516m9543k0872O6838L4166
$$ 8951 2304 -13510 4004 6722 -8295 -4682 10254 32339 35855 -13688 -34560 32278 66444
1435F6444n4645l8381J3129K4097K4227j2075m6090j240L6261K247j0886j295
$$ 66444 11799 -26582 -13453 10644 34871 22796 -23294 -24534 11727 13974 3088 1793
1447A793o916M126N329j3599J4665K5637m0119l6182M3104L0771l2396k3787J242
$$ 1793 -5123 -997 4332 -9267 5398 31035 -9084 -45266 -2162 28609 -3787 -27574 -26332
1460b6332J2017J8639j0078k4885J7229K1442j4760p668P846J0514K2993j0160
$$ -26332 -14315 4324 -5754 -30639 -13410 8032 -6728 -14396 -6550 3964 26957 16797
1472A6797m8167J6588O2548j3298n2804K61K1941J0152L650j9397j2542J4318
$$ 16797 -31370 -14782 47766 34468 -18336 -18075 3866 14018 17668 -1729 -14271 47
1484D7j951m743K5016J574k9411k831J0811J2377K7319j6095o0670R112O3748
$$ 47 -1904 -6647 18369 19943 -9468 -12299 -1488 10889 38208 22113 -38557 -29445 34303
1497C4303J838m5457k2534Q462L2030J1819l4798j2721K7130k436j1891J8355
$$ 34303 36141 -9316 -31850 -23388 8642 20461 -14337 -27058 72 -2364 -14255 4100
1509D100M027j1303N702q339o303L3828P334m3003q351L0590R104j0663j6571
$$ 4100 8127 -3176 2526 -5813 -12116 21712 29046 -13957 -22308 8282 17386 6723 -9848
1522i848n467K5937L652l5447O632M1139j2810l2684N071J4059J8233J0209l8151
$$ -9848 -15315 10622 14274 -21173 -14541 26598 13788 -18896 -13825 234 18467 28676 -9475
1535i475k9202M0678L2308k1691k3917o253J0126K3296n393j9922J4713K735k9562
$$ -9475 -38677 2001 34309 12618 -11299 -17552 -7426 15870 10477 -9445 5268 8003 -21559
1548b1559J3765L7974j2809k9688n724O826L0919J6183m4371l1036L4804K9372
$$ -21559 -7794 30180 17371 -12317 -18041 -11215 19704 35887 -8484 -39520 -4716 24656
1560B4656r101j8874j9351J0490L3211j3424l0310K1216J6385k7873o651J7427
$$ 24656 15555 -3319 -22670 -12180 21031 7607 -22703 -1487 14898 -12975 -19626 -2199
1572b199L775N44j2722k1030K0764K7337k0596j6873J4314M795L396N143j2841
$$ -2199 1576 2120 -10602 -31632 -10868 16469 -4127 -21000 -6686 -1891 1505 6648 -6193
1585f193Q705K3906k4554k5529L6918K7347k7269k5905k425K1832L1902j7152
$$ -6193 2512 26418 1864 -23665 13253 40600 13331 -12574 -14999 6833 38735 21583
1597B1583m5232R783L4847r34q740n961j1373J3611J3694j8680Q92J9811k4017
$$ 21583 -23649 -13866 20981 20047 11307 5346 -6027 7584 21278 2598 3490 23301 -716
1610g16k3946K4456J7776j2907k0973k0422J4272L9648j3484m3665R797K9005
$$ -716 -24662 -206 17570 4663 -16310 -36732 -22460 17188 3704 -39961 -30164 -1159
1622a159J06m067p063n207K3990O953l0127M679L2287q034k2800p75P332J8293
$$ -1159 -1053 -5120 -12183 -17390 6600 13553 -16574 -11895 20392 12358 -10442 -11217 -3885 14408
1636A4408L289l3454n707L7896M26k4818R375J1555m989J379o605l49K5844n877
$$ 14408 17697 -15757 -21464 16432 16858 -7960 1415 12970 7981 9360 2755 2406 28250 22373
1650B2373l9360N008L2476o99j8998k0896p605L3584J7838m1070j8492L1225Q978
$$ 22373 -16987 -11979 20497 19798 800 -20096 -27701 5883 23721 -17349 -35841 -4616 4362
1663D362j1898J672k105L979J1264j4454n327L0125n34l2662K721J9748N961l47
$$ 4362 -7536 -5864 -7969 -3990 7274 -7180 -12507 17618 17084 -15578 -12857 6891 12852 12505
1677A2505j9882j6449L1468K1483l2550j3591K4132P233n993o633q659J7039J6855
$$ 12505 -7377 -23826 7642 29125 -3425 -17016 7116 14349 8356 1723 -6936 10103 26958
1690B6958k9514j7215L0344R237k0137p964k879P530J8927j5636k6137K1184J8100
$$ 26958 -2556 -19771 10573 19810 -327 -8291 -11170 -3640 15287 -349 -26486 -5302 12798
1703A2798k0179o965J2268K954L277r282j5432K3792K2685l0609k0007K5188J5168
$$ 12798 -7381 -14346 -2078 876 4153 -5129 -20561 3231 25916 -4693 -24700 488 15656
1716A5656m219r522j7549J1415L1703j4070k9092J5760J6438r897n425l242J443
$$ 15656 11437 1915 -15634 -4219 27484 13414 -15678 82 16520 6623 1198 -2044 -601
1729f01J6168j0891k7190J8493K5294k1661j7953R869Q460R210n519k6444R292
$$ -601 15567 4676 -22514 -4021 21273 -388 -18341 -8472 -12 9198 3679 -22765 -13473
1742a3473L2059j4611k6040J2078J2566k563m312j5902L047K9210q333l1721J3745
$$ -13473 18586 3975 -22065 -9987 2579 16 -4296 -20198 -17151 12059 3726 -27995 -14250
1755a4250K5570o975q269l015J667K2949J831k8881O131K8745r834j8259N035
$$ -14250 11320 4345 -3924 -6939 -5272 17677 19508 -9373 -3242 25503 15669 -2590 2445
1768B445M078P083m71k5502j74L2990n421l0644N611J7310K565r38j5667o237
$$ 2445 6523 13606 13135 -12367 -12541 20449 15028 -15616 -10005 7305 9870 8932 -6735 -12972
1782a2972K8031M605l1206n24K1861m238r919n847n648J7149P630k9746m615L1928
$$ -12972 15059 19664 -11542 -12066 9795 5557 -4362 -10209 -15857 1292 8922 -20824 -25439 6489
1796F489J201j9574R65P450J1433R984k0384j0430L0505P766k6607k115J2752
$$ 6489 7690 -11884 -10919 -3469 7964 17948 -2436 -12866 17639 25405 -1202 -3317 9435
1809I435J196J958j2777j4940K2563J3372k9140r111K3054M186q541n547p252
$$ 9435 10631 12589 -188 -15128 7435 20807 -8333 -17444 5610 9796 1255 -4292 -11544
1822a1544J4622J6499k4539j5699K4993O819j8865l951JM253J3175j5539k1216
$$ -11544 3078 19577 -4962 -20661 4332 11151 -7714 -11665 -11664 -7411 5764 -9775 -30991
1835c0991K3687J8197k2115q721J2551P985O671p929j7440J8621K3054k2050j5765
$$ -30991 -7304 10893 -11222 -19943 -7392 593 7264 -665 -18105 516 23570 1520 -14245
1848a4245J9839O989o699l094j1121P135K2124j4724k4030J8874J6791j2875p969
$$ -14245 5594 12583 5884 2790 -8331 -1196 20928 6204 -17826 1048 17839 4964 -3005
1861c005r86N499J7226r610k5766J6229K3721j8250j4364R999M514N240k487k0015
$$ -3005 -3991 1508 18734 9124 -16642 -413 23308 5058 -9306 693 5207 10447 7960 -12055
1875a2055O935K6868j1757k1588J0920J1022r49k503j4590J109K5633p557k9456
$$ -12055 -5120 21748 9991 -11597 -677 10345 9396 6893 -7697 -6588 19045 11488 -17968
1888a7968J1278K1012j0795j0203j346Q44J4999j406k5602M672K4393q957j5871
$$ -17968 -6690 14322 3527 -6676 -8022 -7178 7821 6415 -19187 -14515 9878 921 -14950
1901a4950L390J715P285L631k2545k889L0331k879k6766O585J7079J604n01j0895
$$ -14950 -11560 -9845 -2560 1071 -21474 -24363 5968 3089 -23677 -17092 -13 1591 1090 -9805
1915i805k646K5537M615k4871L128J9309m321m784j201o935J2852Q786k6119n457
$$ -9805 -12451 13086 17701 -7170 -4042 15267 10946 6162 4961 -1974 10878 19664 -6455 -11912
1929a1912K7925O30k0964k575O908J1347O019k2110j0389K8111N854k4667j684
$$ -11912 16013 16643 -4321 -6896 12 11359 17378 -4732 -15121 12990 18844 -5823 -7507
1942g507R785j453K255p804j4077J6806J2661k4162q263K1507O529o401o191n143
$$ -7507 2278 825 3080 -4724 -18801 -1995 10666 -13496 -21759 -252 6277 -124 -6315 -11458
1956a1458J7677J6628k1532j2061K5648N718j8155L01M367J325P099j2600j7183
$$ -11458 6219 22847 1315 -10746 14902 20620 2465 2766 7133 8458 15557 2957 -14226
1969a4226K0066J5489k1034j2577Q176R242R529r960k2863J3848K3251j8271j5287
$$ -14226 5840 21329 295 -12282 -4106 5136 14665 4705 -18158 -4310 18941 670 -14617
1982a4617J5970J105j1465n5l267L463J0732j6261j6708K0044J5102j2525q757
$$ -14617 1353 2458 -9007 -9062 -12329 -8866 1866 -14395 -31103 -11059 4043 -8482 -17239
1995a7239l037Q101K3526n836k9062J2841K7538j3000j3923J0570N565J106l970
$$ -17239 -20276 -12175 11351 5515 -23547 -10706 16832 3832 -10091 479 6044 7150 3180
2008C180j2312R525K0174j4124j6243J2351P833N73K791j3716n156K5348k67k6085
$$ 3180 -9132 393 20567 6443 -9800 2551 10384 10957 13748 32 -5124 20224 19957 -6128
2022f128Q208J9123j2124j4079L476R338J0151j2678k6413J2645K7477j0700j7548
$$ -6128 2080 21203 9079 -5000 -1524 7814 17965 5287 -21126 -8481 18996 8296 -9252
2035i252l98k60J0539J3730k0179j5926K1459O038j6511L427R796l442o119o193
$$ -9252 -9650 -9910 629 14359 -5820 -21746 -287 5751 -10760 -7333 2463 -979 -7098 -13291
2049a3291P254K3795r653l1459J0606K8232n579j0415k039n963J1050J4760j7450
$$ -13291 -6037 17758 8105 -23354 -12748 15484 9905 -510 -2549 -8512 2538 17298 -152
2062a52j1789J7987M752j2452k610M577J1302L864k3965o277L3306N024k8765
$$ -152 -11941 6046 10798 -1654 -4264 313 11615 15479 -8486 -14763 18543 23567 -5198
2075e198j003J2964l160K767J127j2727K528P086j1723m92J4853l120j0957o338
$$ -5198 -6201 6763 3603 6370 7497 -5230 -2702 4384 -7339 -7831 7022 3902 -7055 -13393
2089a3393Q35K2912J2728l5477j9001L4997J7809k0437j1004j490J175J3497j311
$$ -13393 -12558 10354 23082 -12395 -31396 3601 21410 973 -10031 -11521 -10346 3151 1840
2102A840j4838K921L862j0376N028J0242l695j91n630j0643K1165K2774k5041
$$ 1840 -12998 -10077 -6215 -16591 -11563 -1321 -5016 -5207 -10837 -21480 -315 22459 -2582
2115b582k1054K1984J4784p361o101n598M350J1939r508r977J6665N117j4179
$$ -2582 -23636 -1652 13132 5771 -330 -5928 -1578 10361 853 -9124 7541 12658 -1521
2128a521o91L239M526J8382n982k9268Q769L0637o323j6948m75Q50L039J862q178
$$ -1521 -2212 1027 5553 23935 17953 -11315 -2546 28091 21768 4820 4345 5195 8234 10096 1918
2143A918K691M594j9433o872K3772N290j6521p110o513P666K9031n055l6533L85
$$ 1918 4609 9203 -10230 -17102 6670 11960 -4561 -11671 -18184 -10518 18513 13458 -23075 -22690
2157b2690K7506N729q871j0367m647J2987M612j3655P453J2717j6761q557J7938
$$ -22690 4816 10545 1674 -8693 -13340 -353 4259 -9396 -1943 10774 -5987 -14544 3394
2170C394O501k520L45j3570r24K6273K644k1922k044R165K828J019r208m269J5586
$$ 3394 9895 7375 7720 -5850 -6774 19499 22143 221 -1823 7342 10170 11189 1981 -2288 13298
2185A3298m801k5683R707K4010j0545j7168k800Q97J4570R887k1794j5353J5073
$$ 13298 8497 -17186 -7479 16531 5986 -11182 -13982 -13085 1485 11372 -10422 -25775 -10702
2198a0702Q687k901n21q458k445J0144m712j399J8842o010k7047R318K7157J391
$$ -10702 -2015 -4916 -5437 -13895 -16340 -6196 -10908 -12307 6535 525 -26522 -17204 9953 11344
2212A1344j0923j3000m261K3598J6599k0341j3772J0835O281M429J312j1596J911
$$ 11344 421 -12579 -16840 6758 23357 3016 -10756 79 6360 10789 12101 505 2416
2225B416J3542j0609p348K0246K842k0059l166Q553O116N762j3865j6184J4519
$$ 2416 15958 5349 -1999 18247 21089 1030 -2136 6417 12533 18295 4430 -11754 2765
2238B765J1569j4524k907O677n065j12J292o755J0512J2244k1319j4308K0607
$$ 2765 14334 -190 -3097 3580 -1485 -1597 -305 -7060 3452 15696 -5623 -19931 676
2251F76J4112p015j2783j3159Q815K3642q566k2165N742P331o062O261L390q862
$$ 676 14788 7773 -5010 -18169 -9354 14288 5722 -16443 -10701 -3370 -9432 -3171 219 -8643
2265h643K195K10p010J4983J3370k0088j3987J2800J2145M370r026k1058N686
$$ -8643 -6448 -6238 -13248 1735 15105 -4983 -18970 -6170 5975 10345 1319 -19739 -14053
2278a4053K5190n820j8718O331N448k416M288j838j765J3516l617j6019J1484
$$ -14053 11137 5317 -13401 -7070 -1622 -4038 250 -1588 -3353 10163 6546 -9473 2011
2291B011J7258o410q918k811k3J3941L574k0123j443J6674p061r883R772L157
$$ 2011 19269 12859 3941 1130 1107 15048 18622 -1501 -2944 13730 6669 -3214 6558 9715
2305I715m131k286q850M780K1272p455k3948L052J5167L352k421j5339j1798J8495
$$ 9715 5584 3298 -5552 -772 20500 13045 -10903 -7851 7316 10668 8247 -7092 -18890 -395
2319c95J0020j9358l386J0238o474m295P154N43L026k55j4456M070K3441k802
$$ -395 9625 -9733 -13119 -2881 -9355 -13650 -6496 -5953 -2927 -3182 -17638 -13568 9873 7071
2333G071j7935Q41O281Q069P815j4194j2564J8440R153j6081o12J0682k324j057
$$ 7071 -10864 -10023 -3742 4327 12142 -2052 -14616 3824 12977 -3104 -3716 6966 4642 3585
2347C585l215l985J3789P153k0787n338J7255J785o396k031p848L432J2946j0425
$$ 3585 370 -3615 10174 17327 -3460 -8798 8457 10242 3846 1815 -6033 -2601 10345 -80
2361h0j1057J3030K509j3357J494N912K298K078j1591r867K0357J2888k0412r444
$$ -80 -11137 1893 4402 -8955 -7461 -1549 749 2827 -8764 -18631 1726 14614 -5798 -15242
2375a5242J0753N211M426j631j4204N185J6619q201q478J1235J615p041J324j510
$$ -15242 -4489 722 5148 3517 -10687 -5502 11117 2916 -5562 5673 7288 247 1571 61
2389F1M462J0407j3576j5361J6883J2281j3486o978K539J492R052k350j5099P807
$$ 61 4523 14930 1354 -14007 2876 15157 1671 -5307 -2768 -1276 7776 5426 -9673 -1866
2403a866J4202j1043p786R029K360j82j232j1780M948J7720j0075j7492R795R135
$$ -1866 12336 1293 -6493 2536 4896 4714 3482 -8298 -3350 14370 4295 -13197 -3402 5733
2417E733m235n03m966k050J3286j462j4309Q424J1669j0875n278L794O84O366
$$ 5733 1498 995 -3971 -6021 7265 5803 -8506 -82 11587 712 -4566 -772 -88 6278
2431F278k214j8862L051J9120o119j4994K883L775L154M206j0263l457J7027q25
$$ 6278 4064 -14798 -11747 7373 1254 -13740 -10857 -7082 -3928 278 -9985 -13442 3585 2760
2445B760j3493P725Q976m312n45k651k860J3428K462j9524R23J7114k805p453
$$ 2760 -10733 -3008 5968 1656 1111 -1540 -4400 9028 11490 -8034 -7111 10003 7198 -255
2459b55M61k012P850O569j4285l384J7266j068j3503L498L242l20K729j0229q708
$$ -255 206 -1806 6044 12613 -1672 -5056 12210 11142 -2361 1137 4379 4059 6788 -3441 -12149
2474a2149J5301L753j8655j707J0234j398o46k912o627J0437R154j5241k436J6414
$$ -12149 3152 6905 -11750 -13457 -3223 -4621 -5267 -8179 -14806 -4369 4785 -10456 -12892 3522
2488C522m56p042J485o54N330R531j1699r502J6683O152j1341m33L175J785Q240
$$ 3522 3066 -3976 -2491 -3145 2185 11716 17 -9485 7198 13350 2009 1576 4751 6536 14776
2503A4776n061j1071J2736R371j4337l246J0270o27k122j555q721O263J1497j3616
$$ 14776 9715 -1356 11380 20751 6414 3168 13438 12811 10689 9134 413 6676 18173 4557
2517D557j1083J1707L762o848j804n042J243J1982q506j4935J1890Q480j2152
$$ 4557 -6526 5181 8943 2095 291 -4751 -3508 8474 -32 -14967 -3077 5403 -6749
2530f749l771M293j184N169k374j3331P736J2999j0656q155Q137J482N32J558
$$ -6749 -10520 -6227 -7411 -2242 -4616 -17947 -10211 2788 -7868 -16023 -7886 -6404 -5872 -4314
2544d314j0566K074J5612p361j3936J0341P507n795j047k118K90J2205k003j4124
$$ -4314 -14880 -12806 2806 -4555 -18491 -8150 -643 -6438 -7485 -9603 -9313 2892 889 -13235
2558a3235P495J2715o795l309K992j619P140L934j4074L69J6871n288j1892O334
$$ -13235 -5740 6975 180 -3129 -137 -1756 5384 9318 -4756 -4387 12484 7196 -4696 1638
2572A638M047N16J629q523j006J6742k132j4478O388Q264m130L18k006o261J0413
$$ 1638 5685 6201 7830 -693 -1699 15043 12911 -1567 4821 13085 8955 9273 7267 1006 11419
2587A1419M438j6799j337J3633l219p376o12j681O891N260j4510k945J6712j379
$$ 11419 15857 -942 -2279 11354 8135 759 147 -1534 5357 10617 -3893 -6838 9874 8495
2601H495j2565M851L001k131L986o237q214J2023M092j5270j484R039j241L91
$$ 8495 -4070 781 3782 1651 5637 -600 -8814 3209 7301 -7969 -9453 -414 -1655 -1264
2615a264m340p283J1375R369j5985l984J6432q58q759K841l11J554O841r261r010
$$ -1264 -5604 -12887 -1512 7857 -8128 -12112 4320 3462 -5297 -2456 -2767 -1213 5628 -3633 -12643
2630a2643J2702L881j0665j073J449L40Q147n300j2493J1916J0795j4269l924
$$ -12643 59 3940 -6725 -7798 -6349 -6009 2138 -3162 -15655 -3739 7056 -7213 -11137
2643a1137J2386n02l537p07n129O378R169j1663q139J2046K674m440J099m595
$$ -11137 1249 747 -2790 -3497 -8626 -2248 6921 -4742 -12881 -835 1839 -2601 -1502 -6097
2657f097N38J4455m226j4158J1301J0923r551l178O034J642M053l044j0650Q834
$$ -6097 -5559 8896 4670 -9488 1813 12736 3185 7 6041 7683 11736 8692 -1958 6876
2671F876J2030j1519o266P800p63j15L942r632k172J4304n674j3731Q287P252
$$ 6876 18906 7387 1121 8921 8158 8043 11985 2353 181 14485 8811 -4920 3367 10619
2685A0619p250l994l350K021J0416o286j6861P707J2109r281l430K665n734M341
$$ 10619 3369 -625 -3975 -1954 8462 2176 -14685 -6978 5131 -4150 -7580 -4915 -10649 -6308
2699f308O869j0608k411J2266m029r595O625M643l3m91r012J985J7879l504j6860
$$ -6308 561 -10047 -12458 -192 -4221 -13816 -7191 -2548 -2581 -3072 -12084 -10099 7780 4276 -12584
2714a2584P071J0625m475R45O77o513O846N542j0565n13J0817l918n656O62j255
$$ -12584 -5513 5112 637 1582 2259 -4254 2592 8134 -2431 -2944 7873 3955 -1701 -1039 -2294
2729b294P835M991j6293m019J9141K52j3784M229M144l786L178j497m273P199
$$ -2294 5541 10532 -5761 -9780 9361 9613 -4171 58 4202 416 3594 2097 -2176 5023
2743E023j29j1875L011Q502k797j324m668p840J4034J1577j7721q690J5910K815
$$ 5023 4894 -6981 -3970 4532 1735 411 -4257 -12097 1937 13514 -4207 -12897 3013 5828
2757E828o681K436j810j582M930m429k807R769k990j0960M045M798j545N992o066
$$ 5828 -853 1583 -227 -1809 3121 -1308 -4115 5654 2664 -8296 -4251 547 -998 4994 -1072
2772a072j3031J3196J4183j2684p542J0062J579p77Q77m547M717N725j1097l889
$$ -1072 -14103 -907 13276 592 -6950 3112 4691 3914 4791 244 4961 10686 -411 -4300
2786d300J3796m98r015J749k762q90J3309l300j5588N713J0811n930k475K655
$$ -4300 9496 8998 -17 1732 -1030 -1920 11389 8089 -7499 -1786 9025 3095 620 3275
2800C275k794J671k026p335R517O568j7599o545J3792J790l719m97r686q20J6694
$$ 3275 481 2152 126 -7209 2308 8876 -8723 -15268 -1476 314 -3405 -3902 -13588 -14408 2286
2815B286M10j3643K013N267K43L517j926l365Q399k978j0870J2328J1017j4037
$$ 2286 2696 -10947 -8934 -3667 -3424 93 -1833 -5198 3201 223 -10647 1681 12698 -1339
2829a339n871Q714J241L534L535j1677k156J3190r66n938K946j247p45L619o691
$$ -1339 -7210 1504 2745 6279 9814 -1863 -4019 9171 8205 2267 5213 3966 3221 6840 149
2844A49j566J3533n706j8166P641J2177n754m603k943n471Q654O777j0693l006
$$ 149 -1417 12116 6410 -11756 -4115 8062 2308 -2295 -5238 -10709 -2055 4722 -5971 -8977
2858h977N267m504J461O417m988q86M304r286K3J9030k264j7733K616J0800L513
$$ -8977 -3710 -8214 -6753 -336 -5324 -6210 -1906 -11192 -11169 7861 5597 -12136 -9520 1280 4793
2873D793K128p504p280J1340O736p643Q51K997o335L799N033o388L730O120j3635
$$ 4793 6921 -583 -7863 3477 10213 2570 3421 6418 83 3882 8915 2527 6257 12377 -1258
2888a258l453J6129J963j0902j927o32L880P648q603q269R144m8r855N909L427
$$ -1258 -4711 11418 13381 2479 552 -80 3800 11448 2845 -5424 3720 3672 -6183 -274 3153
2903C153p182R94o92o859J0115R074j4506p532R896M645K358k000j1223L147J2399
$$ 3153 -4029 -3035 -3727 -10586 -471 8603 -5903 -13435 -3539 1106 3464 1464 -9759 -6612 5787
2918E787n950n444Q669l506q879P501L971l224L412n553q516J2881J0169j0130
$$ 5787 -163 -5607 3062 -444 -9323 -1822 2149 -1075 2337 -3216 -11732 1149 11318 1188
2932A188n993J514K364J0014K28j5072K708J1494p397m454R465l011o190L393
$$ 1188 -4805 -3291 -927 9087 9315 -5757 -3049 8445 1048 -3406 6059 3048 -3142 251
2946B51k256J833R574o890j0891Q679P122l635O32m396m778J0636K450j2608L845
$$ 251 -2005 -172 9402 2512 -8379 300 7422 3787 4419 23 -4755 5881 8331 -4277 -432
2961d32P388j0302l487P882n08m72j621j0077L321J5326n349j1137K752J605K138
$$ -432 6956 -3346 -6833 1049 541 69 -1552 -11629 -8308 7018 1669 -9468 -6716 -5111 -2973
2976b973P132o936q463R856K408q762N978N130q768j244L800J72P774m8j4658
$$ -2973 4159 -2777 -11240 -1384 1024 -7738 -1760 3370 -5398 -6642 -2842 -2670 5104 5056 -9602
2991i602L019J5539k558n426J460l401L480R751p814o659J0553j098r476N986
$$ -9602 -6583 8956 6398 972 2432 -969 2511 12262 4448 -2211 8342 7244 -2232 3754
3005C754L820l812O24m944m096J1910L297j4403r04Q032k481P23J393p957K135
$$ 3754 7574 3762 4386 -558 -4654 7256 10553 -3850 -4754 3278 797 1520 2913 -5044 -2909
3020b909P095q378j856J1200m038q540M050J683K361N182r962p960J3874N932
$$ -2909 4186 -4192 -6048 5152 1114 -7426 -3376 -1693 668 5850 -4112 -12072 1802 7734
3034G734j0172q61K086k534N840J830q775M125N078r121O15R885l531l912Q89
$$ 7734 -2438 -3299 -1213 -3747 2093 3923 -4852 -727 4351 -4770 -4155 5730 2199 -1713 -824
3049h24l672M942R332j0537r470J0638L842o009J483k245k929P593j257q319P282
$$ -824 -4496 446 9778 -759 -10229 409 4251 -1758 -275 -2520 -5449 2144 887 -7432 -150
3064a50N306r539K95N967j041K835K28j0443M390J2484p730p358O137k76j878
$$ -150 5156 -4383 -4088 1879 838 3673 3901 -6542 -2152 10332 2602 -4756 1381 1105 -773
3079g73M582m957k043Q070m425p465R890L827q098j4R12j303Q988l94j3737L506
$$ -773 3809 -1148 -3191 4879 454 -7011 2879 6706 -1392 -1406 -494 -1797 7191 6797 -6940 -3434
3095c434J0821n842l669L138l355J635M514p039k3J0168o563o765Q876K788l891
$$ -3434 7387 1545 -2124 1014 -2341 -706 3808 -3231 -3254 6914 351 -6414 2462 5250 1359
3110A359K038m139k643J1409r6j2408K867O767m903N14K12m975N136L018j0604
$$ 1359 3397 -742 -3385 8024 7928 -4480 -1613 5154 251 765 977 -3998 1138 4156 -6448
3125f448J943J0409n867o087N156m32R46M511q251m473J1738k87r485L755J526
$$ -6448 -4505 5904 37 -6050 -894 -1326 -380 4131 -4120 -8593 3145 2858 -6627 -2872 -1346
3140a346l246M026j760n635Q364K578j1204L111R533m108j923J862m262N406P235
$$ -1346 -4592 -566 -2326 -7961 403 2981 -8223 -5112 4421 313 -1610 252 -4010 1396 8631
3155H631r505m075J0016j013m750L759j920j181O315m360n686R868J983j0643
$$ 8631 -874 -4949 5067 4054 -696 3063 1143 -38 6277 1917 -3769 6099 8082 -2561
3169b561K379N548l342K138j295p643O508O711j0301l002P118l046j500K829o159
$$ -2561 -182 5366 2024 4162 2867 -4776 1732 8443 -1858 -4860 2258 -788 -2288 541 -5618
3184e618Q08P967p040o601R795J277p616K281M58j386O699k343q667P334O309
$$ -5618 -4810 3157 -3883 -10484 -689 588 -7028 -4747 -4289 -5675 1024 -1319 -9986 -2652 3657
3199C657p695M10M757l019L044L549q011L360R962p546n097Q060J242l301K192
$$ 3657 -4038 -3628 1129 -1890 1154 4703 -3308 52 10014 2468 -2629 5431 6673 3372 5564
3214E564m225m75R431l966r183P475L293o466K519M38m307N196J033r491L235
$$ 5564 1339 864 10295 6329 -2854 4621 7914 1448 3967 4405 98 5294 6327 -3164 71
3229G1P798p395m089M177j166P06J998q482K28J0746m677p415O789J078l453M250
$$ 71 7869 474 -3615 562 -604 102 2100 -6382 -6154 4592 -85 -7500 -711 367 -3086 1164
3245A164k217m340Q537L81j0112M336O099n319q92P78m127N799K778j0010P31
$$ 1164 -1053 -5393 3144 3525 -6587 -2251 3848 -1471 -2363 -1585 -5712 87 2865 -7145 -6414
3260f414R559m661m694N443j499r35M919n158l398R059r07q280M090K274k267
$$ -6414 3145 -1516 -6210 -767 -2266 -3201 1718 -3440 -6838 2221 1314 -6966 -2876 -602 -2869
3275b869K979k650n790Q585M302j0528J289Q492l985q36L475l339K423N297o751
$$ -2869 110 -2540 -8330 255 4557 -5971 -4682 3810 -175 -1011 2464 -875 1548 6845 94
3290I4k325Q655j846m998L221j898j221P114m824p846R239L880r439J334M818
$$ 94 -2231 6424 4578 -420 2801 903 -318 6796 1972 -5874 3365 7245 -2194 -860 3958
3305C958k572J665k62n627N309N277q855j398P164k721j926L355n629L02Q700
$$ 3958 1386 3051 2789 -2838 2471 7748 -1107 -2505 4659 1938 12 3367 -2262 -1960 6740
3320F740n351p180Q391K291o597J749O89j308N222k945p352P173M637r155K70
$$ 6740 1389 -5791 2600 4891 -1706 43 732 -576 4646 1701 -5651 1522 6159 -2996 -2726
3335b726M608m249J199L136p902J167Q443n446n506O275K97k487J908l910L4Q647
$$ -2726 1882 -2367 -1168 1968 -5934 -4767 3676 -1770 -7276 -1001 -704 -3191 -1283 -5193 -5159 3488
3351C488m493q640Q323M198p141J870K575m089M394K454p357K861O756n465k057
$$ 3488 -1005 -9645 -1322 2876 -4265 -2395 180 -3909 485 2939 -4418 -1557 5199 -266 -2323
3366b323M132j912J963L003q313K8J1111m508p963O713K003m529K913l18l623
$$ -2323 1809 -103 1860 4863 -3450 -3422 7689 3181 -4782 1931 3934 -595 2318 2000 -1623
3381a623N760k50p282M027M167n257P09O37m476N114M442j0523q10J0244l202
$$ -1623 4137 3887 -3395 632 4799 -458 251 888 -3588 1526 5968 -4555 -5365 4879 1677
3396A677n636M866M23j876L370l128j416P632k197o873M862J765l581L672j784
$$ 1677 -3959 907 1330 -546 2824 -304 -1720 5912 3715 -3158 1704 3469 -112 3560 1776
3411A776p250P412N727j0065j188P557k931j925K748k314J729K286p189K14Q489
$$ 1776 -5474 1938 7665 -2400 -3588 3969 1038 -887 1861 -453 1276 3562 -3627 -3413 5076
3426E076m188o022L985j186k535O527l175q387O688M956p074j22M044j957J585
$$ 5076 888 -5134 -1149 -2335 -4870 1657 -1518 -9905 -3217 1739 -5335 -5457 -1413 -3370 -1785
3441a785j44l445N698L982r435N09Q969l390k386L924m263j480Q673j944o975
$$ -1785 -1929 -5374 324 4306 -5129 -4620 4349 959 -1427 2497 -1766 -3246 5427 3483 -3492
3456c492N387J948m046K989L09j840M305l176o155Q475M315j0601r52O348l371
$$ -3492 1895 3843 -203 2786 3095 1255 5560 2384 -3771 4704 9019 -1582 -2534 3814 443
3471D43KK972o801j139O756k667l086L600k061j583L764k784q57P384m618q184
$$ 443 445 3417 -3384 -4523 2233 -434 -3520 80 -1981 -3564 200 -2584 -3441 3943 -675 -8859
3487h859R000N317p876k0K375k657L969K538o568J191M924l934M1M496l867M86
$$ -8859 141 5458 -2418 -2438 -63 -2720 1249 3787 -2781 -1590 3334 -600 -559 3937 70 556
3503E56L985o657M22J0324m361r356N856L312k930J837k179l913N280P16n249
$$ 556 4541 -2116 -1694 8630 4269 -5087 769 4081 1151 2988 809 -3104 2176 2892 -2357
3518b357L541J610o217K326L148m204K702K945r457P30J0456k595o776K164j52
$$ -2357 1184 2794 -3423 -1097 2051 -2153 549 3494 -5963 -5233 5223 2628 -4148 -1984 -2136
3533b136J202M329m236l697O604j505m487O243P00o198K793J202m648N739L132
$$ -2136 -934 3395 -841 -4538 2066 561 -3926 2317 3017 -3181 -388 814 -3834 1905 5037
3548E037r561p20P855o14k105Q68m005K227N437n140j199O709m049m889O344N10
$$ 5037 -4524 -5244 2611 1997 -108 760 -3245 -1018 4419 -721 -1920 4789 740 -4149 2195 2705
3564B705l580L671k855n606P951L479p422j050K683j337L635R80o535K798L989
$$ 2705 -875 2796 -59 -5665 2286 5765 -1657 -2707 -24 -1361 2274 3254 -3281 -483 3506
3579C506o406J086P064n166m769M179o43k52M584n096o231O804L103m165J308
$$ 3506 -2900 -1814 5250 84 -4685 -506 -1149 -1401 3183 -1913 -8144 -1340 1763 -2402 -1094
3594a094j696k378O725P43o786M547L251o718J236O493l092j540J657m295K488
$$ -1094 -2790 -5168 1557 2300 -4486 61 3312 -3406 -2170 4323 1231 -309 1348 -2947 -459
3609d59O663m625m631M376k38n28M294l920l518O896j036o094O224K395p367o7
$$ -459 6204 1579 -3052 1324 1086 558 4852 932 -2586 4310 3274 -2820 3404 5799 -1568 -1635
3625a635K987j086K731q77q127K877O785m185j980K735l963R86O346m231k730
$$ -1635 1352 266 2997 2120 -6007 -3130 3655 -530 -2510 225 -3738 -2752 3594 -637 -3367
3640c367N757k548m528O525K175m541M83j501p18P247l95q870L372N063l499J421
$$ -3367 2390 -158 -4686 1839 4014 -527 -44 -1545 -2263 4984 4589 -4281 -909 4154 655 2076
3656B076J925n428J183M758m686l7N462m350m151M628K72q11K553o236k527Q020
$$ 2076 4001 -1427 -244 4514 -172 -209 5253 903 -3248 1380 1652 841 3394 -2842 -5369 2651
3672B651J34p280K855J662m255L504J444m715K345J809n969K114O009l978k535
$$ 2651 2785 -4495 -1640 22 -4233 -729 715 -4000 -1655 154 -5815 -3701 2308 -1670 -4205
3687d205K532k767L139N266p156l775P655J99l393L574j289l298M304L53l333
$$ -4205 -1673 -4440 -1301 3965 -3191 -6966 689 888 -2505 1069 -220 -3518 786 1139 -2194
3702b194M737K55o945L647M705l052J103L66n211L844O911o562k762M936j651
$$ -2194 2543 2798 -4147 -500 4205 1153 2256 2622 -2589 1255 8166 1604 -1158 3778 2127
3717B127j095L597k819j585L974l633k915O353j42o292K227J176j923M300j075
$$ 2127 1032 4629 1810 225 4199 566 -2349 4004 3862 -2430 -203 973 -950 3350 2275
3732B275p015L634N652n323n78L312l724L19L016l910J050M379n547l133P422
$$ 2275 -4740 -1106 4546 -777 -1355 1957 -1767 -1448 1568 -2342 -1292 3087 -2460 -5593 1829
3747A829J43l560J735j883j420O964o73o990L500K825l935K046J385m377J994
$$ 1829 1972 -1588 147 -1736 -3156 3808 3135 -3855 -355 2470 -1465 581 1966 -2411 -417
3762d17J396m940K706M910o321k559N344j204p04L172m924j806P361j386m599
$$ -417 979 -3961 -1255 3655 -2666 -5225 119 -1085 -1789 1383 -3541 -5347 2014 628 -3971
3777c971L990J7l437L878k16l683M437l4o367M086M971n276q55L396k533J944
$$ -3971 19 36 -3401 477 261 -3422 1015 981 -5386 -1300 3671 -1605 -2460 936 -1597 347
3793C47M150n838n25N798k596k343M341k025k209L941k316k205N870j185o735
$$ 347 4497 -1341 -1866 3932 1336 -1007 3334 1309 -900 3041 725 -1480 4390 3205 -3530
3808c530L869L341l357J778K11m510M409L356n681K49M315m082R3L611l395k66
$$ -3530 339 3680 323 2101 2312 -2198 2211 5567 -114 135 4450 368 461 4072 677 411
3824D11M083m614k112O422j485n370L250J19j914L701k060m881M718J944n488
$$ 411 4494 -120 -2232 4190 2705 -2665 585 704 -1210 2491 431 -4450 268 2212 -3276
3839c276J494K342l823J155K386m641K178L549n393j294O340j353k548K281j875
$$ -3276 -1782 560 -3263 -2108 278 -4363 -2185 1364 -4029 -5323 1017 -336 -2884 -603 -2478
3854b478m40N537k625m273N486M74m112L525J422l882L418O87m865L814L854o026
$$ -2478 -2918 2619 -6 -4279 1207 1681 -2431 1094 2516 -1366 2052 2739 -2126 1688 5542 -484
3870d84p25M325k328L07J866m712K29N092l712l530N276j676l474L649r18k786
$$ -484 -1209 3116 788 1095 2961 -1751 -1522 3570 -142 -3672 1604 -72 -3546 103 -815 -3601
3886c601M038r29m937M152L275n075P63J470k789L276K057n940J689M976m219
$$ -3601 437 -492 -5429 -1277 1998 -3077 -2314 -844 -3633 -357 1700 -4240 -2551 2425 -1794
3901a794r42M770k397j516L877j986j154N303j903m541M737J439l143K523j073
$$ -1794 -2736 2034 -363 -1879 1998 12 -1142 4161 2258 -2283 2454 3893 750 3273 2200
3916B200l699M742J104o281K403L698m598N9L004l113N51K839m639J0N822k899
$$ 2200 -1499 3243 4347 -1934 469 4167 -431 -372 2632 -481 70 2909 -1730 -1720 4102 1203
3932A203l590L519j175j298L946k919l750N442L34n389L293K245m339J748J540
$$ 1203 -2387 1132 -43 -1341 2605 -314 -4064 1378 1712 -3677 -384 1861 -2478 -730 810
3947H10k930K797K452n579R92N301l709q74L120l415M07M852l937l356N725p76
$$ 810 -2120 677 3129 -2450 -1458 3843 134 -740 2380 -1035 -628 4224 287 -3069 2656 1880
3963A880m321L547K68k685K853r58l698N218J134n804J555L640m342J240K281
$$ 1880 -2441 1106 1374 -1311 1542 584 -3114 2104 3238 -2566 -1011 2629 -1713 -473 1808
3978A808n033R88M872m694j933M873j976j835K797j763n96M578l493l440O001
$$ 1808 -3225 -2237 2635 -2059 -3992 881 -1095 -2930 -133 -1896 -2492 2086 -1407 -4847 1154
3993A154O22n202K619J538l638L040J556m927K305L534m226p9L696k705L15J968
$$ 1154 1776 -3426 -807 731 -2907 133 1689 -3238 -933 2601 -1625 -1704 1992 -713 -398 1570
4009A570l570P56N689m652l293N834m91l444L202m89k797L757J80m147L291J522
$$ 1570 -2000 -1244 4445 -207 -3500 2334 1843 -1601 1601 1112 -1685 2072 2252 -1895 1396 2918
4025B918m142J903J554l266K826J853o226J882N491m431k841N034k055j275L005
$$ 2918 -1224 679 2233 -1033 1793 3646 -2580 -698 4793 362 -2479 2555 500 -775 2230
4040B230k193j677M177k074k944M019j14l469L552j116l886M672J461o624J885
$$ 2230 37 -1640 2537 463 -2481 1538 1424 -2045 1507 391 -3495 1177 2638 -3986 -2101
4055b101M722m017o15K535j847M55K354l726N20M707l571j895N189j817k634M480
$$ -2101 2621 -1396 -2011 524 -1323 -868 1486 -2240 -1720 2987 -584 -2479 2710 893 -1741 2739
4071B739k199l919N654O21n438J984K591k730O36J054k941K871J655n433J616
$$ 2739 540 -3379 2275 2896 -2542 -558 2033 -697 -61 993 -1948 923 2578 -2855 -1239
4086a239M629m401j102M006l391j224N137l267l833N085o7l410K158R5j775K932
$$ -1239 3390 -1011 -2113 1893 -1498 -2722 2415 -852 -4685 400 333 -3077 -919 -824 -2599 333
$$ [...]
8191B3
##END NTUPLES=NMR FID
##END=
