##TITLE=1H_ANY-163B-2
 CD3CN, 8 sc, 
 14.3.2019
##JCAMPDX= 6.0         $$ Bruker NMR JCAMP-DX V2.0
##DATA TYPE= NMR FID
##DATA CLASS= NTUPLES
##ORIGIN= UXNMR, Bruker Analytische Messtechnik GmbH
##OWNER= root
$$ XWIN-NMR		Version 3.5
$$ Thu Mar 14 16:10:43 2019 Russian Standard Time (UT+4h)  she@DPX200
##.OBSERVE FREQUENCY= 200.1315
##.OBSERVE NUCLEUS= ^1H
##.DELAY= (6, 6)
##.ACQUISITION MODE= SIMULTANEOUS
##.ACQUISITION SCHEME= undefined
##.AVERAGES= 8
##.DIGITISER RES= 18
##SPECTROMETER/DATA SYSTEM= spect
##.PULSE SEQUENCE= zg30
##.SOLVENT NAME= CD3CN
##.SHIFT REFERENCE= (INTERNAL, CD3CN, 0, 15.7039)
##AUDIT TRAIL= $$ (NUMBER, WHEN, WHO, WHERE, WHAT)
$$ ##TITLE= Audit trail, XWIN-NMR		Version 3.5
$$ ##JCAMPDX= 5.01
$$ ##ORIGIN= Bruker BioSpin GmbH
$$ ##OWNER= she
$$ F:/spectra/data/she/nmr/H-F/1/audita.txt
$$ ##AUDIT TRAIL=  $$ (NUMBER, WHEN, WHO, WHERE, WHAT)
(   1,<2019-03-14 16:09:42.09 +0400>,<she>,<DPX200>,
      <created by zg, POWCHK disabled, PULCHK disabled
       configuration hash MD5:
       00 E9 B6 7A A2 85 ED C7 34 08 36 98 17 FE 4E 26
       data hash MD5: 16K
       13 E6 72 15 5E 99 85 48 14 CC F4 8A CD 8D 79 FB>)
$$ ##END=
$$ 
$$ hash MD5
$$ FE 2A 4C F6 C7 E7 B3 C2 84 87 49 2D AF A7 41 56
##$RELAX= 
##$RELAX= 
##$RELAX= 
##$RELAX= 
##$RELAX= 
##$RELAX= 
$$ Bruker specific parameters
$$ --------------------------
##$DU= <F:/spectra>
##$EXPNO= 1
##$NAME= <H-F>
##$PROCNO= 1
##$TYPE= <nmr>
##$USER= <she>
##$AMP= (0..31)
100 100 100 100 100 100 100 100 100 100 100 100 100 100 100 100 100 100 
100 100 100 100 100 100 100 100 100 100 100 100 100 100 
##$AQSEQ= 0
##$AQ_mod= 1
##$AUNM= <au_zg>
##$AUTOPOS= <>
##$BF1= 200.13
##$BF2= 200.13
##$BF3= 200.13
##$BF4= 200.13
##$BF5= 200.13
##$BF6= 200.13
##$BF7= 200.13
##$BF8= 200.13
##$BYTORDA= 1
##$CFDGTYP= 0
##$CFRGTYP= 5
##$CHEMSTR= <none>
##$CNST= (0..31)
1 1 145 1 1 1 1 1 1 1 1 1 1 1 1 1 1 1 1 1 1 1 1 1 1 1 1 1 1 1 1 1 
##$CPDPRG= <>
##$CPDPRG1= <>
##$CPDPRG2= <>
##$CPDPRG3= <>
##$CPDPRG4= <mlev>
##$CPDPRG5= <mlev>
##$CPDPRG6= <mlev>
##$CPDPRG7= <mlev>
##$CPDPRG8= <mlev>
##$CPDPRGB= <>
##$CPDPRGT= <>
##$D= (0..31)
0 1.2 0 0 0 0 0 0 0 0 0 0.03 0 0 0 0 0 0 0 0 0 0 0 0 0 0 0 0 0 0 0 0 
##$DATE= 1552565381
##$DBL= (0..7)
120 120 120 120 120 120 120 120 
##$DBP= (0..7)
150 150 150 150 150 150 150 150 
##$DBP07= 0
##$DBPNAM0= <>
##$DBPNAM1= <>
##$DBPNAM2= <>
##$DBPNAM3= <>
##$DBPNAM4= <>
##$DBPNAM5= <>
##$DBPNAM6= <>
##$DBPNAM7= <>
##$DBPOAL= (0..7)
0.5 0.5 0.5 0.5 0.5 0.5 0.5 0.5 
##$DBPOFFS= (0..7)
0 0 0 0 0 0 0 0 
##$DE= 6
##$DECBNUC= <off>
##$DECIM= 24
##$DECNUC= <off>
##$DECSTAT= 4
##$DIGMOD= 1
##$DIGTYP= 9
##$DL= (0..7)
0 120 120 120 120 120 120 120 
##$DP= (0..7)
150 150 150 150 150 150 150 150 
##$DP07= 0
##$DPNAME0= <>
##$DPNAME1= <>
##$DPNAME2= <>
##$DPNAME3= <>
##$DPNAME4= <>
##$DPNAME5= <>
##$DPNAME6= <>
##$DPNAME7= <>
##$DPOAL= (0..7)
0.5 0.5 0.5 0.5 0.5 0.5 0.5 0.5 
##$DPOFFS= (0..7)
0 0 0 0 0 0 0 0 
##$DQDMODE= 0
##$DR= 18
##$DS= 0
##$DSLIST= <SSSSSSSSSSSSSSS>
##$DSPFIRM= 0
$$ [...]
##$SUBNAM2= <"">
##$SUBNAM3= <"">
##$SUBNAM4= <"">
##$SUBNAM5= <"">
##$SUBNAM6= <"">
##$SUBNAM7= <"">
##$SUBNAM8= <"">
##$SUBNAM9= <"">
##$SW= 24.9337058887773
##$SWIBOX= (0..15)
0 0 2 0 0 0 0 0 0 0 0 0 0 0 0 0 
##$SW_h= 4990.01996007984
##$TD= 16384
##$TD0= 1
##$TE= 0
##$TE2= 300
##$TE3= 300
##$TEG= 300
##$TL= (0..7)
0 120 120 120 120 120 120 120 
##$TP= (0..7)
150 150 150 150 150 150 150 150 
##$TP07= 0
##$TPNAME0= <>
##$TPNAME1= <>
##$TPNAME2= <>
##$TPNAME3= <>
##$TPNAME4= <>
##$TPNAME5= <>
##$TPNAME6= <>
##$TPNAME7= <>
##$TPOAL= (0..7)
0.5 0.5 0.5 0.5 0.5 0.5 0.5 0.5 
##$TPOFFS= (0..7)
0 0 0 0 0 0 0 0 
##$TUNHIN= 0
##$TUNHOUT= 0
##$TUNXOUT= 0
##$USERA1= <user>
##$USERA2= <user>
##$USERA3= <user>
##$USERA4= <user>
##$USERA5= <user>
##$V9= 5
##$VALIST= <valist>
##$VCLIST= <CCCCCCCCCCCCCCC>
##$VD= 0
##$VDLIST= <DDDDDDDDDDDDDDD>
##$VPLIST= <PPPPPPPPPPPPPPP>
##$VTLIST= <TTTTTTTTTTTTTTT>
##$WBST= 1024
##$WBSW= 4
##$XGAIN= (0..3)
0 0 0 0 
##$XL= 0
##$YL= 0
##$YMAX_a= 266282
##$YMIN_a= -214451
##$ZGOPTNS= <>
##$ZL1= 120
##$ZL2= 120
##$ZL3= 120
##$ZL4= 120
##$ABSF1= 10
##$ABSF2= 0
##$ABSG= 5
##$ABSL= 3
##$ALPHA= 0
##$AQORDER= 0
##$ASSFAC= 0
##$ASSFACI= 0
##$ASSFACX= 0
##$ASSWID= 0
##$AUNMP= <proc_1d>
##$AZFE= 0.1
##$AZFW= 0.1
##$BCFW= 1
##$BC_mod= 2
##$BYTORDP= 1
##$COROFFS= 0
##$CY= 11.3945322036743
##$DATMOD= 1
##$DC= 2
##$DFILT= <>
##$DTYPP= 0
##$F1P= 18.9103706918063
##$F2P= -1.10871071338519
##$FCOR= 0.5
##$FTSIZE= 0
##$FT_mod= 4
##$GAMMA= 1
##$GB= 0.15
##$INTBC= 1
##$INTSCL= 1
##$ISEN= 128
##$LB= 0.24
##$LEV0= 0
##$LPBIN= 0
##$MAXI= 10000
##$MC2= 0
##$MEAN= 0
##$ME_mod= 0
##$MI= 1.114404
##$NCOEF= 0
##$NC_proc= 0
##$NLEV= 6
##$NOISF1= 3.799351
##$NOISF2= 2.8
##$NSP= 1
##$NTH_PI= 0
##$NZP= 0
##$OFFSET= 15.70392
##$PC= 1
##$PHC0= -9380.617
##$PHC1= 13.40026
##$PH_mod= 1
##$PKNL= yes
##$PPARMOD= 0
##$PSCAL= 0
##$PSIGN= 0
##$REVERSE= no
##$SF= 200.130013532006
##$SI= 16384
##$SIGF1= 3
##$SIGF2= 2
##$SINO= 400
##$SIOLD= 16384
##$SREGLST= <1H.CDCl3>
##$SSB= 0
##$STSI= 0
##$STSR= 0
##$SW_p= 3612.71676300578
##$SYMM= 0
##$S_DEV= 0
##$TDeff= 0
##$TDoff= 0
##$TI= <>
##$TILT= no
##$TM1= 0
##$TM2= 0
##$TOPLEV= 0
##$USERP1= <user>
##$USERP2= <user>
##$USERP3= <user>
##$USERP4= <user>
##$USERP5= <user>
##$WDW= 1
##$XDIM= 8192
##$YMAX_p= 0
##$YMIN_p= 0
$$ End of Bruker specific parameters
$$ ---------------------------------
##NTUPLES= NMR FID
##VAR_NAME=  TIME,          FID/REAL,        FID/IMAG
##SYMBOL=    X,             R,               I
##VAR_TYPE=  INDEPENDENT,   DEPENDENT,       DEPENDENT
##VAR_FORM=  AFFN,          ASDF,            ASDF
##VAR_DIM=   8192,          8192,            8192
##UNITS=     SECONDS,       ARBITRARY UNITS, ARBITRARY UNITS
##FACTOR=    0.0002004,     1,               1
##FIRST=     0,             0,               0
##LAST=      1.6414764,     0,               0
##MIN=       0,             -214451,         0
##MAX=       1.6414764,     266282,          0
$$ Real data points
##PAGE= N=1
##DATA TABLE= (X++(R..R)), XYDATA
$$ [...]
1282c367M150M837r64n466k175M074L959k014n721j805M061L353k998m673N29
$$ -3367 783 5620 4656 -810 -2985 1089 5048 3034 -2687 -4492 -431 2922 -76 -4749 -4220
1297d220M455J550l012k093K298L744k6l192q99L491K685k267m191j17L935K086
$$ -4220 235 1785 -1227 -3320 -1022 2722 2696 -496 -1395 2096 4781 2514 -1677 -1794 2141 4227
1313D227l573n472J00N824K995n090o258J857P788L374n638o476K613Q840K868
$$ 4227 654 -4818 -4718 1106 4101 -989 -7247 -5390 2398 5772 134 -6342 -3729 5111 7979
1328G979o758o412L074P672J513o517o167K240O732J238o324n237K914O389P69
$$ 7979 1221 -5191 -2117 5555 7068 551 -5616 -3376 3356 4594 -1730 -6967 -4053 2336 3105
1343C105n557l555M128O313m07o154j745N897M745l423o364n6O287L220n377p191
$$ 3105 -2452 -6007 -1879 4434 4027 -2127 -3872 2025 6770 3347 -3017 -3073 3214 6434 1057 -6134
1359f134J191P618K710o616p231K464R015L751p029p950L062J0818L919q333q460
$$ -6134 -4943 2675 5385 -1231 -8462 -5998 3017 6768 -261 -8211 -5149 5669 9588 1255 -7205
1374g205L358J0594L115q848q756L020R806K272q505p456L081Q372K266o604n968
$$ -7205 -3847 6747 9862 1014 -7742 -4722 5084 7356 -1149 -8605 -5524 2848 5114 -1490 -7458
1389g458L098P877J920n811m283L551O408J73n884l179M324M810k448o623r12
$$ -7458 -4360 3517 5437 -374 -4657 -1106 5302 5475 -409 -3588 736 5546 3098 -3525 -4437
1404d437N454L099m430n793R79O538K992m897n599K179P468K918n030n913J427
$$ -4437 1017 4116 -314 -6107 -5128 1410 4402 -495 -6094 -3915 3553 6471 1441 -4472 -3045
1419c045P352L657n671p427R35P453L204n749p149O96O882L332m710n634J198
$$ -3045 4307 7964 2293 -5134 -4199 3254 6458 709 -6440 -5744 1138 4470 -240 -5874 -4676
1434d676N859K599k867l287O48L388K012j397k300j28J417M00q60j042l25p4n15
$$ -4676 1183 3782 915 -2372 -1724 1664 3676 2279 -21 -149 1268 1668 808 -234 -559 -633 -1148
1451a148p11M18J303j13k117n56K776K690r82l021m00L346K945j528l885q24L107
$$ -1148 -1859 -1441 -138 -251 -2368 -2924 -148 2542 1560 -1461 -1861 1485 4430 2902 -983 -1807 1300
1468A300K074j875l235p96J580J531o31j942n99J207J183K9k18L21M84J27k0N45
$$ 1300 3374 1499 -1736 -2532 -952 579 -52 -1994 -2593 -1386 -203 -174 -392 -71 413 540 520 1065
1486A065J279R5k133j739J728K831p52m356k490K759M439m79n502l050M149O055
$$ 1065 2344 2439 306 -1433 295 3126 2374 -1982 -4472 -1713 2726 2247 -3255 -6305 -2156 3899
1502C899k24n716l208M185O423M19o006m326L528O352J90o231m528K899N610M44
$$ 3899 3675 -2041 -5249 -1064 5359 5778 -228 -4554 -1026 5326 5516 -715 -5243 -2344 3266 3710
1518C710n821l948L181N480k05m867k054L671M405q04m267q93M294L076k766m513
$$ 3710 -2111 -6059 -2878 2602 2397 -2470 -4524 -853 3552 2748 -1519 -2412 1882 4958 2192 -2321
1534b321M79M612J599m383m729J460N642J397n686m887L141P079J344o144m962
$$ -2321 -1842 2770 4369 -14 -4743 -3283 2359 3756 -1930 -6817 -3676 3403 4747 -1397 -6359
1549f359L636P965J713p015n708L749P930J073p252n943L063P473J126p150n454
$$ -6359 -2723 5242 6955 -60 -5768 -2019 5911 6984 -268 -6211 -3148 4325 5451 -1699 -7153
1564g153L286O940P77n758m044L357N978O90m877k753L437M436n44m330j700K949
$$ -7153 -3867 3073 3850 -1908 -5952 -2595 3383 4073 -804 -3557 -120 4316 3772 -558 -2258 691
1580F91K925j811m163q01L601J974k959l584R00M103J686l113l410J840N048J374
$$ 691 3616 1805 -2358 -3159 442 2416 -543 -4127 -3227 876 2562 -551 -3961 -2121 2927 4301
1596D301l953l470K213M876P99m418m011J860M835N68m799l617K188M296N53l745
$$ 4301 348 -3122 -909 3967 4766 348 -3663 -1803 3032 3600 -1199 -4816 -2628 1668 2221 -1524
1612a524k699K065L948N80k866j598K004K644k0k146j011J432J377j192j990R5
$$ -1524 -4223 -2158 1790 2370 -496 -2094 -90 2554 2534 388 -623 809 2186 994 -996 -901
1628i01J519j12k068r34J436J740o84k304k29K861K281j568k759N85L131J457
$$ -901 618 506 -1562 -2496 -1060 680 -4 -2308 -2537 324 2605 1037 -1722 -1137 1994 3451
1644C451j897k807R2K646J323k273k922J98K398J156j857k360L02K670J444j797
$$ 3451 1554 -1253 -1161 1485 2808 535 -2387 -2189 209 1365 -492 -2852 -2550 120 1564 -233
1660b33j876J249K716M83k008j225J478K059n29k697r18K174J425j822k847n1
$$ -233 -2109 -860 1856 2339 331 -894 584 2643 2114 -583 -1501 673 2098 276 -2571 -2622
1676b622K723J479k029l032P16L909J795k779l077J453M282J398l292l649J471
$$ -2622 101 1580 -449 -3481 -2765 1144 2939 160 -2917 -1464 2818 4216 924 -2725 -1254
1691a254M570P38m495l507K167M239l9m310k669K521M257k63l959j622L215L454
$$ -1254 3316 4054 -441 -3948 -1781 2458 2419 -1891 -4560 -2039 2218 1955 -2004 -3626 -411 3043
1707C043o62l269j087K845K806j158l674p98K799J983j962l340l97K935J884k201
$$ 3043 2381 -888 -1975 870 3676 2518 -1156 -1954 845 2828 866 -2474 -2871 64 1948 -253
1723b53l225N09L807J658k522k611J194L701J389k808k901J241L692O61l503k885
$$ -253 -3478 -2969 838 2496 -26 -2637 -1443 2258 3647 839 -2062 -821 2871 3532 29 -2856
1739b856J336L503L12l593k813J994L955K3l794j846K958L688n53l586j146L350
$$ -2856 -1520 1983 2295 -1298 -4111 -2117 1838 1861 -1933 -3779 -821 2867 2314 -1272 -2418 932
1755I32K986j671l721j88L141J531k417l080L97K791R83k600k348J308K860N28
$$ 932 3918 2247 -1474 -1662 1479 3010 593 -2487 -2090 701 1684 -916 -3264 -1956 904 1432
1771A432k324j516J707K841K69k540j428J990K501p00k859j137J912J937j127
$$ 1432 -892 -2408 -701 2140 2409 -131 -1559 431 2932 2232 -627 -1764 148 2085 958
1786I58k910p65K264J793j302k379n7K399J836j016k198j06K739J749j600k473
$$ 958 -1952 -2717 -453 1340 38 -2341 -2398 1 1837 821 -1377 -1483 1256 3005 1405 -1068
1802a068L1K593J316k293k917M67L137P66l181k461J890L309k21l121j271K707
$$ -1068 -1037 1556 2872 579 -2338 -1871 1266 2032 -1149 -3610 -1720 1589 1368 -1753 -3024 -317
1818c17L011q30l239l51L062K001j714k917o5K560J374k036l042L49K713J079
$$ -317 2694 1864 -1375 -1726 1336 3337 1623 -1294 -1359 1201 2575 539 -2503 -2154 559 1638
1834A638k311k254Q39L033Q71k277j954J590L215Q7k551j342J830K044m75k350
$$ 1638 -673 -2927 -2088 945 1816 -461 -2415 -825 2390 2477 -74 -1416 414 2458 1983 -367
1850c67j221J324J727o04k207r75J322J730j20j982j033J750K528l06k646o25
$$ -367 -1588 -264 1463 859 -1348 -2323 -1001 729 609 -1373 -2406 -656 1872 1566 -1080 -1705
1866a705K544K168j169k984l86K818J731k430l138O15L009O90k684k171J237K941
$$ -1705 839 3007 1838 -1146 -1532 1286 3017 587 -2551 -1936 1073 1763 -921 -3092 -1855 1086
1882A086N54k701j575K092K924k50k707j021K217K312r83l012p55K550J632j947
$$ 1086 1640 -1061 -2636 -544 2380 2130 -577 -1598 619 2931 1948 -1064 -1819 731 2363 416
1898D16k747K19K505R97j990k049R28K557O33j879j280J265K127L37j659j331
$$ 416 -2331 -2112 393 1390 -600 -2649 -1721 836 1469 -410 -1690 -425 1702 2039 380 -951
1914i51R00J869J73k008j660R07J764J21k020j543R64K261K86k216j245J756K533
$$ -951 -51 1818 1991 -17 -1677 -770 994 1115 -905 -2448 -1484 777 1063 -1153 -2398 -642 1891
1931A891j70k296j038K031K311p08l006p08K453J893j969k917K9K793J321k417
$$ 1891 1721 -575 -1613 418 2729 2021 -985 -1693 760 2653 684 -2233 -2204 589 1910 -507
1947e07k616J060L365O62k768j851K060L024K0k783j492K010K666o85k988j079
$$ -507 -3123 -2063 1302 1964 -804 -2655 -595 2429 2449 -334 -1826 184 2850 2165 -823 -1902
1963a902J904J932r28k606r26J860J896q51k122k69J889J501o45j366j77J383
$$ -1902 2 1934 1006 -1600 -2526 -666 1230 379 -1743 -2012 -123 1378 733 -633 -810 573
1979E73J196n09j392l47J051P07n46j484n30R07J137o48j776j14J740J039j197
$$ 573 1769 1260 -132 -479 572 1279 733 -751 -1281 -374 763 115 -1661 -1775 -35 1004 -193
1996a93j468O32K210P75j810j568J372K279k24k334j180J553J768p69k361q66
$$ -193 -1661 -1029 1181 1956 146 -1422 -50 2229 2005 -329 -1509 44 1812 1043 -1318 -2184
2012b184J794J568j062j946j8J846J171q95j318M50J678M42j203o40Q42P86o12
$$ -2184 -390 1178 116 -1830 -1848 -2 1169 274 -1044 -594 1084 1526 323 -317 525 1311 699
2029F99j085P7Q10M8j194p52P55J005m37j203o6J189R25l53q92q7J036R46k20
$$ 699 -386 -309 501 549 -645 -1397 -642 363 -74 -1277 -1343 -154 771 418 -474 -561 475 1421 1201
2048A201j039n96O63Q74j36j141j016M09J281L3j435r05Q25J477K1j087p40J115
$$ 1201 162 -434 229 1103 967 -174 -1190 -781 500 533 -902 -1807 -982 495 516 -571 -1311 -196
2066a96J571j14j585m09J474J206r74j791j27J849P66j938k132J025K538K41k806
$$ -196 1375 1261 -324 -733 741 1947 973 -818 -945 904 1670 -268 -2400 -1375 1163 1404 -1402
2083a402j553K018L035l31l172j224K897K990j185l383p70K772K410j397l342
$$ -1402 -2955 -937 2098 1767 -1405 -2629 268 3258 2073 -1310 -2080 692 3102 1705 -1637
2098a637q17K555K110j325k962o02K258J965q68k271n79K192J924o68k119l44
$$ -1637 -2454 101 2211 886 -2076 -2678 -420 1545 677 -1594 -2173 19 1943 1275 -844 -1188
2114a188J831J525p59k092n96J743J365j178k231j70J856J189j349k267M20K587
$$ -1188 643 2168 1409 -683 -1279 464 1829 651 -1580 -1750 106 1295 -54 -2321 -1901 686
2130F86J239j999k203J105L194P15k645k323J570L288K99l484k352K170L165m65
$$ 686 1925 -74 -2277 -1172 2022 2737 92 -2231 -661 2627 2926 -558 -2910 -740 2425 1960
2146A960l474j778K351K798m68l024j097K357K391n39k248n49J532J650l71j696
$$ 1960 -1514 -3292 -941 1857 1389 -1635 -2732 -375 2016 1477 -771 -1320 212 1862 1491 -205
2162b05p08J076J028m65j231n59N26P63j47r10l39Q08P07k90o20J71Q32M29l37
$$ -205 -913 163 1191 726 -505 -1064 -538 225 78 -832 -1171 -363 344 54 -566 -395 437 866 529
2181E29p38J52R19M41q60j148K19J036L72j203j240L56J519L89j400r89R36J536
$$ 529 -209 -57 862 1303 443 -705 -486 550 922 -281 -1521 -1165 354 743 -657 -1646 -710 826
2199H26J64j235n60Q43J174j30j054k03O36K06m65l33J93%n20m34M84N60j76r69
$$ 826 990 -245 -805 38 1212 1082 28 -175 461 667 202 -131 62 62 -458 -892 -408 152 -24 -993
2219i93j91J235R53o26j176J73J380R40q41j565J2J553O35j168j490J33J252N76
$$ -993 -1184 51 1004 378 -798 -625 755 1695 854 -711 -699 854 1489 321 -1169 -1036 216 792
2237G92r49j177J60J163O12p93o64K81J000M64m32o71J37Q69L20p76p75J18Q19
$$ 792 -157 -1334 -1174 -11 601 -192 -856 -575 425 889 457 -214 -77 792 1112 336 -439 -321 498
2256D98K53r90j071L66J438J74j512r72J218J809m1j832r23J541K187l88k356
$$ 498 751 -239 -1310 -944 494 668 -844 -1816 -598 1211 1170 -662 -1585 -44 2143 1755 -601
2273f01j024J863K003p62k673r72J997K115j028k824n24K322J908j285k278l0
$$ -601 -1625 238 2241 1479 -1194 -2166 -169 1946 918 -1906 -2430 -108 1800 515 -1763 -1793
2289a793K279J493j165j975K71J979P58j192j478R6J424N54j186j365K35J327
$$ -1793 486 1979 814 -1161 -890 1089 1847 655 -823 -727 697 1251 65 -1300 -1065 262
2305B62L88j016j112M84J459N26j043j172P56J696L57j524j062Q51J583M4j769
$$ 262 650 -366 -1478 -994 465 991 -52 -1224 -468 1228 1585 61 -1001 -150 1433 1477 -292
2322b92j236R93J707k12j889j021J210J743j04j903r01J626J860m59j811m73J645
$$ -292 -1528 -535 1172 960 -929 -1950 -740 1003 899 -1004 -1905 -279 1581 1122 -689 -1162 483
2339D83J286p47j650j68J291Q54j085j301J78J134K15j018n71M50Q84jo58k65
$$ 483 1769 1022 -628 -796 495 1349 264 -1037 -859 275 490 -528 -1099 -649 235 234 -424 -689
2357f89P29P51k15o18j04N75M51k91p28k62O05L56n01p17j20N02M16k47o79NO91
$$ -689 40 791 576 -42 -146 429 880 589 -139 -401 204 560 59 -658 -778 -276 140 -107 -786 -781 -90
2378i0O42l31m81O6O74L96l09o73K8O67J74o83o73K91O48j63p95l11N27P32k95
$$ -90 552 221 -260 -194 480 876 567 -106 -78 589 763 80 -593 -302 346 183 -612 -923 -396 336 41
2399D1q66J26J111M51o58o84L70R59K51r22q27N33J003j24j249o23P91R50l63
$$ 41 -825 -699 412 863 205 -479 -109 850 1101 179 -648 -115 888 764 -485 -1108 -317 633 270
2418B70j161l50R86R24k49j105j4R99P47m17r66n8R45N40o17j006L2Q58K52o16
$$ 270 -891 -1241 -255 669 420 -685 -699 300 1047 630 -336 -394 551 1091 474 -532 -500 358 610 -6
2438fq34p4Q20M92o21o58J51J040L84n95o97L45J042L46q85p94M53J014j6j109
$$ -6 -840 -914 -94 398 -223 -881 -730 310 694 99 -598 -253 789 1135 250 -544 -91 923 907 -202
2458b02p39N30R41k5j256o14R32J143k95j131k72J033R56l63j101j66J177O34
$$ -202 -941 -411 530 505 -751 -1365 -433 710 415 -716 -988 45 1001 638 -463 -629 548 1182
2476A182o02j123L0R39M03p92j032J73R88K98q69o03M86R08J22o48m10M28Q36
$$ 1182 580 -543 -513 426 829 37 -995 -822 166 464 -405 -1008 -522 386 508 -140 -550 -122 714
2495G14R9q20k94M80N17j26p95k80M68M71k10q14k58O33N21k61o09l9O85N62k87
$$ 714 813 -7 -301 179 696 570 -225 -505 -37 434 224 -590 -848 -215 306 45 -564 -603 82 644 357
2516C57o96P1Q18M04n72p05J12P47P6p21o42K61P48M4q84l11N53O83j23o26k02
$$ 357 -339 -268 550 954 382 -323 -211 536 612 -109 -751 -490 258 302 -582 -893 -340 343 220 -406 -608
2537f08O64Q03l51o67q9O21M98m48p07r7N84L76o87p68K48P41J55n51n34L83Q17
$$ -608 56 859 508 -159 -248 373 871 423 -284 -381 203 579 -108 -876 -628 113 268 -283 -817 -434 383
2558C83J33o40m13N70P59j31o64k55M07N14j24p59l55M56O23m02p51j52O42M75
$$ 383 516 -124 -537 33 792 661 -3 -258 149 663 539 -220 -575 -119 504 102 -649 -801 -159 316
2578C16k05o29j27P63O22l79o73N7Q37K68n24o28L9O66J91p29n99L14O96q4n76
$$ 316 111 -518 -645 118 740 361 -312 -255 582 850 326 -302 -263 403 594 -135 -734 -420 276 192 -384
2599c84l88L16P76J4n82k65N97N78j62n58j96N59N06l88p70o1N42K91n04n36o7
$$ -384 -772 -456 320 334 -248 -513 84 662 500 -58 -254 305 811 423 -347 -408 134 425 -79 -615 -682
2620f82P04K56m30n68L17O98K46n88l33M01O24%n66l47K88N54j29p52k79L86N45
$$ -682 22 278 -152 -720 -403 295 541 -47 -380 21 645 645 79 -268 20 574 445 -307 -586 -200 345
2641C45k99n81j74N21N16k28o16j3P30M41k90n85L9O27L80n42o89J39O93J56q08
$$ 345 46 -535 -709 -188 328 100 -516 -529 201 642 352 -233 -194 433 813 271 -418 -279 414 570 -238
2662b38m62K72O52oo43l24M03P44o2o55j09N16O00q8o98k17N69N94l49q57k20
$$ -238 -700 -428 224 218 -425 -749 -346 398 336 -319 -428 88 688 600 -98 -315 254 848 499 -358 -578
2683e78N59N46m33p64k17Q14N96n31o62J12Q41M24m70o48K21P54K76n51o36K35
$$ -578 -19 527 94 -670 -887 -73 523 -8 -670 -558 283 707 237 -411 -190 564 840 289 -347 -112
2703a12M85J50n86n89J93O94Q4o75m13M02O19M5n52k78M76O63p0n97k69N83N27
$$ -112 373 523 -63 -652 -459 235 319 -356 -769 -367 252 297 -255 -533 -57 606 536 -61 -330 253 780
2724G80l65o77j19M19M26l55n85k48O32L97l04n06j8N69L61j63m50j02O30L62
$$ 780 415 -262 -381 38 464 109 -476 -724 -92 305 1 -505 -523 46 407 244 -206 -308 322 684
2744F84m00m77R2M43N6k00n73L3L54Q5l00k47J48L15J8j39n1J74K61p6j94M0K43
$$ 684 284 -193 -101 342 398 198 -375 -342 12 97 -203 -450 -302 13 31 -108 -159 15 276 200 6 46 289
2767B89rp0j94k1J30O5k55k02M2J75P8l28l6J64K40p2j33M3J72K73j60j75N6J86
$$ 289 280 210 16 -5 125 190 -65 -267 -225 -50 28 -300 -336 -172 68 -4 -137 -94 78 351 191 16 72 258
2791B58N8k41j68Q9K20j10l50j91L27K31k62k44M0L91K02j45l82J08N02K84l85
$$ 258 316 75 -93 -4 216 106 -244 -435 -108 123 -139 -383 -343 48 250 105 -277 -169 333 617 232
2812B32m56J26M62J53l80n79J0O10K29n92n30K49O06K55n91m87L53P75J07n95
$$ 232 -224 -98 364 517 137 -442 -432 178 407 -185 -715 -466 140 395 -196 -683 -330 445 552 -43
2832d3l32L73N99k4n07n05K98O55r1p43l86M89O14k44n93l23O65O43k83p14j2
$$ -43 -375 -2 597 573 66 -439 -141 514 423 -320 -706 -217 397 153 -440 -763 -98 545 262 -452 -464
2853d64P08M95l74o98j4O59N43n43q01r4P99L50m98p69lP51M67m63p81J54Q44
$$ -464 244 739 365 -333 -347 312 855 312 -489 -583 216 566 68 -701 -704 47 514 51 -730 -576 268
2874B68L73m79o62K09P66M00o05p07J04O97K23o24n62K01N83J45n67m45K83O50
$$ 268 641 162 -500 -291 475 875 270 -437 -333 364 587 -37 -599 -398 185 330 -237 -682 -399 251
2894B51J03n34k96L69N57R9n47l25M10M77j46n93k08L39L90j52n61j90K96N31
$$ 251 354 -180 -476 -107 450 549 2 -323 87 564 418 -175 -383 -44 346 194 -367 -557 -261 270
2914B70j96n44mM61L09j25l29j73M89L98k38m09j04L66J99j47m38j33L10J27j34
$$ 270 74 -470 -474 -13 296 171 -158 -331 158 556 318 -91 -195 171 370 223 -215 -348 -38 89 -45
2935d5k56M3K23L3l5Pp8J69J26pr7M6Pqo6N4J2j73n7rM0L5r3j12L6J85l6n0O4
$$ -45 -301 -258 -35 -2 -37 -30 -108 61 187 180 83 129 136 128 62 116 128 -45 -102 -111 -71 -36 -129 -241 -205 -20 -56 -106 -42
2964d2N3J13J11j55j5J2J86n7j61j41J12R8q6j98j59L04R0j54k69R8L64J01j69
$$ -42 11 124 235 80 65 77 263 206 45 -96 16 114 28 -170 -329 -25 65 -89 -358 -260 104 205 36
2987C6k20P3M19J83l51l13J59K64J28l63l71J84L32J29m65l41K10M61J37m44k92
$$ 36 -184 -111 308 491 140 -173 -14 250 378 15 -356 -172 160 289 -176 -517 -307 154 291 -153 -445
3008d45K71N28J08m82l30M19M52q7m69k66K77L75q5n31j58L65K65j11m53q2K82
$$ -445 -174 354 462 -20 -350 69 521 434 -35 -301 -24 351 266 -265 -423 -58 207 96 -357 -439 -157
3029a57M79q5l57j73L40M93k34m36q4M25L34l55n42MM42K26k97n17J23L81K34
$$ -157 322 237 -120 -293 47 540 306 -130 -214 211 545 190 -352 -348 94 320 23 -494 -371 10 244
3050B44k78l95O8O13R5k83l24J34M48J49k94m21J15M21J17n38k78K19K94l6k76
$$ 244 -34 -429 -361 252 347 64 -260 -126 322 471 177 -244 -129 292 409 -129 -407 -188 106 70 -206
3071b06j77K25L66n9l57j1L35J36l1k20m5J16J66J5k97j21J74Q4j11j87p5J57
$$ -206 -383 -158 208 149 -208 -219 116 252 221 1 -44 72 238 253 -44 -165 9 93 -18 -205 -280 -123
3093a23J85j02k30J13K57K7p8k18J17K38op8j73R3J70l3k69l4J03P9j00l6j39
$$ -123 62 -40 -270 -157 100 127 49 -169 -52 186 180 102 -71 22 192 159 -110 -144 -41 38 -62 -98 -237
3116b37J09J90q5j41N7J93N2n8r3K0J79R2k71j14J79J68j69k50M0O0R3n7j83M5
$$ -237 -128 62 -23 -164 -107 86 138 80 -13 7 186 278 7 -107 72 240 71 -179 -139 -79 14 -43 -226 -181
3140a81J93L3o9j57J50J73M7q7j20N4J79N6j81k22R5J45m5k04j09N8K21m3j35
$$ -181 12 45 -24 -181 -31 142 189 102 -18 36 215 271 90 -132 -37 108 63 -141 -250 -192 29 -14 -149
3163a49j04K33J60j1j12j40J60K01mk72l6J92J45j69k62n4J99J05j01k51lL21
$$ -149 -253 -20 140 129 17 -123 37 238 234 -38 -74 118 263 94 -168 -222 -23 82 -19 -270 -273 48
3185D8M3j28j29KL03R1j26k94J91J70P8k14k13J66K24o4k41k14J42K77m7k53j31
$$ 48 91 -37 -166 -164 139 230 104 -190 1 171 249 35 -178 -12 212 148 -93 -307 -165 112 65 -188 -319
3208c19K97J38o9j36J1J59J42k1j98k7J48Q1m5j99j38J16R2p0j30o2J72J21j06
$$ -319 -22 116 47 -89 -78 81 223 202 4 -23 125 206 161 -38 -176 -60 32 -38 -168 -230 -58 63 -43
3231d3j18N4J75J19j03j46P1K12lk29k0P2O9K6k77o0J51K10k26p2m5R1J76m8j51
$$ -43 -161 -107 68 187 84 -62 9 221 218 -11 -31 41 110 136 -141 -201 -50 160 -66 -138 -183 -92 84 36 -115
3256a15rJ80J52j56n5j2J85qj06o5j2J63n6j58q0J02M4kj04j04J39J24J8p0l7
$$ -115 -124 56 208 52 -3 -15 170 162 56 -9 -21 142 86 -72 -152 -50 -6 -8 -112 -216 -77 47 65 -5 -42
3281d2J35Q7n7j05n1Q4Q0o0j71RJ46k7m0j71%J34N8l2q4J9J64R2j24m6k1J62J3
$$ -42 93 180 123 18 -33 51 131 71 -100 -91 55 28 -12 -183 -183 -49 9 -23 -107 -88 76 168 44 -2 -23 139 152
3308A52r7j54J10J57r6k14l5J42N2m6j48p5K43J21j12j21J05P8J05p1j15M0J25
$$ 152 55 -99 11 168 72 -142 -177 -35 17 -29 -177 -252 -9 112 0 -121 -16 62 167 96 -19 21 146
3331A46kq1j40pJ28m6j46pQ4Q5l7j40M8P2J52l5j13M3J03nL4q9q1L7R1r8j06l1
$$ 146 144 63 -77 -84 44 -2 -148 -155 -71 14 -23 -163 -115 -43 109 74 -39 4 107 102 136 47 -34 3 94 -4 -110 -141
3359a41J62M8q2j41L9J62J2j24q8P9J73J8j52M6pJ66m4j19r3Q1J60p2j46m4N0
$$ -141 21 69 -13 -154 -115 47 59 -65 -153 -74 99 117 -35 11 4 170 126 7 -86 -5 155 83 -63 -107 -57
3384e7P2k7k00J10Q4J25j27r4P6J35K6o4n8L1M5J00j74j47P2J61q3m2k01O8K00
$$ -57 15 -12 -212 -102 -18 107 -20 -114 -38 97 123 59 1 32 77 177 3 -144 -72 89 6 -36 -237 -169 31
3409C1k2j06n0N0K33L9j65p7J09J82Jk32j1R4N5j65j17lJ01J36qk48n1J85J10
$$ 31 9 -97 -147 -97 136 175 10 -67 42 224 225 -7 -18 76 131 -34 -151 -154 -53 83 75 -173 -224 -39 71
3434G1m4j20O2Q2J81j10j90M2K03jj26j62Q5J32ok16j06R6K08o4j57k5N4J71k6
$$ 71 27 -93 -31 51 232 122 -68 -26 177 176 50 -112 -27 105 99 -117 -223 -127 81 17 -140 -165 -111 60 34
3459C4o2j16J48J29J2r9j43J30lJ15j77p9J19M0k4j02l8J8J16J8p3m0J20N2L4
$$ 34 -28 -144 4 133 145 46 -97 33 30 145 -32 -111 8 48 24 -78 -116 -98 18 36 -37 -77 43 95 129
3484A29k00Q5Q4q%n6j9K6J9k0j15l0R0q9M1K5p5J28Qp7KJ05mKOo6N3Jk1J5m2L5
$$ 129 -71 14 98 90 90 34 15 41 60 40 -75 -105 -15 -104 -63 -38 -113 15 23 -54 -52 53 49 51 57 -9 44 45 24 39 -3 32
3516C2j13P7j27P1%L0k0K2nL2K1n4J08L4m9l9j8j4J24l5j32P4n6P8n4r9K4O3L
$$ 32 -81 -4 -131 -60 -60 -30 -50 -28 -33 -1 20 -34 74 108 59 20 2 -12 112 77 -55 19 -37 41 -13 -112 -88 -25 -22
3545b2j04N9QO5Q8j13q0J24Q1K5r9n0l9J39Q0k22p9J42K6l9j7r3L5O9J2j3j33
$$ -22 -126 -67 -59 6 94 -19 -99 25 106 131 32 -18 -57 82 162 -60 -139 3 29 -10 -27 -120 -85 -16 -4 -17 -150
3572a50J13J91l5j45m1O1J66Nk45n8J72J22j06k03o6J69N7jj57k0J62J40n2j82
$$ -150 -37 154 119 -26 -67 -6 160 165 -80 -138 34 156 50 -153 -219 -50 7 6 -151 -171 -9 131 79 -103
3596a03R6J42K9m6j42l9J41M1r0j41R7Q9J5r7j34M6O4J09j06o8J08R6J24j69j27
$$ -103 -7 135 164 118 -24 -63 78 119 29 -112 -15 74 89 -8 -142 -96 -32 77 -29 -97 11 107 231 62 -65
3621f5L8R1R4j44j06k9J92K9j08j76N4J56N2j01q0k4K25J0j34p5J07Q8k6j6j50
$$ -65 -27 64 158 14 -92 -121 71 100 -8 -184 -130 26 78 -23 -103 -127 98 108 -26 -101 6 94 68 52 -98
3646i8J40N8j6q7%n5Q1K9j07k5J9R0M3j15nO4J04l5j9K1m5N3l8l7n2L0K0k5M6
$$ -98 42 100 84 -3 -3 -58 23 52 -55 -80 -61 29 72 -43 -48 16 120 85 66 87 42 95 57 20 -32 -2 18 -7 39
3675C9j11L8k7ojOM2K2N9Oj25P9KJ5J1l7K2l6M8l0p5O7k6n1PJK6j4k7J19l5m4
$$ 39 -72 -34 -61 -67 -68 -62 -20 2 61 67 -58 21 23 38 49 12 34 -2 46 16 -59 8 -18 -69 -62 -61 -35 -49 -76 43 8 -36
3707c6L2lJ02k7j24N0J21k7n4j0j13J14L6j36k8JJ39Kq7j05J78P6k3j17L5K4J03
$$ -36 -4 -7 95 68 -56 -6 115 88 34 24 -89 25 61 -75 -103 -102 37 39 -48 -153 25 101 78 -39 -4 20 123
3734A23m7l5Lm8O3o6J4m0o3M5K6k0j8nO3O3o0j01J08L9L0k9p8oO2L8k5j19K0M8
$$ 123 76 41 44 -4 59 -7 7 -33 -96 -51 -25 -45 -63 -68 -5 58 -2 -103 5 44 74 45 -33 -39 23 61 36 -83 -63 -15
3764a5J3k7q5O3J01k3m8r7Q4J69j05q4l5J62N7n9n1n3J59qj59m7J3O6QMm2PnR4
$$ -15 -2 -29 -114 -51 50 27 -21 -118 -34 135 30 -54 -89 73 130 71 20 -33 126 118 -41 -88 -75 -9 -1 3 -39 -32 -37 57
3794E7o2q1L2R0M1or8M3K6J7Mo2l5M3J2j7q1p8J02P2l4q2O5j7R8r2Q0j07P1R4
$$ 57 -5 -86 -54 36 77 71 -27 16 42 59 63 1 -34 9 21 4 -77 -155 -53 19 -15 -97 -32 -49 49 -43 37 -70 1 95
3824I5m3p6OR8o3n0n1M6N8n3n3N7m1N6n2k3M0J13n0l8Q1Npj7p0M3M8o5o4M7K4
$$ 95 52 -24 -18 80 17 -33 -84 -38 20 -33 -86 -29 -70 -14 -66 -89 -49 64 14 -24 57 62 55 38 -32 11 59 -6 -70 -23 1
3855Al3N0o4%P1j4n6O0k8O2j7j9K5j4M8p1k5K4Q0q8J1k2NN6j28O6k6Pj2K4J5M9
$$ 1 -32 18 -46 -46 25 11 -45 15 -13 49 32 13 38 24 72 1 -24 0 80 -8 3 -19 -14 42 -86 -20 -46 -39 -51 -27 -12 37
3887C7L9l9k3O3k0q0K4J05o9m7p7O3K5K6k2j28R9J21j01o2j1J06N8j02j0L8N8
$$ 37 76 37 14 77 57 -23 1 106 37 -10 -87 -24 1 27 5 -123 -24 97 -4 -66 -77 29 87 -15 -25 13 71
3914G1Q2q2j34O9N3j9j1j40P1O6m2j6l8K8O5n6mK5kL3l2jR0p0k8M6L4K2p7n9J27
$$ 71 153 71 -63 6 59 40 29 -111 -40 26 -16 -32 -70 -42 23 -33 -37 -12 -14 19 -13 -14 76 6 -22 24 58 80 3 -56 71
3945G1l7m3q4P4J02l4r2nN4J7q7L9P6K0m0p3J5O8Q0k7j65l0J58L7j25n5K0J25
$$ 71 34 -9 -93 -19 83 49 -43 -48 6 23 -64 -25 51 71 31 -42 -27 41 121 94 -71 -101 57 94 -31 -86 -66 59
3973E9N0j56p0J21M9j9r2J05K9rr6j5P5l4M6l2j04J46j0r1j8O5L5j36K4J19J6
$$ 59 109 -47 -117 4 53 34 -58 47 76 67 -29 -44 31 -3 43 11 -93 53 43 -48 -66 -1 34 -102 -78 41 57
4000E7l5k7n4P8R1o0j46J10O1n4p4k8Q6j0m9m4K5J03nj27N3M5j8mn5Q2L9k0L6
$$ 57 22 -5 -59 19 110 50 -96 14 75 21 -53 -81 5 -5 -54 -98 -73 30 25 -102 -49 -4 -22 -26 -81 1 40 20 56
4029E6j73Q6J25j43n8Q2O7Qo8m9Q9L2o4p7L0J49m0o3j9PL2J3m8l7J13J9q7o4L3
$$ 56 -117 -31 94 -49 -107 -25 42 50 -18 -67 22 54 -10 -87 -57 92 52 -11 -30 -23 9 22 -26 -63 50 69 -18 -82 -49
4058d9R4l4q5M2%K8J6m7P1l9k4L0pL9K4p9j3PP2m8j07J04Q1o1o9lQ0k2J9o4O3
$$ -49 45 11 -74 -32 -32 -4 12 -35 36 -3 -27 3 -4 35 59 -20 -33 -26 46 -2 -109 -5 76 15 -54 -57 23 1 20 -44 19
4089A9Q2o0o9j6O3K0%n9qP5m2j0n2jJ11mj15kO0J12p2j02N0l6R0j4l1K6j5L8j30
$$ 19 101 41 -28 -44 19 39 39 -20 -28 47 5 -5 -57 -58 53 49 -66 -68 -8 104 32 -70 -20 -56 34 20 -11 15 0 38 -92
4120i2P3R1m6j03LK2O7L0j08L3M0LM2j19P9NO6j08R5pn1k2m4R3L6p7p8P1O9n4
$$ -92 -19 72 26 -77 -74 -52 15 45 -63 -30 10 13 55 -64 15 20 86 -22 73 66 15 -7 -51 42 78 1 -77 -6 63 9
4150Il8K9j6R2j13l5L9P6J4q0l6J04K2q4K2jL6N2n6r8P9Jpl8mL5k1K2n3M5K8J9
$$ 9 -29 0 -16 76 -37 -72 -33 43 57 -23 -59 45 67 -17 5 4 40 92 36 -62 17 18 11 -27 -31 4 -17 5 -48 -3 25 44
4182D4o5MQ5J2q0o6O8K7l8K1k4oL1J6q3R3k8rj4R1j9K3r8n7J13R4n9r4O2Mk3K
$$ 44 -21 -17 68 80 0 -66 2 29 -9 12 -12 -18 13 29 -54 39 11 2 -12 79 60 83 -15 -72 41 135 76 -18 44 48 25 27
4214B7p3J0N6m8l3lN5N6q3n2J17K7m1l3kN9K0on6P4k4K0j01mjP9n7j00Q7K2J5
$$ 27 -46 -36 20 -28 -61 -64 -9 47 -36 -88 29 56 15 -18 -20 39 59 53 -3 71 47 67 -34 -38 -39 40 -17 -117 -30 -8 7
4245Gl4m8J09O8j37M3j0L0l1j9%LO2r6M5k2R6o7m0L0l1Q6J2n1J5J4K6m9j03J23
$$ 7 -27 -75 34 102 -35 8 -2 28 -3 -22 -22 -19 43 -53 -8 -30 66 -1 -41 -11 -42 44 56 5 20 34 60 11 -92 31
4275C1m0R4j01N7k7lj7k4j5N6N7n9o7N4L8q3L6J7Oj4L0J2QL7p6oJ2M0p8n2N4o
$$ 31 -9 85 -16 41 14 11 -6 -30 -45 11 68 9 -58 -4 34 -49 -13 4 10 -4 26 38 46 83 7 1 13 53 -25 -77 -23 -29
4307b9M9L7j33J7N6L4j29K8R9J8j2r3M9N4Pp3Qn2Q1l6q3J10L7k5m5j2k1M8k4K6
$$ -29 20 57 -76 -59 -3 31 -98 -70 29 47 35 -58 -9 45 52 -21 -13 -65 16 -20 -103 7 44 19 -26 -38 -59 -11 -35 -9
4337iM2J5m0l4M5LJ5J4q2J2J04r0l9l3O1Q7j35K5L0l1N5o4M0k9R6n7n8Q1l1KJ0
$$ -9 33 48 8 -26 19 22 37 51 -31 -19 85 -5 -44 -77 -16 71 -64 -39 -9 -40 15 -49 -9 -38 58 1 -57 24 -7 -5 5
4368Ek3J9L8j9o4MM7j4K8k7K1nj15L4K0J8O0k1k2N6p0O7j7k2O5n8J4n2L5P5r9
$$ 5 -18 1 39 20 -44 -40 7 -7 21 -6 15 10 -105 -71 -51 -33 27 6 -16 40 -30 37 20 -2 63 5 19 -33 2 77 -22
4399b2L1q9J03j3l1kK8K9j3J8j14J06N5o2N8r7O8m2q9Q9o2RK6p8J34q3K5qn4Q5
$$ -22 9 -80 23 10 -21 -23 5 34 21 39 -75 31 86 24 82 -15 53 11 -78 11 -51 -42 -16 -94 40 -43 -18 -26 -80 5
4429EJ4o1P1J7j1Mm5qJ0P8p7m3KOR8m7p5M4J0J0l4M3l0P1rol1rN4l0n4N1o0k3
$$ 5 19 -42 29 46 35 39 -6 -14 -4 74 -3 -46 -44 -38 60 13 -62 -18 -8 2 -32 11 -19 52 43 37 6 -3 51 21 -33 18 -42 -65
4463f5O0K2rk0k7pJ00p7rK0J1j9k0K0LJ20o2o6k3P8Lm6j7O0K1l2o0o4R9rRn7L1
$$ -65 -5 17 8 -12 -39 -46 54 -23 -32 -12 -1 -20 -40 -20 -17 103 41 -25 -48 30 33 -13 -30 30 51 19 -41 -105 -6 -15 -6 -63 -32
4496c2K3M8j5k8Jj8Q2o4Ql3O2j6j7m3m4J6J3rR8o7K3N0jj0J0m8L5PJ3k5kl6K4
$$ -32 -9 39 24 -4 -3 -21 61 -3 5 -28 34 18 1 -42 -86 -70 -57 -66 32 -35 -12 38 37 27 37 -11 24 31 44 19 17 -19 5
4529El7K7L5m8PjJ9K6k0o8N7k1M0J6mk9l2JoK9JJ2l6J22r8p0Q3m8Qj3j1j3L6N7
$$ 5 -32 -5 30 -18 -11 -12 7 33 13 -55 2 -19 21 37 33 4 -28 -27 -33 -4 -3 9 -27 95 -3 -73 10 -38 -30 -43 -54 -67 -31 26
4563B6p0M5O8n3J8K1l3mJj4N2j09o1J51p2R9j68N9J8j4jO6m9M4m8P9kl9P0n7m9
$$ 26 -44 1 69 16 34 55 22 18 19 5 57 -52 -113 38 -34 65 -103 -44 -26 -40 -41 25 -24 20 -28 51 49 10 80 23 -26
4594b6n0O7RJ4o0O4l8J9k3N8k8Mk9K2MLm1K7J9M3j04J8Q1j5l6k5O0p3j7K6K9N1
$$ -26 -76 -9 0 14 -46 18 -20 -1 -24 34 6 10 -19 3 7 10 -31 -4 15 58 -46 -28 53 38 2 -23 37 -36 -53 -27 2 53
4626E3j24O5n2M5nN2L5m8j9l2M2O4o8lJ0n3L5N1q5j7%Q5p5P4l6j3P4k9k4m0N0
$$ 53 -71 -6 -58 -13 -18 34 69 21 2 -30 12 76 8 5 15 -38 -3 48 -37 -54 -54 31 -44 30 -6 -19 55 26 2 -38 12
4657A2K6k1o3K0Q5k6m7K9l7l8R3m3j3O5m6j8K9lM5np0M1Nj5l3M7n4N2m8OJ9m5
$$ 12 38 17 -46 -26 59 33 -14 15 -22 -60 33 -10 -23 42 -4 -22 7 4 49 44 -26 15 20 5 -28 19 -35 17 -31 -25 -6 -51
4689e1K3L8k1J2M0k0l5P1k9J0j25J53k8J0mm4J1L1nm4j0l1qP5p7K7O3n3J4j9k1
$$ -51 -28 10 -11 1 41 21 -14 57 28 38 -87 66 38 48 44 0 11 42 37 -7 -17 -48 -56 19 -58 -31 32 -21 -7 -26 -47
4720d7J8J1K9j7lP7r7QM8l9J8j5j2Lq6R2l4L7j6mJ0j3J8N8k1n0J1MO7l9K6rj5
$$ -47 -29 -18 11 -6 -9 68 -29 -21 27 -12 6 -9 -21 -18 -104 -12 -46 -9 -25 -29 -19 -32 -14 44 23 -27 -16 -12 55 16 42 33 18
4753A8K9m3l8K7M4j7%o3M9k0M8K0m7l3M3J2K4n3NK1m1N4m4J2K0j18N1K8M1p8J18
$$ 18 47 4 -34 -7 37 20 20 -43 6 -14 34 54 7 -26 17 29 53 0 5 26 -15 39 -5 7 27 -91 -40 -12 29 -49 69
4784F9j07k2K4M2J5K0q3M3K9l1j1%J4J1k0qnJ9k8KJ04o9J0rJ8on8J5J4Rj8l1Q6
$$ 69 -38 -60 -36 6 21 41 -42 1 30 -1 -12 -12 2 13 -7 -15 -20 -1 -29 -27 77 8 18 9 27 21 -37 -22 -8 1 -17 -48 38
4817C8l2j7M5Qm8P7k1m1n1N4J3p8N9l8O8qjJ7m5jK0o6N6l7L8n2mN9o0k1O3J5m7
$$ 38 6 -11 34 42 -6 71 50 9 -42 12 25 -53 6 -32 36 28 27 44 -1 -2 18 -48 8 -29 9 -43 -47 12 -48 -69 -6 9 -38
4850c8N1l6lP2n0l9%N8pn0J06m2j6Q8r3nLpJ4m6L8Mn5O1J9o4M1J8m5k2J02j06
$$ -38 13 -23 -26 46 -4 -43 -43 15 8 -42 64 22 6 94 1 -4 -1 -8 6 -40 -2 2 -53 8 27 -37 4 22 -23 -45 57 -49
4882d9L8M0L1r9L4K2j9M0j8K7o6j8M6l5P1m9ol7P6l0m1L0K4n4OQ4k1p0L3M9j39
$$ -49 -11 29 60 -39 -5 17 -2 38 20 47 -19 -37 9 -26 45 -4 -10 -47 29 -1 -42 -12 12 -42 -36 48 27 -43 -10 39 -100
4913a00J35m8j6L2k4M4l3Kk6%K2jk3J7N0k6m7K8L2n0K6k3L3n0O6Rj8J0r1O7M5
$$ -100 35 -13 -29 3 -21 23 -10 -8 -34 -34 -12 -13 -36 -19 31 5 -42 -14 18 -32 -6 -29 4 -46 20 29 11 21 -70 -3 42
4944D2o4JM4LK7qqo4K1K4j9lk4P7p6N9q3ON6l9J6K9m7N5o1L3O2r6L9kM1l8l1O2
$$ 42 -22 -21 23 26 53 45 37 -27 -6 18 -1 -4 -28 49 -27 32 -51 -45 11 -28 -12 17 -30 25 -36 -3 59 -37 2 0 41 3 -28 34
4978C4J7j08Q7r7M0L2l1k0O5j2l6J1O0k6qRLm2n4J26k7l7K7m8J9K8l5N4p4J09
$$ 34 51 -57 30 -67 -27 5 -26 -46 19 7 -29 -18 42 16 8 17 20 -22 -76 50 23 -14 13 -35 -16 12 -23 31 -43 66
5008F6oj15J8O6Kn9k4L6K3R7q5n9k0P0No0J5QO6l2m1K0m6L2Nk8J4J5oL3M9o6n0
$$ 66 60 -55 -37 29 31 -28 -52 -16 7 104 19 -40 -60 10 15 -45 -30 -22 44 12 -29 -9 -55 -23 -18 -46 -32 -17 -23 10 59 -7 -57
5041e7R9mn3N5j09J22q6J9jl5K6l9J02m8NJ0L2k3p0M4J8K2Kp8O6M3Kl3n2N0J5
$$ -57 42 38 -15 40 -69 53 -33 -14 -15 -50 -24 -63 39 -9 -4 6 38 15 -55 -11 7 29 31 -47 19 62 64 31 -21 29 44
5072D4l3J6n8N4l1m6K2K6k6O0%l8J8l5O9p6Q2l2m1N8l1m6K9p1N6M2l1m0J5O7M6
$$ 44 11 27 -31 23 -8 -54 -32 -6 -32 28 28 -10 8 -27 42 -34 48 16 -25 33 2 -44 -15 -86 -30 12 -19 -59 -44 23 69
5103F9K1j00l0OJ6K4pk8Q4n5O1p2k3K4MJ9q3J6Q0k7q2M0K8Q9k6j44R2j0L8M9k3
$$ 69 90 -10 -40 -34 -18 6 -1 -29 55 0 61 -11 -34 -10 -6 13 -70 -54 26 -1 -83 -43 -15 74 48 -96 -4 -14 24 73 50
5134E0q8M6L0k3j5k0l7jL6K3J7m9M4k2rJ8K6l3J5K5j08J3R0k5n3M1k9J0L2j0l5
$$ 50 -38 8 38 15 0 -20 -57 -58 -22 1 18 -31 13 -9 -18 0 26 -7 8 33 -75 -62 28 3 -50 -9 -38 -28 4 -6 -41
5165d1N0k9J6Pj0l1qP1m4j6L0M1l4Nk4k0L0pK3K1nk2J7Lj4o4K2k1NmQ8j9q0O0
$$ -41 9 -20 -4 3 -7 -38 -46 25 -19 -35 -5 36 2 7 -17 -37 -7 -14 9 30 25 3 20 23 9 -55 -33 -54 -49 -53 35 16 -64 -4
5199dj5j9J06o4n1N8m5M4oM5l5r0Q3N7p4NK2l1R6j27JL5KJ0ko6lQ7k3o0Q3J7o2
$$ -4 -19 -38 68 4 -47 11 -34 10 4 49 14 -76 7 64 -10 -5 17 -14 82 -45 -44 -9 -7 3 1 -65 -68 19 -4 -64 19 36 -26
5232b6K6k3J2kN0K2r9P8p9N3L0l8n1N0k4Q5p6J5j3J5l5M1m0lK6j0L7j4J3MJ8j6
$$ -26 0 -23 -11 -13 37 59 -40 38 -41 12 42 4 -47 3 -21 64 -12 3 -10 5 -30 11 -29 -32 -6 -16 21 7 20 24 42 26
5264B6m4K4l2M0mN6o7%M2j31Q6n6P5o0L6j3O0j6jln6P7n8k8O7o1J5K8K1oKk2R
$$ 26 -18 6 -26 14 10 66 -1 -1 41 -90 -4 -60 15 -45 -9 -22 38 22 21 18 -38 39 -19 -47 20 -41 -26 2 23 17 19 -3 6
5297FOk8N3k9K8j9L9qk2%N9n1K0j7j5Kpo6j0O3m3M2K8k5J2l6qk1jL5oK7mm3N9
$$ 6 12 -16 37 8 36 17 56 48 26 26 85 34 54 37 22 24 17 -49 -59 4 -39 3 31 6 18 -18 -26 -47 -48 -13 -19 8 4 -39 20
5332B0p0Q3q0mL1l2L3K2Mj1m4P6lm5N3k2l6K8N1n5N2o3K2l6k0N3j8qO0o5O6r6
$$ 20 -50 33 -47 -51 -20 -52 -19 3 7 -4 -48 28 25 -20 33 11 -25 3 54 -1 51 -12 10 -26 -46 7 -11 -19 41 -24 42 -54
5364e4Q8q5KJ6mp3J12j3j1m1j5N9Q7n5L2n7J2Nk3N1j1m5P0p4M1n6Q1n8NJ0l5R
$$ -54 34 -51 -49 -33 -37 -110 2 -11 -22 -63 -78 -19 68 13 45 -12 0 5 -18 33 22 -23 47 -27 14 -42 39 -19 -14 -4 -39 -30
5396c0k2O5m7J3nRL0k8k0O0j3K9J1j29k2J13J1r5K0K6L3j6l7R5mk9NK2l9oPJ1
$$ -30 -52 13 -34 -21 -26 -17 13 -15 -35 25 12 41 52 -77 -99 14 25 -70 -50 -24 9 -7 -44 51 47 18 23 45 6 0 7 18
5428A8n6M3K7J1Ok6n6l3R8j1o2M6Oq5R3Oj9lK7l5ko6J05p7L7K7m5K5l2P4j04K6
$$ 18 -38 5 32 43 49 23 -33 -66 32 21 -41 5 11 -74 19 25 6 3 30 -5 -7 -73 32 -45 -8 19 -26 -1 -33 41 -63 -37
5460c7QJ00m1l6N8n3R5p8m3J6O0p3M0kK2n9m1K3j3J13j00J29p4J4k7oLk7Q0l0
$$ -37 -29 71 30 -6 52 -1 94 16 -27 -11 49 -24 16 14 36 -23 -64 -41 -54 59 -41 88 14 28 1 -5 -2 -29 51 21
5490B1m6N5p6L0ol2K8k2M0L4l5r4J20r2R5k2oK4kL3n4k5R5r1om5J02kPm1l2M6
$$ 21 -25 30 -46 -16 -22 -54 -26 -48 -8 26 -9 -103 17 -75 20 -2 -8 16 14 47 -7 -32 63 -28 -34 -79 23 21 28 -13 -45 1
5522Aj4K6kj6k0N4k2m1K6K1NKpon5N6m8O7o4K3L2J7p0nR1l1l7p2Q5N2j6m3m8J5
$$ 1 -13 13 11 -5 -25 29 7 -34 -8 13 18 20 13 7 -48 8 -40 27 -37 -14 18 35 -35 -40 51 20 -17 -89 -4 48 32 -11 -59 -44
5556d4P2n7N0n3L3l0L6J3p5J2j6K4M2j1mK8k9j5RRRO7j49M2N3K0j0Mr9L2O1n1
$$ -44 28 -29 21 -32 1 -29 7 20 -55 -43 -59 -35 7 -4 -8 20 -9 -24 -15 -6 3 70 -79 -37 16 36 26 30 -69 -37 24 -27
5588b7L4n4K6K5j6m7P3j8K6k9m0K2K3l0O0l1J9j3L2J7j08N4k8P6p4M0J7m9O8m5
$$ -27 7 -47 -21 4 -12 -59 14 -4 22 -7 -47 -25 -2 -32 28 -3 16 3 35 52 -56 -2 -30 46 -28 12 29 -20 48 3
5618CQm8P5j0m3%L7NL0k4k2r7Q8L5k3l0N1m7kM9j08L4M1m9P5q4j4J02k9l0j0J2
$$ 3 11 -37 38 28 -15 -15 22 27 57 33 11 -86 2 37 14 -16 35 -12 -14 35 -73 -39 2 -47 28 -56 -70 32 3 -27 -37 -25
5650b5k1N9j0o5K3J1O5k8o8J8N1Pk3J9l6N8rk8k9JqO5n4P2k1K7o2L1pj6k0N3O
$$ -25 -46 13 3 -62 -39 -28 37 9 -59 -41 10 17 -6 13 -23 35 26 -2 -31 -30 -38 27 -27 45 24 51 -11 20 13 -3 -23 30 36
5683C6j2j4o0Q9k7Kp3P4k5P0o6o0K1K7K3J6p7J6M8l2j5L0j1M4J4n2k5N5k0J5L7
$$ 36 24 10 -50 39 12 14 -59 15 -10 60 -6 -66 -45 -18 5 21 -56 -40 8 -24 -39 -9 -20 24 38 -14 -39 16 -4 11 48
5714D8j3lj9j0O4p6j8mM8Kn4L3N4l3J0m6N3nJ9l9p9N0K6k7R3k1o8N0M2j19N3o5
$$ 48 35 32 13 3 67 -9 -27 -31 17 19 -35 -2 52 19 29 -17 36 31 50 11 -68 -18 8 -19 74 53 -15 35 77 -42 11 -54
5746e4P2m3K7r6P4L2O3j02l9O3N1n1q3N6NM0nl9N3m1K1N2o8l7QRJ14o1m7L8J6
$$ -54 18 -25 2 -94 -20 12 75 -27 -66 -3 48 -3 -86 -30 -25 15 10 -29 24 -17 4 56 -12 -49 -41 -32 82 21 -26 12 28
5777B8K4j07J02o4M1Jl9j1k2Q9Ml8l8O5N0p7o0J8O0j2Ll3M1l6P4j3o7L3K3p1M1
$$ 28 52 -55 47 -17 24 25 -14 -25 -47 42 46 8 -30 35 85 8 -52 -34 26 14 17 -16 25 -11 63 50 -17 16 39 -32 9
5808Ir3R9j9M9n2L7m4L6j3m1M2o7P7M5j3o9J0K8J2l9L8l9K6Nkn4Kj3N9%n8rO3
$$ 9 -84 15 -4 45 -7 30 -14 22 9 -32 10 -57 20 65 52 -17 -7 21 33 -6 32 -7 19 24 22 -32 -30 -43 16 16 -42 -51 12
5841A2kj1k6o3J13j9J0m1M3K0m6J4o1M4K5NOn3Pjok2R6p4L4k0M0K0l1m4M7L3q4
$$ 12 10 -1 -27 -90 23 4 14 -27 16 36 -10 4 -57 -13 12 17 23 -30 -23 -24 -30 -52 44 -30 4 -16 24 44 13 -31 16 49 -35
5874c5M7lj7Rn9M6L1n6P4j06K7L5J6kj2Mm7O5N0p7K5K6m8plp4J18o2ON2K6n5j
$$ -35 12 9 -8 1 -58 -12 19 -37 37 -69 -42 -7 9 7 -5 -1 -48 17 67 -10 15 41 -7 -14 -17 -91 27 -35 -29 23 49 -6 -7
5907gK3Rmn8L9L8kp0k0N4l0N4Pk3j4M6k2j8J3L1o4K3l8n2Q5P0n3l2KP6j6o9oK6
$$ -7 16 25 21 -37 2 40 38 -32 -52 2 -28 26 33 10 -4 42 20 2 15 46 -18 5 -33 -85 0 70 17 -15 -13 63 47 -22 -28 -2
5941bN9o9m6L7P5rp9N1J7n3K0j04P0L8J3j9k7M1p7L6M3J0m0k2J3J9jK0p7M1Q1
$$ -2 57 -12 -58 -21 54 45 -34 17 34 -19 1 -103 -33 5 18 -1 -28 13 -64 -28 15 25 -15 -37 -24 -5 -6 14 -63 -22 59
5972E9o7mNk9P2J0p4L8k9qN7n5MN5Jn9N9l1Q8k0o7l1J3K2Oo6L4L1J8k4k5j9L8
$$ 59 -8 -12 -7 -36 36 46 -28 10 -19 -27 30 -25 -21 34 35 -24 35 4 92 72 5 -26 -13 9 15 -51 -17 14 32 8 -17 -36 2
6005Bk1N7n8M8n5j2POn4N8N8J6r3O0J3j7jp0O0n3Q3K3m7p1N7k0L7l5Nj4O5k6l1
$$ 2 -19 38 -20 28 -27 -39 -32 -26 -80 -22 36 52 -41 19 32 15 14 -56 4 -49 34 57 10 -61 -4 -24 13 -22 -17 -31 34 8 -23
6038b3J2j7L4l4jM0j1M3n3n6J21NL2j09J8NOk0n7R1K7k4n4n0O3M5n9Pk3M2J6O
$$ -23 -11 -28 6 -28 -29 11 0 43 -10 -66 55 60 92 -17 1 6 12 -8 -65 26 53 29 -25 -75 -12 33 -26 -19 -42 0 16 22
6070B2q2P7LJ0p6NP5j1m9M2k4JO7q4K4PQq7L5N0L3p0K9mN1J0q4K2K9k6K3l3k0
$$ 22 -60 17 20 30 -46 -41 34 23 -26 16 -8 -7 60 -24 0 7 15 -72 -37 13 46 -24 5 1 52 62 -22 0 29 3 26 -7 -27
6103b7Q7m7n3pK7Q0j42Q1o1J16j0o7j0L6L3o4L3J6l5O1m1j02P7M4Kq8P7M0o1M
$$ -27 60 13 -40 -47 -20 60 -82 -1 -62 54 44 -23 -33 3 36 -28 5 21 -14 47 6 -96 -19 25 27 -61 16 56 -5 -1
6133ao2J4J04j9q9N4MNk5J4n6J05k6l7K7m6O6k5o8P6M1q8L6m5P2o2%N7NJ8j3o6
$$ -1 -63 -49 55 36 -53 1 5 10 -15 -1 -57 48 22 -15 12 -34 32 7 -61 15 56 -32 4 -41 31 -31 -31 26 31 49 36 -30
6165c0J3K1J00r5j6MP6k1n8l3J02O9j64o1J05J9l7m6j3P3Q7r2m0K7K8m3k2qP6
$$ -30 -17 4 104 9 -7 -3 73 52 -6 -39 63 132 -32 -93 12 31 -6 -52 -65 8 95 3 -37 -10 18 -25 -47 -55 21
6194B1n2M5O5j06j7M5l6JK7L5K8j07Q4nJ3KLk3J7k0%M4p0Q6j03k1J09m3k8J8k1
$$ 21 -31 14 79 -27 -44 1 -35 -34 -7 28 56 -51 33 28 41 43 46 23 40 20 20 64 -6 80 -23 -44 65 22 -6 12 -9
6225iQ1o5m7lP8N2k8n4m7R4p9N2k9mN5j3p2P7p5N4j8p0J04o7L4k0k9P6J0oj00
$$ -9 72 7 -40 -43 35 87 59 5 -42 52 -27 25 -4 -8 47 34 -38 39 -36 18 0 -70 34 -33 1 -19 -48 28 38 32 -68
6256f8P7lN0o4K8l5L9j1p1j2R9m1K7Mk3OK9q9mR8l9j4j9J6L9j3n0%Q0m1m4N4K7
$$ -68 9 6 56 -8 20 -15 24 13 -58 -70 29 -12 15 19 -4 2 31 -58 -62 36 -3 -17 -36 -20 19 6 -44 -44 36 -5 -49 5 32
6289C2p9P5l8R1n1n9O3L8pjl1m6j0N5j4m3J4K3N8n9j19N4O1J8l4J7J2J1jj34J1
$$ 32 -47 28 -10 81 30 -29 34 72 65 64 33 -13 -23 32 18 -25 -11 12 70 11 -108 -54 7 25 -9 8 20 31 30 -104 -93
6320i3%J21m9j8k6Q7M8n8Mj11J13nK4l8k9K2QK9pj0k8RJ3J6L7k9m2K4lq3L2M4
$$ -93 -93 28 -21 -39 -65 22 70 12 16 -95 18 13 37 -1 -30 -8 0 29 22 12 -16 -7 6 22 59 30 -12 12 9 -74 -42 2
6352BLm3j7J11l7m2K9n1Q8j0qj43O3P6N5j07p5MJ80Pr0j25J41N5k9K1o8R5m9k2
$$ 2 5 -38 -55 56 19 -23 6 -45 43 33 25 -118 -55 21 76 -31 -106 -102 78 85 -5 -130 11 66 37 58 -10 85 36 14
6382A4n3R3Jm7J1j2L2o5J02j03K0j7O1k6k7K3R1j40JO1o9M1n4J31m8K1j04O5K9
$$ 14 -39 54 55 8 19 7 39 -26 76 -27 -7 -24 37 11 -16 7 98 -42 -41 20 -49 -8 -62 69 21 42 -62 3 32
6411C2k2K2o6l3L0J04p5mL2KK4m0K4o0Q8j28J2K3M7lm1L1J0o0K4N4n5N5q5RqR5
$$ 32 10 32 -34 -67 -37 67 -8 -12 20 22 46 6 30 -30 58 -70 -58 -35 12 9 -32 -1 9 -51 -27 27 -28 27 -58 -49 -57 38
6443C8l8J5m8K5P5J2r1jqOk0mJ3K9Jqm1M4N1j2k6m8lL6M6p2n3Q2P5r5j9L6K8J7
$$ 38 0 15 -33 -8 67 79 -12 -13 -21 -15 -35 -39 -26 3 4 -4 -45 -1 50 38 12 -36 -39 -3 43 -29 -82 0 75 -20 -39 -3 25 42
6477D2p7l2J0Q9l9j4N0kj2K9Jn1j20R5L1J2Mo1PN7M3n4o0%L2O9r7J1L1R1r0Lr4
$$ 42 -35 -67 -57 32 -7 -21 29 27 15 44 45 -6 -126 -31 0 12 16 -45 -38 19 62 8 -52 -52 -20 49 -48 -37 -6 85 -5 -2 -96
6510i6J17P4j00m8m1J35mj01J3N8nM0o8K8o0R4Qpp7P2N0j9lq4l0O2K5k9L6j01
$$ -96 21 95 -5 -53 -94 41 37 -64 -51 7 2 42 -26 2 -58 36 44 37 -40 32 82 63 60 -24 -54 8 33 4 40 -61
6540f1P8k3jqK5K2j6Qq0O3N2k9o2P8p8N9%m5pl6N3k3N4q0L0M3k2j9L1j6N2j2j7
$$ -61 17 -6 -7 -15 10 32 16 24 -56 7 59 30 -32 46 -32 27 27 -18 -25 -61 -8 -31 23 -57 -27 16 -6 -25 6 -10 42 30 13
6573A3j5M6n9po6J04j2Q1q6ok9P4k2K4l1k2om8J8K2j1J8J9K7K6r2K1o6J47Kk4
$$ 13 -2 44 -15 -22 -88 16 4 85 -1 -7 -36 38 16 40 9 -13 -19 -67 -49 -27 -38 -20 -1 26 52 -40 -19 -85 62 64 40
6604D0rk8Ok0J9j7n7OM3K5K8j5j3k6J3l5j1jM6K1k8Pk0O7l9J2m0OL8J1rm6K4Q
$$ 40 31 3 9 -11 8 -9 -66 -60 -17 8 36 21 8 -18 -5 -40 -51 -52 -6 15 -13 -6 -26 41 2 14 -26 -20 18 29 20 -26 -2 6
6638FP5q0l3j7J16l3m0RO0l2m4n4N5P3m2Np8J37m3k0j1l3N1j7K3l1L0l4J6pm0
$$ 6 81 1 -32 -49 67 34 -6 3 63 31 -13 -67 -12 61 19 24 -54 83 40 20 9 -24 27 10 33 2 32 -2 14 7 -33
6669c3K1j3K8j4l9M0l4Q8K3r0j7O0qOj2j1Pk3K0J7k1M7o0M3k4j2k5L1rK2K1l3
$$ -33 -12 -25 3 -11 -50 -10 -44 44 67 -23 -40 20 12 18 6 -5 2 -21 -1 16 -5 42 -18 25 1 -11 -36 -5 -14 8 29 -4
6701drK8rj8K5L1j02N6k3M7J9n7K6K3l1M1m0J4j8k4J2Jj0J9N0m7Rl1Rj5L2Qq5
$$ -4 -13 15 6 -12 13 44 -58 -2 -25 22 41 -16 10 33 2 43 3 17 -1 -25 -13 -12 -22 -3 47 0 9 -22 -13 -28 4 12 -73
6734g3Q2j3lM0j19M6J1j1L1k8L5k1J5K2k0L7o1L9k9k3L0K0l5o5J08oL0o5M7l7
$$ -73 9 -4 -7 33 -86 -40 -29 -40 -9 -37 -2 -23 -8 14 -6 31 -30 9 -20 -43 -13 7 -28 -93 15 9 39 -26 21 -16
6764a6j8O4m3K5j9m6L2M5jll2ok3P4k8q7J35m5p9M2M4n6J7P7r6L3qP0p0K5R4j23
$$ -16 -34 30 -13 12 -7 -53 -21 24 23 20 -12 -18 -41 33 5 -82 53 8 -71 -29 15 -41 -24 53 -43 -10 -18 52 -18 7 101 -22
6796b2K7J8j5J6j7kQm3P0n2n7O8P2j19L5MK7J8K9o4J6Kj3l3R4o0o1M6n0K7M5J6
$$ -22 5 23 8 24 7 5 13 -30 40 -12 -69 -1 71 -48 -13 -9 18 36 65 1 17 19 6 -27 67 7 -54 -8 -58 -31 14 30
6828C0j6j0J2k8P0j11M5n2N6R7j21M7P7o8J3k3Pm7j9O7j8q2l0J81n8L1k9oj8K
$$ 30 14 4 16 -12 58 -53 -8 -60 -4 93 -28 19 96 28 41 18 25 -22 -41 26 8 -74 -104 77 19 50 21 15 -3 -1
6858am5M4LJ1jRmJ8no4j1M7L4Nn2l0J0M3L8j5m1Ql8M0k3j6J7O0o0J2L2OL1j23
$$ -1 -46 -2 1 12 11 20 16 34 29 -35 -46 1 35 40 -12 -42 -32 11 49 34 -7 1 -37 3 -20 -36 -19 41 -19 -7 25 31 62 -61
6892f1M4j1l4K6J10n8l0lrJO3k6OM0k3l5p0P6M3k5o3QN0J2l6o0M0j1N0m5J6QK7
$$ -61 -17 -28 -62 -36 74 16 -14 -17 -26 -25 38 12 18 58 35 0 -70 6 49 24 -39 -31 19 31 -5 -65 -25 -36 14 -31 -15 -7 20
6925B0n6j3l1O5J7n3M1M9p7NJ27j11J3oK7k4Mk8pJ04l4l3O1o5J7j0LNj0j1J6k4
$$ 20 -36 -49 -80 -15 2 -51 -10 39 -38 -33 94 -17 -4 -10 17 -7 -3 -31 -38 66 32 -1 60 -5 12 2 5 10 0 -11 5 -19
6957a9L7m8J02o9j5M1j4J1o6j5K0O0q5N4l7k0Q9n2o3J28k9l9O2n9PN0j09RP9p0
$$ -19 18 -30 72 3 -12 29 15 26 -40 -55 -35 25 -60 -6 -43 -63 26 -26 -89 39 10 -29 33 -26 -19 31 -78 -69 10 -60
6987f0O5K4o5jN5q0N3lm0M9N0k6k6l9RJ08q2o3L2J3J4j4jNJ8L2m0j7J8%K7o5P5
$$ -60 5 29 -36 -37 18 -62 -9 -12 -52 -3 47 21 -5 -44 -35 73 -9 -72 -40 -27 -13 -27 -28 -23 -5 27 -13 -30 -12 -12 15 -50 25
7020B5L5q3L2mm4K5noMJ1K6Pk8m1N3kP3l5r5P4k1K0Qq7k0O3P5o9n8N8N4lk7J7
$$ 25 60 -23 9 5 -39 -14 -19 -25 -21 -10 16 23 -5 -46 7 5 78 43 -52 22 1 21 29 -58 -78 -15 60 -9 -67 -9 45 42 15 32
7054C2Lj5l3K8qj7O1j6r1J7N9J0j0l8mR7Nl5n1k5J2L4J3n4j1Q2J6l5Lp7Q4j9l
$$ 32 35 20 -13 15 7 -10 51 35 -56 -39 20 30 20 -18 -22 75 80 45 -6 -31 -19 15 28 -26 -37 45 61 26 29 -48 36 17 14
7087A4k9m6N2j5O8n2Nk3M0l3q5J9J03j0l6Qo%nP7o6J3M9J6q0n2O0L0m1k9O5k1
$$ 14 -15 -61 -9 -24 44 -8 -3 -26 14 -19 -104 -85 18 8 -28 -20 -26 -26 -31 46 -20 -7 42 58 -22 -74 -14 16 -25 -54 11 -10
7119a0M6L3m8p4N7J9k7m4J0O6j1L2m6j08J08O2q7K7l5m3Q5L5K1m0k4K5l8L9p9
$$ -10 36 69 21 -53 4 23 -4 -48 -38 28 17 49 3 -105 3 65 -22 5 -30 -73 12 47 68 28 4 29 -9 30 -49
7148d9kQ6K0l5m6l4M6LN1j26Q3j8P9l0l0l6K3P6k5o2J2J4j1Pk7K3M7p8MJ8k9n
$$ -49 -51 35 55 20 -26 -60 -14 -11 40 -86 -3 -21 58 28 -2 -38 -15 61 36 -26 -14 0 -11 -4 -31 -8 39 -39 -35 -17 -46 -51
7180e1J1R0J2qq3K1j8JN2m7J6K0l1l8Q4l6l1N8n6P3l6R8j10m2N0rLK1k7jO2l9
$$ -51 -40 50 62 54 -29 -8 -26 -25 27 -20 -4 16 -15 -53 31 -5 -36 22 -34 39 3 101 -9 -51 -1 -10 -7 14 -13 -14 48 9
7212Ik8%jM2J2l8qn0O1No5N5q3R4J0j3m4L2K5m6M2m7l1J12q7m8M1O8MK9j07K2
$$ 9 -19 -19 -20 22 34 -4 -12 -62 -1 4 -61 -6 -89 5 15 2 -42 -10 15 -31 11 -36 -67 45 -42 -90 -49 19 23 52 -55 -33
7244c3K8R8p4j9NpN4m2j2j5Q4m7k1M4p6O8K8o4k6l7N8jK9q5lO8j5N1n7lK3L3j03
$$ -33 -5 93 19 0 5 -2 52 10 -2 -17 67 20 -1 43 -33 35 63 -1 -27 -64 -6 -7 22 -63 -66 2 -13 38 -19 -22 1 34 -69
7277f9k6R2K1M4q1l0k5R5l3k7M2J3j1P1n1rmQ0o4o2K1M0oNr8Q0l9M5k7K1j4l9
$$ -69 -95 -3 18 62 -19 -49 -74 21 -12 -39 3 16 5 76 25 16 12 92 28 -34 -13 27 21 26 -72 8 -31 14 -13 8 -6 -45
7309d5O3l8j9O2M8p3N1l3p8N5L2p2Q3k3l8N8n1o4J09l5LL3n3J9K9m3R2j43P1q5
$$ -45 18 -20 -39 23 71 -2 49 16 -62 -7 25 -47 36 13 -25 33 -18 -82 27 -8 -5 28 -25 -6 23 -20 72 -71 0 -85
7339h5M7L4j9O4p1RN1K8o7j8l5P0n3oK0M3rJ9J%KK5m5j6j2L1l1K8L1j7j0K9Ko8
$$ -85 -38 -4 -23 41 -30 -21 30 58 -9 -27 -62 8 -45 -51 -31 12 3 22 23 23 25 50 5 -11 -23 8 -23 5 36 19 9 38 40 -28
7373b8K0PJ6N8o1k8K0k4K2J4p4N7M3l8J%l4M9L3o1k4K4J7l2L7l0m0P6n9O9k8L9
$$ -28 -8 -1 15 73 12 -16 4 -20 2 16 -58 -1 42 4 5 5 -29 20 53 -8 -32 -8 9 -23 14 -16 -56 20 -39 30 2 41
7405D1p1J09r6j4N4p1%QP6n2K8k8K5k1m1J2nK9L2l6K2jN7n7k6PKOJ2K9nk6%K2
$$ 41 -30 79 -17 -31 23 -48 -48 -40 36 -16 12 -16 9 -12 -53 -41 -46 -17 15 -21 1 0 57 0 -26 -19 -17 -11 1 30 25 -1 -1 21
7439B1k1orL5j9kn2N4n7L6N5K1k4mj00N7N7q0N5L3j4n5m5L1K8m2N7J0m7L6%l9
$$ 21 0 -6 -15 20 1 -1 -53 1 -56 -20 35 56 32 28 -72 -15 42 -38 17 50 36 -19 -64 -33 -5 -47 10 20 -27 9 9 -30
7471c0k3M9j0K0mj6L0k7L3n7K9%nn0Q8o7l1P2M1l5k5oK9P0o4k0O9oK9Mp5K5l8
$$ -30 -53 -4 -14 6 2 -14 16 -11 22 -35 -6 -6 -11 -61 27 -40 -71 1 42 7 -18 -24 5 75 11 -9 60 54 83 87 12 37 -1
7504aN2m3M1o3NJ7l5L1%Ok7K2n4Q1k6K1L7j12k1J07p1K6K4Rp7M8pn7O9Rj1J7j9
$$ -1 51 8 49 -14 -9 8 -27 4 4 10 -17 5 -49 32 6 27 64 -48 -69 38 -33 -7 17 26 -51 -3 -10 -67 2 11 0 17 -2
7537brKj5J7P2p6J8rJ8m2L9J1m7M6n3K2K3j2j1KJ1J3jRK3l5k1o3M5K8NRj1Ppl8
$$ -2 -11 -9 -24 -7 65 -11 7 -2 16 -26 13 24 -23 23 -30 -8 15 3 -8 -6 5 18 17 26 49 14 -7 -70 -25 3 8 17 6 13 6 -32
7573c2PJ2K7J0n0K8k4kK8J0m8RK0j3K4ql3K6K1k3J8J9Jj1k7k3Q6p4j0JK9%O1o7
$$ -32 -25 -13 14 24 -26 2 -22 -24 4 14 -34 -25 -5 -18 6 -2 -35 -9 12 -11 7 26 27 16 -11 -34 52 -22 -32 -31 -2 -2 59 -8
7607hj1K5j1pPJ7Mm5J3l7pL7J7N5k3J1p5K1JljO7k0o7J24n5l1M4n7M5j2PL0n7
$$ -8 -19 6 -5 -12 -5 12 16 -29 -16 -53 -60 -23 -6 49 26 37 -38 -17 -16 -19 -20 47 27 -40 84 29 -2 42 -15 30 18 25 55 -2
7641bJrJ9K6L4k8m8n6Q2k2Rj3q3N4J0k1J9J9j9L5o2K4N0K1o0mj1M6N0k1r2L7K6
$$ -2 -1 -10 9 35 69 41 -7 -63 19 -3 6 -7 -90 -36 -26 -47 -28 -9 -28 7 -55 -31 19 40 -20 -24 -35 11 61 40 -52 -15 11
7674A1m0jj2M7rQ3j04O7p6L2k0K0Om9O4l1P2q1K6L7Pn5j5N0q0M4j2mML3n0L4k3
$$ 11 -29 -30 -42 5 -4 79 -25 42 -34 -2 -22 -2 4 -45 19 -12 60 -21 5 42 49 -6 -21 29 -51 -7 -19 -23 -19 14 -36 -2 -25
7707b5M6n6O3k5MJk0l9M0K5K9j11J17o0K3mnNm7J0qn2J19k2j5Ko2M5M6j4j7L9
$$ -25 21 -35 28 3 7 8 -12 -51 -11 14 43 -68 49 -11 12 8 3 8 -39 -29 -37 -89 30 8 -7 -5 -67 -22 24 10 -7 32
7739C2p0Q1k4j8m7M2P5j09%jO2N3r4M3k9k8R7rq5L5jK5l3M6m1L9qr7M7oJ11j19
$$ 32 -38 43 19 1 -46 -4 71 -38 -38 -39 23 76 -18 25 -4 -32 65 56 -29 6 5 30 -3 43 2 41 33 -64 -17 -23 88 -31
7771c1l5J18r2L7K8l7k0M7J4m0k5J5pM4Lj5jO3n8ko5J05m8J2K3l7N9r3O1M0o2
$$ -31 -66 52 -40 -3 25 -12 -32 15 29 -11 -36 -21 -28 16 19 4 3 66 8 6 -59 46 -2 10 33 -4 55 -38 23 63 1
7802Ak8OM6k8L8k1QOnmr8Q3pL3k1j7N2l9M4p0j3M0L1n9j7O3j1j0n4JJ4N8m1N0
$$ 1 -27 -21 25 -3 35 14 22 28 23 19 -79 4 -3 30 9 -8 44 5 49 -21 -34 6 37 -22 -39 24 13 3 -51 -50 -36 22 -19 31
7836C1m2J4j1j1K7M4m5l0rL2p4N8l0P7l7M8o8O8k0K1Lm1J9O1p6j5l3M2O8n0j1
$$ 31 -11 3 -8 -19 8 52 7 -23 -32 0 -74 -16 -46 31 -6 42 -26 42 22 43 46 5 24 85 9 -6 -39 3 71 21 10
7867A0k3j6N1k6K3m5J9Mk3j9R2m0k4Q7p3J6J3l1n0P2l0m6P6j7k2N6k8m4m8Q0l4
$$ 10 -13 -29 22 -4 19 -26 -7 -3 -26 -45 47 7 -17 70 -3 13 26 -5 -55 17 -13 -59 17 0 -22 34 6 -38 -86 -6 -40
7898d0L4Jj0j2lL2kj3m6M2K5J0k7l9Q8j2M9q3m9M0j2L7K3%q5N0L1l6J0J1n1J5
$$ -40 -6 -5 -15 -27 -30 2 0 -13 -59 -17 8 18 -9 -48 40 28 77 -6 -55 -15 -27 10 33 33 -52 -2 29 -7 3 14 -37 -22
7930b2N8m8k3M0l2NO0k7n8J7K9Mn0N1J7kO4o8k1l2O1j5m9j9J31o6o7l7L6O7jl2
$$ -22 36 -12 -35 5 -27 -22 38 11 -47 -30 -1 3 -47 4 21 19 83 15 -6 -38 23 8 -41 -60 71 5 -62 -99 -63 4 3 -29
7962b9k0N4lm8kO0j03J09k7j2OpJ6K5l9J6j6N2J1m1JM9m0j8k3mM4J5p3Q1m6K0
$$ -29 -49 5 2 -46 -48 12 -91 18 -9 -21 -15 -22 -6 19 -20 -4 -20 32 43 2 3 52 12 -6 -29 -33 11 26 -47 34 -12 8
7994HJ8qJ8rL6k9J3p4K3JO6q1K2j9J0L1m2mk1P1k9l1j6L3M6lo7qP5k8n5N7j4K8
$$ 8 26 18 36 27 63 34 47 -27 -4 -3 63 -18 4 -15 -5 26 -16 -20 -41 30 1 -30 -46 -13 33 30 -37 -45 30 2 -53 4 -10 18
8028A8K2l4ml8L2L8no9NJ5qpM1k8J8k4O4Rqmk0lk2qP1r4N7J3K3j7j5L9K5j63R6
$$ 18 40 6 2 -36 -4 34 29 -40 -35 -20 -28 -35 6 -22 -4 -28 36 45 37 33 13 10 -12 -20 51 -43 14 27 50 33 18 57 82 -81 15
8063A5k4OJ5J2Jjp0L5k5J6jrN7m1K4rn1J9nO2j0k8M0rk8k7M7K1k8l0J3mJ8p1O4
$$ 15 -9 -3 12 24 25 24 -46 -11 -36 -20 -21 -30 27 -14 10 1 -50 -31 -36 26 16 -12 28 19 -9 -36 11 32 4 -26 -13 -17 1 -70 -6
8098fLJ0L1Qp5M8n3Q3r0M5k3m8J05n4O6m3K0Kj4J2k2L5k7K9K1n7j1n0R1o9N8M
$$ -6 -3 7 38 46 -29 19 -34 49 -41 4 -19 -67 38 -16 50 7 27 29 15 27 5 40 13 42 63 6 -5 -55 36 -33 25 29
8130B9n6NJ20j46M9l6N1Jl9J4n1N8l2J4J8j0Mj2k3Q5l7p7P0j1M5j3J2k9M1n3K4
$$ 29 -27 -22 98 -48 1 -35 16 17 -22 -8 -59 -1 -33 -19 -1 -11 -7 -19 -42 43 6 -71 -1 -12 33 20 32 3 44 -9 15
8161A5j5q9R5j7o4R7J8k3J3k6OM3l1n4L1rmQ5n4l9J9l2R5m6l8k0M6m9N3l
$$ 15 0 -89 6 -11 -75 22 40 17 30 4 10 53 22 -32 -1 -10 -14 71 17 -22 -3 -35 60 14 -24 -44 2 -47 6 3
8191C
$$ Imaginary data points
##PAGE= N=2
##DATA TABLE= (X++(I..I)), XYDATA
0@%%%%%%%%%%%%%qJ6j6J6j6J7k5L2l2L7m5M9n4O5p4Q2r2J03j16J30j47J64j79
$$ 0 0 0 0 0 0 0 0 0 0 0 0 0 0 -8 8 -8 8 -8 9 -16 16 -16 21 -24 25 -29 36 -38 44 -48 55 -61 69 -78 86 -93
36i3J98k21K44k69L00l33L66m05M50n00N56o22O98p89R00j034J200j421J724k153
$$ -93 105 -116 128 -141 159 -174 192 -213 237 -263 293 -329 369 -420 480 -554 646 -775 949 -1204
56a204K816l956O269j2666O1203K13820j75505l05228K7519K77571Q7948j88639
$$ -1204 1612 -2344 3925 -8741 52462 266282 90777 -214451 -186932 90639 178587 -10052
68a0052j47331Q0366J37186J5291o5990m4249r314L0555P5045L2937r4017j03774
$$ -10052 -157383 -77017 60169 75460 9470 -34779 -44093 -13538 61507 94444 427 -103347
80a03347O6279J55643j4177j85052o3657J67170J24256j29393j75558O4890J95063
$$ -103347 -37068 118575 104398 -80654 -144311 22859 147115 17722 -157836 -92946 102117
91A02117P874j79466o7344J41823J16029p1079j17740Q368R0972M1125l2183n1075
$$ 102117 109991 -69475 -136819 5004 121033 49954 -67786 -59418 31554 72679 40496 -10579
103a0579l3915J0750O7542M9542o7782j22927R851J56609O9062j44329j44893
$$ -10579 -44494 -33744 33798 83340 15558 -107369 -97518 59091 128153 -16176 -161069
114a61069Q5855J90650N894j76158p9509J29296J29297n3763j27575p776R2957
$$ -161069 -75214 115436 121330 -54828 -134337 -5041 124256 70493 -57082 -64858 28099
125B8099L8411m9951m3339O911J6280M562N800m666k7329j2104L3332L1644k5341
$$ 28099 66510 16559 -26780 -19869 -3589 973 6773 2107 -25222 -37326 -3994 27650 2309
138B309m1537K0366N6753k531n8331q576O3721K8670n8943n0640M0013O2690j7934
$$ 2309 -39228 -18862 37891 35360 -22971 -31547 32174 60844 1901 -48739 -8726 53964 36030
151C6030p1137j7931N3150L6802k9889m4523J332L2315J8736m005j3720j3493
$$ 36030 -35107 -53038 112 36914 7025 -37498 -36166 -3851 14885 10880 -2840 -16333
163a6333J802K7088K5321j4427l9536p322L9551K8315k8756m5710L182M0116R250
$$ -16333 -14531 12557 37878 23451 -16085 -23407 16144 44459 15703 -30007 -26825 13291 22541
176B2541l3228j9310J8709J6243j2029j0439J6082J5308j4985j9663J7364L6530
$$ 22541 -10687 -29997 -11288 4955 -7074 -17513 -1431 13877 -1108 -20771 -3407 33123
188C3123j907m1548j6342L6965L3286k2241m5295n240L5047J9488k2124k9593
$$ 33123 31216 -10332 -26674 10291 43577 21336 -23959 -29199 5848 25336 3212 -26381
200b6381L96K0533J1421l785q834p846J938J8826J7052j0507k4016J934K8447
$$ -26381 -25985 -5452 5969 2184 -6650 -14496 -12558 6268 23320 12813 -11203 -9269 19178
213A9178J0756k4820k1496J4312K2094j1654k8076K531K5445l63k8161o874K7246
$$ 19178 29934 5114 -16382 -2070 20024 8370 -19706 -17175 8270 7907 -20254 -27128 118
226A18J6403j8731j9550J2077K5159L549j5329p871O040P071M815K568j1054k1322
$$ 118 16521 -2210 -21760 -9683 15476 19025 3696 -4175 1865 8936 13751 16319 5265 -16057
240a6057M25K9069J1882l4307l3864K0853M5803n18m6685j8836L9394L7288j8317
$$ -16057 -15632 13437 25319 -8988 -42852 -21999 23804 23286 -23399 -42235 -2841 34447 16130
253A6130l6773M829L3762Q859k1055j1883R631P781o070p012O17j5n039k175L596
$$ 16130 -20643 -15814 17948 26807 5752 -6131 3500 11281 5211 -1801 -1184 -1199 -6238 -8413 -4817
268d817J28m487J445O876j120o335O201J4534j238j5889j634J9842J0987j7711
$$ -4817 -4689 -9176 -7731 -855 -1975 -8310 -2109 12425 11187 -4702 -6336 13506 24493 6782
282F782k0511Q101K2565j396k5407j1396J5948J3378r032j4114R03J0485N605
$$ 6782 -13729 -5628 16937 15541 -9866 -21262 -5314 8064 -968 -15082 -14179 -3694 1911
295A911j600k542J70L161N543M372k826p573M41J0160J881j4541r781J0981J1744
$$ 1911 311 -2231 -2061 1100 6643 11015 8189 616 1057 11217 13098 -1443 -11224 -243 11501
310A1501j1413k0063K705K2273O350k1482j5859J7746K7339l307k6749o779K4655
$$ 11501 88 -19975 -17270 5003 11353 -10129 -25988 -8242 19097 15790 -10959 -17738 6917
323F917K0782j0855k5152n004K0431J6681j1801k6403o957K0161J7829j1003k7197
$$ 6917 27699 16844 -8308 -13312 7119 23800 11999 -14404 -21361 -1200 16629 5626 -21571
336b1571o305K5551K2596j3585k9383J010L2835J7896k0650k6158P632L0261Q837
$$ -21571 -27876 -2325 20271 6686 -22697 -21687 11148 29044 8394 -17764 -10132 20129 28966
349B8966k5065k2822J0313K4850J680k4136j7898R861K2429M190k0914j7770J2292
$$ 28966 3901 -18921 -8608 16242 17922 -6214 -24112 -14251 8178 12368 -8546 -26316 -14024
362a4024K7836N468k3813j7438J6733L0204J593l0025j7981K1449K9089p710l4610
$$ -14024 13812 19280 -4533 -21971 -5238 24966 26559 -3466 -21447 2 29091 21381 -13229
375a3229j2878K4385K4033j2147l2389p795K7454K2953j3688k9081j127K9616
$$ -13229 -26107 -1722 22311 10164 -22225 -30020 -2566 20387 6699 -22382 -23509 6107
387F107K0261j5128k7207J008K9601J6351k1000k7901M760K8216Q804k4546k4366
$$ 6107 26368 11240 -15967 -14959 14642 30993 9993 -17908 -13148 15068 23872 -674 -25040
400b5040Q462K7002M933k4852j8220J4938K5814J034k1769j1174J6307K2221j256
$$ -25040 -16578 10424 15357 -9495 -27715 -12777 13037 14071 -7698 -18872 -2565 19656 18400
413A8400k1298r633J5739J7712n905k1380q564J4038J5112p059k1957o495J7986
$$ 18400 -2898 -12531 3208 20920 15015 -6365 -14929 -891 14221 7162 -14795 -21290 -3304
426c304J5488r850j9877Q7K1346J3439j1989j8162M654K2217P863j7192j6034
$$ -3304 12184 2334 -17543 -17456 3890 17329 5340 -12822 -8168 14049 21912 4720 -11314
439a1314P643J8366J194j8799j3869Q901J7175j324j9442r825J3897J7454l125
$$ -11314 -3671 14695 15889 -2910 -16779 -7878 9297 7973 -11469 -21294 -7397 10057 6932
452F932j8106n194J7656J7447p410j9960r86K0299J1231j4176j8775K394J8023
$$ 6932 -11174 -16368 1288 18735 11325 -8635 -9621 10678 21909 7733 -11042 -8648 9375
465I375N813j6755j6423N961J7533K619j5630j0944Q980J6832K926j3639r052
$$ 9375 15188 -1567 -17990 -12029 5504 8123 -7507 -18451 -9471 7361 10287 -3352 -12404
478a2404J0865J7042n34j5988p352J1604J3303n253j7756o098J3184J1020r560
$$ -12404 -1539 15503 14969 -1019 -8371 3233 16536 11283 -6473 -12571 613 11633 2073
491B073j7510o39J6086Q943j0399j4157L672J8423Q834j2600j4091O745J9153
$$ 2073 -15437 -16076 10 8953 -1446 -15603 -11931 6492 15326 2726 -11365 -4620 14533
504A4533M802j6273j4665P016J8494J867j9878j4858J0286J8719j168j9621j0361
$$ 14533 19335 3062 -11603 -4587 13907 15774 -4104 -18962 -8676 10043 8875 -10746 -21107
517b1107J3283J8521j726j7802o292J6051J5944n450j6239k401J4338R738q928
$$ -21107 -7824 10697 8971 -8831 -15123 928 16872 11422 -4817 -7218 7120 16858 7930
530G930j5195l64J3284M769j2554j2302M620J3306J867j2650q929R437J6327J89
$$ 7930 -7265 -7629 5655 10424 -2130 -14432 -9812 3494 5361 -7289 -16218 -6781 9546 9735
544I735j5467o586J4361J6210m483j8462o256J5398J4861q531k1681n019J6823
$$ 9735 -5732 -12318 2043 18253 13770 -4692 -10948 4450 19311 10780 -10901 -15920 903
557I03J2779j0249j9262k560J6837J2981q342j6778KJ7878J1382q955j4266J884
$$ 903 13682 3433 -15829 -18389 -1552 11429 3087 -13691 -13689 4189 15571 6616 -7650 -5766
571e766J5693P151j2057j3676M740J4491j70j6315q719J0712J2232n616j6599
$$ -5766 9927 17078 5021 -8655 -3915 10576 10406 -5909 -14628 -3916 8316 2700 -13899
584a3899k847J6817J2930r995j7479K263K1308J1890j3463k0063K131K3105J2050
$$ -13899 -16746 71 13001 3006 -14473 -12210 9098 20988 7525 -12538 -10407 12698 24748
597B4748j8050k4573K511K5128J0977j9951k4757L701K6653J2074j9324k2456
$$ 24748 6698 -17875 -15364 9764 20741 790 -23967 -20266 6387 18461 -863 -23319
609b3319O900K6446J0208j7493j8193P150K2526O712j7415j5818P744J7912N41
$$ -23319 -16419 10027 20235 2742 -15451 -8301 14225 20937 3522 -12296 -4552 13360 13901
622A3901j7945j1063R860J4463l760j7852n385J6034J3884q936j7903J224K0990
$$ 13901 -4044 -15107 -5247 9216 5456 -12396 -17781 -1747 12137 3201 -14702 -13478 7512
635G512J2579j3316k0451L077K4398J1461j9254k4100M192K5733J0437k0907k5494
$$ 7512 20091 6775 -13676 -10599 13799 25260 6006 -18094 -13902 11831 22268 1361 -24133
648b4133M024K7725J2183k0275k4079N583K7279J2983j6752k1656M136K4576J1645
$$ -24133 -20109 7616 19799 -476 -24555 -18972 8307 21290 4538 -17118 -12982 11594 23239
661B3239j5824j9281L339J8538O556j3837j4766L035J3408K359j1747p808O825
$$ 23239 7415 -11866 -8527 10011 16567 2730 -12036 -9001 4407 6766 -4981 -12789 -5964
674e964R559k052q814n51J0201P075o314r656L520J3854M154j2691j2058N281
$$ -5964 3595 1543 -7271 -7822 2379 9454 3140 -6516 -2996 10858 15012 2321 -9737 -4456
688d456J5322L026j5909j4998O179J8173L980j6142j3880O895J8347O042j2385
$$ -4456 10866 13892 -2017 -17015 -10836 7337 11317 -4825 -18705 -11810 6537 12579 194
701A94j2733N032J6081O396r621j0776J584R722M684o024q302j274M253J843k429
$$ 194 -12539 -7507 8574 14970 5349 -5427 -3843 5879 10563 4539 -3763 -5037 -784 1059 -1370
716a370k108l63j096r50K565N117J665m741m960L928J0962M123r642j0642L604
$$ -1370 -3478 -3841 -4937 -5887 -3322 1795 3460 -1281 -6241 -2313 8649 12772 3130 -7512 -3908
731c908J3723N051j2284j5088J683J5968P275j3003j5837K344J6450Q398r483
$$ -3908 9815 14866 2582 -12506 -10823 5145 12420 -583 -16420 -14076 2374 10772 1289
744A289j3410J585J4863Q649p498j1076J454J0753M910p183q677J680P855M3r405
$$ 1289 -12121 -10536 4327 12976 5478 -5598 -4144 6609 11519 4336 -4341 -2661 5194 5237 -4168
759d168m636P382O386o458j0699K359J4220N999j2343j2699Q128K0079M329j7883
$$ -4168 -8804 -1422 4964 -1494 -12193 -9834 4386 10385 -1958 -14657 -6529 13550 17879 -4
773dj4581R420K1243M231j9840j8868O701K3277P463k0395k2138N476K6071J1450
$$ -4 -14585 -5165 16078 20309 469 -18399 -11698 11579 19042 -1353 -23491 -18015 8056 19506
787A9506j9227k3628O338K8355J1355j9758k0721P868K4212O751j8222j6327P181
$$ 19506 279 -23349 -17011 11344 22699 2941 -17780 -9912 14300 21051 2829 -13498 -6317
800f317J7716J553j5624j0397P036J1845p82j1876o190Q823J1726k572j3181k809
$$ -6317 11399 12952 -2672 -13069 -6033 5812 5030 -6846 -13036 -4213 7513 4941 -8240 -11049
814a1049J4343J2306p950j7264m54J9715J1751j5485k2249L286K3933Q866k0113
$$ -11049 3294 15600 7650 -9614 -10068 9647 21398 5913 -16336 -13050 10883 19749 -364
827c64k1611N880K4259Q801j8258j9654N924K3146J0143j4068j8054J917K0070
$$ -364 -21975 -16095 8164 16965 -1293 -20947 -15023 8123 18266 4198 -13856 -11939 8131
840H131J2461j1546j9795r73J8370J0946j2137j8196J19J6086P105j2007j2365
$$ 8131 20592 9046 -10749 -11722 6648 17594 5457 -12739 -12620 3466 10571 -1436 -13801
853a3801N080J2897J095r610l394P985O832l123o528J040P450K855o041o524J563
$$ -13801 -8721 4176 5271 -4339 -7733 252 7084 3961 -2567 -1527 5923 8778 2737 -3787 -2224
868b224O703K321o510q770p1R517N957p561j1492J386J3694P679q498j2064K667
$$ -2224 4479 6800 290 -8480 -8551 966 6923 -638 -12130 -10744 2950 10629 2131 -9933 -7266
883g266J4685O516j0054j0703L398J0534K263p681o787R43M722J363l040l066
$$ -7266 7419 13935 3881 -6822 -3424 7110 9373 1692 -5095 -4152 570 1933 -1107 -4173
897d173n58J033J825J768J1j470j35K100K051R98L44j066k248m03L164K624l273
$$ -4173 -4731 -3698 -1873 -105 -94 -1564 -1699 401 2452 3450 3794 2728 480 77 3241 5865 2592
914B592p063k034O791N716n709j0540M62J1169N524p504q311L685J0453L038o956
$$ 2592 -4471 -6505 286 6002 293 -10247 -9785 1384 6908 -596 -8907 -5222 5231 8269 1313
929A313n072M101O033o02m568k117J090J247l66k004k385k05K247P53k705k116
$$ 1313 -3759 342 6375 5773 1205 -912 178 1425 1059 -945 -3330 -3535 -1288 -535 -3240 -5356
945e356L045N227m67o215q93Q737O323o878r947L588J2081J815j2149q870O600
$$ -5356 -2311 2916 2449 -3766 -4659 4078 10401 3523 -6424 -2836 9245 11060 -1089 -9959 -3359
960c359J1179j542j2173n576P296Q470j053p278m007M083Q147L376n755p305K477
$$ -3359 7820 6278 -5895 -11471 -4175 4295 3242 -4036 -8043 -3960 4187 7563 1808 -5497 -3020
975c020J0367L811r037r410M078J1409Q8j2547o569Q898Q813n577j0716R01J0314
$$ -3020 7347 11158 2121 -7289 -3211 8198 8286 -4261 -10830 -1932 6881 1304 -9412 -8511 1803
990A803L849p062n774M813Q415L50o227k948L717M862M71m657n471L80O533K991
$$ 1803 5652 -1410 -7184 -2371 6044 6394 167 -2781 936 5798 6269 1612 -3859 -3479 3054 6045
1006F045p057q618K356J0633K952r996q288P217J3031m93j2126m006J0588Q921
$$ 6045 -1012 -9630 -7274 3359 6311 -3685 -11973 -4756 8275 7782 -4344 -8350 2238 11159
1020A1159m939r949n44Q257M012n783p028L47N111K104l407m846o19M568M809
$$ 11159 6220 -3729 -4273 3984 7996 2213 -4815 -4468 643 2747 -660 -5506 -6125 -1557 3252
1035C252k217o523K4Q457N129n901p643L205J0374J441j0433o734P350R139m218
$$ 3252 1035 -5488 -5464 2993 8122 2221 -5422 -2217 8157 9598 -835 -7569 -219 8920 4702
1050D702j1609j953R122N288n598q016Q23Q153M196m130n654Q76O695M587l008
$$ 4702 -6907 -8860 262 5550 -48 -8064 -7241 912 5108 978 -4676 -3800 2895 7482 4474
1065D474o826j263P196N540n514r879J36R599L742q743q886L868J0762J434r932
$$ 4474 -2352 -3615 3581 9121 3607 -6272 -6136 3463 7205 -1538 -10424 -6556 4206 5640 -4292
1080d292n568P503R513j448q648k478P082O871k302p971k920N891O015l014q597
$$ -4292 -9860 -2357 7156 5708 -2940 -5418 1664 8535 6233 -1738 -4658 1233 7248 4234 -4363
1095d363l202O252O705l251r746j912R481P220n649r364J656J1008M850p593q243
$$ -4363 -7565 -1313 5392 2141 -7605 -9517 -36 7184 1535 -7829 -6173 4835 9685 2092 -6151
1110f151L593J0201J603r362o642M585P912m65q485n367M468P807l6q045m339
$$ -6151 -2558 7643 9246 -116 -6758 -2173 5739 5274 -3211 -8578 -4110 3697 3661 -4384 -8723
1125h723O057Q324m38q040l513O998Q339k273r613k507Q086O182n221r300q07
$$ -8723 -2666 5658 5220 -2820 -6333 665 9004 6731 -2882 -5389 2697 8879 3658 -5642 -6449
1140f449P855M456n804q140R41Q591L654n918o246K527Q394L307o011o304L383
$$ -6449 1406 5862 58 -8082 -7141 1450 5104 -814 -7060 -4533 3861 7168 1157 -5147 -1764
1155a764Q680J296q095n808M350P580q91q766m857N863P319k392q592k101P406
$$ -1764 6916 8212 117 -5691 -1341 6239 5348 -3418 -8275 -2412 4907 2515 -6077 -8178 -772
1170g72O293k933p305o42P807N774m233p732L46P824L788o065p582R57P689K660
$$ -772 5521 2588 -4717 -5359 2448 8222 3989 -3743 -3397 4427 8215 2150 -5432 -4475 3214 5874
1186E874p144p090K919Q182J436o855m938M201P965J136o567m320M822P397l93
$$ 5874 -1270 -8360 -5441 2741 4177 -2678 -7616 -3415 4550 5686 -881 -5201 -379 7018 6625
1201F625p230l906M664O139j653p878l432N652N626l278p461p67O718M606l584
$$ 6625 -605 -4511 153 6292 4639 -3239 -6671 -1019 4607 1329 -6132 -6899 -181 4425 841
1216H41o086R20P397L625m825n582K084O733J807n662n903K012O826J119p308
$$ 841 -5245 -4325 3072 6697 1872 -3710 -1626 5107 6914 1252 -4651 -2639 4187 5306 -2002
1231b002n640L768P293J06p265m179N249P610m56p182k626O065O071j685o355
$$ -2002 -7642 -3874 3419 3525 -3740 -7919 -2670 4940 4484 -2698 -5324 741 6812 5127 -1228
1246a228k011M520M467k161o062j930M068L376k536m903n56M234L023k563l990
$$ -1228 -3239 1281 5748 3587 -2475 -4405 -337 3039 503 -4400 -4956 -722 2301 -262 -4252
1261d252J337N369J530l926k542L117M359p98m811j962L663L420k491n445r59
$$ -4252 -2915 2454 3984 58 -2484 633 4992 4194 -617 -2579 1084 4504 2013 -3432 -4391
1276d391M046K957k600m623o38M664M032k098m978Q7N528L640k799m827J16N035
$$ -4391 -345 2612 12 -4611 -5249 -585 3447 1349 -3629 -3542 1986 5626 2827 -2000 -1884 3151
1292C151K414l959m687J232M108m4m291k220K327K971j095l412j6L857K238k340
$$ 3151 5565 1606 -3081 -1849 2259 2215 -2076 -4296 -1969 1002 -93 -3505 -3521 336 2574 234
1308B34k871J658M588J364l793l899J785N584R51o224n314L136O778L42p369n289
$$ 234 -2637 -979 3609 4973 1180 -2719 -934 4650 5601 -623 -5937 -2801 3977 4319 -3050 -8339
1324h339M313Q190M04p795m444N792P900k13p016l778M912O735n10p085l838M377
$$ -8339 -4026 4164 4568 -3227 -7671 -1879 6021 5808 -1208 -4986 -74 6661 6151 -934 -4772 -395
1340c95N446j582o745k715M611M844k370o400l76O428L752m199n144K212P084
$$ -395 5051 3469 -3276 -5991 -1380 3464 1094 -5306 -5682 746 4498 299 -4845 -2633 4451
1355D451K032n878n220L529P475L86p898n585M244P938R4q816o390N151R907N19
$$ 4451 6483 605 -4615 -1086 6389 6775 -1123 -6708 -2464 5474 5568 -3248 -9638 -4487 5420 5939
1371E939r796o078O610J0562M40r712n838O486J0028l67r653n439N642P860p46
$$ 5939 -3857 -9935 -3325 7237 7677 -2035 -7873 -1387 8641 8274 -1379 -6818 -1176 6684 5938
1386E938q377m941M503O980p38p235l193M977N931j238n830j216N705M586l138
$$ 5938 -2439 -7380 -2877 4103 3365 -3870 -7063 -2086 3845 2607 -3223 -4439 1266 5852 2714
1401B714n671R42O138J854n424m943K391N858M78o439m799L423O662M83o405m382
$$ 2714 -2957 -2015 4123 5977 553 -4390 -1999 3859 4337 -2102 -6901 -3478 3184 3667 -2738 -7120
1417g120L785P536J590o428n305L795Q232J335p017n525L190P036R01o518n202
$$ -7120 -3335 4201 5791 -637 -5942 -2147 6085 7420 403 -5122 -1932 5104 6005 -513 -5715
1432e715K456N663N97m739l240J697L797J235k055j865J014K366Q82p48n44K10
$$ -5715 -3259 2404 3001 -1738 -4978 -3281 516 1751 -304 -2169 -1155 1211 2093 1345 801 1011
1448A011L85k11n71J34M54q33k178n70K225J440k184k925N33L680K017k137l118
$$ 1011 1396 1185 614 748 1202 369 -1809 -2379 -154 1286 -898 -3823 -3290 390 2407 270 -2848
1465b848Q11M208J839k274k641M40K422J054j440k386m85J170O03j028r61m7J98
$$ -2848 -2037 2171 4010 1736 -905 -465 1957 3011 1571 -815 -1300 -130 473 -555 -1516 -1563 -1365
1482a365R4N3N17J032J20j369k59K443K590j307l656q65L635L217k179n603j794
$$ -1365 -1271 -1218 -701 331 451 -918 -1177 1266 3856 2549 -1107 -1972 1663 4880 2701 -2902 -4696
1499d696M651M421k572o506j582N254N211j717o157k110N482O071j381o329k239
$$ -4696 -45 4376 1804 -4702 -6284 -1030 4181 2464 -3693 -5803 -321 5750 4369 -1960 -4199
1514d199M923N283j407o259k644M269M578k152n784j407M184L251k394m367K97
$$ -4199 724 6007 4600 -1659 -4303 -34 4544 2392 -3392 -4799 -615 2636 242 -4125 -3828
1529c828M659K441l307l527K264N029P45m494l141K974N175l95o265l563M235
$$ -3828 831 3272 -35 -3562 -1298 3731 4476 -18 -3159 -185 4990 4595 -1670 -5233 -998
1544i98N714j287p228l449N034O913r02p695l473O028P578r25p584l548N619P211
$$ -998 4716 3429 -3799 -7248 -2214 4699 3797 -3898 -7371 -1343 6235 5310 -2274 -5822 -203 7008
1560G008r98p841l736N171O128j699p026k960M435N056j377n705j793M346M256
$$ 7008 6010 -1831 -5567 -396 5732 4033 -2993 -5953 -1518 3538 2161 -3544 -5337 -991 3265
1575C265j671m173j91M046K694k079l567O34L817J208l651l163J605L620m4m139
$$ 3265 1594 -2579 -2770 1276 3970 1891 -1676 -1042 2775 3983 332 -2831 -1226 2394 2350 -1789
1591a789k739K349M364q8m622k287L585M664l29m469k188L576M730m90n179k336
$$ -1789 -4528 -2179 2185 2097 -2525 -4812 -1227 3437 3108 -1361 -3549 27 4757 4267 -912 -3248
1607c248L423L887j193m606k053K552L352r63l685j171K616K492q05k127j10K113
$$ -3248 175 4062 2869 -1737 -3790 -1238 2114 1151 -2534 -3705 -1089 1403 598 -1529 -1639 474
1623D74J654r06j578O84J859j98k066o36J515R59j509k445j3K403J182k436k424
$$ 474 2128 1222 -356 328 2187 1989 -77 -713 802 1761 252 -2193 -2206 197 1379 -1057 -3481
1640c481J295L189Q80k259j942J453L154Q86k415k188J242K686K11k522k070O81
$$ -3481 -2186 1003 1883 -376 -2318 -865 2289 3175 760 -1428 -186 2500 2711 189 -1881 -1200
1656a200K292K81k547j888J455K370k75k207n70K103J980o46k146Q7K738J286
$$ -1200 1092 1373 -1174 -3062 -1607 763 488 -1719 -2289 -186 1794 1148 -998 -911 1827 3113
1672C113k079k314Q09K652L96k908k589J157L268M18l686k442K195M019K36l770
$$ 3113 1034 -1280 -471 2181 2577 -331 -2920 -1763 1505 1923 -1763 -4205 -2010 2009 2245 -1525
1688a525k274K817M743j79m547k089L531L974j196m647j842L287L293j752m529
$$ -1525 -3799 -982 3761 3582 -965 -3054 477 4451 3255 -1392 -3234 53 3346 1594 -2935
1703b935r59L507K653j987l329j62L466K412j711l096M62L724J522k326k820O27
$$ -2935 -3894 -387 2266 279 -3050 -3212 254 2666 955 -2141 -1679 2045 3567 1241 -1579 -952
1719i52L099R85k892k994J020L335L09l361k395J890L486J68l148j934K437L780
$$ -952 2147 3132 240 -2754 -1734 1601 1910 -1451 -3846 -1956 1530 1698 -1450 -3384 -947 2833
1735B833m4l483j671K649L389o48l819j874K709L198j335m322j215L254K732j866
$$ 2833 2789 -694 -2365 284 3673 3025 -794 -2668 41 3239 1904 -2418 -3633 -379 2353 487
1751D87l710k35L834K415k299l209J112L806J024k575k387J387L009J72l093k043
$$ 487 -3223 -3458 376 2791 492 -2717 -1605 2201 3225 650 -1737 -350 2659 2831 -262 -2305
1767b305J728K422o59k944j197J957K232o33k583p07K618K397j042k631N3K644
$$ -2305 -577 1845 1186 -1758 -2955 -998 1234 601 -1982 -2689 -71 2326 1284 -1347 -1294 1350
1783A350J663j510k521p7K490J165k240k375L38K220Q27j870k178N11K673J098
$$ 1350 3013 1503 -1018 -1095 1395 2560 320 -2055 -1717 503 1330 -540 -2718 -2207 466 1564
1799A564j933k041J246K994Q98k415k053J494L124P9l502j843K314K682j277l597
$$ 1564 -369 -2410 -1164 1830 2728 313 -1740 -246 2878 2957 -545 -2388 -74 2608 1331 -2266
1815b266q09K878K208j877l214M32L458J493k220k172J041L043R80k309k257J118
$$ -2266 -3075 -197 2011 134 -3080 -2648 810 2303 83 -2089 -1048 1995 2975 666 -1591 -473
1831d73K830K95k968k039J437K449j60k931j633K045K630o52k739m99K563J974
$$ -473 2357 2652 -316 -2355 -918 1531 1371 -1560 -3193 -1148 1482 830 -1909 -2408 155 2129
1847B129r44k001k43K098J569j084k155l49J625J140j003k233o73J760J748j220
$$ 2129 1185 -816 -1059 1039 2608 1524 -631 -980 645 1785 782 -1451 -2124 -364 1384 164
1863A64k669n4K881J654j751k439P40L266J175k512k313J495L048p1l115j785
$$ 164 -2505 -2559 322 1976 225 -2214 -1474 1792 2967 455 -1858 -363 2685 2614 -501 -2286
1879b286J842K470p02l034j300K364K244j093k820j66K765J940j362k553L54L012
$$ -2286 -444 2026 1324 -1710 -3010 -646 1598 505 -2315 -2481 284 2224 862 -1691 -1337 1675
1895A675J365k238k340R77K601J12k506j752J193K143k68k503j034J668J833k78
$$ 1675 3040 802 -1538 -561 2040 2152 -354 -2106 -913 1230 962 -1541 -2575 -907 926 648
1911F48j823o09J519J962j21j845p85J597J754m56k123j076J386J746p00k522
$$ 648 -1175 -1784 -265 1697 1576 -269 -1054 543 2297 1841 -282 -1358 28 1774 1074 -1448
1927a448r90J926J878j085k326l70K401J942j266k455K34L064J461k172k445R26
$$ -1448 -2438 -512 1366 281 -2045 -2415 -14 1928 662 -1793 -1559 1505 2966 794 -1651 -725
1943g25K935M86k918k284J552K916m10l410j392K432K596q61k942o25K722K412
$$ -725 2210 2696 -222 -2506 -954 1962 1552 -1858 -3250 -818 1778 917 -2025 -2650 72 2484
1959B484j170k720j29K735J650j500k399j87K158J278j642k407R3J959Q07j395
$$ 2484 1314 -1406 -1535 1200 2850 1350 -1049 -1236 922 2200 558 -1849 -1756 203 1010 -385
1975c85j507L34J611Q59q21j109K95J455Q11o92j064r4J190Q81j062j639O2J540
$$ -385 -1892 -1558 53 912 91 -1018 -723 732 1543 851 -213 -307 883 1764 702 -937 -875 665
1993F65L96j683j374P88J844Q2k004j035J831K228o44k210k36K226J566j187k149
$$ 665 1061 -622 -1996 -1208 636 718 -1286 -2321 -490 1738 1094 -1116 -1352 874 2440 1253 -896
2010h96l4K017J071j675k083K82J841M01j501j255O78J504R1j216l64J223R88
$$ -896 -930 1087 2158 483 -1600 -1318 523 924 -577 -1832 -1154 350 441 -775 -1139 84 1072
2027A072o47p75N90R52k7r85n64Q61P33q76j417L6J111L94r60r03K37R98O97n12
$$ 1072 425 -350 240 1192 1165 180 -384 477 1210 334 -1083 -1047 64 458 -502 -1405 -1168 -170 527 15
2047A5q36K5J222Q19k42j035m06Q93J030k38j628o71J027R49n60j498n47J188
$$ 15 -821 -796 426 1245 1003 -32 -438 455 1485 1247 -381 -1052 -25 924 364 -1134 -1681 -493
2065d93J155n74j538L1J752R48j021j308N73K054M25j901j573J463K282o28k949
$$ -493 662 88 -1450 -1419 333 1281 260 -1048 -475 1579 2004 103 -1470 -7 2275 1647 -1302
2082a302j073K299K161j350l301m56L214K311k020l135L35L535J863k125k834
$$ -1302 -2375 -76 2085 735 -2566 -3022 192 2503 483 -2652 -2317 1218 3081 956 -1878
2097a878L74L085J577k106k802K03K566J116j819k428N0K254J220j428k111L46
$$ -1878 -1504 1581 3158 1052 -1750 -1547 1019 2135 316 -2112 -2062 192 1412 -16 -2127 -1781
2113a781K213J161j152j670L06K000J093j396j890M78K026N45j930j848O80K308
$$ -1781 432 1593 441 -1229 -923 1077 2170 774 -1116 -638 1388 1933 3 -1845 -1165 1143
2129A143L48k537j772J577K817m5k966j358K406L050m08l492j221L003K853j273
$$ 1143 1491 -1046 -2818 -1241 1576 1531 -1435 -2793 -387 2663 2255 -1237 -2458 545 3398 2125
2145B125l586p64K752K317j637l341m63K722J770j598k355k2K198J348r16j623
$$ 2125 -1461 -2225 527 2844 1207 -2134 -2597 125 1895 297 -2058 -2080 118 1466 550 -1073
2161a073Q0J470J070n92j238q0J014M74n03r89l21P17L28n88p44J17O74L26n88
$$ -1073 -993 477 1547 955 -283 -363 651 1125 622 -367 -688 29 357 -231 -975 -858 -184 142 -446
2180d46n17M38J014L64q64n47O10J230k1j147q87O32J336j90j653q68J046J291
$$ -446 -963 -525 489 853 -11 -558 52 1282 1261 114 -773 -141 1195 1005 -648 -1516 -470 821
2198H21n11j480l38J090J078l72j002P4J074L60m78j54L63J12l53k73L66L24m93
$$ 821 310 -1170 -1508 -418 660 288 -714 -640 434 794 316 162 525 637 284 11 377 701 208
2217B08j037j0R02N43j049j133M82J378O08j023j072N06J773M90j288j066O32
$$ 208 -829 -839 63 606 -443 -1576 -1094 284 892 -131 -1203 -697 1076 1566 278 -788 -156
2234a56J394J89j291j056M27J163J1j099q19M97Q53K9o53m39M22R43L01o55n27
$$ -156 1238 1427 136 -920 -493 670 681 -418 -1237 -740 113 142 -511 -950 -528 415 716 61 -466
2253d66O00Q91P5r88p26O58J217l28j680p20J268J351p04j936n28J863J654q61
$$ -466 134 1025 1100 112 -614 44 1261 933 -747 -1467 -199 1152 448 -1488 -2016 -153 1501 640
2271F40k253j83K419J726j278k344n7K441J538j671k647J52K525J048j970k234
$$ 640 -1613 -1796 623 2349 1071 -1273 -1330 1111 2649 978 -1669 -1517 1008 2056 86 -2148
2287b148N07K261P75j730j746Q62K142M39j515j068R22J539L05j314j021O88J265
$$ -2148 -1641 620 1395 -335 -2081 -1219 923 1362 -153 -1221 -299 1240 1545 231 -790 -102 1163
2304A163qj385j014P92J168r6j442q32R58J524j61j622n15J330J610l23j699o05
$$ 1163 1155 -230 -1244 -452 716 620 -822 -1654 -696 828 667 -955 -1470 -140 1470 1147 -552 -1157
2322a157J573J506o25k043n14J524J297q13k047m96J668J378r75j889L4J844J059
$$ -1157 416 1922 1297 -746 -1260 264 1561 748 -1299 -1795 -127 1251 276 -1613 -1579 265 1324
2339A324j028j421L36J675O20j131j158O33J181j0j158n39N34O62l42q99k92P30
$$ 1324 296 -1125 -789 886 1506 375 -783 -150 1031 1021 -137 -676 -142 520 178 -721 -1013 -283
2357b83N74n47n50K00P45M18k53n48J04P63K99n20n88Q6O20N6n54o25Q2O09J53
$$ -283 291 -256 -806 -606 139 557 304 -244 -140 623 922 402 -186 -100 520 576 22 -603 -521 88 241
2378B41n05o67K74P10K90m79m24L43P94K43p20l93N72O34k48q24j77N57L79n35
$$ 241 -264 -931 -657 53 343 -136 -560 -217 577 820 100 -293 279 913 665 -159 -336 221 600 65
2398F5r40J21Q37K63q77n91O80Q99M4q51m52R08J108l01j186k51J022O61n44j220
$$ 65 -875 -754 83 346 -531 -1122 -442 457 501 -350 -802 106 1214 913 -273 -524 498 1159 615 -605
2418f05k20R72P19q15j212K18J032M50o92p52K16R95N72o92p75M19R70J95p75
$$ -605 -825 147 866 51 -1161 -943 89 539 -153 -905 -689 306 878 186 -589 -170 800 995 220
2437B20n95K10Q32N9q40q32M47Q32l3q61m70M81R71Q9r05n27Q01J164k00j086
$$ 220 -375 -165 667 726 -114 -946 -499 333 300 -561 -1031 -550 421 510 -395 -922 -121 1043 843 -243
2457b43l30Q31R28m10j223l80R04Q20o95j180l2J122N13p08r63J79J193N60q24
$$ -243 -573 258 1186 776 -447 -827 77 897 202 -978 -1010 112 625 -83 -1046 -867 326 886 62
2476F2p88M25J139K33q82p04L94R04k5j059n91O02Q11l33p89l49O33O64j75o86
$$ 62 -726 -301 838 1071 189 -515 -121 783 758 -301 -892 -290 521 188 -601 -950 -317 347 172 -514
2496e14j63Q22N68l14n81n3O46M26m06p53l5N62L82n76o87K3O62L19n22o52K40
$$ -514 -677 145 713 399 -182 -235 411 837 431 -322 -357 205 587 11 -676 -653 9 328 -194 -846 -606
2517f06Q45L05o52m43M77P35K01p85m86M96Q03k35r27l27O29N05m72p27j81P07
$$ -606 239 544 -108 -551 -74 661 862 77 -409 87 890 655 -272 -599 30 535 63 -664 -845 -138
2537a38N04m19p52K59Q14M35n42n60K72P27K53o77n81L29Q11j54q53m71N02N75
$$ -138 366 -53 -805 -546 268 703 161 -399 -127 600 853 176 -405 -76 735 581 -272 -743 -241 334
2557C34j41p56l18O04O28j86o99N0O38N62k88o70j9O90M07m06q22J8O02L43n38
$$ 334 193 -563 -881 -277 351 165 -534 -484 154 716 428 -242 -261 429 836 430 -392 -374 228 571 33
2578C3o82L1O50L41o11n55L41Q47O6n58l99L83Q27L5o67m72N30N74j47p98l72
$$ 33 -649 -618 32 373 -238 -793 -452 395 461 -97 -496 -113 714 749 82 -390 140 714 567 -231 -603
2599f03M96M73k23p35k38O46N29l62n46L5P76K57k40n31J00O70K84n66n38K20
$$ -603 -107 366 143 -592 -830 -184 345 -17 -563 -528 248 505 265 -266 -166 504 788 222 -316 -96
2619i6N28N6o27m81K13N88l8n58l16L95O06n7m50k23N58N70j67o85r1O27L14l88
$$ -96 432 488 -139 -620 -407 181 143 -415 -731 -336 270 213 -237 -460 98 668 501 -184 -275 352 666 278
2641B78n64j21O32K31m92p05J61O52J84m79m98L11P50K83o10m09L34P53Lp43l55
$$ 278 -286 -407 225 456 -36 -741 -580 72 256 -223 -721 -410 340 623 13 -396 -62 691 694 -49 -404
2662d04N59M84j41q79k53N08N60l65p93j4O05M98k97o08K5P13N74m80o79Q5Q42
$$ -404 155 639 498 -381 -634 -126 434 69 -724 -738 -133 365 68 -540 -515 198 772 292 -387 -302 540
2683E40K70m68p59K6P67K68p07p42K46Q36J01o93m76L74P88J60o46l95M47P33
$$ 540 810 342 -417 -391 376 644 -63 -805 -559 277 378 -315 -791 -417 371 531 -115 -510 -63 670
2703F70p2n81l55L85O25n7q17l36M31N61k70p35j35M71N56k55o31k5P52M33m09
$$ 670 598 17 -338 47 672 615 -202 -538 -107 454 184 -551 -686 -215 341 86 -545 -570 182 615 206
2724B06n37J51O12L30m75n61M3O39J08m84n75J44M53J67m33m07P8O12K75m47l27
$$ 206 -331 -180 432 762 287 -274 -231 408 516 32 -543 -399 54 221 -212 -619 -541 71 346 -101 -428
2745d28K47N55J31k97k76Q4L55O7l48l51J87K64j86k78r4K24J24n4l01N7L27J48
$$ -428 -181 374 505 208 -68 16 371 438 90 -261 -74 190 4 -274 -368 -144 -20 -74 -375 -318 9 157
2767A57k08l5J97K29m2q1j84J79J61k10k92l8J59L5j42j72l8K01J38j30k11K27
$$ 157 -51 -86 111 340 298 217 33 212 373 163 -129 -167 -8 27 -115 -287 -325 -124 14 -116 -327 -100
2789a00K43M3k07OK33J31n1l33q6L61Q5l83l08J43K80K9l14k97J13N34J40m29
$$ -100 143 186 -21 -15 218 349 298 -35 -121 240 325 -58 -366 -223 57 86 -228 -525 -412 122 262 -167
2811a67k77K99N65J15m01m09L03O43M0p92m16L60O28j61p07k78L85O00q2p06k68
$$ -167 -444 -145 420 535 134 -275 28 671 711 -81 -497 -137 491 330 -377 -655 -270 330 248 -458 -726
2832g26N53O46j25n45j96N07O12k54o57j57O31L32l54p25q1O08M16n13p12N6P82
$$ -726 -173 473 348 -197 -393 114 726 472 -185 -342 289 621 267 -458 -539 69 485 -28 -740 -684 98
2853I8L84o02n69K45Q23L44n55p17K96Q58K05p26o49K41P55K12p43p00L53P32
$$ 98 482 -120 -689 -444 379 723 168 -549 -253 605 810 84 -565 -324 431 643 -100 -800 -447 285
2873B85J67p73n01L94P69J85o06n15M50P90l2o26m32L81O10M3o70m16K58O08j03
$$ 285 452 -321 -822 -428 341 526 -80 -595 -145 645 613 -13 -445 -64 546 589 -81 -497 -239 369 266
2894B66o62k37M48M92j79n28j74N16N62j96n08p5N54L13k35m89k04N50L14m05
$$ 266 -396 -633 -185 307 128 -400 -574 -58 504 308 -200 -275 279 592 357 -132 -336 214 528 123
2914A23n61p2N67J94k92n02Q6N25K56l28l52J46M78K20k16l91J13K30J68k58k58
$$ 123 -438 -510 57 251 -41 -543 -457 68 324 -4 -356 -210 268 488 272 -119 -6 224 392 134 -124
2935a24NJ96p8j21j42M8J18L7o6o8J38Q2K6m2K21j6k1q5J5M9m4q5j17L8L6Lj88
$$ -124 -119 77 -1 -122 -264 -216 -98 -61 -127 -195 -57 25 51 9 230 214 193 108 123 172 128 43 -74 -36 0 3 -185
2962a85p0O2M2L3l4qJ60J08n6p7K6J73J46j40j94J8J21J59k22l27O9K67Q1l89
$$ -185 -255 -193 -151 -118 -152 -160 0 108 52 -25 1 174 320 180 -14 4 125 284 62 -265 -196 71 152 -237
2986b37k23K84L09P7l75j36K75L49m8k89j83K44M15m4m61k65K86L32j42m83k24
$$ -237 -460 -176 133 210 -165 -301 -26 323 275 -14 -197 47 462 418 -43 -308 -22 310 168 -315 -539
3007e39L75M75j65m87k16N14M72k59m20rM01L06j28m10j40M09K55k63m67m0L75
$$ -539 -164 311 146 -341 -557 -43 429 170 -250 -259 142 448 320 -90 -230 179 434 171 -296 -336 39
3028C9K19k53m41J7L82L49l38l77Q9O01J73k92m16P0N90J59n15m19K55M46o0l75
$$ 39 258 5 -436 -419 -37 312 -26 -403 -314 287 460 168 -248 -178 412 571 56 -363 -108 338 278 -97
3050i7l47J95M03O1m42k67L02M75j4l48k31K64N40l8m65k57L39L58k36l60r4K62
$$ -97 -444 -249 154 215 -227 -494 -192 283 269 -79 -310 -46 494 456 -9 -266 73 431 195 -165 -259 3
3072CK13j52l53k0L01K9m6k01N4K04J85j01j41q1L00J48k21k30Q9Q5J48k16k67
$$ 3 216 64 -289 -309 -8 21 -25 -226 -172 32 217 116 -25 -106 194 342 121 -109 -20 65 213 -3 -270
3095b70M9K48Q3l10j03J97J42J1j42n1J55K16o6j94L6J38J03j00j20r6J02N1r1
$$ -270 -221 27 110 -200 -303 -106 36 47 -95 -146 9 225 159 -35 1 139 242 142 22 -74 28 79 -12
3118a2j55JJ57M5j93r6R1K37M7k52J06J03J40j09j97N9K04K5k00j36N1J63J5k16
$$ -12 -167 -166 -9 36 -157 -253 -162 75 122 -130 -24 79 219 110 -87 -28 176 201 1 -135 -84 79 94 -122
3142a22j59J45J56J1q5j90J08K47Pj10p1R3K34q3j04j13N7J36l4k16j57K05J09
$$ -122 -281 -136 20 31 -54 -244 -136 111 118 8 -63 30 264 181 77 -36 21 157 123 -93 -250 -45 64
3165F4q0j86l9J91J38o5k57Q6K70J67j55k12j0K69O4j63j99L0K04M6k58j56J12
$$ 64 -16 -202 -241 -50 88 23 -234 -148 122 289 134 -78 -88 181 245 82 -117 -87 117 163 -95 -251 -139
3188a39J44Lj21j15O7L46rk71l9K16J61j2k22q6J61J71j94k21j2O5J39q0j92%
$$ -139 5 8 -113 -228 -161 185 176 -95 -134 82 243 231 9 -77 84 255 61 -160 -172 -107 32 -48 -240 -240
3212b40K06R5r9j57N2K33R8j06j40NK27K8j04k17M3K07l9k16m9L2J50P5j82j87
$$ -240 -34 61 -38 -195 -143 90 188 82 -58 -53 174 202 98 -119 -76 131 92 -124 -173 -141 9 84 -98 -285
3236b85J21K16L4q1j26K12J03M0k14m2J71Q6j29j68r5J86K4j14j53L4J68M8p0
$$ -285 -164 52 86 5 -121 91 194 234 20 -22 149 235 106 -62 -157 29 53 -61 -214 -180 -12 36 -34
3259c4j55J12J74N3j52m1R9J24l6j73k1J21J30j32j99p5J50R8r0r6L9L3J22q3
$$ -34 -189 -77 97 150 -2 -43 56 180 144 -29 -50 71 201 69 -130 -205 -55 43 -47 -143 -104 -71 51 -32
3283c2j23M5J52J34p6j57Q9Q8M1j60m1N5L0m8l6j57J15K4O6j71k1J22J46l9l4
$$ -32 -155 -110 42 176 100 -57 32 120 161 1 -40 15 45 -3 -39 -196 -81 -57 9 -162 -183 -61 85 46 12
3308A2j12J85J62j08j90nK18J1j41j36K1J01N9j79l5m0J44J5m3j04P6R4N1j5o8
$$ 12 -100 85 247 139 -51 -56 162 173 32 -104 -83 18 77 -102 -137 -177 -33 -18 -61 -165 -89 5 56 41 -27
3333b7O0J60m7j90j9M0J19kj24j20P0J40r6j08JJ27J9J4j01K5J50J05j11j43Q4
$$ -27 33 193 146 -44 -63 -23 96 94 -30 -150 -80 60 -36 -144 -143 -16 3 17 -84 -59 91 196 85 -58 26
3358B6J66p7r8r6L1P6Pj31p3P3J17k3j02l4M7K01n3j05k3K03M1n2j11p8J99k5
$$ 26 192 115 17 -79 -48 28 35 -96 -169 -96 21 -2 -104 -138 -91 110 57 -48 -71 132 173 121 10 -68 131 106
3384A06n7j54MJ21K7k15N4kJ29P4j50j6P6J54q0j36J8J26N9jj59n1J03P9mk72
$$ 106 49 -105 -101 20 47 -168 -114 -116 13 87 -63 -79 -3 151 71 -65 -47 79 138 137 -22 -73 30 109 105 -167
3410a67L4J71L7j10j12k1J87J01j17j22LJ86J17p7j76M8M3J31q7j55m0J53K1r4
$$ -167 -133 38 75 -35 -147 -168 19 120 3 -119 -116 70 187 110 -66 -18 25 156 69 -86 -126 27 48 -46
3434d6j26j0J66J56k08j55R5K06M8j33j00J32J29R3k10j52J97R6j31j98QJ21k3
$$ -46 -172 -182 -16 140 -68 -223 -128 78 126 -7 -107 25 154 247 37 -115 82 178 47 -151 -143 -22 -45
3457d5R7j85nP6J10J0j14o1J13J69l6j66j8J54O7j14j10lJ61k7p8r9q3J13J22
$$ -45 52 -133 -138 -62 48 58 -56 -117 -4 165 129 -37 -55 99 166 52 -58 -61 100 73 -5 -104 -187 -74 48
3482D8r4p3M2O0Q4j6l3j6N2R6q2o5KO5Oq8n1m9O1Q9r0n3JL3N9n1M0lP8J2j7k8
$$ 48 -46 -119 -77 -17 67 51 18 2 54 150 68 3 5 70 76 -12 -63 -112 -51 38 -52 -105 -104 -71 -12 -63 -23 -26 52 64 47 19
3514A9L5j2Ll6k5N0o2jN3p1j1l8O4l7J8%o2J32mR2j15J33r8K1N5p0o4J0P4l1j07
$$ 19 54 42 45 9 -16 34 -28 -29 24 -47 -58 -96 -32 -69 -51 -51 -113 19 15 107 -8 125 27 48 103 33 -31 -21 53 22 -85
3545h5l7K6J22mp9k3m0J68N1j78M3Q4J12Jj73m9J18L8Pj44N3NM6p3j31L3J7J47
$$ -85 -122 -96 26 22 -57 -80 -120 48 99 -79 -36 48 160 161 -12 -61 57 95 102 -42 11 16 62 -11 -142 -109 -92 55
3573E5n2r6J5R3J24l4j61%J83l2m9r5r6K10O5m4k72QJ96M6r3j27J26L3R2m6j78
$$ 55 3 -93 -78 15 139 105 -56 -56 127 95 46 -49 -145 65 130 86 -186 -178 18 64 -29 -156 -30 3 95 49 -129
3600a29M5J29P2q3j52P5J71M2j75q2k5J78J4j32q0Q1N6J0p7oJ4J20J03j37j05
$$ -129 -84 45 117 34 -118 -43 128 170 -5 -87 -112 66 80 -52 -132 -51 5 15 -62 -68 -54 66 169 32 -73
3625g3Q4J24mr8q7M9R2M1j96k5oJ52j8j40m3M4J15j0r5k7J19J21kj48O3L2O6m5
$$ -73 11 135 131 33 -54 -5 87 128 -68 -93 -99 53 35 -105 -148 -104 11 1 -94 -121 -2 119 117 -31 32 64 130 85
3653H5j39K7K9K3p2n3oO0N9j4j62O8L5J60m5n9K8NJ0Pk3j06J42J3m1m1o8L6qO0
$$ 85 -54 -27 2 25 -47 -100 -106 -46 13 -1 -163 -95 -60 100 55 -4 24 29 39 46 23 -83 59 72 31 -10 -78 -42 -50 10
3683A0l2j37J61M8lk9n0J04K7k1k6k1Q9j8j47jQ6k3n6J7K7l8L3o3N6Q5p2o5K2
$$ 10 -22 -159 2 50 47 18 -32 72 99 78 52 31 120 102 -45 -46 40 17 -39 -22 5 -33 0 -63 -7 78 6 -59 -37
3712c7P3K6p5MjQ8L7j02nl1J18p4q9l9J03J3J0n9l4J07J5Ko4J2j4R0k6p3J5M1
$$ -37 36 62 -13 -9 -10 78 115 13 8 -23 95 21 -68 -107 -4 9 19 -40 -74 33 48 50 -14 -2 -16 74 48 -25 -10 31
3742C1M8j0j09jJ03or3%k6m5J07O1j02j5%J04O7j08j4K9J06oj37M4o1J76j39q9
$$ 31 79 69 -40 -41 62 56 -37 -37 -63 -108 -1 60 -42 -57 -57 47 114 6 -8 21 127 121 -16 28 -33 143 4 -85
3770h5m3J48L8j05m8J5Q1M2n0l8L1P1N1j03l7L7J31p8j9q9N6J1j4p1j1R8k1nK9
$$ -85 -128 20 58 -47 -95 -80 1 43 -7 -45 -14 57 108 5 -32 5 136 58 39 -50 6 17 3 -68 -79 19 -2 -7 22
3799B2Jm1Q5k6rl3l5J09qk9n9K6p8J51j8j22O4P4j6j37n5L9J04m3N5r9P5N3l7
$$ 22 23 -18 67 41 32 -1 -36 73 65 36 -23 3 -75 76 58 -64 0 74 58 -79 -134 -95 9 -34 21 -78 -3 50 13
3828A3j1rJ1O1p5n0P7k3kl5k0LJ00j2r8Q5l4K8N1n6k1M0nj08P9L7M4k9r4P3L5
$$ 13 2 -7 4 65 -10 -60 17 -6 -8 -43 -63 -60 40 28 -70 15 -19 9 60 4 -17 23 18 -90 -11 26 70 41 -53 20 55
3859E5M2j53kR2k4l8l5O7O2k6m3l3K2J02m4m3%O2j9K9m0nk5k5n6J08L8j16m9R9
$$ 55 97 -56 -58 34 10 -28 -63 4 66 40 -3 -36 -14 88 44 1 1 63 44 73 33 28 3 -22 -78 30 68 -48 -97 2
3889B%k6K3q9J67jj6q6N0L0J5o7k6j4J36p5j16J7R7M7o4j34J48jJ7m2l1O0O2p
$$ 2 2 -24 -1 -90 77 76 60 -26 24 54 69 2 -24 -38 98 23 -93 -76 21 68 4 -130 18 17 34 -8 -39 21 83 76
3919G6p5RJ8Q6p1j22Q8N0j10J6J1j1MRl6O7r6J02jJ7K8M3r1m4P9k5jk4K1pL0j01
$$ 76 1 10 28 114 43 -79 9 59 -51 -35 -24 -35 -31 -22 -58 9 -87 15 14 31 59 102 11 -33 46 21 20 -4 17 10 40 -61
3951f1k3J22P7j21p3k2J75p2o8KO2O6q4n0M5Q3O0j33k6J13n4n4j06J54j6L7p6
$$ -61 -84 38 115 -6 -79 -101 74 2 -66 -64 -2 64 -20 -70 -25 58 118 -15 -41 72 18 -36 -142 12 -4 33 -43
3978d3p1R4L7Mn2N6K7k1j6o3Q9Mj3j0j02O5N6p7K8jrJkl0M4rk3m1L2Q1p1rN1L3
$$ -43 -114 -20 17 21 -31 25 52 31 15 -48 41 45 32 22 -80 -15 41 -36 -8 -9 -18 -17 -19 -49 -5 -14 -37 -78 -46 35 -36 -45 6 39
4012C9Mj5p5M4Q6n9j00J6L5K8q2K5R8q6J12j53QJ60k3q5jQ5M0l0j10o9J46j3j8
$$ 39 43 28 -47 -3 83 24 -76 -60 -25 3 -79 -54 44 -42 70 -83 -75 85 62 -23 -24 61 101 71 -39 -108 38 25 7
4041Gj20J11R3p2j28O4J08m8L2j58Q4Q4P0j79pJ35Mp1l8N3n7M0Jp6N4N4m0r1P2
$$ 7 -113 -2 91 19 -109 -45 63 15 47 -111 -27 57 127 -52 -59 76 80 9 -29 24 -33 7 8 -68 -14 40 0 -91 -19
4070a9M0l4j9M9k1L5K0l7o5J57q6q7L5J31n4j16%O6NL6n9r6J25O4r5p9Q2J14R
$$ -19 21 -13 -32 17 -4 31 51 14 -51 106 20 -67 -32 99 45 -71 -71 -5 0 36 -23 -119 6 70 -25 -104 -22 92 101
4099A01j26oM8K9j2n6J9J4J02j43m1Q7K1l6j13R4Q7m0kl4m6J13j7q5m1J06N1n5
$$ 101 -25 -31 17 46 34 -22 -3 11 113 -30 -71 16 37 1 -112 -18 69 29 27 -7 -53 60 43 -42 -83 23 74 19
4127A9n2m4Q8n7J2l2L4M7j0k6QN2r9PN2L9M1o2JLJ02n9j44J07mj1lr5L5P9K0j22
$$ 19 -33 -77 11 -46 -34 -66 -32 15 5 -21 -13 39 -60 -53 -1 38 79 17 18 21 123 64 -80 27 23 12 9 -86 -51 28 48 -74
4159g4LJ27K8j13j2P4L4N7j85Q5j7L1lol3P7m5%j11N9N2K1j64P4M9M6q9q4Q1Q6
$$ -74 -71 56 84 -29 -41 33 67 124 -61 24 7 38 35 29 -4 73 28 28 -83 -24 28 49 -115 -41 8 54 -35 -119 -38 48
4189D8n3m9N6M5M8j12o8M5Q1J5j37L8O9l6j5m2P2J9m9j4J5J06K3n8l3j6K9k3l8
$$ 48 -5 -54 2 47 95 -17 -85 -40 41 56 -81 -43 26 -10 -25 -67 5 24 -25 -39 -24 82 105 47 14 -2 27 4 -34
4218c4N2L8q1k8l6M6P3p3L0n6N7K1N4j03N5O4m3k8k8J8M5p0K4M0K4K7r9n9K8J17
$$ -34 18 56 -25 -53 -89 -43 30 -43 -13 -69 -12 9 63 -40 15 79 36 8 -20 -2 43 -27 -3 37 61 88 -11 -70 -42 75
4248G5j17r8J20LP1o1j1K8K7k2o0J10m8K5o9j8L6N2k8q6pJ23nK2n2M2k7K2l6o8
$$ 75 -42 -140 -20 -17 54 -7 -18 10 37 15 -45 65 17 42 -27 -45 -9 43 15 -71 -78 45 40 62 10 52 25 47 11 -57
4278e7J05l0q2P4QO9q7J4j9P0j5j18P2J3N0q2Jm2Q7J1m1o4K8J11n8n8k9Q3P0q0
$$ -57 48 18 -64 10 18 87 0 14 -5 65 50 -68 4 17 67 -15 -14 -56 31 42 1 -63 -35 76 18 -40 -69 14 84 4
4308Dr3P5R3j8j52nO5Q6j06L7n2J06K7o6Jj2L1J2n1jN2m1R2j04K5rM7p9N7%j22
$$ 4 -89 -14 79 61 -91 -96 -31 55 -51 -14 -66 40 67 1 2 -10 21 33 -18 -19 33 -8 84 -20 5 -4 43 -36 21 21 -101
4339a01N9P8QK9o3k3L2Q0p1j7J7m8O1q5J6m3P0j2L1q6j0R6L4j21k9K1J47j08O5
$$ -101 -42 36 44 73 10 -13 19 99 28 11 28 -20 41 -44 -28 -71 -1 -13 18 -68 -78 18 52 -69 -98 -77 70 -38 27
4368B7J0J2n0M6m4M5rn7L8m8j2j3K1K0j9O1p7PM8L1k0m7P7n1L8ml2l5O7o0K0r
$$ 27 37 49 -1 45 1 46 37 -20 18 -30 -42 -55 -34 -14 -33 28 -49 -42 6 37 17 -30 47 -4 34 30 -2 -37 30 -30 -10 -19
4400a9Q2O9j25m4J9NN4m2L4j9N8j11M3J2%L0l8j5j1L5l4N1Qm1q1Q4o6Q1j7m7J6
$$ -19 63 132 7 -37 -18 -13 41 -1 33 14 72 -39 4 16 16 46 8 -7 -18 17 -17 34 42 1 -80 4 -62 19 2 -45 -29
4431b9L1Pk3k1L6QM1kj04N8J2L0j34J7R1QL0p6l7K1Q1m5k5j4L9M1k0op1J01K6
$$ -29 2 9 -14 -35 1 9 50 48 -56 2 14 44 -90 -73 18 26 56 -20 -57 -36 45 0 -25 -39 0 41 21 15 -56 45 71
4462G1j0k5K0q5O6n8p3P9K6oK4p7P2l7nL6N1n4j4L4j0m9P3J7n0L3p5O3m5Q0n8
$$ 71 61 36 56 -29 37 -21 -94 -15 11 5 29 -48 24 -13 -18 18 69 15 1 35 25 -24 49 66 16 49 -26 37 -8 72 14
4493A4o7m2O3nJ8loL5k5R1n4n0N8j4km7Q9Ok2j8j0J3pkj2j8MJ3K3L1m6ml5J39
$$ 14 -53 -95 -32 -37 -19 -22 -28 7 -18 73 19 -31 27 13 11 -36 53 59 37 19 9 22 15 13 1 -17 -13 0 23 54 8 4 -31 108
4527A08p5mp5M5j2M3n6O3p7M5j7q6J13p3O6m5K8l2R1o1K4k0QL7L9j4r2j9K2L7
$$ 108 33 29 -46 -1 -13 30 -26 37 -40 5 -12 -98 15 -58 8 -37 -9 -41 50 -11 13 -7 1 38 77 63 -29 -48 -26 11
4557A1Jr9P2lM%l3rK1nK2M3n6QR5K5r1l1j5L6O9p8J5rL1L1r6N1m6O8o3O9m5k9
$$ 11 12 -87 -15 -18 -14 -14 -47 -56 -35 -40 -18 25 -31 -23 72 97 6 -25 -40 -4 65 -13 2 -7 24 55 -41 10 -36 32 -31 38 -7 -36
4591c6J01mp8J8j4N4n9p%O4j12L2j3J6L9nk5Mk6j5J10j2j9Jj2rJ1mk9J7L6J5k6
$$ -36 65 61 -17 1 -13 41 -18 -25 -25 39 -73 -41 -54 -38 1 -4 -29 -25 -51 -66 44 32 13 14 2 -7 4 0 -29 -12 24 39 13
4624A3kK9pj9k7RrK8k7j5k0L1J3l4m6J10mL3j3j1j18P5M7n6K4m4M0k2O8n7q7J10
$$ 13 11 40 33 14 -13 -4 -13 15 -12 -27 -47 -16 -3 -37 -83 27 23 56 43 32 -86 -11 36 -20 4 -40 0 -22 46 -11 -98 12
4656A2JL7m5rlO0l1k1Kj1K9k8L1oKJ8o8N0o4N1Ro7J5L1K3pm5R2j10J7N4M8k8l1
$$ 12 13 50 5 -4 -7 53 22 1 3 -8 21 -7 24 18 20 38 -30 20 -44 7 16 -51 -36 -5 18 11 -34 58 -52 -35 19 67 39 8
4690HJ4k8l6O5m1K1Pk5k2lL4K0o3O4MP9q5J3l3N%pP3l2nmmm8qM5n2J5rK7O9o0
$$ 8 22 -6 -42 23 -18 3 10 -15 -37 -40 -6 14 -49 15 19 98 13 26 -7 -2 -2 -9 64 32 27 23 19 -29 -37 8 -44 -29 -38 -11 58 -2
4726bL8n6J0L7Jk7J1J3m9M8l6k5Q1Pq3m3Q9k5L5k2K0qk3Kl2Q8k4K1o1K4K1m6P1
$$ -2 36 -20 -10 27 28 1 12 25 -24 24 -12 -37 44 51 -32 -75 14 -11 24 2 22 14 -9 -7 -39 49 25 46 -15 9 30 -16 55
4759E5q9mL0k7l7J03J3L4m9o2j0k%K7L9o1Q7j5l3J0N3j13P8j2J0n7k9O3l8L8R
$$ 55 -34 -38 -8 -35 -72 31 44 78 29 -33 -43 -45 -45 -18 21 -40 47 32 -1 9 62 -51 27 15 25 -32 -61 2 -36 2 11
4790A1n6O4m0qrM0M8j4n9n1R2m9O1n1L2J7q8N4m1K6k3K9P6q6o8Q9m7J3N4j9k8
$$ 11 -45 19 -21 -29 -38 2 50 36 -23 -74 18 -31 30 -21 11 28 -60 -6 -47 -21 -44 -15 61 -25 -93 -4 -51 -38 16 -3 -31
4821c1K8K6jn8MR3q1n1L8J6J1K5k7K5o2M2k8M7K1p1N2n9N2jNL5o1k1k0J6J7N2
$$ -31 -3 23 22 -36 -32 61 -20 -71 -33 -17 -6 19 -8 17 -45 -3 -31 16 37 -34 18 -41 11 10 15 50 -11 -32 -52 -36 -19 33
4853C3j9qn2J1L9l6OO2j6l2M0n0Q0j1j9o5O4%o5O9qm2J6M0m5K5L0m3J9n5K3M7
$$ 33 14 6 -46 -35 4 -32 -26 36 20 -12 28 -22 58 47 28 -37 27 27 -38 31 23 -19 -3 37 -8 17 47 4 23 -32 -9 38
4885C8m9O8m1j9L8n4L9k6L5k3k6L9kr4L1RJ2Nk1L6K3k3j4j5L2K7l1L6n0M3M3l3
$$ 38 -11 57 16 -3 35 -19 20 -6 29 6 -20 19 17 -77 -46 -37 -25 -20 -41 -5 18 -5 -19 -34 -2 25 -6 30 -20 23 66 33
4917C3Qp1j9O6m2M0k1K2p4L1k0M7j04J20p6O6N2j15%P8M9j00M6Jp1L9K0J8q3R6
$$ 33 41 -30 -49 17 -25 15 -6 16 -58 -27 -47 0 -104 16 -60 6 58 -57 -57 21 70 -30 16 17 -54 -15 5 23 -60 36
4947C6n2J9L9m0PL1pk4L1J1n7M6o5K1J4J6j8M7m3J9k9m3O4n8Q3j05R2m1j1L3J7
$$ 36 -16 3 42 2 9 40 33 9 40 51 -6 40 -25 -4 10 26 8 55 12 31 2 -41 23 -35 48 -57 35 -6 -17 16 33
4978C3l8pN3j4L0n6oJ2M0r4K4Lj9M8QL4r2P3l8K0m7N3j6P5j2l2m3l5O6l3n8N2
$$ 33 -5 -12 41 27 57 1 -5 7 47 -47 -23 -20 -39 9 17 51 -41 32 -6 14 -33 20 4 79 67 35 -8 -43 23 -10 -68 -16
5010a6J5J8n6LN2jO2j9p1l2O5Jl6M5J0N8j43K3K3j6J2O7r3JoJ6J12p0Pn3R1m9
$$ -16 -1 17 -39 -36 16 15 77 58 -13 -45 20 21 -15 30 40 98 -45 -22 1 -15 -3 64 -29 -28 -34 -18 94 24 31 -22 69 20
5042B0rl9qK9M2m3M0m8M0Rj8M2q1O6m9K4m3m8N3P4m7j1K0j4M0J4o3J1LJ4k3m8
$$ 20 11 -28 -36 -7 35 -8 32 -16 24 33 15 57 -24 42 -7 17 -26 -74 -21 53 6 -5 15 1 41 55 -8 3 6 20 -3 -51
5074e1P9QOqp1L4o2J35l4j38Q2P9p3POk3K3J7L8n2Lj1L2p9qK2P1Pkn7l4J17k0
$$ -51 28 36 42 34 -37 -3 -65 70 36 -102 -20 59 -14 -7 -1 -24 -1 16 54 2 5 -6 26 -53 -61 -39 32 39 37 -20 -54 63 43
5107D3o5QJ1O7m1pRoJ2ML6q6Nk0N0j6n7Q5k4L4k4ml9rN1Qj7mMj7Rk7O1k9m2O3
$$ 43 -22 -14 -3 64 23 16 25 19 31 35 71 -15 -10 -30 20 4 -53 32 8 42 18 14 -25 -34 17 25 8 4 8 -9 0 -27 34 5 -37 26
5143B6j9m7P2p2Q6l9n1R0q1Nk1P1J4k7L3p1j3O9Qp7O4l7K0N2j21O1qj6lQ7r8J3
$$ 26 7 -40 32 -40 46 7 -44 46 -35 -30 -51 20 34 7 40 -31 -44 25 33 -44 20 -17 3 55 -66 -5 -13 -29 -32 55 -43 -30
5175c0N9m8M1k1OkRj2N1k6p6K0L3l9L1jO9p6j6K0P5n7Qk0k3M5n6kK8OM1j3o9L2
$$ -30 29 -19 22 1 7 5 14 2 53 27 -49 -29 4 -35 -4 -5 64 -12 -28 -8 67 10 18 -2 -25 20 -36 -38 -10 -4 37 24 -45 -13
5209a3oL9n9M5l1M7j3K3l8jj9P4l8J9j06N2L3K9l1lk2Q0n6k5pJ00m8J4%r6M5m3
$$ -13 -19 20 -39 6 -25 22 9 32 -6 -7 -26 48 10 29 -77 -25 8 37 6 3 -19 61 5 -20 -27 73 25 39 39 -57 -12 -55
5241e5J13n4j0NN7k9%k6nJ6rk0J6n1P5n7m4Q0J4K7p1K3q8J68j1o9K8o3Q3k3L8
$$ -55 58 4 -6 -1 56 27 27 1 -4 12 3 -17 -1 -52 23 -34 -78 2 16 43 -28 -5 -93 75 64 -5 23 -40 43 20 58
5272E8r2j0P7p%p8O4L6k4o9O6l2l7K8L4n8R3j4k7N0j7j4m8mO0n5m1L6L0j1l3M4
$$ 58 -34 -44 33 26 26 -52 12 48 24 -45 21 -11 -48 -20 14 -44 49 35 8 58 41 27 -21 -25 35 -20 -61 -25 5 -6 -39 5
5304EqO0o1JL0Nn8M3Mm3L9L5p4K6oNk8M6k1M3j06k6M3K3K7j7k4K4k0O6l0L6m3
$$ 5 -3 57 -4 -3 27 32 -26 17 21 -22 17 52 -22 4 -2 3 -25 21 0 43 -63 -89 -46 -23 4 -13 -37 -13 -33 33 3 39 -4
5337dJ7k3Q1j09K2K8j9o8O7l4KJ8K1l8L6RL5k0k6qK7lnJ6l8L9l7J2qJ2J7j3j2
$$ -4 13 -10 71 -38 -16 12 -7 -75 -8 -42 -40 -22 -1 -39 -3 6 41 21 -5 -13 14 11 6 22 -16 23 -14 -2 -10 2 19 6 -6
5370fpJ4kK3m6M7l4N9j4l2jm2J04j21N1qM9J8r8O0l9N6j5l8M8k8K6J0o8L2k1N8
$$ -6 -13 1 -1 22 -24 23 -11 48 34 2 1 -41 63 -58 -7 -15 34 52 -46 14 -25 31 16 -22 26 -2 24 34 -34 -2 -23 35
5402C5o2nL0QOJ8n5P5n1J4JK0o7M5nK8q2J10m5pJ6q6J4Q7J8m7krrj7M5r3M4J4
$$ 35 -27 -32 -2 6 12 30 -25 50 -1 13 14 34 -33 12 7 35 -47 63 18 11 27 -59 -45 42 60 13 11 2 -7 -24 21 -72 -28 -14
5436a4l8K1P3%k7ll7O7K7k8p2J8n2P1Ok7M7k0lm1P0p7L0o2L7%M6M5m4j5j5j6q
$$ -14 -52 -31 42 42 15 12 -25 42 69 41 -31 -13 -65 6 12 -15 32 12 9 -32 38 -39 -9 -71 -34 -34 12 57 13 -2 -17 -33 -41
5469d1J10o8J0j6jK6j1j2J6j5K2nm1P8l6NJ1m8j9M2L0K2m4n2K5J1K5n6qK8N3n6
$$ -41 69 1 11 -5 -6 20 9 -3 13 -2 20 15 -26 52 16 21 32 -16 -35 7 37 59 15 -37 -12 -1 24 -32 -40 -12 41 -15
5501a5J0KO5j06J22j25L8O2n2NPq4%J18oJ1l7J6l7l5K9j3N3K3j41N6MK6l0O8p2
$$ -15 -5 -3 62 -44 78 -47 -9 53 1 6 13 -71 -71 47 41 52 15 31 -6 -41 -12 -25 28 51 -90 -34 -30 -4 -34 34 -38
5532c8L1J5j02P6M6k2L1k3m7j1J8l8PJ1O3l3m0J01l5MJ0K2o8j0P0l8J5j1QmM1
$$ -38 -7 8 -94 -18 28 6 37 14 -33 -44 -26 -64 -57 -46 17 -16 -56 45 10 14 24 46 -22 -32 38 0 15 4 12 8 49
5563D9l6o2P0k2J17j22n9K3J45r8k7L5kJ23j42k1j1N0mrKo0N1L7Qn1JoP1j9p9
$$ 49 13 -49 21 -1 116 -6 -65 -42 103 5 -22 13 11 134 -8 -29 -40 10 6 -3 -1 -61 -10 27 35 -16 -15 -21 50 31 -48
5594d8J2O5k5mq2Q9J4k8m3O4M6l2n6J3PK4l6n5N0M8n5L9RLj6l6K0K6J4J0j07R1
$$ -48 -36 29 4 0 -82 7 21 -7 -50 14 60 28 -28 -15 -8 16 -20 -75 -25 23 -32 7 16 19 3 -33 -13 13 27 37 -70 21
5626B1j3NK8oj6nLn9M6K6l0Jl0N3kn6l3L4J9O9J9r5JN4k7l6m2J05J5l6m7M2r7
$$ 21 8 13 41 35 19 14 17 -42 4 30 0 1 -29 24 22 -34 -67 -33 -14 55 74 -21 -20 34 7 -29 -71 34 49 13 -34 8 -89
5659h9Q4Ll2ON2nj6J3p5J4N0j2J8nJ3m6K8J4j9RKj5L3n7l1L6N3k5K2m0K1k4J4
$$ -89 -5 -2 -34 -28 24 19 3 16 -59 -45 5 -7 11 6 19 -27 1 15 -4 5 7 -8 25 -32 -63 -27 26 1 23 -17 4 -20 -6
5692fKn3K6L2lk2k1L6n0L1P0nj31J07n2pR0m7j9K0j2pPOl8J10j03K1Q3l6j7m8
$$ -6 -4 -57 -31 1 -2 -24 -45 -9 -59 -28 42 37 -94 13 -39 -46 44 -3 -22 -2 -14 -21 -14 -8 -46 64 -39 -18 65 29 12 -36
5724c6M1J9m3Rn0l7J31m8J0j4K2J0M7j8m4j7RM8j4k8J4Q2o6l6m1J51p3J7o5j8
$$ -36 5 24 -19 -10 -60 -97 34 -14 -4 -18 4 14 61 43 -1 -18 -9 39 25 -3 11 93 27 -9 -50 101 28 45 -20 -38
5754c8j5Q1P7j07m3L7M2k7K2j5k9M4J8m7p2M5J13n5lk5nL0m5kM2n9O2o4kPK9N1
$$ -38 -53 28 105 -2 -45 -8 34 7 29 14 -15 29 47 0 -72 -27 86 31 28 3 -2 28 -17 -19 23 -36 26 -38 -40 -33 -4 47
5786D7K4q6l7L2J09m6m8k1l1J04q0PM3K2o3K8Qj5OQ7n8Mk9m9R7p0j1O9o9O5l5
$$ 47 71 -15 -52 -20 89 43 -5 -26 -57 47 -33 -26 17 39 -24 4 12 -3 3 90 32 36 7 -42 55 -15 -26 43 -26 39 4
5817DK2n8l1N6j6%n6L9kJ2l0kO4N8j7k9j8L8jk1Nomqmn4O6NL4ro6J9k0J1O3l6
$$ 4 26 -32 -63 -7 -23 -23 -79 -40 -42 -30 -60 -62 2 60 43 14 -4 34 33 12 17 11 7 -1 -5 -59 7 12 46 37 -29 -10 -30 -19 44 8
5853Hj5k5M1lJ0J3l7J3J6m0P8j21P4N5j24P9j3k7R7j7m4n0M7J4m1k6L5J6%o2j3
$$ 8 -7 -32 9 6 16 29 -8 5 21 -19 59 -62 12 67 -57 22 9 -18 79 62 18 -32 15 29 -12 -38 -3 13 13 -49 -62
$$ [...]
8191c5
##END NTUPLES=NMR FID
##END=
