##TITLE=1H_ANY-163B-1
 CD3CN, 8 sc, 
 14.3.2019
##JCAMPDX= 6.0         $$ Bruker NMR JCAMP-DX V2.0
##DATA TYPE= NMR FID
##DATA CLASS= NTUPLES
##ORIGIN= UXNMR, Bruker Analytische Messtechnik GmbH
##OWNER= root
$$ XWIN-NMR		Version 3.5
$$ Thu Mar 14 16:19:15 2019 Russian Standard Time (UT+4h)  she@DPX200
##.OBSERVE FREQUENCY= 200.1315
##.OBSERVE NUCLEUS= ^1H
##.DELAY= (6, 6)
##.ACQUISITION MODE= SIMULTANEOUS
##.ACQUISITION SCHEME= undefined
##.AVERAGES= 8
##.DIGITISER RES= 18
##SPECTROMETER/DATA SYSTEM= spect
##.PULSE SEQUENCE= zg30
##.SOLVENT NAME= CD3CN
##.SHIFT REFERENCE= (INTERNAL, CD3CN, 0, 15.7039)
##AUDIT TRAIL= $$ (NUMBER, WHEN, WHO, WHERE, WHAT)
$$ ##TITLE= Audit trail, XWIN-NMR		Version 3.5
$$ ##JCAMPDX= 5.01
$$ ##ORIGIN= Bruker BioSpin GmbH
$$ ##OWNER= she
$$ F:/spectra/data/she/nmr/H-F/1/audita.txt
$$ ##AUDIT TRAIL=  $$ (NUMBER, WHEN, WHO, WHERE, WHAT)
(   1,<2019-03-14 16:18:14.17 +0400>,<she>,<DPX200>,
      <created by zg, POWCHK disabled, PULCHK disabled
       configuration hash MD5:
       00 E9 B6 7A A2 85 ED C7 34 08 36 98 17 FE 4E 26
       data hash MD5: 16K
       66 FA E8 15 78 58 7A 72 E5 9B 5F 86 93 EE 00 70>)
$$ ##END=
$$ 
$$ hash MD5
$$ 80 95 DE B6 9E 30 91 1B 32 5A 14 A1 2B 2F D1 BD
##$RELAX= 
##$RELAX= 
##$RELAX= 
##$RELAX= 
##$RELAX= 
##$RELAX= 
$$ Bruker specific parameters
$$ --------------------------
##$DU= <F:/spectra>
##$EXPNO= 1
##$NAME= <H-F>
##$PROCNO= 1
##$TYPE= <nmr>
##$USER= <she>
##$AMP= (0..31)
100 100 100 100 100 100 100 100 100 100 100 100 100 100 100 100 100 100 
100 100 100 100 100 100 100 100 100 100 100 100 100 100 
##$AQSEQ= 0
##$AQ_mod= 1
##$AUNM= <au_zg>
##$AUTOPOS= <>
##$BF1= 200.13
##$BF2= 200.13
##$BF3= 200.13
##$BF4= 200.13
##$BF5= 200.13
##$BF6= 200.13
##$BF7= 200.13
##$BF8= 200.13
##$BYTORDA= 1
##$CFDGTYP= 0
##$CFRGTYP= 5
##$CHEMSTR= <none>
##$CNST= (0..31)
1 1 145 1 1 1 1 1 1 1 1 1 1 1 1 1 1 1 1 1 1 1 1 1 1 1 1 1 1 1 1 1 
##$CPDPRG= <>
##$CPDPRG1= <>
##$CPDPRG2= <>
##$CPDPRG3= <>
##$CPDPRG4= <mlev>
##$CPDPRG5= <mlev>
##$CPDPRG6= <mlev>
##$CPDPRG7= <mlev>
##$CPDPRG8= <mlev>
##$CPDPRGB= <>
##$CPDPRGT= <>
##$D= (0..31)
0 1.2 0 0 0 0 0 0 0 0 0 0.03 0 0 0 0 0 0 0 0 0 0 0 0 0 0 0 0 0 0 0 0 
##$DATE= 1552565893
##$DBL= (0..7)
120 120 120 120 120 120 120 120 
##$DBP= (0..7)
150 150 150 150 150 150 150 150 
##$DBP07= 0
##$DBPNAM0= <>
##$DBPNAM1= <>
##$DBPNAM2= <>
##$DBPNAM3= <>
##$DBPNAM4= <>
##$DBPNAM5= <>
##$DBPNAM6= <>
##$DBPNAM7= <>
##$DBPOAL= (0..7)
0.5 0.5 0.5 0.5 0.5 0.5 0.5 0.5 
##$DBPOFFS= (0..7)
0 0 0 0 0 0 0 0 
##$DE= 6
##$DECBNUC= <off>
##$DECIM= 24
##$DECNUC= <off>
##$DECSTAT= 4
##$DIGMOD= 1
##$DIGTYP= 9
##$DL= (0..7)
0 120 120 120 120 120 120 120 
##$DP= (0..7)
150 150 150 150 150 150 150 150 
##$DP07= 0
##$DPNAME0= <>
##$DPNAME1= <>
##$DPNAME2= <>
##$DPNAME3= <>
##$DPNAME4= <>
##$DPNAME5= <>
##$DPNAME6= <>
##$DPNAME7= <>
##$DPOAL= (0..7)
0.5 0.5 0.5 0.5 0.5 0.5 0.5 0.5 
##$DPOFFS= (0..7)
0 0 0 0 0 0 0 0 
##$DQDMODE= 0
##$DR= 18
##$DS= 0
##$DSLIST= <SSSSSSSSSSSSSSS>
##$DSPFIRM= 0
$$ [...]
##$SUBNAM2= <"">
##$SUBNAM3= <"">
##$SUBNAM4= <"">
##$SUBNAM5= <"">
##$SUBNAM6= <"">
##$SUBNAM7= <"">
##$SUBNAM8= <"">
##$SUBNAM9= <"">
##$SW= 24.9337058887773
##$SWIBOX= (0..15)
0 0 2 0 0 0 0 0 0 0 0 0 0 0 0 0 
##$SW_h= 4990.01996007984
##$TD= 16384
##$TD0= 1
##$TE= 0
##$TE2= 300
##$TE3= 300
##$TEG= 300
##$TL= (0..7)
0 120 120 120 120 120 120 120 
##$TP= (0..7)
150 150 150 150 150 150 150 150 
##$TP07= 0
##$TPNAME0= <>
##$TPNAME1= <>
##$TPNAME2= <>
##$TPNAME3= <>
##$TPNAME4= <>
##$TPNAME5= <>
##$TPNAME6= <>
##$TPNAME7= <>
##$TPOAL= (0..7)
0.5 0.5 0.5 0.5 0.5 0.5 0.5 0.5 
##$TPOFFS= (0..7)
0 0 0 0 0 0 0 0 
##$TUNHIN= 0
##$TUNHOUT= 0
##$TUNXOUT= 0
##$USERA1= <user>
##$USERA2= <user>
##$USERA3= <user>
##$USERA4= <user>
##$USERA5= <user>
##$V9= 5
##$VALIST= <valist>
##$VCLIST= <CCCCCCCCCCCCCCC>
##$VD= 0
##$VDLIST= <DDDDDDDDDDDDDDD>
##$VPLIST= <PPPPPPPPPPPPPPP>
##$VTLIST= <TTTTTTTTTTTTTTT>
##$WBST= 1024
##$WBSW= 4
##$XGAIN= (0..3)
0 0 0 0 
##$XL= 0
##$YL= 0
##$YMAX_a= 207362
##$YMIN_a= -163313
##$ZGOPTNS= <>
##$ZL1= 120
##$ZL2= 120
##$ZL3= 120
##$ZL4= 120
##$ABSF1= 10
##$ABSF2= 0
##$ABSG= 5
##$ABSL= 3
##$ALPHA= 0
##$AQORDER= 0
##$ASSFAC= 0
##$ASSFACI= 0
##$ASSFACX= 0
##$ASSWID= 0
##$AUNMP= <proc_1d>
##$AZFE= 0.1
##$AZFW= 0.1
##$BCFW= 1
##$BC_mod= 2
##$BYTORDP= 1
##$COROFFS= 0
##$CY= 11.3945322036743
##$DATMOD= 1
##$DC= 2
##$DFILT= <>
##$DTYPP= 0
##$F1P= 18.9103706918063
##$F2P= -1.10871071338519
##$FCOR= 0.5
##$FTSIZE= 0
##$FT_mod= 4
##$GAMMA= 1
##$GB= 0.15
##$INTBC= 1
##$INTSCL= 1
##$ISEN= 128
##$LB= 0.24
##$LEV0= 0
##$LPBIN= 0
##$MAXI= 10000
##$MC2= 0
##$MEAN= 0
##$ME_mod= 0
##$MI= 1.114404
##$NCOEF= 0
##$NC_proc= 0
##$NLEV= 6
##$NOISF1= 3.799351
##$NOISF2= 2.8
##$NSP= 1
##$NTH_PI= 0
##$NZP= 0
##$OFFSET= 15.70392
##$PC= 1
##$PHC0= -9378.587
##$PHC1= 10.80026
##$PH_mod= 1
##$PKNL= yes
##$PPARMOD= 0
##$PSCAL= 0
##$PSIGN= 0
##$REVERSE= no
##$SF= 200.130013532006
##$SI= 16384
##$SIGF1= 3
##$SIGF2= 2
##$SINO= 400
##$SIOLD= 16384
##$SREGLST= <1H.CDCl3>
##$SSB= 0
##$STSI= 0
##$STSR= 0
##$SW_p= 3612.71676300578
##$SYMM= 0
##$S_DEV= 0
##$TDeff= 0
##$TDoff= 0
##$TI= <>
##$TILT= no
##$TM1= 0
##$TM2= 0
##$TOPLEV= 0
##$USERP1= <user>
##$USERP2= <user>
##$USERP3= <user>
##$USERP4= <user>
##$USERP5= <user>
##$WDW= 1
##$XDIM= 8192
##$YMAX_p= 0
##$YMIN_p= 0
$$ End of Bruker specific parameters
$$ ---------------------------------
##NTUPLES= NMR FID
##VAR_NAME=  TIME,          FID/REAL,        FID/IMAG
##SYMBOL=    X,             R,               I
##VAR_TYPE=  INDEPENDENT,   DEPENDENT,       DEPENDENT
##VAR_FORM=  AFFN,          ASDF,            ASDF
##VAR_DIM=   8192,          8192,            8192
##UNITS=     SECONDS,       ARBITRARY UNITS, ARBITRARY UNITS
##FACTOR=    0.0002004,     1,               1
##FIRST=     0,             0,               0
##LAST=      1.6414764,     0,               0
##MIN=       0,             -163313,         0
##MAX=       1.6414764,     207362,          0
$$ Real data points
##PAGE= N=1
##DATA TABLE= (X++(R..R)), XYDATA
$$ [...]
1928B78l444J559M329J519l142l512J561M746M41n495l344L581M388j759n412
1943c706j788M497M471k592o045K77O427L124m249m480K013N588J613m441m302
1958c593K125N061j70n055k694K456L258k08l428k094K119L397j99k847o71K242
1974c01J943o2j331r81J033J793j79k054r81O98Q61qj660j686R16K629j70k859
1992b399q70L000K661j033l143l78L989K909k866m378J108M810P02m390l300J861
2008a717M012J26m590k494L406L717j488l692K19L427K024j719k385Q64L287M84
2024C481l355j520K539J948k171l022P0K725J351k524l058J319L853N22l076j522
2040b440K004K776O06j877j797Q48K615O12k132k090k25J601J522j123l411p86
$$ plain form
1928 278 -3166 -1607 2722 4241 1099 -2413 -852 3894 4335 -1160 -4504 -923 3465 1706 -3706
1943 -3706 -5494 -997 3474 882 -5163 -4886 1541 4665 416 -4064 -2051 3537 5150 709 -3593
1958 -3593 -1468 3593 3423 -1632 -4326 -1870 1388 1180 -2248 -4342 -2223 1174 975 -1872 -2543 -301
1974 -301 1642 1580 249 -732 301 2094 1915 -139 -1120 -422 439 431 -1229 -2915 -1999 630 460 -2399
1992 -2399 -3269 -269 2392 1359 -1784 -2162 1827 4736 1870 -2508 -1400 3410 4112 -278 -3578 -1717
2008 -1717 2295 2421 -2169 -4663 -1257 2460 972 -2720 -2501 926 2950 1231 -1154 -290 2997 3481
2024 3481 126 -1394 1145 3093 922 -2100 -2030 695 2046 -478 -3536 -2217 1636 2158 -918 -2440
2040 -2440 -436 2340 2946 1069 -728 120 2735 3347 1215 -875 -1100 501 2023 900 -2511 -3297
2056c297L113K406j954l096J79L348K436k007l508R21M572J137l850k849K346
2071a03L888n73m967k645L641M667k388o561n91O379L892m058n925J044P175L566
2087F441n580o261K686P460J289o073m782K428N724J049n356m571K194N069O89
2102B406m019k971J378M154J906k687l329J316M123J323k745k839N77L170J577
2117C340l101l728J050M101M46l997k738K283M283K65m726k738M354N534j475
2132C153o047j190N548M525k720o523j142N991M199m368o664N43O095K630l996
2147C4n013R08N454K418l602l476J739L726Q31j861j638L58J537Q44j211j313
2163b65j80K60K61Q0o55j158L68J371K21r45l5R13P65J2m41j65J122O72j321j218
$$ plain form
2056 -3297 -184 2222 268 -2828 -2649 699 3135 1128 -2380 -1459 3113 4250 400 -2449 -103
2071 -103 3785 3212 -1755 -4400 -759 3908 1520 -5041 -5632 747 4639 581 -5344 -4300 2875 6441
2087 6441 861 -5400 -2714 4746 6035 -38 -4820 -2392 3332 4381 -975 -5546 -3352 1717 2406
2102 2406 -1613 -4584 -3206 948 2854 167 -3162 -1846 2277 3600 855 -1984 -1407 1763 3340
2117 3340 239 -3489 -2439 1662 2108 -1889 -4627 -2344 1939 2204 -2522 -5260 -906 4628 3153
2132 3153 -2894 -4084 1464 5989 3269 -3254 -4396 1595 5794 1426 -5238 -4695 1400 4030 34
2147 34 -4979 -4071 1383 3801 199 -3277 -1538 2188 3019 1158 -480 -122 1415 2259 1048 -265
2163 -265 -445 -185 76 156 -499 -1657 -1289 82 303 -642 -677 236 1001 1013 572 407 1529 2201 880 -338
2183c38R57J345n71j912r73Q57J721k76k496j002K379J955j135j852M85J954J017
2200B115q96j087N02J338o29j488N95J265j306k222L97K224O08k442k505J295
2216b236L984P21l787k426L136M233m04l820k000K702L798o07m546k160L145L074
2232B807j499l683j161K277K591p40k985o35K666J983j047j544p6J512J642k81
2248A827k189j008J866J581j153k736q57J995K266j159l872p06M092L024k634
2263C37m285N44N097L085l261n295Q00O272K545n142n387J642N739J710n033n032
2279e664J948O223J158n553l724L259N293K25m369k519L099M482l85m204j557
2294b288K972K459j363l044j071J816K215r85k862o62K403J920p53k152p71K187
$$ plain form
2183 -338 619 1964 1393 -519 -1492 -635 1086 810 -1686 -2688 -309 1646 511 -1341 -856 1098 2115
2200 2115 1219 132 634 1972 1343 -145 450 1715 409 -1813 -1416 808 1416 -1026 -3531 -2236
2216 -2236 1748 2469 -1318 -3744 -608 3625 3221 -599 -2599 103 3901 3294 -1252 -3412 -267 2807
2232 2807 1308 -2375 -3536 -1259 1332 592 -2393 -3028 -362 1621 574 -970 -1046 466 2108 1827
2248 1827 -362 -1370 496 2077 924 -1812 -2669 -674 1592 433 -3439 -4145 -53 2971 337
2263 337 -3948 -3404 1693 4778 1517 -3778 -2978 3294 5839 697 -4690 -3048 2691 4401 -632 -5664
2279 -5664 -3716 2507 3665 -1888 -5612 -2353 2940 3165 -1204 -3723 -624 3858 3473 -731 -2288
2294 -2288 684 3143 1780 -1264 -2335 -519 1696 711 -2151 -2813 -410 1510 757 -1395 -2166 21
2310B1K949n01l461p74L418K553j918l754o78L311K585k449m590j01M370K051
2326C032k989l595O38M084K172k556l632J313M514R62l523k263J884K901k17l135
2342d10j804K055K272j517k762K34K264N85j503j232Q64K046N47j645q89J590
2358F95J604n02j476n07O04P97j45j679j083R12J152m29j270m52O71J269L42j251
2376g48q76J308J731r2j316m84Q55J238r5k038r69J549J212j691j983N24J912
2393C7N38j498j672J048K759L03k720j068K579K350r75k699o03K395K139j711
2409A202l578k31L138J292k439k546N25K721J355j968k292J113L226N52k297j330
2425a557J323K045L52j819j788Q72K149j74k219j158R20J570Q4j595j326J169
$$ plain form
2310 21 2970 2469 -992 -1766 1652 4205 2287 -1467 -2145 1166 3751 1302 -3288 -3389 981 3032
2326 3032 43 -3552 -2914 1170 3342 786 -2846 -1533 2981 3943 420 -1843 41 2942 2725 -410
2342 -410 -2214 -159 2113 596 -2166 -1932 332 917 -586 -1818 -954 1092 1639 -6 -895 695
2358 695 2299 1797 321 -186 418 1215 1070 -609 -1692 -780 372 -57 -1327 -1779 -1108 161 503 -748
2376 -748 -1624 -316 1415 1323 7 -477 378 1616 1521 -517 -1486 63 1275 -416 -2399 -1875 37
2393 37 575 -923 -2595 -1547 1212 1515 -1205 -2273 306 2656 1681 -1018 -1621 774 2913 1202
2409 1202 -2376 -2607 531 1823 -616 -3162 -2637 84 1439 -529 -2821 -1708 1518 2070 -227 -1557
2425 -1557 -234 1811 2163 344 -1444 -572 1577 1403 -816 -1974 -1054 516 600 -995 -2321 -1152
2441a152K389Lj974p35J642J942k0j902j382J603K331q15l000p71K230J544j367
2458E66k513n48K601J955j766k732P26L069R40j806j767Q59K571Q55k304j974
2474a268J347K156m61k388j002J176J547k51k116p34J745J634r45j468K39J541
2490G52R18n53j258o1J568P00j302j312M38Q39L4q37j207k8J315N03j270q73R23
2509g11J374Q9p46q31O54J722K41j732r82J411J161p34j653o00R92J271q48k053
2527a975j34K013Q74j353j284P85J671O84j112j335R19J920o3j964o75J062J020
2544A053m81j567r58J070J527p38j996N1J746J050q13j246R5J707J302j147j745
2561a090O66J789J07j396j106K33J236M76j457j554O97J697O5j349p77Q32J626
$$ plain form
2441 -1152 1237 1240 -734 -1469 173 2115 2095 193 -1189 414 2745 1930 -1070 -1841 389 1933 566
2458 566 -1947 -2495 106 2061 295 -2437 -1711 1358 2298 492 -1275 -416 2155 3010 706 -1268
2474 -1268 79 2235 1774 -614 -1616 -440 1107 856 -1260 -1994 -249 1385 440 -1028 -789 752
2490 752 1670 1117 -141 -202 1366 2066 764 -548 -110 729 763 -74 -1281 -1309 6 509 -761 -1634 -711
2509 -711 663 752 6 -825 -171 1551 1792 60 -922 489 1650 916 -737 -1337 -345 926 78 -1975
2527 -1975 -2109 -96 778 -575 -1859 -1074 597 1281 169 -1166 -247 1673 1610 -354 -1029 33 1053
2544 1053 572 -995 -1953 -883 644 -94 -2090 -2039 -293 757 -56 -1302 -1207 500 1802 655 -1090
2561 -1090 -424 1365 1472 76 -1030 -797 439 915 -542 -2096 -1399 298 363 -986 -1763 -931 695
2578F95N95j436j113J409J912n56j780n05J224J134n82j909p34J617J286j346
2594h9j721K74J692Q09r52j317K75K114R79j630j252J078J670j5j502j112N47
2611a52J561m5k068j014J397J369o65j535l27J215J685m00j880j81K161J211j282
2628A050j472K05J491R36j300j952K1J959M64j889j403P26J705L99j322j409R73
2645h18K267L13k029q26J479J619k24j702j254J244J775o10k396p60J821J279
2661A178j049j818l91J753J711j027k141M11K444R08j391j602K25J958R86j645
2677E10k223M65K155L52j885j538M09J920Q37j729j857J052K610K62j939j008
2693a607J249K018K01k024j351J383J869p03k210n92J130J261m00j634p28J496
$$ plain form
2578 695 1290 -146 -1259 150 2062 1506 -274 -779 445 1579 997 -912 -1646 -29 1257 -89
2594 -89 -1810 -1536 156 965 13 -1304 -1029 1085 2064 434 -818 260 1930 1915 413 -699 -152
2611 -152 1409 1364 -704 -1718 -321 1048 383 -1152 -1479 -264 1421 1021 -859 -1040 1121 2332 1050
2628 1050 -422 -217 1274 2210 910 -1042 -1021 938 1402 -487 -1890 -1164 541 940 -382 -1791 -818
2645 -818 1449 1762 -267 -1093 386 2005 1781 79 -1175 69 1844 1234 -1162 -1922 -101 1178
2661 1178 129 -1689 -2080 -327 1384 357 -1784 -1373 1071 1979 588 -1014 -789 1169 2155 510
2677 510 -1713 -1248 907 1259 -626 -2164 -1755 165 1002 -727 -2584 -1532 1078 1340 -599 -1607
2693 -1607 -358 1660 1861 -163 -1514 -131 1738 1035 -1175 -1767 -637 624 224 -1410 -2138 -642
2709f42J574p58j751J90J615J153n78j486j69J761J197j453j828M58J513K17j333
2726c20j228P9J589N96j394j110Q87J386K90q21n27K92J283O16j089r45P63R45
2744A292k96q44o06J84N77M6r60l94Q26M24n43k62M87M43J98o5k84K47Q23j14
2764A179r87j28P64L3n66n36j96M07M31n65q41K13J103J05o47j46K98P89L35n70
2784D75n88O59J009n31j172l9O91K81o36r70k98J149P40j249j224Q06J546J71
2802H20r49q86O25J692N33j630j271J072J570j03j642j326N33J769L39k123j489
2819b466J321J945j11j758q28J170J998K14k123r82J783J816p87j756o93J107
2835a50J364m00k169p51J659J452j173j711M7J527J365p59j850p3K467J266j677
$$ plain form
2709 -642 932 174 -1577 -1387 228 1381 803 -683 -852 909 2106 653 -1175 -717 796 1013 -320
2726 -320 -1548 -1469 120 716 -678 -1788 -901 485 775 -46 -573 -281 1002 1618 529 -416 347 1292
2744 1292 996 152 -454 -270 307 353 -607 -1001 -175 249 -294 -556 -69 374 572 507 223 470 1293 1179
2764 1179 192 64 828 861 295 -241 -437 -30 401 -164 -1005 -792 311 416 -231 -377 -79 710 1045 475
2784 475 -113 546 1555 1024 -148 -187 504 785 149 -821 -1119 30 770 -479 -1703 -897 649 820
2802 820 -129 -1015 -390 1302 1835 205 -1066 6 1576 1473 -169 -1495 -962 807 1146 -977 -2466
2819 -2466 -1145 800 689 -1069 -1897 -727 1271 1485 -638 -1620 163 1979 1192 -564 -1257 -150
2835 -150 1214 814 -1355 -2106 -447 1005 -168 -1879 -1832 -305 1060 301 -1549 -1622 845 2111 434
2852D34j758N89J921P16j466k109K35K223P33k204j670P91J975O24j474j563N86
2869a417K351Q14j798j298J014J748L39j317j391M30J796K21j877j164R60J067
2885D78j02j073o79N19J409J74j127m18J072R26k31p16l67O07R83l01j483k06
2903e35J081M88q81r84m5P04O95m28j060K32J229L40n59k59J33N58M86k19q26
2922A50j0O36j49m38k00o1k00Q0J05k89j0J95j70N1O70J79n72k9O47M07k41m09
2944C42l47K84P43m13j196k43P89L81m28p50l27O18R98j32j151k3J167N76m14
2963D74o36k08P41Q06n30j363j00J156L23r46r70lR27P70p80j362M32J842M25
2982I98j364q50O26J605N77j445j548Q55J965m3j983j088Q65J458J51j648j400
$$ plain form
2852 434 -1324 -735 1186 1902 436 -1673 -1438 785 1518 -686 -2356 -1565 410 1034 -440 -2003 -1417
2869 -1417 934 1748 -50 -1348 -334 1414 1753 436 -955 -525 1271 1492 -385 -1549 -589 478
2885 478 376 -697 -1376 -857 552 726 -401 -819 253 1179 948 232 -135 472 1455 1154 -329 -535
2903 -535 546 1034 153 -831 -876 -172 523 95 -965 -733 496 836 277 18 151 709 1195 976 150
2922 150 140 776 627 189 -11 -72 -272 -192 -87 -376 -386 -191 -361 -310 360 539 -33 -62 585 992 751 342
2944 342 -5 279 1022 609 -587 -830 -41 340 -88 -838 -1165 -547 451 319 -832 -855 312 888 474
2963 474 -162 -370 371 1177 647 -716 -816 340 663 -283 -1253 -1256 -329 441 -339 -1701 -1269 573 998
2982 998 -366 -1216 -590 1015 1592 147 -1401 -546 1419 1376 -607 -1695 -830 628 779 -869 -2269
2999b269J057K114n3j950q19J455J744Qj661j111J436J935n25k126n07J311J216
3016A255o51j598o75J191J480o72j770n2J456J021m41j228l44J448J448p94j800
3033g26K7J661P71j090j571j84J599R47j311j940O05J929L79j257j105O11J560
3050I05O22j183j225Q32J572P8j199r19M16J113L59j503j166Q38J333l71j192
3067f90k64P45Q58rr17k83J143P63o64p28K41M55K11j98o02l59M09L48n01o03
3087f45P9L50L31j76n38n7Q82N35p00n13O43P14k37m34l34J31M39M1r33k22O70
3108B6J5n76k36J87K67J96r5m38K35P24J23n17j20N82J51j21m85l15L76N62o30
3129h9r19R7Q63o8n55l17J92O74L66n67m85N85Q57k07m89j30K11M43O6n55p90
$$ plain form
2999 -2269 -1212 902 849 -1101 -1920 -465 1279 1287 -374 -1485 -49 1886 1361 -765 -1272 39 1255
3016 1255 604 -994 -1669 -478 1002 330 -1440 -1492 -36 985 544 -684 -1028 420 1868 1074 -726
3033 -726 -699 962 1733 643 -928 -1112 487 1434 123 -1817 -1212 717 1096 -161 -1266 -655 905
3050 905 1527 344 -881 -49 1523 1601 402 -517 -101 1012 1371 -132 -1298 -460 873 502 -690
3067 -690 -954 -209 649 640 -277 -560 583 1346 682 -46 195 650 861 663 61 -298 111 459 -42 -645
3087 -645 -566 -216 115 -61 -599 -656 226 761 61 -452 191 905 668 234 -100 31 470 511 -422 -644 26
3108 26 41 -535 -771 -584 -317 -121 -216 -654 -419 305 428 -89 -209 373 524 403 -82 -397 -21 541 -89
3129 -89 -1008 -911 -48 -116 -671 -988 -796 -122 244 -323 -808 -223 634 427 -62 -192 19 462 528 -27 -817
3150h17M91O90m08p35j17K38M91K32o32m30P55R22k99p52J28O63M25o1q56l85
3170d57Q15O10p23r04L3P12J45l67p76o3J144N25q06p50P49Q87P6m95m44K40Q77
3191A028J08j044n65O87N21n08o02k41L56N65j7q09j47Q42M84l87k18J11L53M07
3211I24j44o21j23P50N0o59l61M1K31R2k16n32j8P41J39m67k28N09L08J18k15
3232C19m43L62O84j35q32j78O00J37m10m86k43M00M49l71p45K58P77P0m65q3K38
3253i7M63K81m19n58M11P01l24p25j26K80K50j63o71l40P19M67n65m95K51O64
3273DJ64j11m26o1P93M21o39o18L75N17q2m67n59l4P08K15q14n25N70O91j62l35
3295c75j58K21P52K06p49l75O87O21m51n66j87K74M91j43q92m12R02M55n47n87
$$ plain form
3150 -817 -326 364 -44 -779 -896 -658 -167 65 -567 -997 -242 680 381 -371 -243 420 845 784 -72 -457
3170 -457 358 968 245 -659 -626 86 231 -136 -912 -975 169 694 -112 -862 -113 774 850 355 -89 151 1028
3191 1028 1136 92 -473 214 735 227 -375 -616 -260 305 288 -521 -668 174 658 271 53 164 517 924
3211 924 780 159 36 786 836 177 -184 -143 88 180 -36 -568 -586 155 294 -173 -401 108 416 534 319
3232 319 -124 238 922 787 -45 -223 377 514 104 -382 -625 -225 224 -147 -892 -634 143 213 -252 -335 -97
3253 -97 366 647 228 -330 81 782 458 -267 -393 -113 137 -26 -697 -1037 -318 149 -416 -911 -660 4
3273 4 168 57 -369 -430 363 784 145 -473 -98 419 337 -130 -689 -723 -15 200 -614 -1139 -569 122 -40 -375
3295 -375 -533 -312 440 646 -103 -478 209 830 379 -187 -374 -100 391 248 -644 -1056 -154 301 -246 -833
3315h33K51O18L66j50p51K01R53L38q19m25M42M68m0m15o39J34P32K0q61k82N55
3336a37L64p4l12k56M06P87k7q72K9P16L48k73n38k69M22M51l77q82O9P80J5n22
3358a52k95J11M42M63l74n38K89R08m1n99j90K85L25K00o43o00L09P47l43q15
3378e11j55N00L60l7n48k94O84P10m71o55K45O98K20l29m83j77N94L92p46o61
3398f64K09N09O8l95m93Q8O27M25o75n44N33Q32nn30l02K32O13J59q53n58N82
3419a42O37m58o64m0K31M37q3o36k25O37O61l37m44K6M44M42o2o14k62O60M34
3440F42n93o47P6M00K16k97o16j3P56L56o18l32M66L70J71j63k94l9N91K21m69
3461A84m06J50K69M6j30n07j10M95K30n76k20L99L67Mj58n5P7L78J54k57j61K54
$$ plain form
3315 -833 -582 36 402 252 -499 -298 655 993 174 -251 191 659 619 204 -435 -301 431 451 -410 -692 -137
3336 -137 227 153 -159 -415 -9 778 751 -121 -92 624 972 699 161 -108 314 765 388 -494 -425 355 370 -152
3358 -152 -447 -336 106 569 195 -343 -54 854 813 214 24 309 634 834 191 -409 -100 647 304 -511
3378 -511 -666 -166 194 157 -391 -685 -1 709 238 -417 -172 526 746 417 -66 -243 351 743 -3 -664
3398 -664 -455 54 122 -273 -766 -678 -51 374 -301 -845 -312 520 515 -15 -317 -85 528 687 -166 -724 -142
3419 -142 495 37 -627 -667 -436 1 -82 -718 -943 -306 355 18 -426 -400 44 486 424 -190 -452 208 642
3440 642 49 -598 -522 -122 94 -203 -819 -832 -76 280 -338 -670 -204 166 337 174 -120 -159 432 653 184
3461 184 -222 -72 197 243 113 -394 -504 -9 221 -355 -575 -176 191 195 37 -18 59 437 591 334 173 427
3483D27j8j62J11k35k06R5Q7k38j36J87k8K0J95n8o0L07J29q2l2J63q6j22K31
3506D89m3m36J6K05j09p8j30k24Q5L41j0m70Q1M87J84j85j12n7K66L80j41n81
3528d2m3N28L3m64k77j23K33L75k16o68P8O87J85m14k07K5M82M50k29p06O7P26
3550D80J87o42m82J03L40K65m40o67N2Q24Q3o02j90J85M61M17l32o33K23R19J27
3571F78p61m58K44O20J93o89q77M22R60r2j039k09O71N38k9o36l45O51Q98l25
3591D15p28n9N73L59j37n13m88M02O51k25q35j97O25L17j22m34l57N16P81k26
3611C18o42O2O43K49j81l87k77M08M57l31o47q9M63K44j99m55k08N00N59k29o96
3632d38K41P51J18l98k27R1L65L18n32m52K38M58k76l95M3R1n5J27j06j79K20
$$ plain form
3483 427 409 247 358 123 -83 12 99 -139 -275 -88 -116 -96 99 41 -19 288 417 335 303 466 380 258 489
3506 489 446 10 26 231 122 44 -86 -310 -225 116 106 -364 -283 204 388 203 91 34 300 680 539 -42
3528 -42 -85 443 476 12 -265 -388 -155 220 4 -664 -586 101 286 -128 -335 -310 172 622 393 -313 -246 480
3550 480 667 25 -457 -354 -14 251 -189 -856 -804 20 103 -499 -689 -504 -43 374 42 -591 -368 551 678
3571 678 -83 -541 -297 323 516 -173 -1050 -628 332 240 -799 -1008 -337 201 172 -464 -809 -158 740 415
3591 415 -313 -372 201 560 423 -90 -578 -176 475 250 -585 -782 -157 160 38 -396 -753 -237 544 318
3611 318 -324 -262 381 630 449 62 -215 193 650 319 -328 -417 46 290 91 -364 -572 -72 487 258 -438
3632 -438 -197 554 672 274 47 138 503 821 289 -163 75 533 257 -138 -95 -4 -59 68 -38 -217 3
3653CJ41p4J06J50j07O4K16L3k87n9J61j76K0j3k19j85K79J3l61O6J37MJ07%o
3678A3J4K51Rj84NJ83j39j02J31j06k43PM2p5J7k6k80J27M13o5m97K21M64Mj47
3703C7k22jN20K62o12n77M20O40l40o40j06K76L87p8o01k32P53M29l67n21K42
3724c31M78J90j06l61j33M63K31m93l25J19J61Nr3k28j69L06L56j60l03M9K06
3745a38K13K78k86m69M48O31k41o16j32L73L35o3p45l12P09N91n94p28K37O84
3765A75K09l13m87J23Q80K80p33m70N67N26l40m71j29K74K33j13m38j07M42O5
3785A73l26J00J34l8N1K11q8K0R7L3J6J14j95m07J85L76j72m71n7K21K13q1l44
3808b35j74M33N08l85m61L45N81j57l55j71K11M10j29n13j56N45L6n23l00L78
$$ plain form
3653 3 144 70 176 326 219 283 499 532 245 186 347 171 191 178 -41 -226 53 66 -295 -229 -92 -88 19 19 13
3678 13 27 278 287 103 108 291 152 50 181 75 -168 -161 -119 -194 -177 -203 -483 -356 57 -8 -505 -284 180 184 37
3703 37 -185 -186 334 596 -16 -593 -173 467 127 -513 -619 -343 44 -34 -635 -867 -114 315 -52 -573 -331
3724 -331 147 337 231 -130 -263 200 431 -62 -387 -268 -107 -102 -195 -423 -592 -286 70 -90 -393 -344 -138
3745 -138 75 353 67 -402 46 677 436 -180 -312 61 396 333 -412 -724 -15 576 -18 -746 -509 175
3765 175 384 71 -416 -293 587 867 134 -336 231 757 417 -54 -183 91 324 211 -227 -334 108 173
3785 173 -153 -53 81 43 94 305 217 237 334 367 383 497 302 -105 80 456 284 -187 -244 -23 190 109 -235
3808 -235 -409 24 532 147 -314 31 612 455 100 -71 140 550 421 -92 -248 297 333 -190 -490 -112
3828a12J50j48j78m7L38K17l14k84N31L49l08m94L80L35k16l35k58K12M53j03
3848A68q77kO39K17o16k22L86L60J17m20k68M27N38k14n96J56M98o6k79k24oJ97
3870h7kk83j70L40J64l29r2M00Lk74Q8L70R1jm32l0N84J97p71m23O90L60m71n12
3894e90K2N44M08m91o77K64R75N7q90j88P68N19k89o17j09O22N07o57o71K46P44
3915D97k14n57j46L90K51j08l44j6M17K57l57j03M12J02k56j42K88k6j00k51p8
3936h4L65J04n08l14N06L51m01m82L07N92P0m37l77M03P73k81p95j3Q50J36p92
3957b7l91K95N92n4o95l81O17P04o28p51M43P57k9n61k23M49M75j08p19l5O85
3978D15O9p30k80N31K56l35l64lL77L08m44m14M38N50l40l35P3M55K4k06l44J58
$$ plain form
3828 -112 38 -110 -288 -335 3 220 -94 -378 153 502 194 -300 80 415 199 -136 -394 -182 271 168
3848 168 -709 -711 -72 145 -471 -693 -307 53 170 -250 -518 -91 447 233 -363 -207 291 225 -54 -278 -284 -87
3870 -87 -89 -372 -542 -202 -38 -367 -459 -59 -56 -330 -242 128 219 218 -214 -244 340 537 -234 -657 33 393 -78 -590
3894 -590 -568 -24 384 -107 -784 -520 455 512 -378 -566 202 721 432 -185 -294 328 835 178 -493 -247 497
3915 497 283 -274 -420 -30 221 113 -231 -247 170 427 70 -33 379 481 225 83 371 345 245 -6 -84
3936 -84 281 385 -123 -437 69 420 19 -463 -156 436 506 69 -308 95 868 587 -208 -221 629 765 -27
3957 -27 -418 -123 469 415 -280 -661 -44 660 32 -719 -276 481 452 -109 -332 117 592 484 -235 -270 415
3978 415 484 -246 -526 5 261 -74 -438 -441 -64 244 -200 -614 -176 374 34 -301 -228 227 251 45 -299 -141
4000a41M99j24p14RN75J02p47j62N14L09j87n44J03O45L02o36m69P04O64n69o55
4021e22K97N79L4o10n18L66Q13k60r39RQ71K26o18l51L37O04J12n86l97O17O35
4042F99m38p10K11O41K5n46l73K87N14j64o48M1N81J84n44j15N19K97l08k75J27
4063EL68J52m78l21N64M34o12o57M57N43j61n11j52L39N23l48o76J75J084Lq45
4084a14k08O65M73l60n12j65O83L01p96n84N71O65l79o54M8N37K93l81n14L19
4104a12O94mp22j12O72K12m61l89J66L79O2o61k67N56L56m88m92L78M86j66l93
4125c06mL85L16k18n53K32O77j44o75j4N25J45m67l46R1N17Q7p32k89O90N04n44
4147a23n87M75O05j58l95l15M25N84l00p93R6Q02qp87j93M38M49k32n22j20N61
$$ plain form
4000 -141 358 234 -480 -471 104 206 -541 -703 -189 120 -67 -611 -508 137 439 -197 -666 38 702 133 -522
4021 -522 -225 354 388 -222 -740 -374 439 179 -760 -751 120 346 -272 -623 -286 318 430 -156 -553 64 699
4042 699 261 -449 -238 403 428 -118 -491 -204 310 146 -502 -461 120 304 -240 -355 164 461 153 -122 5
4063 5 373 525 47 -274 290 724 112 -545 -88 455 294 -217 -369 -30 493 145 -531 -356 728 731 -114
4084 -114 -322 343 816 456 -56 -221 462 763 -33 -617 -46 619 240 -414 -366 171 464 83 -431 -112
4104 -112 582 578 -144 -256 416 628 167 -222 -56 323 385 -276 -543 13 369 -119 -611 -233 253 87 -306
4125 -306 -310 75 391 173 -380 -148 529 385 -290 -304 221 366 -101 -447 -356 161 248 -484 -773 -83 421 -123
4147 -123 -710 -235 370 212 -183 -498 -73 511 211 -582 -486 316 308 -479 -672 -234 215 -17 -539 -659 -98
4168i8M54n81m27N30N97k54n77P4M41J67k40m44J34O26j31o89r3N98Q8m82r1J67
4190b31L87M0m56j55N91M02m73m82M70M76k79m74l5L24L12l26n81K04O96j70o34
4211c94oN65J94l44k60J55M96K20o20k24N77L89n17m89K67M63j61m62j39K92M13
4232D15k69n70J30P75k8n98j02M55L45j97m26j18N33L71n89n73M74N62m13m58
4252b81j9M12J19k03m16R8O80n5o20L7N65J0l32r0J89J56N0l46k31M32J92n94
4274b47l20N17K92m43k69K31K98R4k97k57L33N92k61p05J04N87J17l92l64J42
4294b48L53J65n67m48N04N45l86n28K16M10N8j53l11K00M89p3m72o3M90K7m18
4315b10k8J21J05p7k03mJ13K05l96k1M12J16k94j63L06K64q5k68j58L31M68l77
$$ plain form
4168 -98 356 -225 -652 -122 475 221 -356 -282 159 326 86 -358 -224 402 271 -418 -511 87 175 -307 -398 -231
4190 -231 156 196 -260 -415 176 578 105 -377 93 569 290 -184 -219 105 417 91 -490 -286 410 240 -394
4211 -394 -400 165 359 15 -245 -90 406 626 6 -218 359 748 231 -258 9 472 311 -151 -290 2 415
4232 415 146 -424 -294 481 453 -145 -247 208 553 356 -70 -188 345 716 127 -446 28 590 177 -281
4252 -281 -300 112 231 28 -388 -290 390 335 -285 -248 317 327 -5 -95 94 250 300 -46 -277 155 347 -247
4274 -247 -567 -50 242 -201 -470 -239 59 153 -144 -401 -68 524 263 -442 -338 249 366 -26 -390 -248
4294 -248 105 270 -297 -745 -241 304 -82 -610 -394 16 74 -79 -390 -190 299 226 -246 -309 181 208 -210
4315 -210 -238 -117 -12 -89 -292 -296 -183 22 -374 -395 17 133 -161 -324 -18 246 161 -107 -265 66 534 157
4337A57n71K66M67p7m98j93L46K67p0l94j32N65L89n71l23M63L22j08k48p4J25
4358A08K86j71l89N8L37Qm60O4K82K8j78o9J12J20J29k27j25M19J64m10j74M03
4380C15J43j70k48j67K29K24j82m40J04M73l9m20L2K96Q6j39j17o6L26J54l09
4401H5j91K74K13l17j67M7J84p2p9j66O8K06o0l40J59L83j48k27R8J95M7j30j71
4424a09n1L21J18l86k53L44J67k65j92j2K01J87j57l44J32M15K7l36k1K19R8j0
4446I3j41j33J86J36k28k35J79J75l00o2J53Rj06J9J44M0oL2j88K65J80k21k50
4469b59K74K14j70k45l7N0K50R4m95q3L98J86l47j81K75K06O2j14k48%M24K3l64
4492h7M8K29K7j74q4o6M7J49n6k12J27J28j70M9J86jj38M3J62o5%j5n0R7J82l02
$$ plain form
4337 157 -414 -148 319 242 -256 -449 -103 164 94 -300 -432 133 522 -49 -372 91 413 305 57 -17 108
4358 108 394 223 -166 -108 229 237 -223 -159 123 151 -27 -96 16 136 265 38 -87 332 496 86 -88 315
4380 315 458 288 40 -127 102 326 144 -296 -192 281 242 -178 -146 150 236 97 -20 -86 240 394 85
4401 85 -106 168 381 64 -103 -56 128 56 -23 -189 -121 85 25 -315 -156 227 79 -148 -50 145 192 62 -109
4424 -109 -160 161 279 -107 -360 -16 151 -114 -306 -318 -117 70 -87 -431 -299 116 143 -193 -214 5 103 93
4446 93 -48 -181 5 141 -87 -322 -143 32 -268 -330 -177 -168 -274 -255 -111 -71 -77 -45 -233 32 212 -9 -259
4469 -259 15 229 59 -186 -223 -173 77 171 -324 -407 -9 177 -170 -351 -76 130 192 78 -170 -170 254 277 -87
4492 -87 -39 190 217 43 -41 -107 -60 89 33 -179 -52 76 -94 -45 141 140 2 45 207 142 142 127 77 174 356 54
4518E4k12K01K25j62j42K4K5J41P6l39o5L18K20k98j28K82M0J6j04q0l1J50L1
4541B42k88J7J36p5j36J03mj05J63M2j54O8K10j95l3K30j7k40L9J85j66m3j7j07
4565a45J11J39j89k31J33K88j48j76L3J57L2J41j99k15K83K41k29j90J22ron7
4587a14n5j71J24J95j53r7R7j7N0P1L4j53R7J35n4o5J2M4KN9j3k69M1J80m5j51
4613b16o1J70j9J95j65k27K19K50r7k27Q1J40M9P5j82j19J28K18k08k82J77R4
4635gK5j8m5j17K01J22j10q8J42Q0RK5p7j58J33J38r6j90N9J03j01N7r3p1N4J92
4661A69j34j59J01J96n4M2K5j15J01J52j39k05N5J99j41j9p2o3J63M3p8j91Q1
4684d3K29j14j6rL1J2J61j26j41J78R4j24p1P7j66n3J82j41j10Q1N7l0o9J37j31
$$ plain form
4518 54 -158 43 268 106 -36 -12 13 154 230 -109 -174 144 364 66 -62 220 260 276 172 92 61 211 242
4541 242 -46 -29 107 32 -104 -1 -5 -110 53 95 -59 9 219 24 -9 221 204 -36 3 188 22 -21 -38 -145
4565 -145 -34 105 -84 -315 -182 106 -42 -218 -185 -28 4 145 -54 -269 14 255 26 -164 -42 -51 -57 -114
4587 -114 -169 -340 -216 -21 -174 -271 -174 -191 -141 -70 -36 -189 -92 43 -11 -76 -64 -20 -18 41 28 -241 -200 -20 -65 -216
4613 -216 -277 -107 -126 69 -96 -323 -104 146 49 -178 -97 43 92 167 -15 -134 -6 212 4 -278 -101 -7
4635 -7 18 0 -45 -162 39 161 51 -37 105 185 194 219 142 -16 117 255 159 -31 28 131 30 87 -6 -77 -23 169
4661 169 35 -124 -23 173 119 161 186 71 172 324 185 -20 35 234 93 74 2 -61 102 145 67 -124 -43
4684 -43 186 72 56 47 78 90 251 125 -16 162 256 132 61 138 -28 -81 101 -40 -150 -69 -12 -42 -111 26 -105
4709a05Q7J01q0r3Q1J04q5PN9j39QP9p7j74J48O3o8m0LKn7K06o0j02Q5O2o3KM7
4738An2o8J19L5j56rR7j53J8Q7j27m2J28J16j98M3J75r7j7J44j13K7Q4j0r5n9
4764a22J90j00j18J21j25l2J41M2j36l9J61l9k0J44j27m0J95R2j66R6k1J5m0K9
4788A01j23o0J42J3j99O3J14L3q5Q8rp8J02J20j93KJ92l6p3N8o3r7R9N3j37p0
4814d3J27J1p1J9j4l3J96J1j18q9K20q4m0R3k1q0N7L1j60l7J59m9j47J13n9r6
4840a04J66N5j42m3J88K4j73Q0Q4j45J2J18j52n0J58qj39J9mn0J0J78k50j4K07
4865B5K9j77N0P9r8R9J42k05o4Q9O3j78Q7k5j19Q8J55j67j27J59Mm6oM5n2J24
4891b6Q7j72p3R7J65j34j05J23j97J24J16j20j41J30Q8p6JK9o2L3K60j52j75J82
$$ plain form
4709 -105 -18 83 3 -90 -9 95 10 17 76 -63 -55 24 -53 -227 -79 -16 -84 -124 -121 -119 -176 30 -30 -132 -47 15 -48 -46 1
4738 1 -51 -119 0 35 -121 -130 -33 -186 -168 -81 -208 -250 -122 -6 -204 -161 14 -83 -100 44 -69 -42 42 32 -63 -122
4764 -122 68 -32 -150 -29 -154 -186 -45 -3 -139 -178 -17 -56 -76 68 -59 -99 96 188 22 118 97 112 72 101
4788 101 -22 -82 60 73 -126 -63 51 84 -1 87 78 0 102 222 29 31 223 187 114 172 109 12 111 164 27 -43
4814 -43 84 95 24 43 29 -4 192 203 85 -4 216 132 92 185 164 84 141 172 12 -25 134 85 -62 51 -8 -104
4840 -104 62 117 -25 -68 120 144 -29 51 135 -10 2 120 -32 -82 76 68 -71 -52 -56 -106 -96 82 -168 -182 25
4865 25 54 -123 -73 6 -92 7 149 -56 -120 -31 32 -146 -59 -84 -203 -115 40 -127 -254 -95 -91 -137 -143 -98 -150 -26
4891 -26 61 -111 -184 -87 78 -56 -161 -38 -235 -111 5 -115 -256 -126 -38 -114 -113 -84 -146 -113 147 -5 -180 2
4915BJ02p4n2Qr7Q3QP0l08J86J41r3l6Qr9P6J99j04j34J37J17q4PK5o0O2J24n1
4943A63l18J53J77q5j17j3L6P8J02j15k30K49K17q3j56k0J2J04P0j10k01J72J47
4966B32j43p4m2L7J08M0j20j94J69J57j00j05mP5Q0J42k03j84K16J55r6j68k9
4989e1O3P2Q4j94j37J46J58j01k12LJ79O5J36j85k16K76J87k15j83M6R0M0m3j66
5013a58r2J96J47k15j72J69R5J1ql7j53J48K02j20j80R0Q2K6l9j11j26R9J86q2
5037d2k45J41M7M2N4j08j27J08L34k54j46Q0J89J4j17m6j32K05J36j04k96J31
5059a36J48Rj21j07P4Q2J27j29j23J30P0J5k3J3o7K9J77p0j54M6L6l0P4rk55Q2
5085a12L05q1k90O0K59o6Q8r3j29J34K11j03k36J9J64m2kq1l9J62J16j59j83J17
$$ plain form
4915 2 104 30 -22 -14 -111 -28 -20 50 -258 -72 69 -24 -60 -52 -151 -75 124 20 -114 23 140 56 63 88 28 90 214 163
4943 163 -155 -2 175 90 -27 -40 -4 74 176 61 -169 80 297 214 58 38 50 154 224 114 -87 85 232
4966 232 89 15 -27 10 118 158 38 -156 13 170 70 -35 -39 36 116 258 55 -129 87 242 146 -22 -51
4989 -51 12 84 168 -26 -163 -17 141 40 -172 -169 10 75 211 26 -190 86 273 58 -125 -79 11 51 8 -158
5013 -158 -250 -54 93 -122 -294 -125 -30 -19 -27 -64 -217 -69 133 13 -167 -77 5 31 -8 -119 -245 -146 40 -42
5037 -42 -287 -146 -99 -57 -3 -111 -238 -130 204 -50 -196 -116 73 87 -30 -76 -208 -3 133 29 -267 -136
5059 -136 12 21 -100 -207 -133 -51 76 -53 -176 -46 24 39 16 29 -38 -9 168 98 -56 -10 26 -4 70 61 -194 -112
5085 -112 193 112 -178 -118 141 75 163 70 -59 75 286 183 -53 -34 130 88 86 5 -34 128 244 85 -98 19
5109A9J61mj58Rj7J16P9r3j16K3K17j35J1l0r0pJ64Pk23J6Q8j5O5o6j29O9K26
5136A87p4k37K0J85N5Mj91m5O0K69q3l20J4K14L6j48o4n1J46J60j28k71R8K43
5160G9Oj00n2o6R8J40j23j98R2J44m2j18K0j01Q2J66r0j58kK18L3r1m2n6N0K53
5186A42p7k97N9K65K3k21q5kN4J66n5k87J52K18J1k09Nk8J42R4k2k33R7L26k07
5211C1j24m7J32O0jq5j40J01J57j5j44rM8N9N2oq0OQ1O4j41j1N5l2J19m0j42k8
5239h0K97o9j99k0J44J9J3kj65M8K48l4k17O8J13m7l4Oj18J16P9q6j97J00J17
5264A00n6K5Ko5jJ07Lo7J3J31j61M2O3n5m6N4%j33M7P2j05lQ2r9n8K04M2j14m5
5293b1J9M5K5j2q2j8Q5l7j43R3K6m1k2L6m4j17K15L7j91O4P3j10J8J44j15k0Q7
$$ plain form
5109 19 180 176 18 27 10 126 205 112 -4 19 236 101 112 82 -8 -15 149 156 -67 -51 37 22 87 21 -108 -39 187
5136 187 113 -124 -104 81 136 140 -51 -96 -36 233 150 -170 -156 58 94 -54 -118 -169 -23 137 9 -262 -164 79
5160 79 85 -15 -67 -133 -35 105 -18 -216 -124 20 -22 -140 -120 -221 -139 27 -63 -221 -223 -5 28 -63 -105 -161 -111 142
5186 142 65 -232 -173 92 115 -106 -191 -193 -139 27 -28 -315 -163 55 66 -143 -138 -166 -24 70 48 -185 -88 238 31
5211 31 -93 -140 -8 52 51 -34 -174 -73 84 69 -75 -84 -36 23 75 69 -11 -5 76 140 -1 -12 43 11 130 90 -52 -80
5239 -80 217 148 -51 -71 73 92 105 103 -62 -14 234 200 -17 51 164 117 83 89 -29 87 166 80 -117 -17 100
5264 100 44 69 71 6 5 112 115 48 61 192 31 73 136 81 35 89 89 -44 3 75 -30 -33 49 -50 -108 96 138 24 -21
5293 -21 -2 43 68 56 -26 -44 41 4 -139 -46 -20 -61 -83 -47 -91 -208 7 44 -147 -83 -10 -120 -102 42 -73 -93 -6
5320fR5j95N8L1j14P5O0j61o9J59J34j41p1J05o6K8J27j05j38J80M2q6j10Q2J12
5345B6q1J12j44p0J29Q9j28j22J35qL6L8n5n7J37N6j41q0J39Q5r4Q7j35MJ28J7
5371A03j17q7J17L6m9l2ml6J55N1j74J6M5O4K2Pr2j1O4J69k91k4J32Q7j19PL0
5398F9n6MR4j03q1J62L7l3p6j0K6J54Mr7j16J54M4j84j2M9L4L3Lj53kJ63l3j37
5426f3J8R3l7P0Lo0l2R2N8j27m8M7o4P3J7j58K2J26K5j29QM6n9L5P8j28J3O3J06
5455H8j65N5j0q1J00M7q6o7J24J3j26M2K7j20OJ23l8j0L9K2j14J31L3j54o1J64
5481a8j2j11Q7L8q9K1Q7j26nJ52lj51N1O9K1k3K4j35R3J51m0j57P6K3j9N2j14
5508e8j03M4J57o0j13P2J25m8M3jj17M1J45o0j65M2J70J2m9k3r1K8J50m4j64M9
$$ plain form
5320 -6 89 -106 -48 -17 -131 -56 4 -157 -226 -67 67 -74 -145 -40 -106 -78 49 -56 -194 -14 28 -58 -168 -86 26
5345 26 -55 57 -87 -157 -28 61 -67 -189 -54 -62 -26 12 -43 -100 37 93 -48 -128 11 96 2 89 -46 -42 86 103
5371 103 -14 -101 16 52 3 -29 -33 -69 86 137 -37 -21 24 88 110 117 25 14 78 247 -44 -68 64 151 32 39 69
5398 69 13 17 111 8 -73 89 126 93 17 7 33 187 191 94 -22 132 176 -8 -20 29 63 96 99 -54 -56 107 74 -63
5426 -63 -45 48 11 81 84 24 -8 84 142 15 -33 14 -50 23 40 -118 -96 30 55 -74 -66 -20 -79 -44 34 -94 -81 -18 88
5455 88 -77 -22 -32 -113 -13 34 -52 -119 5 18 -108 -66 -39 -159 -153 -30 -68 -78 -39 -17 -131 0 33 -121 -182 -18
5481 -18 -30 -141 -54 -16 -105 -84 3 -123 -128 24 21 -130 -79 -10 11 -12 12 -123 -30 121 81 -76 0 23 4 56 -58
5508 -58 -161 -117 40 -20 -133 -61 64 16 59 58 -59 -18 127 67 -98 -56 114 126 77 54 -37 -9 141 97 -67 -18
5534a8J66L0j81j8m6J59P1O2k51lK10P5j47j05k4J03J76j88j50j1K61o1k9r7O
5559a0j4K41j16k58J42J62j4j45J2j3O0J63j97j41R0J86q1j58j9Q4R2K9j04j38
5583a47J53J05m1j53Q0j7J27M9j34j76J16K26j78o8q2J10K2M1j05j14R8J15m2
5606a5r0Q1p9K0J51m8j38j5J81q6j03P5j02J74Oq3j59K6K41j9j86J9O4l6J48l9
5632a2j48J10J04K5j39j8M5n7O1Kj48P6K22j05j41L3k8L9J65j52J9j15J38J14
5656I0n4J0m9j15K43m2o6j35J44R9o6j14n3P0J64Ok26r0K73J62j96j77O7J81J17
5681B43r2k30J9K25J6j14j46N3Q7M6k2k26N1K18P3k46L7j4P9J38Pj53j76K04J77
5706B54q4j93j05J57J38P5l64j78L71K11j55k78k3K26J92q1l12n8L52J58l27j35
$$ plain form
5534 -18 148 178 -3 -21 -67 92 163 225 -26 -29 181 256 109 4 -20 83 259 71 -79 -90 171 110 81 -16 -10
5559 -10 -24 217 101 -157 -15 147 133 -12 0 -13 47 210 13 -128 -38 148 67 -91 -110 -26 66 95 -9 -147
5583 -147 6 111 70 -83 -3 -20 107 156 22 -154 -38 188 10 -58 -140 -30 -8 33 -72 -186 -88 27 -15
5606 -15 -105 -24 -103 -83 68 20 -118 -133 48 -38 -141 -66 -168 6 12 -71 -230 -204 37 18 -168 -149 -85 -121 27 -12
5632 -12 -160 -50 54 79 -60 -78 -33 -90 -29 -27 -175 -99 123 18 -123 -90 -118 -79 86 -66 -47 -162 -24 90
5656 90 36 46 -3 -118 125 83 17 -118 26 125 59 -55 -108 -38 126 132 -94 -184 89 251 55 -122 -55 126 243
5681 243 151 -79 -60 165 181 67 -79 -26 61 107 85 -141 -90 128 201 -45 -8 -22 57 195 202 49 -127 77 254
5706 254 170 -23 -128 29 167 242 -122 -300 71 282 127 -151 -174 52 244 163 -149 -207 145 303 -24 -159
5728a59Q2J94N7j88j96J8L77lk70j20K09J29j06q9r7P9K39l0k31l6R8Q5l7k7j49
5753a71k9J83J56k11j57M5J88M7m1k67PL44J23k99k12J86K23k8j40k08J22K91
5775A52J4l78j54L13J75o7k21q2J53K19k3k87J4K25Q0k45K2jQ0P6l6r4lQ2r0j4
5801i0J14k9o1R2Q3m6k04L6J40J10j03q5p5K35J79k93j59J20K18l8j79r8J12J96
5825A75P5l31j30K61J74j90j32J22O9j5j3j17Q2Q7kj89J59J8k6j12J20L5l1p3
5849A6q5N9K11j4l20N9K95n2j70j24J76J69n2k32j11L17K18k60l97J56K68N3k70
5872i0j15R9K81N2l47r0K17J37r2j89J15M2L2Oj40LJ18j4j29P3M8j60L3J57L3
5897H0j52l8P3K3P3j32k05K28K51k6m14j0K90J08j61k52OL47J49l67l05L21L79
$$ plain form
5728 -159 -77 117 174 -14 -210 -192 185 182 -88 -208 1 130 24 -65 -162 -83 156 126 -105 -141 -43 42 5 -22 -171
5753 -171 -200 -17 139 -72 -229 -184 4 51 10 -257 -250 94 217 -82 -294 -108 115 87 -53 -261 -139 152
5775 152 166 -212 -366 -53 122 55 -166 -248 -95 124 101 -186 -172 53 133 -112 -90 -91 -11 65 29 -65 -68 14 -76 -90
5801 -90 24 -5 -66 26 109 63 -141 -105 35 145 42 -43 -118 117 296 3 -156 -36 182 144 -35 -133 -21 175
5825 175 250 -81 -211 50 224 34 -98 24 93 78 65 -52 30 117 115 -74 85 103 77 -35 85 120 89 16
5849 16 -69 -10 201 187 -133 -74 221 169 -1 -125 51 220 168 -64 -175 142 360 100 -297 -141 127 180 -90
5872 -90 -205 -106 175 227 -120 -210 7 144 52 -137 -22 20 52 58 -82 -79 39 25 -104 -31 17 -143 -110 47 80
5897 80 -72 -110 -37 -14 59 -73 -278 -50 201 175 -239 -249 41 149 -12 -264 -258 89 238 -129 -434 -113 266
5920B66k09k72j9J59K78j01l32k8L98J31l60j76Q6K28j4j38r8J10J28kj71P4R5
5943C3oj52J87qq6Kj0Q4K2j44j03J02K51n4l32R9K53L5j89j53J48J87l9j96j57
5968b26L13K71k41l36J74K47M7k53j51R0L68q5l47pL10R2k97j37J89J27N2j54
5990D6j81J51K30j21k39P9K86j43j42L6J5J51p0k46J35K44j12k48J2K41N7j45
6012C6j03J14R3J2k24m3K45J05k55j72J39K28j44k06K9K03M9m6k78K6L56Rk92
6035a19p8K60R4j83j93J62P4J24l24r1L01J34k04k75J92K26J6k58p7Q0L04q5l15
6058b35K1L17Nk59q1J98J73j13k39k7K52J36k41j76J75J94o9j83N3J10Q2o9j67
6081a43K2K00Pj97L8J46L2k30P7Q7j6o2o0q4K33J24k92j71L51J26j82j47j4L04
$$ plain form
5920 266 57 -215 -234 -75 203 102 -230 -258 140 271 -89 -265 -179 49 35 -103 -201 -91 37 35 -136 -62 33
5943 33 27 -125 62 54 -32 -30 -40 44 66 -78 -181 -79 172 118 -214 -115 138 173 -16 -169 -21 166 127 -69 -226
5968 -226 87 358 117 -219 -45 202 249 -4 -155 -65 303 218 -129 -136 174 266 -31 -168 21 148 200 46
5990 46 -135 16 246 125 -114 -35 251 108 -34 2 17 168 98 -148 -13 231 119 -129 -117 124 181 36
6012 36 -67 47 140 152 -72 -115 130 235 -20 -192 -53 175 31 -175 -146 57 106 60 -218 -192 164 173 -119
6035 -119 -197 63 157 -26 -219 -57 17 141 -183 -274 27 161 -43 -318 -126 100 116 -142 -219 -139 165 80 -235
6058 -235 -214 103 108 -151 -232 -34 139 26 -213 -240 12 148 -93 -269 -94 100 31 -152 -99 11 93 24 -143
6081 -143 -121 79 86 -111 -73 73 105 -125 -48 39 23 -39 -99 -183 50 174 -118 -289 62 188 6 -141 -155 149
6105A49P6j79l36K13L60o2m05l0L57J45l58j17O6K48J21k70k32K50L02j81j99
6126h2K2K58M5j49j99O7K40n7k32l3J85O0j30q0J14Q4mo0k7Q1Q4j99j05K36Q8
6151B07k12j32J02J89p8l6j76J20J83j12k97J29L65l0l11j10J97J65K7l36k1K83
6173A16J88l16k65K93K09j66k07m8J75J09p3l04J48K96l8k44o7J96R5j08j54R9
6195f6R2R0k00j39J44K10k07j33J68Q3Kk12RM9K74j63k42Q2K72o1j95p1J80R0
6219E6l4j74M5Q9J09k49q0K60Q4j67j39J84Q8mj60j33K05K16k35k19J95K93j08
6242A22k69n7K23K11j13l69Q2L38L3k16k46K75K04q6k04q3K04J99j08k36J5K74
6264A93J2k07r5Q0J47k3j43l2J4J68k4j75J72k6Lj19K39q6p5l7Q2R4n4j63j09
$$ plain form
6105 149 225 46 -290 -77 283 221 -184 -214 143 288 -70 -187 -121 127 248 -22 -254 -4 298 117 -82
6126 -82 -60 198 243 94 -105 -38 202 145 -87 -120 65 125 -5 -85 29 113 109 49 22 103 187 -12 -117 119 207
6151 207 -5 -137 -35 154 76 40 -136 -16 167 55 -242 -113 252 222 -89 -199 -2 163 190 -146 -167 116
6173 116 304 -12 -277 16 225 59 -148 -196 -21 88 15 -289 -141 155 117 -127 -194 2 97 -11 -165 -66
6195 -66 26 116 -84 -223 -79 131 -76 -209 -41 42 44 -168 -159 -110 164 1 -241 -159 113 52 -143 -214 -34 56
6219 56 22 -152 -107 -18 91 -158 -238 22 106 -61 -200 -16 72 68 -92 -225 -20 196 -39 -258 -63 230 122
6242 122 -147 -204 19 230 117 -252 -170 168 201 -15 -261 14 218 132 -72 -155 49 248 140 -96 -81 193
6264 193 205 -2 -97 -17 130 107 -36 -68 -54 114 90 -85 87 61 64 -55 184 98 23 -14 68 162 108 -55 -164
6289a64K90J74k15l30K00K57m7k49j25J36L14Pm04n5K40K49k21k77L1K66J88k22
6311D3l01J45L00K1k56j21K12K0O2j58q4R1Q5k8j30N3R9j3j13L5O0j13M4J03m3
6336A3q4rrO3J05j41k35K12K49j62j31j03K61P4n0k87l6L14J07k38j91J87J32
6359D1P9j81j37K9L30J1l82M6J52k6o4N2kR3m2n1PJ00nj43l3J65J0j68jJ02P3
6386E5o3p2j14J96R8l4k00R0J51M5j82q7J20J34J3j81j17J70K05j24j96LJ69k
6410G7Oj57K4J00J16j59o2O8LK7K5K6j23qJ50L7j40l8l0M2K13p5k95N8L10P9k36
6437C8k05J29K35J00l04k54J63M21q5k99j09K37Q7Nk48j71L35K02j36l27J19K14
6459A47M0j35k12L4J73P2q4j57L3K09Qr6j00j86J58K37l7k83j9J43J10J3j72j38
$$ plain form
6289 -164 126 300 85 -245 -45 212 165 -84 -209 -73 241 248 -156 -211 29 278 57 -220 -189 77 265 43
6311 43 -258 -113 187 208 -48 -169 43 63 125 -33 -117 -26 59 31 -99 -46 53 40 -73 -38 22 -91 -47 56 13
6336 13 -71 -80 -89 -26 79 -62 -297 -85 164 2 -129 -232 29 103 53 -234 -270 44 151 -87 -278 -91 41
6359 41 120 -61 -198 -169 161 172 -210 -164 -12 -38 -102 -50 -52 41 -1 -52 -45 55 50 -93 -126 39 49 -119 -120 -18 55
6386 55 -8 -80 -194 2 100 66 -134 -44 107 152 -30 -117 3 137 150 -31 -148 22 227 103 -93 -90 79 77
6410 77 83 -74 -50 50 166 7 -55 13 16 43 68 94 -29 -37 113 150 10 -28 -58 -16 197 122 -173 -115 195 274 38
6437 38 -167 -38 197 297 -7 -261 -98 323 238 -61 -170 67 154 159 -89 -260 75 277 141 -186 -67 147
6459 147 187 52 -160 -126 47 119 35 -122 -89 120 128 32 -68 -254 -96 141 104 -179 -198 -55 55 68 -104 -242
6483b42J02L32j22l14L3J44K27p9j93j34K18K78k36k42K4K94O1j28j68k3J97J23
6505A52k16j98J55J92qj62l4N1J13M8j91j57K15J42r6r5lM5P0J1q6j31J03J83
6529A03l8j36k4PJ43Q5p6k08R2R2L2n3o2m2J08O4m6j40rJ88nj27k7K8R5O7r5j15
6557i9J22M8q8K7M1l4n8O0k5L3L9j3p1L3J07l9r5J42q1q6J18m8J4j7Kk7m5J45
6585A05K2k08k4J86L1j3p9j24O9J75m2j49k5J38J5n7q0K2J7J17n5r8k7J18M0l4
6611D0p5r0K5J85Rj52k2O8R2l2Qp0q6J77N4k08p3J37L7J5j05o9M8J12N1k06q8
6638b18J59J14m5j13K6mJ40n8j15N3Q7N5r1j23j9J20R7n2j82j5K41L6j13m1LL9
6664a9Q4k9j36m2J94J15j32q4J1L8Q2Jk07M4J24P2j49k9N6N6L2j15k5K6K06o1
$$ plain form
6483 -242 -140 192 70 -244 -211 -67 160 81 -112 -246 -28 250 14 -228 -204 90 151 23 -145 -168 29 152
6505 152 -64 -262 -107 85 77 -85 -119 -68 45 93 -98 -255 -40 102 6 -89 -92 -47 23 34 -52 -183 -80 103
6529 103 65 -71 -95 -88 55 140 64 -144 -52 40 72 19 -43 -85 23 87 41 -99 -108 80 75 -52 -79 -51 44 111 16 -99
6557 -99 23 71 -17 10 51 17 -41 19 -6 27 66 53 -18 15 122 83 -12 130 49 -37 81 33 47 30 32 5 -40 105
6585 105 127 -81 -105 81 112 99 20 -104 -35 140 98 -51 -76 62 77 20 -60 -38 -21 96 41 -57 -84 34 74 40
6611 40 -35 -125 -100 85 94 -58 -80 -12 80 48 56 -14 -100 77 131 -77 -150 -13 24 39 -66 -135 -87 25 76 -130 -218
6638 -218 -59 55 10 -103 -77 -81 59 1 -114 -61 26 81 -10 -133 -152 -32 65 13 -169 -184 57 93 -20 -61 -58 -19
6664 -19 65 36 -100 -142 52 167 35 -49 -38 0 82 83 -124 -80 44 116 -33 -62 -6 50 82 -33 -58 -32 174 113
6690A13j60m1J43J0k9k8j37Q0J58Kj74MJ42j0l2o5MR5M9l0j10k4J57n6Mj3l7J7
6718C2O4j6j27L9J38L3j09o0P4l8N4o2j12J01J42n3j24P9nJ5Pq0m7J27R2j83k7
6745d6J03m3O0p9j9k4J30M0j37MMN7p2j9OJ0J14o4n4r5R3N5k3j05J01o1Q3l5n4
6774g0k8J05K2r6L2j5QOJ4p9K6J04Jj36N0mN3m9N1r6J1J31o6p1O7L5k1O1r3K1
6804b6l7M0J6j06O3N5L2l5m7j0N8l3Kq2J25P2m3j03N1j7N4k6Nr3R1R0q7j30J50
6833B9pk8N9n1%M2J16j89j2lP8K9l2q4M1J01J1o9j08R8M1o0k3n7O8J23mq0j06
6862g7J43R9j27k6oK2J12k2j04j04J04J61j43n3n2O3N5k6m3jP6J06q1k0j03L0
6888a7J22o4j00L6P4N1j51k3N3Q7p0K2q8N6N3M5j56j6Q2K3ln0k6OQ8L8j43n8J31
$$ plain form
6690 113 -47 -88 55 65 36 8 -129 -49 109 111 -63 -59 83 73 41 -24 -20 75 124 94 -16 -40 117 61 65 52 15 32
6718 32 96 80 -47 -8 130 163 54 -6 68 30 84 22 -90 11 153 100 -24 55 50 65 72 -8 -55 72 164 -19 -46
6745 -46 57 14 74 -5 -24 -48 82 122 -15 -11 -7 50 -22 -41 -35 -25 89 25 -29 -124 -31 24 1 -104 -3 -64 19 -16 -70
6774 -70 -98 7 29 -67 -35 -50 -42 -36 -22 -101 -75 29 30 -106 -56 -60 -7 -56 -5 -101 -90 41 -25 -96 -29 6 -15 46 -47 -26
6804 -26 -63 -23 -7 -113 -50 5 37 2 -45 -55 3 -30 -28 -110 15 87 44 -59 -8 -25 29 3 8 -85 6 96 9 -121 29
6833 29 22 -6 53 2 2 44 160 -29 -41 -44 34 63 31 -53 -12 89 100 31 -77 21 62 2 -21 -78 -10 113 109 29 -77
6862 -77 66 165 38 12 6 28 140 118 14 -90 14 175 32 -21 -73 -10 45 19 -24 -25 51 157 76 56 -47 -17
6888 -17 105 41 -59 -23 51 102 -49 -72 -19 68 -2 20 -68 -12 41 86 -70 -86 -4 19 16 -34 -60 -54 34 72 -71 -129 2
6917Bp9N6qn8N2K9J0q5kQ0L1j29R6m1KJ9O6p7q3J31n1Op7P9K5j2pl6pM7o2J8P8
6950A3n6m2L8KP8o2N2n4o7P1J01j42J7N1j3rN7j44k2J75l5q7j3J2J22l7Qm4mJ01
6980F7K0j53P6J0M6MJo6o5J88pj79K2M2J20r2n7j7J08Nj6j08L3J24jm7p8k9M8
7009aJ27p8j47L5K08K3k01n7pJ85O8q4k03P1J86rr3p2j0Q2J21j02j91N0J95m1
7035E5m8q9Q6P1J7r6j26L3J96k6j09n4R2M2j9J8j81O5J83qj39l2O5O2jr4o4N4
7063d7J97q7j38j09J53Q3L3j89j28J56K58j63j19o1J9J84K8j45m8N3J63q2j65
7086a54J02k3J34j5j15m2rJ56jj56J7Q9Pm3Q5o3mN4ok7J6jK7n3K8k1K2K1M8j24
7116e1l2J01nM3n4r2K9J24K1j67N7K6M9k9Km2r2K13n0k9o7L1L6N2j2j04k3J52
$$ plain form
6917 2 -77 -21 -29 -87 -35 -6 4 -81 -83 -3 28 -101 -5 -46 -44 -25 41 -36 -119 12 -39 -33 -110 -31 -6 -18 -25 -61 -68 -21 -83 -65 13
6950 13 -43 -85 -47 -45 33 -29 23 -31 -98 -27 74 -68 -51 0 -13 -22 35 -109 -131 44 9 -78 -91 -79 43 6 14 -30 -34 67
6980 67 87 -66 10 20 66 70 71 5 -60 128 121 -58 -36 6 126 34 -23 -40 68 73 57 -51 -18 106 105 58 -20 -49 -1
7009 -1 126 48 -99 -64 144 167 -34 -91 -98 87 155 71 -132 -61 125 116 23 -49 -59 23 144 42 -149 -99 96 55
7035 55 7 -82 4 75 92 -4 -130 -97 99 73 -36 -90 2 44 25 43 -138 -73 110 102 -37 -69 -4 58 57 -37 -101 -47
7063 -47 150 63 -75 -184 -31 52 85 -104 -232 -76 182 19 -100 -161 -142 42 70 -75 -123 -70 93 11 -154
7086 -154 -52 -75 59 44 -71 -113 -122 34 33 -123 -106 -17 -10 -53 32 -31 -35 19 13 -14 2 1 28 -25 3 -18 4 25 73 -51
7116 -51 -83 18 13 56 2 -90 -61 63 84 -83 -26 0 49 20 22 -20 -112 101 51 22 -45 -14 22 74 62 -42 -65 87
7144H7Q0j07j03QL9J11K6j38q0M6J96r7p7n7M3J76q3o7r2J11J36q1j45O8R6p1
7170B5Q2j70j5R8J03j55r8J45P6L3p0j20nJ57L3q4j50J07J05K9r4j27JK15K6k01
7196e4r5M4J70M3j09j24qJ35J55j12k14J58J26k0r9j51LJ99K0j51q8P3R8J07j83
7221g7p0N5J18Op9j62K10Q9j21l5m3L2J91n9k12l2K06R1m2r4o2lJ85l2j90k7J17
7248d0J75q1j39p1J48N1N2k33l0J96O9p1j36L0P8O7J6j07l1N3J54o7r9l8R8K8
7274G2Q8j57l3J18m9k1J5k6j5j3N6q3QO5M0n3pLL3j5m0Q2p6O4M2j08oJ17l6l6
7304B9K5j5k4K2L5J0p9N5n7M8l6%Ol0J26q3LJ3q7L3O2l5r0P8M1m0Rj3j14O6O8
7335B6N3j16j1M7R2j39L4k8QN6J2p6o7J31k4j4j4j5K2Q2n2k4NN7Qq2LMk6J45q6
$$ plain form
7144 87 167 60 -43 -35 4 115 141 3 -77 -31 165 68 -9 -66 -23 153 70 3 -89 22 158 77 -68 0 96 25
7170 25 107 -63 -78 20 123 -32 -130 15 91 124 54 -66 -71 86 119 35 -115 -8 97 126 32 -95 -94 121 147 -54
7196 -54 -149 -105 65 108 -1 -125 -133 2 157 45 -169 -11 115 95 -4 -155 -152 47 67 -84 -172 -99 -1 106 -77
7221 -77 -147 -92 26 32 -47 -209 1 90 -31 -66 -109 -77 114 55 -157 -189 17 108 66 -28 -90 -93 92 60 -130 -157 -40
7248 -40 135 54 -85 -156 -8 43 95 -138 -168 28 97 26 -110 -80 -2 65 81 -26 -57 -4 150 83 -16 -54 44 72
7274 72 160 3 -30 88 39 18 33 7 -8 -21 35 -48 -40 25 65 12 5 8 41 26 -14 68 -8 56 98 -10 -16 101 65 29
7304 29 54 39 15 37 72 82 3 58 1 49 13 13 19 -11 115 32 35 48 -39 -6 56 21 -69 9 50 10 19 6 -108 -42 26
7335 26 79 -37 -48 -1 91 -48 -14 -42 -34 22 34 -42 -109 22 -2 -16 -30 -45 -23 59 7 -17 -12 45 53 -29 -26 -22 -48 97 11
7366A1r6lJ48j5p4k8O4jk7M4j80R3J71j08j4k9n3N4J23j02j56J49K6Lmo2K8J8
7394b0P2rj29Q0Q1o1j06JL7N5M0p7q3J47M2J1j40Q7k9N1jr9J0P2O4j07p3Q7J4
7423A7J6M9n8p1N5J14o8r5N9P0l9j04J16l7k8J13j30J8J8L8Ol0n2P0j1N8j0j69
7451h5J23P6q3o0M3KK5Q6j23j6N2M2j24j5P4L1NJ4o8K0J7O4q4m7J05m7o6R3n9
7480epM9N1j63M5R5Ok5n7p2M0J25n6p9l6J61k8r6L5j02J06Rpn4N0N3kq2m6qR3
7511gj5nm8J9O0j1j00NN9K1R0q9p2nJ29j6m7M0L0o1l5lmL5O5l5r7J23ml0l9MJ2
7544c1k6J39p8j00Q5K9L6n2k6M7jJ4o1j3M2P3o2k5O1l9jml3qM9l0l5K7JP4rk6
7576A7MM2ml2p8Q3k0L8l9K8mm4L1M9o5j0Q3m5npJ4J4k5k3%%Q2M4l6r0n9J13n0
$$ plain form
7366 11 -85 -88 60 45 -29 -57 7 6 -21 23 -157 -64 107 -1 -15 -44 -97 -43 80 -22 -178 -29 -3 0 -4 -66 -38 -20
7394 -20 52 43 -86 -6 75 14 -92 -91 -54 1 41 -36 -119 28 70 81 -59 28 -1 50 49 -50 -40 32 96 -11 -84 3 17
7423 17 33 82 24 -47 8 122 54 -41 18 88 49 -55 61 24 -4 109 -21 -3 15 53 59 29 -23 47 36 94 84 -85
7451 -85 38 114 31 -29 14 16 41 127 4 -12 40 82 -42 -57 17 48 53 67 -1 19 36 100 16 -31 74 27 -39 54 -5
7480 -5 -12 37 88 -75 -30 65 71 46 -11 -83 -43 82 26 -53 -89 72 44 -52 -17 -119 -13 -4 -11 -65 -15 38 36 -46 -92 -100 -7
7511 -7 -22 -27 -75 -56 4 -7 -107 -102 -43 -22 68 -21 -93 -98 31 15 -32 8 38 -23 -58 -61 -65 -30 35 0 -97 26 22 -8 -47 -43 -31
7544 -31 -57 82 4 -96 -11 18 54 2 -24 23 22 36 -25 -38 4 77 15 -10 51 12 11 7 -26 -34 15 -15 -50 -23 -22 52 43 17
7576 17 21 63 59 27 -51 32 12 50 11 39 35 -9 22 71 6 -4 79 34 29 22 36 50 25 2 2 2 84 128 92 2 -57 56 6
7609FM3j12R1J06j14m2mJ4L6M6k7q1J7J31j2j10lJ1R8k9o0M2jn5N4rl9O1r9N0
7639ILm0J0mJ3o6O7K4k5l1ROJ4j5mm4oJ60o3J5m3l4K4N8n1m3qL4N7n2k9j4k7R2
7673dn5O3k2O3j54N6L8J1k9k3J14j01N6Mn3M3J4k5q7Q4J2JM1r1k7M9N9j5p9L0
7703b7P9m0j4kn0P9j5L2j19Q4l9M8n6K6QJ6K1Mp9LJ11o3j0%ON3L4p3j22J49K1
7734F5L0o9k0J2L4K1q8r6J28O4n7l0r6J16Q7P9j38j46J48O7q6l7J3J5J31p2q1
7761fpM4J9rr4O0n8PJ02k2n5P9Q6j39l1j0N4L1K0r6k4M1J24j09j18J6J42j5qj43
7791a19oJ33J32j09j11nJ05P9r2p9l0J10Q2p1j76R3J11p7jJ4o7Q1klk0L7npl0
7820c3%kJ2K7m0k1J0l5J02k1MKL5m0k1l0L1M3j0l1n4kJ33K8n7j56O8K10o7j06
$$ plain form
7609 6 49 -63 28 134 20 -22 -26 -12 24 70 43 -38 -21 110 98 -12 -15 -4 94 65 5 47 46 -9 45 36 -3 58 -41 9
7639 9 12 -28 -18 -22 -9 -75 -8 16 -9 -40 -31 -25 -11 -26 -30 -74 -80 80 17 32 -11 -45 -21 37 -14 -57 -65 -31 26 -26 -55 -69 -96 -4
7673 -4 -59 4 -18 45 -109 -53 -15 -4 -33 -56 58 -43 13 17 -36 7 21 -4 -91 -7 5 6 47 -44 -71 -22 37 22 -57 -27
7703 -27 52 12 -2 -4 -54 25 10 42 -77 7 -32 16 -40 -14 -6 10 31 35 -44 -41 70 7 -3 -3 3 56 90 17 -105 44 65
7734 65 95 26 6 18 52 73 -15 -111 17 81 24 -6 -102 14 101 180 42 -104 44 111 25 -12 1 16 147 75 -6
7761 -6 -13 31 50 41 -53 7 -51 -44 58 36 -19 60 146 7 -24 -34 20 51 71 -25 -49 -8 116 7 -111 -95 47 32 24 -119
7791 -119 -125 8 140 31 -80 -85 20 99 7 -72 -102 8 90 19 -157 -64 47 -30 -31 -17 -84 -3 -5 -8 -28 9 4 -3 -33
7820 -33 -33 -35 -23 4 -36 -57 -47 -82 20 -1 3 5 40 0 -21 -51 -20 23 13 -18 -72 -74 59 87 30 -126 -58 152 85 -21
7850b1n8QJ09O2j56KN2L9LL0p0j3O7oJ2l3o7J6M8L7Rj26M7L0P5j00o9O9j2J27
7880A11q4p5M3O5km5k9P4n5P0j02m4J26O3j3j70M5J15l2j1j09J3J35N2j18lL5
7907E5N0q2mm6J7J9R0n7p7qM3M1O7j51l2m4K70k5j64q6P7J87p8p3j44J05J20K9
7935I9k05RJ29J6j8m0k3mJ18m7j59J2K19j23l0j9K3J21rj27m5R0P4j11l1J3L3
7962c5J03o8k2k2N8n0PQ3o7l8j5J21k6j50K6J07O8l0j77J9R2J28o3j83K5J46O5
7989A02j32n7j0O1J06r7r6J01J05j33p2Q4J28r2j0m5M2P1m4j3n7J03n0Lm7P7L9
8016F7k9Ml3N1m1j6o7J10nj8r7J15L7q5l5QJ23jj28n4P3R5N0r6j05Q2j6N3L6p3
8046Ej1N3p1o5J47N4l2j37N4O9J6j25l2K4J52r6j18K0J45%k6j23M4J28n6m6m0
$$ plain form
7850 -21 -79 -71 38 100 -56 -54 -2 37 40 70 0 -13 54 48 60 27 -40 -24 24 61 70 -56 -9 21 96 -4 -73 -4 -16 111
7880 111 27 -48 -5 60 58 13 -16 58 3 73 -29 -73 53 116 103 -67 -22 93 61 50 -59 -46 89 141 23 20 55
7907 55 105 23 19 -27 -10 9 99 42 -35 -43 0 41 108 -43 -75 -119 151 126 -38 -124 -47 140 62 -11 -155 -50 70 99
7935 99 -106 -97 32 48 30 -10 -33 -37 81 34 -125 -113 106 -17 -47 -66 -43 78 69 -58 -103 -13 61 -50 -81 -68 -35
7962 -35 68 0 -22 -44 14 -36 -29 54 -13 -51 -66 55 29 -121 -95 12 80 50 -127 -108 -16 112 49 -134 -109 37 102
7989 102 -30 -87 -97 -36 70 -27 -123 -22 83 -50 -122 -38 90 -2 -12 -57 -15 56 12 -1 -58 45 -5 -2 -49 28 67
8016 67 38 42 9 60 19 3 -64 46 41 23 -74 41 78 -7 -42 -34 89 88 -40 -94 -21 74 124 28 -77 5 -11 42 78 5
8046 5 -6 47 -24 -89 58 112 80 -57 -3 66 82 -43 -75 -51 101 5 -113 -93 52 52 26 -97 -53 75 19 -27 -67
8073f7J40K8q8j30O0J21r9k3k3J16M6l2q2j8R0M9j03n7P3Q6p0j01JP1J06o7j22
8100i5Q4K2j9l6K3J7l4K6k8o8J46k7n8qJ02m4j41K4J22Q1p3j04K5Q6Q4j32j12
8127a37J04P3n8j03O4L4N6o6q4J39J5l2r5L6K8R6o7r7J11J4K5p3k3M5P5o8n0M6
8155HpPj8j5N6M4q5m5N4J23j36p0N2L6Q8j30QM2M0J6q1j19J68P6j54l5K0J24m0
8184B7l9j00K09k4o3j19O8
$$ plain form
8073 -67 73 101 13 -117 -57 64 -35 -58 -81 35 81 49 -33 -51 39 88 -15 -72 1 87 17 -84 -83 -12 94 27 -95
8100 -95 -11 11 -8 -44 -21 -4 -38 -12 -40 -108 38 11 -47 -55 47 3 -138 -114 8 89 16 -88 -63 23 107 -25 -137
8127 -137 -33 40 -18 -121 -57 -23 33 -33 -117 22 37 5 -90 -54 -26 70 3 -94 17 31 56 -17 -40 5 80 12 -38 8
8155 8 1 8 -10 -25 31 75 -10 -55 -1 122 -14 -84 -32 4 92 -38 -30 12 52 68 -13 -132 36 112 -42 -77 -57 67 27
8184 27 -12 -112 97 73 10 -109 -41
8191d1
$$ Imaginary data points
##PAGE= N=2
##DATA TABLE= (X++(I..I)), XYDATA
0@%%%%%%%%%%%%%nJ2j5J6j6J6j6K1k7L0l2L7m3M7n4O0o8P9q7R7j11J23j32J45
37G7j63J82k01K21k45K72l02L35l73M16m63N18n86O70p71Q97j064J291j616K118
57A213k986M756r670M7231J66818j35133k35542K3352K12218O2853j46290j09406
69a20586O4293J03827Q051n2216l0117j403K3946N2233J9554p2198p3253N5111
81b2758J12788k0123j39165l8204J30284Q8179j03530j32333N3566J51253L308
92H3265j42706n1714J14401R1654n7161r3452O308P2933L5763k5914m6894k9256
104d2773J5757N9346L3874o2522r6304J8744J29832M5704j25290j10479Q1220
115e2891J53115n307j46458n9502J11112J06998m9338j13073n575Q8234L6822
$$ plain form
0 0 0 0 0 0 0 0 0 0 0 0 0 0 0 -5 7 -8 8 -8 8 -8 13 -14 16 -16 21 -22 25 -29 31 -37 42 -45 52 -59 64 -68 77
37 77 -86 96 -105 116 -129 143 -159 176 -197 219 -244 274 -312 358 -413 484 -580 711 -905 1213
57 1213 -1773 2983 -6687 40544 207362 72229 -163313 -139961 72257 135110 -11180 -120586
69 -120586 -56293 47534 55585 3369 -26748 -28151 -4205 48028 67582 -4616 -77869 -22758
81 -22758 90030 69907 -69258 -107462 22822 111001 7471 -124862 -71296 79957 83265
92 83265 -59441 -111155 3246 94900 37739 -55713 -49405 23528 59291 33377 -13517 -42773
104 -42773 -27016 32330 66204 3682 -92622 -73878 55954 101658 -23632 -134111 -52891
115 -52891 100224 94917 -51541 -111043 69 107067 57729 -55344 -60919 27315 64137
126F4137n2421m7130J1848K8825O690r031j4576j4625M312K7236J4023k6798k8106
139c5616K5984M9740q629n7542n939O3606K8018n7917n1423L5177O2322q331o4890
152b5440k5953M4493M3830j7789m6278j1051K8283K8072L569j9898k4245L535
164a8872L8166K7157k5033m6286j397M8183K7797l8039n1486J0487N2081R691
176C2449m4115k5020K6007K6599j0920k1190M942J9294J248j4523R25K0646O047
189B2389k0610j2509J6616J7140j0310k2456m540J4433R389q696j2785O1O341
202e537J035K063O182l780j1841M849K1244O135j7843j2268J1617J5844l956j6422
216b678m553Q590R23q463J055P421p698j4027P926K0681j408k1691n835K1232
$$ plain form
126 64137 11716 -35414 -23566 5259 11949 2918 -11658 -26283 -21971 5265 19288 -7510 -35616
139 -35616 -9632 40108 31479 -26063 -32002 31604 59622 1705 -49718 -14541 47781 39450 -25440
152 -25440 -51393 -6900 36930 19141 -27137 -38188 -9905 18167 21736 1838 -22407 -18872
164 -18872 19294 46451 21418 -24868 -26265 21918 49715 11676 -39810 -29323 22758 32449
176 32449 -11666 -36686 -10679 15920 5000 -16190 -11248 8046 9294 -5229 -4304 16342 22389
189 22389 1779 -10730 5886 23026 12716 -9740 -14280 153 9542 846 -11939 -11878 -5537
202 -5537 -4502 -2439 3743 -37 -11878 -7029 14215 20350 2507 -9761 1856 17700 13744 -2678
216 -2678 -7231 1359 2282 -6181 -5126 2295 -5403 -19430 -11504 9177 7769 -13922 -19757 1475
230A475J7750r295j8239K250J6438K981r699k068J353q884m275J4378P582k0812
244i065j9640J5638K8459m490l1654p584L1188K1675k0903k4630J4585K7127m654
257A6052k2561k75J7648L061j5734r690Q537R985o329j3857j361J0342N992k383
271e73n395m580L488J4645Q249j3264j6023Q852K3547L447k3416j7295J4533K4889
285B1104m664k9428j0328K0943J5979j1599j8241k80J4134J0303l250r673j588
298f588R733R508n34q813p046N139J2933l57j8461r787J5470J5188j1980k3215
312a8810M06K4057J1575k0590k2746J2840L2237L072k8600j3632K2180K5179n621
325B1547k6314j1057J8212K1101p492k7326j0215J8322J9778o421k5496j0653
$$ plain form
230 1475 19225 9930 -8309 -6059 10379 13360 3661 1593 2946 -5938 -10213 4165 11747 -9065
244 -9065 -28705 -13067 15392 10902 -20752 -28336 2852 24527 3624 -21006 -6421 20706 16052
257 16052 -6509 -6784 10864 13925 -1809 -11499 -2962 7023 694 -13163 -14524 -4182 1810 -573
271 -573 -5968 -10548 -7060 7585 15834 2570 -13453 -4601 18946 22393 -1023 -18318 -3785 21104
285 21104 16440 -12988 -23316 -2373 13606 2007 -16234 -16514 -2380 7923 4673 -5000 -6588
298 -6588 3145 12653 12119 3306 -3740 1399 14332 13975 -4486 -14273 1197 16385 4405 -18810
312 -18810 -18404 5653 17228 -3362 -26108 -13268 18969 22041 -6559 -20191 1989 27168 21547
325 21547 -4767 -15824 2388 23489 15997 -11329 -21544 -3222 16556 10135 -15361 -26014
337b6014K1638K5069q927k9805l763K9276J9417j6216k5258K716K6506J2260j9780
350G119k2768N995K2155L583j9134j6602M478J8247Q113j4836j8420O652K5259
363I841Q937j9109j8425J0192K7024N998k5331k0023J6605K8322l356l0097j3539
376b2961J9063K1904p167k8266j1205K2174K3147r320k6425l167K5503J9810j1295
389A1795k5259k270K5968J6292j8516k5900M206K5071Q127k0167k1159N890K3221
402G299N782k1675j7370J2535K3070J849j8244j0175J3265K0500O27j9486j0114
415a2137J3943J6365n391j8644p656J1344J4161m403j9601p784J5630J5352p523
428C656j8439j826J8387J4858q585j8860R95K1911J0220j6349j7285O074J7996
$$ plain form
337 -26014 -4376 20693 11766 -18039 -21802 7474 26891 10675 -14583 -11867 14639 26899 7119
350 7119 -15649 -9654 12501 16084 -3050 -19652 -15174 3073 11186 -3650 -22070 -15418 9841
363 9841 18778 -331 -18756 -8564 18460 24458 -873 -20896 -4291 24031 20675 -9422 -22961
376 -22961 -3898 18006 10839 -17427 -28632 -6458 16689 7369 -19056 -22223 3280 23090 11795
389 11795 -13464 -15734 10234 26526 8010 -17890 -13684 11387 19514 -653 -21812 -15922 7299
402 7299 13081 -8594 -25964 -13429 9641 11490 -6754 -16929 -3664 16836 17463 -2023 -12137
415 -12137 1806 18171 12780 -5864 -13520 -2176 11985 7582 -12019 -19803 -4173 11179 3656
428 3656 -14783 -16609 1778 16636 8051 -10809 -9814 12097 22317 5968 -11317 -5243 12753
441A2753L263j6766j5273O440J7845J298j8587j1343J1790J7763Oj6029q337J4481
455f96J9583l592k0683m941J8448J3197j1190j8679q91J6085Q783j2779j7357
468a4712K329J6026M737j2139j0837M511J4472P074q951j1046N741J6196L158
481A6559j3328r671O567J2023l92j4194r251Q710J1978m823j5138l459J1238R068
495E887m603j1357j284J3784J1455o791j3527J680J4639O901j0827j4371J105
508g309J4907N737j4761j4839N974J5497J171j3908r551P465J4723K662j2125
521d357o981J0851J3428k364j1859l434Q553P463n370j2140j542J0423L887j0296
535c738q926M640R531L93r327o145P366J3324P85j2142n035J1913J2896l444j5198
$$ plain form
441 12753 16016 -750 -16023 -9583 8262 9560 -9027 -20370 -8580 9183 9189 -6840 -15177 -696
455 -696 18887 15295 -5388 -10329 8119 21316 10126 -8553 -9444 6641 15424 2645 -14712
468 -14712 -12383 3643 8380 -3759 -14596 -10085 4387 11461 2510 -8536 -2795 13401 16559
481 16559 3231 -6440 127 12150 11758 -2436 -11687 -2977 9001 4178 -10960 -14419 -3181 5887
495 5887 1284 -10073 -11357 2427 13882 7091 -6436 -4756 9883 16784 5957 -8414 -7309
508 -7309 7598 13335 -1426 -16265 -10291 5206 6377 -7531 -17082 -9617 5106 7768 -4357
521 -4357 -11338 -487 12941 10577 -1282 -4716 3837 11300 5930 -6210 -7752 2671 6558 -3738
535 -3738 -12664 -8024 1507 1900 -7427 -13572 -6206 7118 7903 -4239 -9274 2639 15535 12091 -3107
550c107p047J0950J3355n897j9390n415J4950J1842q072j5995k574J3692J1644
563H936o113j4389l1J5503R784p127j1116J199J2323O359j0473j3485L687J4148
577I205k57j6326q191J1495J3324m869j6909m210J7217J5342r210j9428M27K0997
591H607J3466j1273k1002k258K1438J5582j5129k6500j577K4079J4344j5733k5239
604b1195q60K5156J6318j5188k3381L145K4938J2611j3820j8511K651K0102R461
617B1427j5172j7843M883J7719K768j6250j2275P867J5779n33j7745q627J5115
630b887J6684o730j8775j928J9470J5685r288k2421l380K2351J6032j5128k6789
643a7104k357K3617J6332j4314k7142k772K5952J8097j4787k5250n35K3673J6532
$$ plain form
550 -3107 -10154 796 14151 8254 -11136 -16551 -1601 10241 2169 -13826 -16400 -2708 8936
563 8936 2823 -11566 -11597 3906 13690 6563 -4553 -3354 8969 15328 4855 -8630 -4943 9205
577 9205 8948 -7378 -15569 -4074 9250 4381 -12528 -16738 479 15821 6611 -12817 -12390 8607
591 8607 22073 10800 -10202 -12460 8978 24560 9431 -17069 -18646 5433 19777 4044 -21195
604 -21195 -22055 3101 19419 4231 -19150 -16005 8933 21544 7724 -10787 -8136 11966 21427
617 21427 6255 -11588 -6705 11014 13782 -2468 -14743 -6876 8903 8370 -9375 -18002 -2887
630 -2887 13797 7067 -11708 -13636 5834 21519 12231 -10190 -13570 8781 24813 9685 -17104
643 -17104 -19461 4156 20488 6174 -20968 -23740 2212 20309 5522 -19728 -20263 3410 19942
656A9942j0332k1477k406K0848J5126j0867j9549j572J4720Q273r547j4368l38
669a1547J2053M804r571p495O426R054j510q127j218Q923P707n171j0896J202
683e366J3732N919j1276j3382K119J4235O548j2644j7213J887J8556Q335j2949
696a499j4870L473J6593R029q427j3249R77J3576P285o771r419r31O124M570k593
711C868o552k079K580L76j788J240K030k907m184K120P946N055m701r286O40J3271
727G629Q631r350j4992k89J4085R787r068j8223l612J6530J3045r665j8675j879
741a6046J6214J2820o278j5759k769J4953J2066o496j2801o98J0377O069o179
754E473r727k10Q919K260j0249p074P640R969m134j3063k148J4651J2394r112
$$ plain form
656 19942 9610 -11867 -14273 6575 21701 10834 -8715 -10287 4433 12706 3159 -11209 -11547
669 -11547 506 5310 -4261 -11756 -5330 3724 2214 -5913 -7131 1792 9499 4328 -6568 -5366
683 -5366 8366 14285 3009 -10373 -8254 5981 12529 -115 -17328 -15441 3115 11450 -1499
696 -1499 -16369 -12896 3697 12726 4299 -8950 -7973 5603 12888 6117 -3302 -4233 1891 6461 3868
711 3868 -2684 -4763 -2183 -1807 -3595 -2355 -325 -3232 -7416 -5296 2650 7705 3004 -6282 -5642 7629
727 7629 16260 6910 -8082 -8371 5714 15501 6433 -11790 -15402 1128 14173 4508 -14167 -16046
741 -16046 168 12988 6710 -9049 -11818 3135 15201 8705 -4096 -4794 5583 11652 5473
754 5473 -4254 -4464 4455 6715 -3534 -10608 -2968 7001 2867 -10196 -12344 2307 14701 5589
768E589j8579J485K2260J1649j5555k0647K234K2014J2447j5026k4783k035K3712
781D765J6377j4236k6618m125K4371K0853j1407k8273l831K7218J9865j3847k4922
794a3810p34K2416J3749j3032k0588L10J7820P230j2807j3196L073J2000L743
807F174r663r699N361J4252K201j3422p836J1604J5965k409j8589q295J6264J8569
821B0477q708k5532n739K1586J6600j2376k4667m159K1611J7881j0180k3250l353
834a9809K0610J7262o343j9454p241J4824J8218l261k0463r330J3251J5546m043
847I767j7614p525J1628J2222n752j3859k54J1920M629o556m050N353O491j031
861E369n908j119N993L643n124o860J8N429L426l049p784l876O780Q860k860j1392
$$ plain form
768 5589 -12990 -11505 10755 22404 6849 -13798 -11564 10450 22897 7871 -16912 -18947 4765
781 4765 21142 6906 -19712 -23837 534 21387 9980 -18293 -22124 5094 24959 11112 -13810
794 -13810 -14544 7872 21621 8589 -11999 -11689 6131 13361 554 -12642 -9569 2431 6174
807 6174 -3489 -13188 -7827 6425 8626 -4796 -12632 -1028 14937 12528 -6061 -14356 1908 20477
821 20477 11769 -13763 -19502 2084 18684 6308 -18359 -22518 -907 16974 6794 -16456 -19809
834 -19809 801 18063 11720 -7734 -14975 -151 18067 14806 -5657 -14987 -1736 13810 9767
847 9767 -7847 -15372 -3744 8478 2726 -11133 -11387 533 5162 -1394 -5444 -91 6400 5369
861 5369 -539 -1658 4335 7978 2854 -4006 -3988 1441 4867 1818 -5966 -9842 -3062 5798 2938 -8454
877h454l238J0663J1081k427j1809l039J1641J0068n787j1615q73P302L175l742
891B946n005j854J411J898L58m14j317k327n0M456L704j801l071M24L190L425
907E973J291l228n184l40M977L150l927q442l359P175Q497m096j2301j734J2080
922E32Q442n981r868J438J0974N596o903p510L361P242r21o211k268K193J461
937A577j283l098k072J491K861n06l618j430M009O544M90p644l751R614J0415
952A3599o324j4961p68J4380O872j1625j4380L030J5099M120j2928j0416O069
965h233J1597J931p276o385K091R807O960m984j0045p2J0569O337q102j2678L06
980h177J2784M314j2722j0257Q319J2563l349j2707j917J1305P568o353r326K921
$$ plain form
877 -8454 -11692 -1029 10052 7625 -4184 -7223 4418 14486 8699 -2916 -3789 3513 6688 2946
891 2946 -2059 -3913 -2502 -604 -246 -660 -1977 -4304 -4354 102 3806 2005 -1066 -642 2548 5973
907 5973 7264 4036 -1148 -1488 3489 6639 2712 -5730 -9089 -1914 6583 2487 -9814 -11548 532
922 532 8974 2993 -6875 -5437 5537 11133 4230 -3280 81 7323 6402 191 -2077 116 1577
937 1577 294 -2804 -4876 -3385 -524 -1030 -4648 -6078 -2069 4475 4965 -2679 -6430 3184 13599
952 13599 7275 -7686 -8454 5926 12798 1173 -13207 -10177 4922 9042 -3886 -14302 -8233
965 -8233 3364 5295 -1981 -8366 -6275 3532 10492 5508 -4537 -4609 5960 12297 4195 -8483 -8177
980 -8177 4607 8921 -3801 -14058 -5739 6824 3475 -9232 -11149 156 7724 1371 -7955 -5034
994e034J1422L487p685o219K803O250K143n051q367j771Q149O294o172j1045O5
1009a0731J2106P719q272j2491L581J6306M739j3192r048R067J2753k019j2534
1022b016n152Q052P946m477j0493j854P103M546l202n786j802N150P109q36q087
1037c799k301R328Q241n033j0906j49J1861O050j1173j2675N054J4095k50j4358
1051f015o577R556J0374k939j0698l127Q968Q751k747q345j725O854O975q09q538
1066d2n927O186R694l199j3333m360J0416R145o285j2980m35J3674P673r757j1143
1081a0673N051J3401K505r532p027M682R909J657r587q057M185R388K82r721p407
1096a0944M646J0841J375j1317p308R124J2494k355j2427l207J1002J0010m882
$$ plain form
994 -5034 6388 9875 2190 -4029 -1226 5024 7167 2116 -6251 -8022 127 6421 249 -10796 -10731
1009 -10731 1375 9094 822 -11669 -8088 8218 12957 -235 -9283 -216 12537 10518 -2016
1022 -2016 -7168 884 8830 4353 -6140 -7994 -891 3655 453 -5333 -7135 -1985 5124 4288 -3799
1037 -3799 -6100 3228 11469 6436 -4470 -4619 7242 13292 2119 -10556 -5502 8593 8343 -6015
1051 -6015 -12592 -3036 7338 4399 -6299 -9426 -458 8293 5546 -2799 -4524 2330 9305 8496 -42
1066 -42 -5969 217 9911 6712 -6621 -10981 -565 8580 2295 -10685 -11120 2554 10227 470 -10673
1081 -10673 -5622 7779 10284 752 -6275 -1593 8316 9973 386 -7671 -3486 5902 6184 -3537 -10944
1096 -10944 -6298 4543 5918 -5399 -12707 -3583 8911 6556 -5871 -9078 1924 11934 7052
1109G052j2641j708J1709O640q778j1172J232R715L996p195q886J331J0262M734
1123F291p496p991L357J0327L796p219p901L534J1266K433j0711p778N981R374
1137G263j511j0615n610O548R068k030j0310k823Q968P507l469q096j116P799
1151A573P148l385r378q89R450N447o847r208N97Q637L708p878r122L239J0643
1166C735J676r069n047O256Q803K34p868m321O273Q547j915r329k891O863O185
1181H132l282r092l030P279O650n054r710K30R108M715n138o804J500Q757M544
1196H805n711o970K533P859J675o552n950J773O748J720p322o366M150P784p78
1211C398p752l064N803O728j203p263j636P595O159m137p249K14O363L385m535
$$ plain form
1109 7052 -5589 -7297 4412 11052 2274 -8898 -7666 2049 6045 -1150 -10036 -8705 1557 6291
1123 6291 -1205 -9196 -5839 4488 8284 1065 -6836 -3302 7964 10397 -314 -8092 -2111 7263
1137 7263 5752 -4863 -10473 -3925 5143 3113 -7197 -10020 -1052 6455 2986 -5110 -6226 1573
1151 1573 8721 5336 -4042 -4931 4519 9966 3119 -6089 -5492 3145 6853 -1025 -10147 -6908 3735
1166 3735 5411 -3658 -8705 -2449 6354 6588 -1280 -5601 672 9219 7304 -2025 -4916 1947 8132
1181 8132 4850 -4242 -7272 7 6657 1603 -8107 -7877 1231 5946 808 -5996 -4496 4261 8805
1196 8805 3094 -3876 -1343 6516 8191 1639 -4311 -2538 4210 5930 -1392 -7758 -3608 4176 3398
1211 3398 -4354 -7418 -1615 5113 3910 -3353 -4989 2606 8765 4628 -2621 -2407 3956 7341 2806
1226B806p716q21P424M037o429p851K089Q542K971o149o624L045R344K434p566
1241d64n011N116P049n67o065l614L019M933q82o413k947L581L623j999m104q31
1257e576L774L826j609m447R72O257J990m968l489L266N060m31n835l812M018
1272a004N617k171p393k086N032M439j864n593k119N375O368j344o341r19O131
1287B128M686k586n822j447M997L825m300o365J194N716L73n468l002L226M841
1302A996p84n725j407O651N463l611o323J181P257L968m844q211l31Q725M908
1317H913p630j0080J360J0355M942p560j0351J449J2402N901q891r704M002J1863
1331F971L763p895q296K598J0016K764q981p881L634Q185N24p803n736M014Q385
$$ plain form
1226 2806 -4910 -5731 1693 5730 -699 -8550 -6461 2081 5052 -1097 -7721 -4676 4668 7102 -464
1241 -464 -5475 -359 6690 6123 58 -3556 -537 4396 3514 -2899 -5846 -2265 1358 -641 -4745 -5576
1257 -5576 -1802 2024 415 -4032 -3060 3197 5187 219 -3270 -4 5056 4625 -1210 -5022 -1004
1272 -1004 4613 2442 -4951 -7037 -2005 2434 570 -5023 -7142 -1767 4601 3257 -3084 -4003 2128
1287 2128 6814 4228 -1594 -3041 1956 5781 1481 -4884 -3690 2026 2399 -3069 -6071 -2845 1996
1302 1996 1212 -4513 -5920 731 6194 2583 -3740 -2559 4698 8666 3822 -4389 -4720 4005 8913
1317 8913 1283 -8797 -7437 2918 7860 300 -10051 -8602 3800 9701 810 -8894 -4892 6971
1331 6971 10734 2839 -5457 -2859 7157 9921 940 -6941 -3307 4878 5402 -2401 -8137 -4123 4262
1346D262J45q956l840Q240Q161l495q960p33R620P005n967j1269j79J1635N564
1361A1233r185j1436R92J1569O439q391j2990R58J4491P463r738j2540K512J4455
1375E832P618r085j2972J966J3991N621j0350j1251K238J0380L766p867r328J879
1389g562R920L109p556o241L869Q090J534o311m374N127P928j464q734j991P461
1404B805M906n515q458o21P999M839o219r325J051R669M904n799p951K30R393
1419A908P174m809r882l07R814N931n613r227j370P350N551m585q345p06O407
1434g09L405k821l896m46K929L088l6j733J03J692N36j2N25j17j370j421n42O19
1452b06J286r16l762j410L777L446j759m331q40M093M591p53m993j196N071L885
$$ plain form
1346 4262 4407 -4549 -8389 -149 8012 4517 -4443 -5176 4444 11449 5482 -5787 -5966 5669 11233
1361 11233 2048 -9388 -8396 3173 9612 1221 -11769 -10811 3680 11143 1405 -11135 -8623 5832
1375 5832 13450 4365 -8607 -6641 7350 12971 2621 -8630 -6392 3988 7754 -113 -9441 -7562
1389 -7562 2358 5467 -2089 -8330 -4461 3629 5163 -1148 -5522 -395 7533 6069 -2665 -4656 2805
1404 2805 7711 2196 -6262 -6883 1116 5955 -264 -9589 -8538 1131 6035 236 -7715 -7485 1908
1419 1908 9082 4273 -5609 -5916 3898 9829 4216 -5011 -6381 969 6520 1935 -6410 -7116 -709
1434 -709 2696 -125 -4021 -4467 -1538 1550 1514 -219 -116 1576 2112 2100 2625 2508 1138 -283 -825 -206
1452 -206 1080 164 -3598 -5008 -1231 2215 456 -3875 -4715 -622 3969 3216 -1777 -2973 2098 5983
1468E983j931l675p51J757J427j156k694r90J207J17j263M12J618nj295l23J498
1485f4K751J119l172l156L015O127K98o530m859L112P171R81q552p434M126R673
1501D606J030q729o242M406R685K944p689p354M113J0077K269p704o558K729P931
1516E514K297p228p117K822P552L10p151l879M128N601o01n854j933N971N519
1531E951l313o406J007P039L352n150p220O73Q010L563p970q849K822J0048K864
1546F421q271q595K910J1375M632q809r398L835J1659L973p937q806K291J0362
1560E642L944q529r004K740Q661J702o980o102K378P254K035n684m284L934N766
1575C473l42m451j402L492L732j173m804r57M771K478m322n111Q81M737J836m157
$$ plain form
1468 5983 4052 377 -374 1383 2810 1654 -1040 -2030 -823 -706 -1969 -1557 61 56 -1239 -1562 -64
1485 -64 2687 3806 634 -2522 493 6620 6918 388 -4471 -1359 5812 6793 -1759 -9193 -5067 4606
1501 4606 5636 -3093 -9335 -4929 4756 7700 11 -7343 -3230 6847 9116 1412 -5146 -2417 5514
1516 5514 7811 583 -6534 -3712 3840 4150 -3001 -6880 -2752 2849 2248 -3606 -5539 432 5951
1531 5951 2638 -3768 -2761 4278 7630 2480 -4740 -4067 3943 7506 -464 -9313 -6491 3557 6421
1546 6421 -1850 -10445 -7535 3840 8472 -337 -9735 -5900 5759 9732 1795 -7011 -4720 5642
1560 5642 9586 1057 -7947 -5207 3454 5156 -1824 -7926 -5548 1706 3741 -1943 -6227 -2293 3473
1575 3473 3131 -1320 -2722 770 4502 3329 -1475 -2432 2339 4817 495 -4616 -3735 1002 2838 -1319
1591a319n208J532O925K381n372m480L045O475J867m515n165J931O709J900n887
1606H19m997K272M895O15m371l919J528M336N04l770j381K869K228o72j283M33
1622A06J973J035j672j835J830K793j540m223p97L373K184k459m735q26N071L743
1638D021l567n272J192N895K720l109m166M83N215K718l753m595R51M275R13l425
1654D96l732J37L863J756l783l610K219M575K33l776j630L131M393n90m787j660
1670b765M951L792l237n838l36M884L258l695o670m13O991M003n376o703J669
1685e485P801L662n104o787J790Q973L209p030o691L063P585J075o925n883K973
1700c774P272K86p276l977M788N864q65n613k253M373N706q94n876j485N253M047
$$ plain form
1591 -1319 -6527 -4995 1930 4311 -1061 -5541 -2496 3979 5846 1331 -3834 -1903 4806 6706 819
1606 819 -4178 -1906 2989 3604 -767 -4686 -3158 1178 1682 -2088 -3469 -600 1628 956 -327 106
1622 106 2079 3114 1442 -393 1437 4230 2690 -1533 -2330 1043 3227 768 -3967 -4793 278 4021
1638 4021 454 -4818 -3626 2269 4989 1880 -2286 -1803 3412 6130 2377 -2218 -1267 3008 3921 496
1654 496 -3236 -3099 764 2520 -1263 -4873 -2654 1921 2154 -1622 -3252 -121 4272 3682 -1105 -2765
1670 -2765 2186 5978 2741 -3097 -3433 1451 4709 1014 -5656 -6069 922 4925 -451 -7154 -5485
1685 -5485 2316 5978 874 -5913 -4123 4850 8059 1029 -5662 -2599 4986 6061 -864 -6747 -3774
1700 -3774 3498 3784 -3492 -7469 -2681 3183 2318 -3295 -5548 -1175 4531 3637 -2239 -3724 1529 5576
1716E576k575n235j290M132L781k784o548p99N767L512l925n414M85N965L977
1731D625l630n899J303P203K829n035n199J749N983K111n300o072K039O912Q06
1746D425o693m484L668O113J5n904l072M971O291j722o103m44N654L303l243m816
1762b041q4M608K262m163m754J534M612M05l893k664J507M180J067l565k706K920
1778g75M730K8l539j829K404L446j59m335k716K665L355j551m112j255K692L008
1794B057n64l907j603L816L957j626m288j48M252L303k094m885m17N152K438m889
1810E54n282J919N164L90n260l394L289N558n27n846j424N377M009k415m280O3
1826b105M260K825k653m574N6M412J387l815l652Q00L475J341l069l427J586M578
$$ plain form
1716 5576 3001 -2234 -3524 608 4389 1605 -4943 -5742 25 3537 -388 -5802 -5317 648 4625
1731 4625 995 -4904 -3601 3602 6431 1396 -3803 -2054 3929 6040 740 -5332 -3293 3619 4425
1746 4425 -2268 -6752 -3084 3029 3044 -2860 -5932 -961 5330 3608 -2495 -2939 2715 6018 2775 -2041
1762 -2041 -2125 2483 4745 582 -4172 -2638 1974 2379 -1514 -4178 -2671 1509 2576 -989 -3695 -775
1778 -775 3955 3983 444 -1385 1019 4465 4306 -29 -2745 -80 3275 1724 -2388 -3643 -951 2057
1794 2057 1493 -2414 -4017 -201 3756 2130 -2158 -2306 1946 5249 3155 -1730 -2147 3005 5443 554
1810 554 -4728 -2809 2355 2745 -2515 -5909 -2620 2938 2411 -3435 -4859 518 4527 2112 -2168 -2105
1826 -2105 2155 4980 2327 -2247 -2191 2221 3608 -207 -3859 -3059 416 1757 -1312 -4739 -3153 1425
1842A425P70l491j772K537L212K42k678j875J619K807l72l251j654J214J848K21
1858H02k467k567J224L988L23m019j834L319M288o33m350j320M588M365k956n627
1874b876M06N292J417m566m195J495M616R14m610l332L269M913p32m491j226L763
1890E7L836r40m369j053M608L171l173m585N46L921R79l441l430J004L944P13
1906A788l439j975K411L074Jj974j286J170K896J066k367k324J179K600M64k523
1922G61k964K25L376J076l731l056K169M177K01l651k046K819M672j99m931j814
1938b916M904L876k787n402l17M895K673m087n776J052O225J408n667l832L376
1953b375N497L09m946k724L762N228q85n075j335L845K973j571l905j446K416
$$ plain form
1842 1425 2195 -1296 -3068 -531 2681 2923 245 -1630 -11 2796 2424 -827 -2481 -1267 581 802
1858 802 -1665 -4232 -3008 980 1303 -2716 -4550 -1231 3057 2424 -1926 -3246 1342 5707 2751 -2876
1874 -2876 -2470 2822 4239 -327 -4522 -3027 1589 2503 -2107 -5439 -2170 2743 2011 -2480 -3706 57
1890 57 3893 2953 -1416 -2469 2139 5310 2137 -2448 -1902 2019 2998 -443 -3873 -2869 1075 1788
1906 1788 -1651 -3626 -1215 1859 1860 -114 -1400 -230 2666 3732 1365 -959 220 2820 3284 761
1922 761 -2203 -1978 1398 2474 -1257 -4313 -2144 2033 2234 -1417 -3463 -644 4028 3829 -1102 -2916
1938 -2916 1988 5864 3077 -2325 -2642 2253 4926 839 -4937 -3885 2340 3748 -1919 -5751 -2375
1953 -2375 3122 3431 -1515 -4239 -477 4751 3866 -1209 -2544 1301 4274 2703 -1202 -2648 -232
1968b32K552j630l641m66K570J484j052j512j46J589J916k72j726j10J646J073
1984B043m24j510r33R67J893r99l344o12K712J535k262k945N03L835J890l157
2000h08l418K510N143P0m524k003L360L751j088m732j658L665K901k864m194N71
2016c318L483R06k436k133J519L282J54l014o31L410J993k156k380J103K844L91
2032C017k973k636J678L167p69l887j208K499K325o23k098j039J655K833J88k088
2048D1j260J244K154R99j514k757qL101J258l083l131P49L147R33k733k944J606
2065b198M485M53m039j641L622L616j270m288j050M420L649l449n927O02O352
2080C337J831n709n337K446O752J254o518m916M533P464l00o679k905M685N606
$$ plain form
1968 -232 2320 690 -2951 -3417 -847 637 -415 -1927 -2073 -484 1432 1160 -566 -676 970 2043
1984 2043 1619 109 -824 143 2036 1037 -2307 -2919 -207 1328 -934 -3879 -3376 459 2349 -808
2000 -808 -4226 -1716 3427 3497 -1027 -3030 330 4081 2993 -1739 -3397 268 3169 305 -3889 -3318
2016 -3318 165 1071 -1365 -3498 -1979 1303 1457 -1557 -2188 1222 3215 1059 -1321 -218 2626 3017
2032 3017 44 -2592 -914 2253 1484 -2403 -3611 -1112 1213 590 -1508 -2547 -892 1941 2129 41
2048 41 -1219 25 2179 3178 1664 -1093 -1101 2000 3258 175 -2956 -2207 940 1873 -860 -3804 -2198
2065 -2198 2287 2740 -1299 -2940 682 4298 3028 -1260 -2310 2110 5759 2310 -3617 -3015 3337
2080 3337 5168 -541 -5878 -3432 3320 4574 -1944 -6860 -2327 5137 4837 -1842 -4747 -62 5544
2095E544n51n679l214L745M788r89n196k319K494L559L1l754k892K216M176J51
2111B110l396j882K030L558Q30l090k517K253L917n04m437j956K936L217j325
2126A744n054j699M473M231l035n836L98O108L324m012n404J085O804K981n380
2141G28n553K519O434Q77n496m351K143N072O26m898l199K629L847j92k671j159
2157b644J444K098O68j162j041O71R45K26k40p05r36K10J056l85j481l66P58M03
2175d81l72m42J64R39P57r24n95J507J557o43j595j75J394J240q50k524o67K227
2193E17J221k027k154P09K026L00j273r16J000J539j74j007Q09J583q36j637P89
2210D69K204k23k718j907J653L137o68m202j832L659L471j744m053n09L734L300
$$ plain form
2095 5544 4993 -686 -3900 -155 4633 3644 -1552 -3871 -1377 2182 2213 -1541 -4433 -2217 1959 2110
2111 2110 -1286 -3168 -1138 2420 3250 160 -2357 -104 3813 3309 -1128 -3084 -148 3069 1744
2126 1744 -3310 -5009 -536 3695 660 -5176 -4778 1330 4654 642 -4762 -3677 3127 6108 728
2141 728 -4825 -2306 4128 5005 -491 -4842 -2699 2373 2999 -1899 -5098 -2469 1378 1186 -1485 -2644
2157 -2644 -1200 898 1566 404 -637 34 979 1205 965 260 -676 -466 590 205 -1276 -1642 -884 -481
2175 -481 -853 -1295 -1131 -192 565 -359 -954 553 2110 1467 -128 -303 1091 2331 1481 -1043 -1710 517
2193 517 1738 -289 -2443 -1734 292 592 -681 -1597 -597 942 768 -239 570 2153 1317 -320 469
2210 469 2673 2450 -268 -2175 -522 2615 1947 -2255 -4087 -428 3043 1299 -2754 -3263 471 3771
2226C771j450m072o22M232K707k305l714OK860J615j800l267k94K647J197j931
2242d20j927N40J844J147p26j733j2K431J564j412k116K25K356J423j866l528
2258b210o6L755J716l876l957J573M900J281m322m177K486O355J137n763l818
2273d986L757N980N7n669l590L402N551o33o466k981M259M516j653m984j521L859
2289a102L954j434m411k44L992K356j878k701J98K535J558j526k870j73K496J075
2305A825j978k452j38K210J858j379l146J33L906K005k514k966R85L831J798k961
2321A017l786J058M506R28m076l328J618L782O84l680k940K042M285O6l839j400
2337c063L010K988p54k811p40K746K017j787k766O00K271j7k316j233J098J463
$$ plain form
2226 3771 2321 -1751 -2373 1859 4566 2261 -1453 -1447 1413 3028 1228 -2039 -2333 314 1511 -420
2242 -420 -2347 -1807 37 1184 458 -1275 -1287 1144 2708 1296 -820 -595 1761 3184 1318 -2210
2258 -2210 -2276 1479 3195 -681 -4638 -3065 1835 3116 -1206 -5383 -2897 3458 4595 -1168 -4986
2273 -4986 -1229 4751 4808 -861 -4451 -1049 4502 3869 -2597 -5578 -1319 3197 1544 -3440 -4961 -1102
2289 -1102 2852 1418 -2993 -3237 755 3111 1233 -1468 -1270 1265 2823 1297 -1573 -1746 750 1825
2305 1825 -153 -2605 -2743 -533 1325 -54 -3200 -3067 839 2844 330 -2636 -1651 2180 3978 1017
2321 1017 -2769 -1711 2795 3723 -353 -3681 -2063 1719 2403 -1277 -4217 -2175 2110 2176 -1663 -3063
2337 -3063 -53 2935 2181 -630 -1370 1376 3393 1606 -1160 -560 1711 1694 -622 -1855 -757 706
2353G06j82j892o80J851J556q74j344L00J419Q69k43j204m65J292J040r56j493
2370c00k52O99O15m57j445p70J388J410n92j400K8J417J222l58j437k26J897J167
2388B606j641j737Q58J831l24k110j376J103J979n05k907o97K839J948j651k383
2404b167M43K911J738j989k783O83L455P38l098k174J268K585J21k659k199J465
2420a662K843k97k840q97K094J970k61j732q89J693K154m74k219o09J583J201
2436A658p53j741j083J192J665o79k499l72J919J607q51j764m53K087K212j137
2452A008k478J34K820J158j900k288K65K438J015k478k634J032K877J31k570j333
2468b803J556K380L12k236j242K107K387p56k263k63J759J209q11k138n87J787
$$ plain form
2353 706 524 -1368 -2048 -197 1359 485 -859 -559 860 1729 1486 282 -183 1109 2149 1193 -300
2370 -300 -552 147 762 305 -1140 -1910 -522 888 296 -1104 -1076 341 1563 1205 -232 -458 1439 2606
2388 2606 965 -772 86 1917 1593 -517 -1893 -790 1189 684 -2223 -2920 -81 1867 216 -2167
2404 -2167 -1724 1187 2925 936 -1847 -1164 2291 3029 -69 -2243 -975 1610 1731 -928 -3127 -1662
2420 -1662 1181 884 -1956 -2853 -759 1211 950 -782 -1671 22 2176 1702 -517 -1126 457 1658
2436 1658 905 -836 -1919 -727 938 259 -2240 -2612 -693 914 63 -1701 -2154 -67 2145 1008
2452 1008 -1470 -1336 1484 2642 742 -1546 -1281 1157 2172 -306 -2940 -1908 969 1100 -1470 -2803
2468 -2803 -1247 1133 1445 -791 -2033 74 2461 1705 -558 -821 938 2147 1336 -802 -1389 398
2484C98J042j551j799M70J554L86q74r85M08J782O30j225q08J136J088n9r30p46
2502h3K67J154M1j537r81R40J033o22j181l76Q68J236n9j457l48J837J288r11
2520A109j310Q9J423Q53j032j883N6J985K25j966j266R02J371j6j414r60J149
2537f85J949k80j791k05J841J076q12j232l65J314J065j119k047J20J781L19j500
2554e71j305L82J541P44j416j352J108K046n5j373n75R53J228K22j517j262J063
2571a39J435o69j750n93R58J144l12j583p79J589J646p62j729L14J682J015o86
2588G81j505j02J809R62j640j880O85J528M5j472j276N13J777M85j837j103J544
2605f86J769k81j462l60J143J602j71j991n12J663J110j239j782K2J197Q54r89
$$ plain form
2484 398 1440 -111 -1910 -1440 114 500 -374 -1359 -951 831 1461 236 -572 564 1652 1593 663 -83
2502 -83 184 1338 1379 -158 -1139 -199 834 212 -969 -1345 -477 759 700 -757 -1105 732 2020 1109
2520 1109 -201 -112 1311 2164 1132 -751 -695 1290 1515 -451 -1717 -815 556 540 -874 -1834 -685
2537 -685 1264 984 -807 -1012 829 1905 1093 -139 -504 810 1875 756 -1291 -1171 610 929 -571
2554 -571 -1876 -1494 47 791 -625 -1977 -869 1177 1122 -251 -826 127 1355 1577 60 -1202 -139
2571 -139 1296 627 -1123 -1716 -758 386 74 -1509 -2288 -699 947 185 -1544 -1230 452 1467 781
2588 781 -724 -826 983 1945 305 -1575 -890 638 683 -789 -2065 -1552 225 710 -1127 -2230 -686
2605 -686 1083 802 -660 -1020 123 1725 1554 -437 -949 714 1824 585 -1197 -1175 22 876 -113
2622a13j800O5K131R22j605j201R83J666O28j264j335P82K078J79k101j131J228
2639A12J441l93j732j249J103J890m26k140n01J936J476o74j446l47J635J722
2655B407p51k240q5K124R07j631j821N0J805Q94j625k194O99K458L27j974j166
2672a816J078J964O85j729j513J273K274K8k208j157J130J717r5k204j649J352
2688h70K269n52k428o53J766J749l92j818p20J923J856r15k033Q1J747P56r01
2705H65j723m02J486J026j443j836L39J740M98j194j128L64J968Q15j546j352
2721a523J143J851j14j458q05O46J275J65j698j288J109J190n12j222m02O67J032
2738E6L08j070n66J134J119l49q14J5M62O27j24r97l72P94J88r07m42M36J80j43
$$ plain form
2622 -113 -1913 -1848 283 1205 -400 -1601 -618 1048 1676 412 -923 -141 1937 2116 15 -1116 112
2639 112 1553 1160 -572 -1821 -718 1172 746 -1394 -1895 41 1517 843 -603 -950 685 2407
2655 2407 1656 -584 -669 1455 2362 731 -1090 -1040 765 1659 34 -2160 -1461 997 1324 -650 -1816
2672 -1816 -738 1226 1911 182 -1331 -58 2216 2244 36 -1121 9 1726 1631 -573 -2222 -870
2688 -870 1399 847 -1581 -2234 -468 1281 889 -929 -1649 274 2130 1215 -818 -737 1010 1766 865
2705 865 -858 -1260 226 1252 -191 -2027 -1688 52 550 -644 -1772 -1408 560 1375 -171 -1523
2721 -1523 -380 1471 1357 -101 -906 -260 1015 1180 -518 -1806 -697 493 -19 -1241 -1643 -976 56
2738 56 364 -706 -1272 -138 981 632 -182 -167 295 922 798 -199 -571 223 411 -496 -938 -502 -322 -465
2758d65k98j67L51P13j0o83J87J031K30n19k60J69M61K08o03q61K58Q71l94r39
2778g20k36N46L56J44o26l33Q19J033n09q88M80J024K55o16p14L3J045L11j383
2797B1j123P84J217l71j423n06P99J440R1j582p51J631J680n37j589m05J083J620
2815B079k06k120j096J628J619j018k091n84J499J455n02k120m80K051J605j095
2831F24j709K41J718J082p67j907j94K002R22j536j898L37J627N18j351j792L64
2848a719K303P59k038j478J375K141K01j672j332J025K303J28k370j321J394J770
2864A469l71j950j252Q49K019P6k243j015J502J738j30j432o83J061J834q0j834
2881d42o76J377J105o78j303m93O68R99l45j474l95J225P34p18o46Q4Q67Q64k94
$$ plain form
2758 -465 -763 -930 -579 134 124 -559 -372 659 889 370 110 279 740 948 345 -516 -258 613 219 -720
2778 -720 -956 -410 -54 90 -536 -869 -50 983 474 -414 66 1090 1345 729 15 48 1093 1404 21
2797 21 -1102 -318 899 528 -895 -1401 -602 838 929 -653 -1404 227 1907 1370 -219 -624 459 2079
2815 2079 1873 -247 -1343 285 1904 886 -1205 -1789 -290 1165 663 -1457 -1937 114 1719 624
2831 624 -1085 -844 874 1956 1189 -718 -912 1090 2012 476 -1422 -1085 542 1060 -291 -2083 -1719
2848 -1719 584 1343 -695 -2173 -798 1343 1544 -128 -1460 -435 1868 1996 -374 -1695 -301 1469
2864 1469 1098 -852 -2104 -1255 764 840 -1403 -2418 -916 822 692 -740 -1423 -362 1472 1392 -442
2881 -442 -1118 259 1364 686 -617 -1110 -442 557 212 -1262 -1657 -432 302 -416 -1062 -978 -111 753 459
2900D59j115J77J371M59j083p98K83P48L14q30j041J99J014O0r65k97M67N14K76
2919B12k38m34L21Q32R9m19o0K21L7k5ol04k45K5k04j47L49l9o67JP80L14k67
2942A36l13R7N19O75k11r12K3J043K07p52p00j3M85N29n63j253O1J100L77q12
2962b77n74M14Q38O06m31j093M26J333K72j165p28M39Q79K79j155j263M68J627
2980H95j59j697p33J121J423j3j442r60J357K020m02j966n70J506J315n31j673
2997e09r80J316J686p08k327n39J848J185o74j712n50J656J736q10j954J46J964
3014G74Q96j049j374j91J460R22j154j809K44J523M99j119j209j0J433J095j063
3031a32j611N98K003M74j343j105N79J656O10j688j627J012J743k11j789q60Q86
$$ plain form
2900 459 -656 -479 892 1351 268 -530 -247 501 815 -15 -1056 -857 157 217 -748 -1045 -578 -64 212
2919 212 -26 -460 -139 693 792 373 313 534 571 546 540 236 -9 16 -188 -335 14 -25 -692 -691 89 403 136
2942 136 -177 -80 439 1114 903 -9 14 1057 1264 512 -188 -201 284 813 250 -1003 -942 158 535 -277
2962 -277 -851 -437 401 1007 576 -517 -91 1242 1514 349 -379 60 939 1218 63 -1200 -732 895
2980 895 736 -961 -1694 -573 850 837 -605 -1565 -208 1812 1410 -556 -1126 380 1695 1164 -509
2997 -509 -1489 -173 1513 805 -1522 -2061 -213 972 298 -1414 -1964 -308 1428 618 -1336 -1190 774
3014 774 1670 621 -753 -944 516 1438 284 -1525 -1281 242 741 -378 -1587 -1597 -164 931 -132
3031 -132 -1743 -1145 858 1332 -11 -1116 -537 1119 1729 41 -1586 -574 1169 958 -831 -1691 -805
3048h05J290R4j386j042J251J618l35j293l03J008J106rj275p31J100J180o90
3065G78j425j93R33M41m63r44j95R99P05q30o06N61P15J13j91k27p5N49M46n21
3085E70o34K11M14o0l38n81j90P75K38p56o09P78P59k86n32J41M32N51J0p11j15
3106F7Q36J10p66k81K22J11j03k67m90J55N91r8o16K3O61K17j99k37j3O07N20
3127A050n35p99L88Q58k97q48k34J83M49j7p98m47N99P48m08o52J72N46M12P9
3147D49m81l15N93O28m28p45j1L64K75k58p29l81N88P00o74o78J74P71L52k56
3167f2n26k3R46O25p34p52M13P50m4p31n74J20Q15J59j069o99P58P68k28o62j64
3188i14N28Q20N9q26l56J051N85m77o73O8L33L64k83r13j16P04K89p45l47L41
$$ plain form
3048 -805 485 579 -807 -1849 -598 1020 685 -608 -911 97 1203 1194 -81 -812 288 1468 778
3065 778 -647 -840 93 534 71 -873 -1068 -69 636 -194 -800 -239 476 589 398 171 96 645 1091 570
3085 570 -64 147 561 501 163 -418 -608 167 405 -351 -960 -182 577 291 -241 -100 332 883 893 182 67
3106 67 903 1013 247 -34 188 299 196 -71 -561 -406 185 87 -529 -506 155 372 173 -64 -77 530 1050
3127 1050 515 -284 104 962 665 -183 -417 -234 215 198 -600 -1047 -448 300 -108 -760 -588 -42 370 449
3147 449 -32 -347 246 874 446 -299 -310 54 329 71 -658 -1039 -451 249 -425 -1103 -929 -158 194 -62
3167 -62 -588 -611 335 960 226 -526 -113 637 593 -138 -712 -592 223 382 -687 -1386 -628 140 -88 -750 -914
3188 -914 -386 434 493 -333 -689 362 947 470 -203 -135 198 562 279 -634 -750 -46 243 -502 -849 -508
3208e08L95K70j47m01J31Q04K44o22k22M81J96Lk90m85P1M77o1p06k46N16K70
3229A70k24k98j19L46P02n1o85Q7P05L45n27k49O5L64K19n39o46J50O85k41o65
3250d06j07K93M25J4m28l62O38P71m16n81K67M98K31k77n44k36O12M27q23o95
3270f99M24M48o5m48k82J24O72L03o25m44N86P26j77m67j72J97N34J19q94n71
3290g11O52N01m83o23j16L01N61n9p34k21Q84N46m97m58K50M54L81k11p93j70
3310e46Q56L24q76o58L47N50mm58o14K56R48J24p96l52P28N85q4m47k50L61O62
3331F56j05q49k31N98K47l91n01k38M60N40k21q17K4Q88L18m21l10K38M68M57
3351H10m08o89K87O99j11p67k14J81M18l1m37m74K80P76m8p05k4N15M46O7l88
$$ plain form
3208 -508 -113 157 10 -391 -260 544 788 166 -56 425 621 624 334 -151 -80 397 336 -370 -616 -100 170
3229 170 -54 -352 -471 -125 577 526 -159 -72 633 978 451 202 267 631 850 311 -335 -185 500 259 -406
3250 -406 -513 -220 205 219 -209 -571 67 838 422 -159 108 606 837 560 16 -220 392 819 -4 -699
3270 -699 -275 173 108 -340 -622 -498 174 477 -148 -592 -6 720 543 76 -96 101 635 754 -140 -711
3290 -711 -59 442 -41 -664 -780 -479 82 23 -711 -932 -48 498 1 -457 -207 247 628 417 -376 -546
3310 -546 310 634 -242 -900 -553 -3 -7 -465 -1079 -823 125 249 -547 -899 -171 414 330 -117 -367 -6 656
3331 656 551 -298 -529 69 316 -75 -576 -814 -354 186 -35 -852 -828 60 378 -43 -353 -115 353 810
3351 810 402 -287 0 699 588 -179 -393 -212 206 175 -262 -736 -456 320 272 -433 -457 58 504 571 183
3372A83l67N34P17l75p72o7P07Q9l55o35j80N69N38o38p26L93P30m4l11j84J96
3393BN98L90n95o51M78P28k26o07l04K7N66J35p96n39N66P06k99o12k1M08O15
3414E69N1o60l24Q88N09n74n71k7N01J61j84p37k53O17M25o14n14J37M51L27j26
3435E2n62rQ58M48o79n30M02N22j3m39m74M1O69M6q09m12M86L52j76k52j41R3
3457e27N62K36n19j90M20L90l9k60k20k4M92M7o28m08M35K25l05k05m7M2L30O8
3479a25k25l2L41J40m4L3J10j50R8K09k92j70Q0P0j78k2j25j26J68J28j41j32
3501c85K89L3pK46J42k27J0L49mj64q0k3q2K09n9n61m1M70Pk88j80J92J68L31
3525C45m2n47K17O45J34m58j76J20L14K13m39n50N0N88J19o93l14J83L61L35l95
$$ plain form
3372 183 -184 350 1067 692 -80 -147 560 649 294 -341 -521 48 586 -52 -778 -385 345 301 -10 -194 2
3393 2 600 990 395 -256 222 950 724 117 -187 -160 406 541 -255 -794 -228 478 179 -433 -454 -46 569
3414 569 620 -40 -364 524 1033 459 -112 -139 362 523 339 -398 -651 -34 391 -223 -737 -600 -149 178 52
3435 52 -510 -519 339 787 108 -422 -20 502 489 50 -424 -383 286 332 -477 -889 -403 -51 -227 -479 -620 -527
3457 -527 35 271 -248 -438 -18 372 333 73 -147 -171 321 368 -260 -668 -233 -8 -313 -518 -565 -523 -193 -125
3479 -125 -350 -382 -41 99 55 88 198 48 146 355 63 -107 -27 43 -135 -157 -282 -408 -240 -112 -253 -385
3501 -385 -96 -63 -70 176 318 91 101 450 446 282 202 179 97 306 247 -314 -355 115 122 -166 -346 -154 14 345
3525 345 303 -244 -27 618 752 294 118 238 552 765 326 -224 -174 414 533 -160 -474 -291 70 405 10
3546A0n34K25R21N8n88k51L75M86J24m96o22K94O94j34p97l01L43L96rm70m76
3567g52K89R36K6q25j94N97O17o7o16m84N75P69l26j040j35P25L45m16p07k08
3587h91N89P15m67q30J99Q30K51k36m03j49M91N98k71q57J0O18J84l80n20k05
3607g24M63M87l52q47K20P87J34l88k91J44M71L80k61o57J95O57P6m55l82k1L35
3628b9L18n03o92K69P78k2n95j94M02M30J02l51l42N37M91l19k80K7J51J3q7r8
3650Fk54N5K86k28j80J78k9J8K18N3j45O6K72J2o1J05r2j32K74O6l86j81K13m6
3674H8j20P2j41n2K05J4j88PL32m8k8K27J1j58J04P2l7q7n4j65K5K52k20m96J67
3699b18L93l5l18j82K22M29K41m69m37N50O58l63o29J8M50K53k73o42j47N84L84
$$ plain form
3546 10 -524 -299 622 680 92 -159 216 702 826 330 -292 2 696 562 -235 -536 -193 203 194 -276 -752
3567 -752 -463 473 499 -326 -520 77 694 627 11 -473 102 871 545 -495 -630 95 440 24 -683 -891
3587 -891 -302 413 -54 -884 -685 145 396 160 -243 -392 99 697 426 -431 -421 197 381 1 -519 -724
3607 -724 -261 226 -126 -973 -753 34 168 -220 -511 -367 104 484 223 -434 -239 418 494 39 -343 -364 -29
3628 -29 289 -214 -906 -637 141 119 -476 -670 -268 162 264 -87 -429 108 599 280 0 27 178 191 104 6
3650 6 -248 -193 93 -135 -315 -137 -166 -148 70 123 -22 44 316 328 267 372 280 148 422 488 102 -79 134 88
3674 88 -32 40 -101 -153 52 66 -122 -115 217 169 141 368 379 221 325 397 360 273 219 54 79 331 111 -385 -218
3699 -218 175 140 -178 -360 -138 291 532 63 -374 176 834 471 -158 -140 310 563 290 -352 -499 85 469
3720D69o76n02L91L94j7j50k88Q5N05K50m59k60L63K45j51j42j73q7J79K13l46
3741a57l64P3K19J23Nk89l43M49N58k43m96R0N15L47k93m85j76O96M47p49p34
3762h07L74O76r8n64m32K54P52J07p67k78Q12N06m79l34P5M37K01k07m29m9M78
3783B28M3m90p1J79j04j3Q3q2p8J62R1NJ35K3k30K37L92j31m61N2L61N0k08k94
3807a21k21M40K79n17m82M38N64k45m37J46L28L22j4m79j8O03J02n63j34M01J50
3828E42m24k63N4K18P5k69l82M46M03l96l58M26M41j03l51k0L38L13k37o11M6
3849a12O21R9p39l55M70L33k78l49k39M71N33l66o00L44N31j0l20j15K38J75o
3870C26l31j77L66k8l92r2K92n2k76o0M12k3j60k12P9N00J92o04k52O37N84o46
$$ plain form
3720 469 -207 -709 -318 76 59 -91 -379 -294 211 461 2 -258 105 350 199 57 -116 -203 -24 189 -157
3741 -157 -521 -448 -229 -106 -101 -390 -733 -284 274 31 -465 -375 140 487 194 -291 -467 229 676 -73 -807
3762 -807 -433 243 145 -419 -851 -597 155 262 -505 -783 29 535 56 -278 -203 234 435 228 -201 -250 228
3783 228 271 -219 -290 -111 -215 -228 -145 -227 -305 -143 -52 -47 88 111 -119 118 510 379 -82 -30 331 381 173 -121
3807 -121 -342 98 377 -140 -622 -184 380 135 -302 -156 172 494 480 1 -17 586 688 125 -9 392 542
3828 542 118 -145 -91 127 202 -67 -449 -3 400 4 -354 72 513 410 59 39 377 690 453 -158 -112
3849 -112 509 608 -131 -486 -16 317 39 -310 -549 -78 455 89 -511 -167 364 354 34 -81 157 332 326
3870 326 -5 -182 184 156 -236 -328 -36 -88 -364 -424 -12 -35 -195 -407 -328 172 364 -240 -492 145 729 83
3892H3n98K26O04J29o21o24K96Q62r8j013k07R52L90m93n05J40P26L18n87o06
3912f26M50P81k76o35q4M66J17j76m09o9L98J03m01k13M14K59l41j2L98M0j49
3933C5q7N1K94J79n18k71M94L13n03n43L22M75r3m91k42M80O22k64p37J30R52
3954E98J33p28l36O12M64k25o22k09O28M78p40o70L94Q00k89o84MN01L66j94n80
3975b99J65P40O4o72q8N55K31m44l74Q0L63N0l75m56L91M31l48n24L03N37n9l40
3997f9j01K87M15j18n54RO57L9p25j53M88K41m55l97J13N09R3p60k49P92M90n30
4019B2o73M51P63j60n58k49M76O78m62q22J0Q62O9q04l44M74M56q9o49j93O29
4040a13N94n43o20M35O93j45n55p9L34L48j66o03K6N87n6o40j18N47J44m02j78
$$ plain form
3892 83 -515 -289 315 444 -177 -801 -505 357 259 -754 -961 -9 381 -112 -617 -477 249 567 -20 -626
3912 -626 -176 605 329 -306 -390 76 193 17 -392 -461 -63 40 -361 -574 -160 99 -242 -254 144 184 35
3933 35 -52 -1 293 472 -46 -317 177 490 -13 -556 -234 241 148 -343 -585 -105 517 253 -484 -354 598
3954 598 731 3 -333 279 743 518 -104 -313 315 793 53 -617 -223 577 288 -396 -392 109 475 281 -299
3975 -299 -134 606 670 -2 -90 465 696 252 -122 -42 321 371 -4 -460 -69 362 14 -510 -207 330 271 -69
3997 -69 -170 117 532 414 -140 -131 526 565 -160 -313 175 416 -39 -436 -323 186 279 -481 -730 62 552 22
4019 22 -651 -200 563 403 -155 -404 72 750 288 -534 -524 338 407 -397 -741 -267 189 100 -549 -742 -113
4040 -113 481 -62 -682 -247 446 301 -254 -333 1 349 183 -420 -394 193 137 -503 -621 -74 70 -332 -510
4061e10J05N06Ql61k06N79M22n74m12M36N50k45o19m3M09L95m97o35K26Q59j19
4082B74q61o2P74L82l71n17J77O50K64p49m21P04N54n41o76K33M66J22n09l83
4102d90K47O25q4p47K9P86J32n66j92M13L73o1m79j28M76L87n57n10M32M48l93
4123A41m34J39L09J57k76l62J74P23j35o34n1Q01P3n80k47L61L49p1n50k96O69
4144B60L17o81o15N58O49k58o48l2N25M68l27o59J84R15l7q11j93O60K16l43n18
4165c70QM96K58o35m90N67N19m12n00J99N04Q0k89l04K73N49j51o46k4P69k4o83
4187c06j86L47K31k19l65r7O10K50o11l66N60M87l48m11J27M72J65l07m72L17
4207a22N36j30p77J9O68P3m93k94K11M51L5m94j79N79L79n75l43M66M48k05m71
$$ plain form
4061 -510 -405 101 109 -252 -458 121 543 -31 -443 -7 543 298 -321 -364 45 440 -57 -692 -466 393 274
4082 274 -587 -649 125 507 136 -381 -204 446 710 -39 -460 244 798 257 -419 -186 280 402 -107 -490
4102 -490 -243 382 298 -449 -420 366 498 -68 -260 153 526 465 -14 -142 334 721 164 -346 86 534 141
4123 141 -293 -154 155 312 36 -326 -152 571 436 -198 -249 552 625 45 -202 159 508 437 -113 -409 260
4144 260 577 -104 -719 -161 488 230 -418 -450 75 543 216 -443 -259 656 619 -192 -385 275 491 148 -370
4165 -370 -362 134 392 -243 -733 -166 353 -59 -559 -360 144 224 -65 -369 -96 453 302 -344 -368 401 377 -306
4187 -306 -492 -145 86 -133 -498 -595 15 265 -346 -712 -152 335 -13 -424 -297 175 340 33 -439 -122
4207 -122 414 284 -493 -474 194 267 -226 -520 -309 142 177 -317 -496 83 462 -113 -456 10 458 253 -218
4228b18L6L53K48l23n49J81O24j13o66q4N92K43l42l11O6N97J30m41l60N47M92
4249G02m05m98J74M09L0k85l65J70M57j64n57N4M74P3m28J8L42R5m6j87m2M02
4271D23J25m70j97M37K36m19l41J69L46p2l48k81L38N08k64p02K55O74M8n30j77
4292b42K59M55m7n07l39N84M58n58n66K89M73n7l86k49J75M70o3n28J7N65J17
4313C20m74K7K57J41j77j56k8J76J2l08j60L71J10m15k32M36J85k20k51M5L51
4334A0L17k96n14K96O06j05n97o2M46J50k29m32j36M30K60l98l97L81M76k62k88
4355c44O3K31K77j39l37J44L37K2m72N1K61j4k57KM6P1R1k82j03M39J08l81j08
4378b94L98K17k66q0N7J04K57k48l57J42M58j19n61lM99k6j90j64J3L01J67l31
$$ plain form
4228 -218 -182 171 419 96 -453 -272 352 239 -427 -511 81 324 -18 -329 -263 334 464 23 -337 210 702
4249 702 297 -201 -27 382 412 127 -238 -68 389 225 -332 -278 196 269 -159 -141 201 296 250 63 21 423
4271 423 548 78 -119 318 554 135 -206 -37 309 237 -111 -392 -54 454 190 -512 -257 417 465 -65 -242
4292 -242 17 472 425 -82 -421 163 621 63 -503 -214 259 202 -184 -433 -258 212 149 -379 -362 203 320
4313 320 -154 -127 130 271 94 -62 -90 86 98 -210 -370 1 111 -304 -536 -100 85 -135 -386 -341 10
4334 10 327 31 -483 -187 419 314 -283 -345 101 251 22 -410 -546 -116 144 -254 -651 -270 206 -56 -344
4355 -344 -281 -50 227 88 -249 -105 232 254 -218 -167 94 80 -177 -175 -129 -58 33 -249 -352 87 195 -186 -294
4378 -294 104 321 55 -25 32 136 393 145 -212 -70 388 269 -292 -295 204 178 -12 -176 -163 138 305 -26
4400b6k16M42K27k85j33K45Q0j52p2n2M4J90j25l23R4L30j70k90J90J51J0j61
4422bn8M1L62M9m42j13N09J77l71j87J13O3J17k12l32J34M38k2m79oL05J17j83
4445A8m3PJ37J31j42k24K14J52j91j05P8Lj44M1po3P2r0j26K31J87k82k11K48
4469a09L71j83k46R6P2J35k5k60j59L88J43m20j97K47J69p8j17j75J30K37N8l44
4491b67pL07J07j42r4L6K1J39j10k51N0J67p9j04K39k03o6Q5J08k0k7O5MN3J09
4516A20l2k58K11K80k30k41J29J21Ln0k03j31L22J28k94j91L80O4k8r6L4l5K07
4539B10P0k55j5J87K7k43R2L2j02JJ24j37q9K39j01o9J64%j93J44J78q3j12J19
4563A88m9N8Q5j37k23K04J96k37k12R4J00M5Mr1j42J68K06j32j68J19J81j31P9
$$ plain form
4400 -26 -242 200 427 142 9 254 334 182 110 58 102 292 167 -156 -62 268 98 -192 -2 149 159 -2
4422 -2 -60 -19 343 392 -50 -163 346 523 152 -35 78 141 258 46 -286 -152 286 264 -215 -221 84 201 18
4445 18 -25 -18 119 250 108 -116 98 250 59 -46 32 35 -109 -68 -75 -138 -66 -156 -282 -51 136 -146 -357 -109
4469 -109 262 79 -167 -71 1 136 111 -149 -308 80 223 -197 -394 -147 22 -56 -173 -348 -218 19 77 -267
4491 -267 -274 33 140 -2 -96 -60 -39 100 -10 -261 -211 -44 -123 -227 12 -191 -257 -172 -64 -84 -111 -46 -42 11 120
4516 120 88 -170 41 321 91 -150 -21 100 103 53 -150 -281 41 169 -125 -316 64 128 100 4 38 3 210
4539 210 280 25 10 197 224 -19 73 105 3 4 128 -9 -98 141 40 -29 135 135 -58 86 264 181 69 188
4563 188 139 197 282 145 -78 126 322 85 -127 -33 67 112 116 25 -117 51 257 125 -43 76 257 126 205
4586B05j26n7R3R1j95j48J12R3j11m6L4j27Q1J63p0j44Q8O7K4klj84Q9K72j53
4611D6j84OJ39m3j1r9k03J25K23r2k32O2L06p4m1n7q9J98J94j28k54J49K00k24
4635h3p1Q7j24P6J36j55j88J46J74j09j7M0j04Q7J74n9j69R9K64j57q1n0m6K4
4659a06J76j41j94L6K40m5j01Ro1J05K17q4k72K54K00q9j69J11JK8J03j48j69
4682i9P7J63j02j42J56j3l4J16p3j34J46J50j60k9R8j1K5lO0j79L3K04j88l3K5
4707E3m8M4pK5j40J07J24p8l7J46l1n1J07N0j96Q8N4q2r0Q6m9q2N7l9j28M3J59
4734H5j07q5J74L2r8R1R0j99OJ39j37KP9rj65P7K6r1o4J09k9p8Q6M%j1R3p0MJ04
4764E8J8j45J46j33j63K47J9j75n7P9Jl4K6J7j79J33J39j48l9J26L0o1N8L1j20
$$ plain form
4586 205 79 22 115 206 11 -137 -25 68 -43 -89 -55 -182 -101 62 -8 -152 -64 3 27 25 22 -162 -73 199 46
4611 46 -138 -132 7 -36 -47 -146 -349 -224 -1 -93 -325 -263 43 -31 -72 -129 -218 -20 174 46 -208 -59 141 -83
4635 -83 -154 -67 -191 -115 21 -134 -322 -176 -2 -111 -128 -88 -192 -105 69 10 -159 -60 204 47 -34 -84 -130 -106
4659 -106 70 -71 -265 -229 11 -34 -135 -126 -187 -82 135 51 -221 33 233 144 -25 86 87 115 218 70 -99
4682 -99 -22 141 39 -103 53 40 6 122 49 -85 61 211 51 22 120 109 134 131 191 12 45 249 61 28 53
4707 53 5 49 42 67 -73 34 158 80 43 189 158 107 214 264 68 156 210 128 38 124 75 -7 50 11 -117 -74 85
4734 85 -22 -107 67 99 1 92 182 -17 -11 128 -9 -7 72 63 -102 -25 1 -90 -154 -45 -74 -152 -66 -62 -62 -73 20 -50 -46 58
4764 58 76 -69 77 -56 -219 28 47 -128 -185 -106 -105 -139 -113 -96 -275 -142 -3 -151 -190 -64 -34 -95 -37 -6 -126
4789a26J29N4k04m4J52J5j59O5jr3J15Q1j84oK59o6k2L8jp4J00J43k06p9J67J02
4815A55k14K1n0j5J48m1j09p2K70m5j26M4J54j35Q7J17j66k8K15m1j47P3K0j10
4839EK7J08j58n6R3Q8j84l7J77pnQ4q1RR7R1j64P8j1q4MJ28j33j43J86J6j57m5
4867g4J15k7M9M9p7j7J01L2r6rJ15j18NJ31j28j26O6J07j23n7mJ2OJ34j12m2J33
4894D5R1j90N7L9r6N7M1l0j53J15J17j39j14J16j26P0Q7j03p7P9J55q9j17P8J5
4919g2L7J38j74j38J67J26j31j02O3o7LJ35j21j78J13J78j10j5K9J9R3J39j61
4942b9j15R1J94o4k01O8j1J24l0j08j29O1K31j79r7N0P7RJ06p5j64K23J84j49
4966F7j43L7J04M8lm6k01J33J44o5j44jJ07L3N3q8j77K46J30Jk85R7J32M4Mj35
$$ plain form
4789 -126 3 57 -147 -191 -39 -24 -183 -118 -119 -212 -97 -16 -200 -206 53 -13 -35 3 2 -72 28 171 -35 -114 53 155
4815 155 -59 -38 -88 -103 45 4 -105 -177 93 48 -78 -34 120 -15 72 189 23 -5 210 169 22 95 115 5
4839 5 32 140 -18 -74 19 107 -77 -114 63 56 51 135 54 63 160 251 87 165 154 70 74 202 69 -74 112 128 -29 -74
4867 -74 41 14 63 112 35 18 119 151 55 46 161 43 48 179 51 -75 -9 98 -25 -82 -86 -74 -68 66 -46 -88 45
4894 45 136 -54 3 42 -54 3 44 14 -139 -24 93 -46 -160 -44 -170 -100 -13 -116 -193 -114 41 -48 -165 -87 -72
4919 -72 -35 103 -71 -209 -42 84 -47 -149 -86 -153 -150 -15 -136 -314 -201 -23 -133 -148 -119 -100 -7 132 -29
4942 -29 -144 -53 141 77 -124 -56 -67 57 27 -81 -210 -149 82 -97 -194 -144 -67 -58 48 -27 -191 32 216 67
4966 67 -76 -39 65 113 110 64 -137 -4 140 75 -69 -70 37 70 123 35 -142 104 234 235 -50 47 179 223 227 92
4992I2j58J21K75k20k12M3J35J08p7j31j72K71J61p7k67J6L00Mj29p9k1J06K40
$$ plain form
4992 92 -66 55 330 110 -102 -59 76 184 107 -24 -196 75 236 159 -108 -92 208 212 83 4 -17 89 329
$$ [...]
8191E5
##END NTUPLES=NMR FID
##END=
