##TITLE=1H_ANY-163-B
 CDCl3, 8 sc, 
 7.2.2019
##JCAMPDX= 6.0         $$ Bruker NMR JCAMP-DX V2.0
##DATA TYPE= NMR FID
##DATA CLASS= NTUPLES
##ORIGIN= UXNMR, Bruker Analytische Messtechnik GmbH
##OWNER= root
$$ XWIN-NMR		Version 3.5
$$ Thu Feb  7 13:50:45 2019 Russian Standard Time (UT+4h)  she@DPX200
##.OBSERVE FREQUENCY= 200.1313
##.OBSERVE NUCLEUS= ^1H
##.DELAY= (6, 6)
##.ACQUISITION MODE= SIMULTANEOUS
##.ACQUISITION SCHEME= undefined
##.AVERAGES= 8
##.DIGITISER RES= 18
##SPECTROMETER/DATA SYSTEM= spect
##.PULSE SEQUENCE= zg30
##.SOLVENT NAME= CDCl3
##.SHIFT REFERENCE= (INTERNAL, CDCl3, 0, 15.7039)
##AUDIT TRAIL= $$ (NUMBER, WHEN, WHO, WHERE, WHAT)
$$ ##TITLE= Audit trail, XWIN-NMR		Version 3.5
$$ ##JCAMPDX= 5.01
$$ ##ORIGIN= Bruker BioSpin GmbH
$$ ##OWNER= she
$$ F:/spectra/data/she/nmr/H-F/1/audita.txt
$$ ##AUDIT TRAIL=  $$ (NUMBER, WHEN, WHO, WHERE, WHAT)
(   1,<2019-02-07 13:49:35.31 +0400>,<she>,<DPX200>,
      <created by zg, POWCHK disabled, PULCHK disabled
       configuration hash MD5:
       00 E9 B6 7A A2 85 ED C7 34 08 36 98 17 FE 4E 26
       data hash MD5: 16K
       66 84 A0 82 98 D0 30 94 FF CE C3 BE 3B 69 1D 86>)
$$ ##END=
$$ 
$$ hash MD5
$$ D0 F1 0C 68 23 54 EC 36 9B 2F B1 33 AB 9C E1 27
##$RELAX= 
##$RELAX= 
##$RELAX= 
##$RELAX= 
##$RELAX= 
##$RELAX= 
$$ Bruker specific parameters
$$ --------------------------
##$DU= <F:/spectra>
##$EXPNO= 1
##$NAME= <H-F>
##$PROCNO= 1
##$TYPE= <nmr>
##$USER= <she>
##$AMP= (0..31)
100 100 100 100 100 100 100 100 100 100 100 100 100 100 100 100 100 100 
100 100 100 100 100 100 100 100 100 100 100 100 100 100 
##$AQSEQ= 0
##$AQ_mod= 1
##$AUNM= <au_zg>
##$AUTOPOS= <>
##$BF1= 200.13
##$BF2= 200.13
##$BF3= 200.13
##$BF4= 200.13
##$BF5= 200.13
##$BF6= 200.13
##$BF7= 200.13
##$BF8= 200.13
##$BYTORDA= 1
##$CFDGTYP= 0
##$CFRGTYP= 5
##$CHEMSTR= <none>
##$CNST= (0..31)
1 1 145 1 1 1 1 1 1 1 1 1 1 1 1 1 1 1 1 1 1 1 1 1 1 1 1 1 1 1 1 1 
##$CPDPRG= <>
##$CPDPRG1= <>
##$CPDPRG2= <>
##$CPDPRG3= <>
##$CPDPRG4= <mlev>
##$CPDPRG5= <mlev>
##$CPDPRG6= <mlev>
##$CPDPRG7= <mlev>
##$CPDPRG8= <mlev>
##$CPDPRGB= <>
##$CPDPRGT= <>
##$D= (0..31)
0 1.2 0 0 0 0 0 0 0 0 0 0.03 0 0 0 0 0 0 0 0 0 0 0 0 0 0 0 0 0 0 0 0 
##$DATE= 1549532974
##$DBL= (0..7)
120 120 120 120 120 120 120 120 
##$DBP= (0..7)
150 150 150 150 150 150 150 150 
##$DBP07= 0
##$DBPNAM0= <>
##$DBPNAM1= <>
##$DBPNAM2= <>
##$DBPNAM3= <>
##$DBPNAM4= <>
##$DBPNAM5= <>
##$DBPNAM6= <>
##$DBPNAM7= <>
##$DBPOAL= (0..7)
0.5 0.5 0.5 0.5 0.5 0.5 0.5 0.5 
##$DBPOFFS= (0..7)
0 0 0 0 0 0 0 0 
##$DE= 6
##$DECBNUC= <off>
##$DECIM= 32
##$DECNUC= <off>
##$DECSTAT= 4
##$DIGMOD= 1
##$DIGTYP= 9
##$DL= (0..7)
0 120 120 120 120 120 120 120 
##$DP= (0..7)
150 150 150 150 150 150 150 150 
##$DP07= 0
##$DPNAME0= <>
##$DPNAME1= <>
##$DPNAME2= <>
##$DPNAME3= <>
##$DPNAME4= <>
##$DPNAME5= <>
##$DPNAME6= <>
##$DPNAME7= <>
##$DPOAL= (0..7)
0.5 0.5 0.5 0.5 0.5 0.5 0.5 0.5 
##$DPOFFS= (0..7)
0 0 0 0 0 0 0 0 
##$DQDMODE= 0
##$DR= 18
##$DS= 0
##$DSLIST= <SSSSSSSSSSSSSSS>
##$DSPFIRM= 0
$$ [...]
##$SUBNAM2= <"">
##$SUBNAM3= <"">
##$SUBNAM4= <"">
##$SUBNAM5= <"">
##$SUBNAM6= <"">
##$SUBNAM7= <"">
##$SUBNAM8= <"">
##$SUBNAM9= <"">
##$SW= 20.0189088683792
##$SWIBOX= (0..15)
0 0 2 0 0 0 0 0 0 0 0 0 0 0 0 0 
##$SW_h= 4006.41025641026
##$TD= 16384
##$TD0= 1
##$TE= 0
##$TE2= 300
##$TE3= 300
##$TEG= 300
##$TL= (0..7)
0 120 120 120 120 120 120 120 
##$TP= (0..7)
150 150 150 150 150 150 150 150 
##$TP07= 0
##$TPNAME0= <>
##$TPNAME1= <>
##$TPNAME2= <>
##$TPNAME3= <>
##$TPNAME4= <>
##$TPNAME5= <>
##$TPNAME6= <>
##$TPNAME7= <>
##$TPOAL= (0..7)
0.5 0.5 0.5 0.5 0.5 0.5 0.5 0.5 
##$TPOFFS= (0..7)
0 0 0 0 0 0 0 0 
##$TUNHIN= 0
##$TUNHOUT= 0
##$TUNXOUT= 0
##$USERA1= <user>
##$USERA2= <user>
##$USERA3= <user>
##$USERA4= <user>
##$USERA5= <user>
##$V9= 5
##$VALIST= <valist>
##$VCLIST= <CCCCCCCCCCCCCCC>
##$VD= 0
##$VDLIST= <DDDDDDDDDDDDDDD>
##$VPLIST= <PPPPPPPPPPPPPPP>
##$VTLIST= <TTTTTTTTTTTTTTT>
##$WBST= 1024
##$WBSW= 4
##$XGAIN= (0..3)
0 0 0 0 
##$XL= 0
##$YL= 0
##$YMAX_a= 459374
##$YMIN_a= -542832
##$ZGOPTNS= <>
##$ZL1= 120
##$ZL2= 120
##$ZL3= 120
##$ZL4= 120
##$ABSF1= 10
##$ABSF2= 0
##$ABSG= 5
##$ABSL= 3
##$ALPHA= 0
##$AQORDER= 0
##$ASSFAC= 0
##$ASSFACI= 0
##$ASSFACX= 0
##$ASSWID= 0
##$AUNMP= <proc_1d>
##$AZFE= 0.1
##$AZFW= 0.1
##$BCFW= 1
##$BC_mod= 2
##$BYTORDP= 1
##$COROFFS= 0
##$CY= 11.3945322036743
##$DATMOD= 1
##$DC= 2
##$DFILT= <>
##$DTYPP= 0
##$F1P= 18.9103706918063
##$F2P= -1.10871071338519
##$FCOR= 0.5
##$FTSIZE= 0
##$FT_mod= 4
##$GAMMA= 1
##$GB= 0.15
##$INTBC= 1
##$INTSCL= 1
##$ISEN= 128
##$LB= 0.24
##$LEV0= 0
##$LPBIN= 0
##$MAXI= 10000
##$MC2= 0
##$MEAN= 0
##$ME_mod= 0
##$MI= 1.114404
##$NCOEF= 0
##$NC_proc= 0
##$NLEV= 6
##$NOISF1= 3.799351
##$NOISF2= 2.8
##$NSP= 1
##$NTH_PI= 0
##$NZP= 0
##$OFFSET= 15.70392
##$PC= 1
##$PHC0= -9033.301
##$PHC1= 9.80005
##$PH_mod= 1
##$PKNL= yes
##$PPARMOD= 0
##$PSCAL= 0
##$PSIGN= 0
##$REVERSE= no
##$SF= 200.130013532006
##$SI= 16384
##$SIGF1= 3
##$SIGF2= 2
##$SINO= 400
##$SIOLD= 16384
##$SREGLST= <1H.CDCl3>
##$SSB= 0
##$STSI= 0
##$STSR= 0
##$SW_p= 3612.71676300578
##$SYMM= 0
##$S_DEV= 0
##$TDeff= 0
##$TDoff= 0
##$TI= <>
##$TILT= no
##$TM1= 0
##$TM2= 0
##$TOPLEV= 0
##$USERP1= <user>
##$USERP2= <user>
##$USERP3= <user>
##$USERP4= <user>
##$USERP5= <user>
##$WDW= 1
##$XDIM= 8192
##$YMAX_p= 0
##$YMIN_p= 0
$$ End of Bruker specific parameters
$$ ---------------------------------
##NTUPLES= NMR FID
##VAR_NAME=  TIME,          FID/REAL,        FID/IMAG
##SYMBOL=    X,             R,               I
##VAR_TYPE=  INDEPENDENT,   DEPENDENT,       DEPENDENT
##VAR_FORM=  AFFN,          ASDF,            ASDF
##VAR_DIM=   8192,          8192,            8192
##UNITS=     SECONDS,       ARBITRARY UNITS, ARBITRARY UNITS
##FACTOR=    0.0002496,     1,               1
##FIRST=     0,             0,               0
##LAST=      2.0444736,     0,               0
##MIN=       0,             -542832,         0
##MAX=       2.0444736,     459374,          0
$$ Real data points
##PAGE= N=1
##DATA TABLE= (X++(R..R)), XYDATA
0@%%%%%%%%%%qJ6j6K4l2L9m7N6p2Q8j04J21j45J76k08K41k81L28l76M31m95N65
32C01o41P26q25R30j045J174j312J464j631J815k017K238k478K737l022L335l675
49a926M050m466M920n418N975o599P296q085Q989j0032J1250j2701J4458j6637
63h926J9429k3150K8388l6369N0134q0338K64497k14680n03469M38681M01181
74C35378j20350m10811l7232K19117J57230n2035l7206r5482j12363R5432K54778
85A96456q2854l21249j3702L65983J62691k96659l12523J98689L68438j15409
95A49861m00718K0518L56403J18409k07083j78373L4795J49219O0874o4949j07740
106f8784q1580O9220K48357P7391k91909k38711J81356L07094j3454l07769j53787
$$ plain form
0 0 0 0 0 0 0 0 0 0 0 0 -8 8 -8 16 -16 23 -24 32 -40 48 -56 65 -80 96 -112 129 -152 176 -200 231 -264 301
32 301 -340 386 -439 491 -554 620 -692 772 -859 956 -1061 1177 -1301 1436 -1586 1749 -1926
49 -1926 2124 -2342 2578 -2840 3135 -3464 3832 -4253 4736 -5296 5954 -6747 7711 -8926
63 -8926 10503 -12647 15741 -20628 29506 -50832 213665 -1015 -504484 -65803 335378
74 335378 215028 -195783 -233015 -13898 143332 91297 54091 -41391 -153754 -58322 196456
85 196456 113602 -207647 -221349 144634 307325 10666 -301857 -103168 265270 149861
95 149861 -250857 -230339 126064 244473 37390 -140983 -106188 43031 103905 38956 -68784
106 -68784 -150364 -81144 167213 244604 -47305 -286016 -104660 202434 188980 -118789 -272576
117b72576K57264K87133j22431k85836j4084J65226O8093n5903p8768p963P1182
128A1337N4886k465n0058q5752J962J20749J4225j34626j8215J44725P9059r3110
140D2717j52957q250J75944P8569j68361j23579J23791J68580j7j45845j12875
151a22283O1907J20715q767p3914k3584M668N0960Q1793k9296j26702m4496P8845
163c0154R6487o217j12010j7498J44316L9974j47828n8732J03218M5062q1570
174b4952n5975P6980J07781m4405j22889J4121P5292k8663k9449L9458j0765l7741
186d1207M9738P6896k2983j20037o4419J14700J20442r4685j27068Q4727J29050
197A05154l4383j00960k3209M8313K5977m3281j3092O5320J0732n5387J2064K8724
$$ plain form
117 -272576 -15312 271821 149390 -136446 -150530 14696 82789 26886 -51882 -59845 11337
128 11337 66223 63758 13700 -72052 -70090 50659 64884 -69742 -87957 56768 135827 42717
140 42717 -110240 -118490 57454 136023 -32338 -155917 -32126 136454 136437 -9408 -122283
151 -122283 -60376 60339 51572 -22342 -45926 -41258 9702 91495 62199 -64503 -108999 -30154
163 -30154 66333 60116 -51894 -69392 74924 114898 -32930 -91662 11556 56618 -24952
174 -24952 -80927 -3947 103834 59429 -63460 -49339 25953 -2710 -32159 7299 -3466 -41207
186 -41207 8531 85427 62444 -57593 -122012 -7312 113130 18445 -108623 -23896 105154
197 105154 70771 -30189 -53398 -5085 20892 -22389 -35481 29839 40571 -14816 -2752 25972
209B5972m8467k5809M3028J8314k3537j1574L6439O3000k7952j16919p650J11688
221C6533K0412q2946l1126N3635O6838k809p8682l4296M0110P863j1625K8098
233A2005j241k9957L0554L8450l1165m9435j2810L1657M0435k2920l8458M9681
245A6796M7419n3649n1102J8763K3836J571j7267j6408L7553M4586k6754l6748
257a1404k412r847P385L1346j6372k6314L3383L5610q766l0880l9296K932N1041
270A6406P02m3163J2724M2260R490j2678l9700l0642L7337L0840l6582j8822L1786
283d2K6862R191k5294n2361L047M7298L303k3855n678J0719M2957K6825o0263
296B709n9962L2710M7478l901k9970k3581K9790O4235j3169p7966k2939L2950
$$ plain form
209 25972 -22495 -48304 -5276 13038 -10499 -22073 14366 77366 49414 -67505 -75155 36533
221 36533 56945 -26001 -57127 -3492 63346 60537 -18145 -52441 -12331 -4468 -16093 12005
233 12005 10764 -19193 11361 49811 18646 -30789 -43599 -11942 28493 5573 -32885 16796
245 16796 64215 10566 -40536 -21773 2063 3634 -13633 -30041 7512 52098 25344 -11404
257 -11404 -13816 -23663 -16278 15068 -1304 -27618 5765 41375 32609 1729 -37567 -34635 16406
270 16406 17108 -26055 -13331 28929 38419 25741 -13959 -44601 -7264 23576 -13006 -31828 -42
283 -42 26820 36011 10717 -41644 -38597 8701 12004 -11851 -17529 -6810 36147 62972 2709
296 2709 -57253 -24543 22935 19034 -10936 -34517 -4727 59508 46339 -31627 -54566 -21616
308b1616L2615J2120l5766l4039N1011O2560k8732o5575k5339L0475O0141J793
320C9648o6541q113O7055K7367l4611n1826l2630L7913O1898k1055n5421J0282
332b6034M9980K8520k6255p2005j6726P3279L7034m3933l1303J6588M0534K7653
344E7332m6269p4358J3440O6029J7136l0139l3739O411O3577K2238p4062n3616
356f6020L3757N0849J7257k9461m5379K3716O6515r163o8812l0254K6018N2883
368B1906K1681m9070l3283N0821M2389k9938n0193k5992K6395N9866n01n8206
380b4125o128M8405K3921k3545n5454k3962N9363N3081l6335m2319J7489L6082
392B6473J6294l1215o1409J454O5131K3848l2377k9199L318M4377K6940n9030
$$ plain form
308 -21616 10999 23119 -12647 -46686 4325 66885 38153 -27422 -52761 -22286 37855 39648
320 39648 -26893 -35006 32049 59416 24805 -27021 -59651 -21738 40160 19105 -36316 -26034
332 -26034 23946 52466 26211 -45794 -62520 10759 47793 3860 -27443 -10855 29679 57332
344 57332 11063 -63295 -49855 16174 33310 3171 -30568 -24157 39420 61658 -12404 -66020
356 -66020 -32263 18586 35843 6382 -38997 -15281 51234 42071 -26741 -56995 -30977 21906
368 21906 43587 -5483 -38766 12055 54444 24506 -25687 -51679 -25284 34582 34081 -24125
380 -24125 -30253 18152 42073 18528 -36926 -60888 -1525 51556 15221 -27098 -9609 26473
392 26473 42767 11552 -49857 -48403 16728 40576 8199 -21000 -17682 26695 53635 -5395
404e395o1889L2477O0023R129k9845l3641J1863N4388J845o2674k8767K8089M1978
417A7581K3800k8612m1668K6355M7273j9700m9654j7346K1154M5059J0245m6218
429a1731j5584M0008J7192k5186l3971j6886L6605N2069j7642m7529P900L5435
441B0680J1198k3406m8160j0472N6819L7411k6328l1908l755K3170L0777k3282
453A2744n9057K549N2664K1894j3112k3361j3476K2522J7400k9538k1674J6837
465a3608J7400J3596M541k0234k885K0817j3096l0847K187J8990J6574N063k4156
478e658j1999L1076J0737l2768k0711M311K1660L4405j280l6370l589K3642K663
491A6119j3894k0164j2020K7435K8292j4110j2792P503n313p425j645r123R243
$$ plain form
404 -5395 -67284 -34807 25216 34345 4500 -29141 -17278 37110 38955 -23719 -52486 -24397 17581
417 17581 41381 12769 -28899 -2544 44729 25029 -24625 -41971 -20817 24242 34487 -11731
429 -11731 -27315 12693 29885 4699 -29272 -46158 -9553 42516 24874 -22655 -14755 20680
441 20680 31878 8472 -39688 -50160 6659 44070 17742 -14166 -17921 5249 36026 12744
453 12744 -46313 -43764 8900 30794 17682 -5679 -19155 3367 20767 -8771 -30445 -13608
465 -13608 3792 17388 21929 1695 -1190 19627 6531 -24316 -22129 -3139 13435 18498 -5658
478 -5658 -17657 13419 24156 -8612 -29323 -25012 -3352 31053 29773 -6597 -10186 13456 16119
491 16119 2225 -17939 -29959 -2524 25768 11658 -1134 6369 1056 -6369 -8014 -17137 -7894
504g894K3693r378j7736J5225J6292o659k2607l1221O435N2846J7854l6242k2947
517b2339J2312K9075J8496l5354n4211J3797N8058K1254k3095l5897q810L9615
529A2901K2405m2906l5361J9835L3200J6643j0593k9297L828L0341r111l4694
541b2809n631K2888L1000O705l9807k0625M3727K8050l6849m6036n747M3859N4007
554E2732j5906o6086j3462M7910L4577j7160n8407l0384N7226O9528j5632n8863
566a3927k1418K5880M1959j570n6428k2990M4944L8928o231l0603k5079J4703
578a1832L1047j7042l5739J1816L6012J3124j2841k8611k791L5137O849m1355
590a6226k2136K2767L9641K1342l1804n1314J2096M9995L603l8250l0152R089
$$ plain form
504 -7894 15799 6421 -11315 3910 20202 13543 -9064 -40285 -33850 18996 36850 608 -22339
517 -22339 -10027 19048 37544 2190 -52021 -38224 19834 41088 17993 -17904 -26714 12901
529 12901 35306 -7600 -42961 -23126 10074 26717 16124 -13173 -9345 20996 11885 -22809
541 -22809 -28440 -5552 25448 32153 -7654 -28279 15448 43498 6649 -39387 -45134 -1275 52732
554 52732 36826 -29260 -42722 5188 39765 22605 -35802 -66186 -8960 60568 44936 -13927
566 -13927 -35345 -9465 32494 30924 -25504 -48494 -3550 35378 29147 -1456 -26535 -11832
578 -11832 19215 2173 -33566 -21750 14262 27386 14545 -14066 -16857 18280 25129 -16226
590 -16226 -38362 -15595 24046 45388 13584 -37730 -25634 24361 27964 -10286 -40438 -31349
602c1349N2182L2037l7311m5246L524K7724J8367j1561l5291N22M4219J5923k3346
615A0394j6282m741L312R773p243p370J9119J0943j2874n810J1r80O777j0479
629e450k3840J3462L7189P185k1114k4200m123K9247J4833l3417k1856K4680K6632
642A9228O715j0413k4949o669J7985J807j1553L74L727Q614J2539j1103j6680
655a0378R873M930j7247o387J1987K0923J5671k1517l4041J6374L4724j0586l3864
668a9538j1862K1152L8643Q903l6772k4601J3492J8354P447j4578l1921O219M9173
681B4111J5239l5363k9627M812K9361J1890l3149k0818L6617L1693j6600k5108
693f942o671J1100J6396r908k7194L938K8984J6348n893l0287k4020K7240L5758
$$ plain form
602 -31349 20833 52870 15559 -29687 -26163 1561 19928 8367 -26924 -26402 17817 33740 10394
615 10394 -5888 -10629 -7317 2456 -4787 -12157 6962 17905 5031 -779 -768 -1748 5029 -5450
629 -5450 -29290 -15828 21361 28546 7432 -16768 -20891 8356 23189 -10228 -32084 -7404 19228
642 19228 25943 15530 -9419 -16088 1897 3704 -7849 -7475 -3748 4866 17405 6302 -10378
655 -10378 -505 4425 -12822 -19209 -7222 13701 29372 7855 -26186 -9812 24912 14326 -19538
668 -19538 -31400 -10248 28395 37298 526 -24075 -10583 7771 15218 640 -31281 -25062 24111
681 24111 39350 3987 -25640 -20828 8533 20423 -12726 -33544 3073 34766 18166 -6942
693 -6942 -13613 -2513 13883 3975 -23219 -19281 9703 26051 20158 -10129 -34149 -6909 28849
706B8849k1399m0237L704M0321L1952j6852n2201j0395M3366K0590k5004k5473
718b2779J860L2850K7454k1977l8847K9K1436J0306m855k0918o015L3644K2207
731C4395k6969k9761J685K3345J7789j8934k9397K0756M2515n009l6391j7609
743b3585J1681K4970J888k9841r111K8041J8791n338j8251k3686L606L2889N875
756A7929k7714j0842K0260K6896R30l8625k5399K9809K8549j8992k3373P077K5181
769A1686J6455j8299l1278M177K2949J256p678n081l793J5884J9757j6803l1158
782b1926k060K2051J9190j0511k9071Q665M3059K724m0673j6881J8379K0265l38
795A2873k1924p546K5121J5082j3615j5327j1169l40K3540J1527k4359j4319K1926
$$ plain form
706 28849 7450 -32787 -29083 11238 43190 26338 -25863 -36258 7108 27698 2694 -22779
718 -22779 -20919 11931 39385 17408 -21439 -21410 26 10332 5477 -15441 -21456 12188 34395
731 34395 7426 -22335 -20650 2695 20484 1550 -27847 -7091 35424 30415 -5976 -23585
743 -23585 -11904 13066 14954 -14887 -23998 4043 22834 17496 -755 -24441 -20835 12054 17929
756 17929 -9785 -20627 -367 26529 27459 -11166 -36565 -6756 21793 2801 -20572 -13495 11686
769 11686 28141 9842 -21436 -17259 5690 6946 -732 -5813 -9606 6278 26035 9232 -21926
782 -21926 -23986 -1935 17255 6744 -22327 -13662 29397 32121 -8552 -25433 -7054 13211 12873
795 12873 -9051 -16597 8524 23606 9991 -5336 -16505 -16845 6695 18222 -6137 -20456 1470
808A470K4506m078l3811k2942K7404L3488j6966k7892Q598K3414J0341j3196k7594
821a7258m557K3445R345j0489p194j439J1371J6905j2798l0547J177K4053J1234
834A3248q777j7332L197L0675O851l4000j9386J5892J9003M002j4805j4955J4660
847a727K3199q795k2250q461M220J7586J2177j5276j3940J4409J5483m410j7081
860d866j6439Q759K5910j442k0593K587J6281L667q413j6436o382J8921J1146
873A2700j3071o663Q064P320L152j0782k0350L880K1106L958q682n799Q82J5563
887A1278Q520k2924j9214J3121J8626J627r779j0437P556J8617p539k3110j971
900a5629J1962P676L549p627o990J1947R139j1733j2936l297P769J7086J21j9955
$$ plain form
808 1470 25976 21898 -11913 -34855 -7451 26037 9071 -18821 -10223 13191 23532 10336 -17258
821 -17258 -21815 1630 10975 486 -6708 -8147 3224 20129 7331 -23216 -22039 2014 13248
834 13248 4471 -12861 -9664 21011 27862 -6138 -25524 -9632 9371 13373 -1432 -16387 -1727
847 -1727 21472 12677 -9573 -18034 -13814 3772 15949 673 -13267 1142 16625 12215 -4866
860 -4866 -21305 -12546 13364 11922 -8671 -6084 10197 13864 5451 -10985 -17367 1554 12700
873 12700 -371 -7034 1030 8350 11502 720 -19630 -15750 5356 9314 632 -5167 -4285 11278
887 11278 19798 -3126 -22340 -9219 9407 11034 1255 -9182 -1626 16991 9452 -13658 -15629
900 -15629 -3667 4009 7558 -69 -7059 4888 14027 2294 -10642 -13939 -6170 10916 11037 -8918
914h918K74K1351L360j7228j4864j48J9689J3743j5434j3501J0648J1685m83j0847
928f73j8018J007K4561Q878j4960r323M491J2862P175j7951k1034J2192K3484
941A2691M16j2068p924M396J5519j050k3240p482J5116J1519J257p835j0747Q249
955a183J5016r228j8715p80J1931J4051J777j7045n851J8712O882j6241j2545
968a3219Q10J3354J4521p502j6979L477J2335K61p873j2134l989J9002J4346j1991
982D419j1526N087P395K454q456j3762O407J7628n68q823n71J173K526R5j2174
997h696n254J3633Q505m658m804k250N168R006r554j7531N616J7036M881n172
1011E926j0199l289J4182O145j6965j1277O830J1601Q926m434j4703J487J3659
$$ plain form
914 -8918 -8644 12707 16067 -1161 -16025 -16173 3516 17259 1825 -11676 -1028 10657 10174 -673
928 -673 -18691 -17684 6877 15755 795 -8528 -4037 8825 16000 -1951 -22985 -10793 12691
941 12691 13107 1039 -6885 -2489 13030 11980 -11260 -18742 -3626 7893 9150 1315 -9432 -1183
955 -1183 13833 4605 -14110 -14890 -2959 11092 12869 -4176 -10027 8685 15567 -674 -13219
968 -13219 -12409 945 15466 7964 -9015 -5538 6797 7058 -815 -12949 -16938 2064 16410 4419
982 4419 -7107 -2020 5375 7829 -627 -14389 -7982 9646 9078 255 -316 857 3383 3478 -8696
997 -8696 -13950 -317 8188 3530 -1274 -3524 1644 10650 1096 -16435 -10819 6217 11098 5926
1011 5926 -4273 -7562 6620 12765 -4200 -15477 -8647 2954 11880 7446 -7257 -5770 7889
1024G889k267j1144m324K576J0990Q150j0392q770R180N504p194q109l966R141
1038b736J6360l763j6290J063J1710L714o559j5180n318J9335J6159j0612j5763
1051g880j767R468J1822n523k1649k134K0438J2703m882j2201r429R824J4100
1064A2890q997j6735K758J2934Q742k185j4075m246J3411K220j3006m909O011
1077e187J0236P169q981j3643N955J2590k404j1102p898M889K0235P297j8984
1090A72j3167R150J1214J013j0779j3148P433J9953J803j2722q002r14P639P317
1104F962q636r266Q487R788O22l743o567k334O518l16q446L862Q032O29k186m487
1120a081l579O217K891j0003l658Q331O305K657l871j0185o6R313q56o462m67
$$ plain form
1024 7889 5622 -5522 -9846 -7270 3720 11870 1478 -7292 1888 7392 198 -7911 -11877 -2736
1038 -2736 13624 9861 -6429 -5366 6344 10058 3499 -11681 -16999 2336 18495 7883 -7880
1051 -7880 -9647 -179 11643 6120 -15529 -17663 2775 15478 10596 -1605 -11034 -1210 12890
1064 12890 3893 -12842 -10084 2850 11592 9407 -4668 -8914 4497 6717 -6289 -11198 -5187
1077 -5187 5049 12218 3237 -10406 -4451 8139 5735 -5367 -13265 -8376 11859 19156 172
1090 172 -12995 -3845 7369 8382 -2397 -15545 -8112 11841 13644 922 -7080 -7994 -355 6962
1104 6962 -1674 -10940 -2453 7335 7957 4214 -2353 -4687 1831 1515 -6931 -3069 4963 5592 3406 -1081
1120 -1081 -4660 1557 4448 -5555 -9213 -882 5423 8080 4209 -5976 -6042 3271 2415 -4047 -4514
1135d514J547N982P116n544q460K565J375k867J516O02L62M937j748n756L426
1150E39K691o666l375J444M187R319O25j1919k177P814K217l301o111n367Q207
1165a873J3165l051j0551l165K161N949J948r897m957J1154Q438l807o276m444
1179e206K437O907m310r129M699J0060J145k900o027l157P844M537r696o340O269
1194b867R379N469p526j4542J670J4051J355j0747o513L801J3432P983j2204j3109
1208a0368M699R312K060m643q674J379J4539M524j2001p819K129N758M502p161
1222a764q076Q044J1766l408q753m775J727Q741J433j1700j946J1982O745l721
1236F295q254p000N700J0778l793j0335L39Q298P130j140j3539o209J0493P341
$$ plain form
1135 -4514 -2967 3015 10131 4587 -3873 -1308 67 -2800 -1284 -682 -320 4617 2869 -2887 539
1150 539 3230 -3436 -6811 -5367 -1180 8139 8764 -3155 -5332 2482 4699 1398 -4713 -10080 -1873
1165 -1873 11292 8241 -2310 -5475 -3314 2635 4583 -5314 -10271 883 9321 5514 -762 -5206
1179 -5206 -2769 4138 -172 -9301 -4602 5458 6603 3703 -2324 -5481 2363 6900 -2796 -9136 -2867
1194 -2867 6512 11981 4455 -10087 -8417 5634 6989 -3758 -10271 -6470 6962 14945 2741 -10368
1208 -10368 -5669 3643 5703 1060 -7614 -6235 8304 12828 827 -6992 -4863 895 5397 -1764
1222 -1764 -9840 -1796 9970 6562 -2191 -6966 -5239 3502 4935 -6765 -8711 3271 10016 6295
1236 6295 -1959 -8959 -3259 7519 3726 -6609 -6270 2028 9158 8018 -5521 -11730 -1237 6104
1250F104n923n482O28O590Q228m274j2696j98Q757K030l194m237j57R416M637
1265A0229j0376p551L826M947K119k906o531M300J0908j764r858l693K221N540
1279A411L578p256m904Q675P050l955o965l993K482Q662j100q235R44P568K453
1294F415k257p217n473O512P599n403n683L169N195L841l204j0272q60R431K566
1309D359m512k442P35N578M729p234q678L248N801R59j799l890O95Q160N98r162
1325b855l482L359L652K290l186m465N061P023l600o742j866J481N907K490o807
1340a740k214O829K480l066m386m581K739P972j236n593J144L298J452q47n351
1355c100l185N587L828k865o16J328O40K213k462o459J425N552l01j918k50J84
$$ plain form
1250 6104 181 -5301 -4673 1917 10145 5871 -6825 -7023 1734 3764 570 -3667 -3824 5592 10229
1265 10229 -147 -7698 -3872 1075 3194 288 -6243 -1943 8965 7201 -2657 -6350 -4129 1411
1279 1411 4989 -2267 -7171 1504 8554 4599 -2366 -6359 -3877 4785 3685 -4550 -3606 3962 6415
1294 6415 4158 -3059 -8532 -2020 5579 176 -5507 -2338 2857 6698 3494 -6778 -7638 1793 4359
1309 4359 -153 -2595 -1860 3718 8447 1213 -7465 -4217 1584 2543 744 -3146 -2451 5709 6307 -2855
1325 -2855 -6337 -2978 674 2964 -222 -4687 374 7397 3797 -2945 -4811 -3330 2577 5067 -1740
1340 -1740 -3954 2875 5355 2289 -2097 -6678 -3939 4033 2797 -2796 -1652 1646 3098 2251 -3100
1355 -3100 -6285 -698 3130 265 -351 977 1617 3830 1368 -5091 -3666 1886 1585 -333 -583 -399
1371c99L577R07o989l171M594K935k91p08k296J941N009k362o398k6K340K620
1387A283J779k931k354M939J619n042k571M99J435L247o32l979K591M489k224
1402B148m110j904K51N068K365m953k070N496K419k075m181m085K445O979n45
1417C248n416r3L054K567j0o374m122N746N332k011k718j025K220M497k439p827
1433e371M77N858J904j391k330j520M655L172o080m940K678L712K616j136n336
1448c032Q58O416j54o023l330J358N046M263m385n121L872M867j688l833l225
1463d111P24O220K160n154k090K476J366N28l412m510K840O100r27k900m08Q73
1479b25K360j58n116j421N258K597j959j383j016J611K979l210n164J842L875
$$ plain form
1371 -399 3178 4085 -2904 -6075 -1481 1454 1163 455 -1841 100 5109 2747 -3651 -3677 -1337 1283
1387 1283 3062 131 -2223 2716 4335 -707 -3278 -2779 -1344 1903 1271 -2708 -117 4372 2148
1402 2148 -1962 -3866 -3615 1453 3818 -1135 -3205 2291 4710 2635 -1546 -5631 -3186 3793 3248
1417 3248 -2168 -2261 793 3360 3350 -3024 -7146 -1400 3932 1921 -797 -1822 398 4895 2456 -5371
1433 -5371 -4894 964 2868 1477 -853 -2373 2282 5454 -626 -5566 -2888 824 3440 2304 -3032
1448 -3032 -2174 4242 4088 -1935 -5265 -3907 1139 5402 1017 -4104 -232 4635 2947 -886 -4111
1463 -4111 -3387 2833 4993 -161 -2251 225 1591 2119 -1293 -5803 -2963 3137 2210 -690 -1098 -225
1479 -225 2135 1977 -3139 -4560 698 3295 1336 -47 -1063 548 3527 317 -4847 -3005 870
1494H70J483n11l185r65M038J245m436k620J656K624L143q57m533Q28M326r51
1510B155l822j172R26L812K177m225j790L226O70k243j527j395J717M743p49l666
1526a163J48K255N23m68m220j571N521M011l673l440N16K688J997k826n069J345
1542c426N881J115j995k820j295K968K823m102l748K146M004J702j211m364p9
1557b401N089P6m795j357K499L476J374l596l723L000L317k419k821j595K113
1572a763N258J007n803k534L579K901o30l931k889M160N817j649m730j173J487
1587h93K773J11m033j850M503L015j346k239k325P80L333q17l971N78L428J565
1603B612o62k817j408K565J689k670j651J501K185K038j369m198j45L438j25k212
$$ plain form
1494 870 2353 1842 -1343 -2308 1730 2975 -1461 -4081 -2425 199 3342 2485 -2048 -1220 3106 2155
1510 2155 -1667 -2839 -1913 1899 4076 -149 -1939 1287 1957 -286 -1813 -3208 -1491 3252 2503 -1163
1526 -1163 -1015 1240 1763 1295 -2925 -4496 1025 5036 1363 -2077 -1561 1127 3124 298 -4771 -3426
1542 -3426 2455 3570 1575 -1245 -2540 428 3251 -851 -4599 -2453 1551 3253 2042 -2322 -2401
1557 -2401 2688 2764 -2031 -3388 -889 2587 3961 365 -3358 -358 2959 540 -2281 -3876 -1763
1572 -1763 3495 4502 -1301 -3835 -256 2645 2015 -1916 -4805 -645 5172 3523 -1207 -2380 -893
1587 -893 1880 1991 -2042 -3892 611 3626 2280 41 -2284 -1504 1829 1012 -2959 -2381 1047 2612
1603 2612 1950 -867 -2275 290 1979 -691 -2342 -841 1344 3382 2013 -2185 -2330 1108 983 -1229
1619a229q73N83K659K128k234l115Q40J214L51J27j674j76L311P15k320p86j96
1636f75k5J130n35j001J455J483j420p28r1o26P51K37j638R68K235r8j011m55
1654d4r08P58J288j609j086J905J261l54k14j742o45J585o6j575Q77J218O3K64
1672I76p13j349O81R61j501j87J152O43J257o00k585J97K095n67j502l16P86J902
1690A330J266k245k313J245J092q9o13j112M27L026J10k378j240N08J158R97j560
1707c91j641K564J902j026j908n10M03J481K9k536J85K468P19q70j493j210J079
1724g55K039j110j993R31J792R21q6k985j005K438J461j784q51N41J186J361j232
1741H69k917P21J559p1l58n21j72K261O93k265j535J334O24O46o78j351Q55K672
$$ plain form
1619 -1229 -2102 -1519 1140 3268 1034 -2081 -1241 -27 324 451 -1223 -1399 1912 2627 307 -479 -675
1636 -675 -700 430 -105 -1106 349 1832 412 -316 -407 -1033 -282 -45 -1683 -715 1520 1422 411 -44
1654 -44 -952 -194 1094 -515 -1601 304 1565 1211 997 -745 -1390 195 129 -1446 -569 649 712 976
1672 976 263 -1086 -405 556 -945 -1132 20 663 1920 1320 -1265 -1068 1027 460 -1042 -1358 -572 1330
1690 1330 2596 351 -1962 -717 375 286 -327 -1439 -1012 2014 2124 -254 -1494 -986 172 1169 -391
1707 -391 -2032 532 2434 1408 -500 -1010 -607 874 903 -1633 -1448 1020 1739 869 -624 -1834 -755
1724 -755 1284 174 -1819 -888 904 1825 1739 -1246 -2251 187 1648 -136 -987 -446 740 2101 869
1741 869 -2048 -1327 232 161 -197 -718 -890 1371 2064 -201 -1736 -402 222 868 190 -1161 -306 2366
1759B366q07k657l69N43J285R27j738j077J798J482r59j369j009L09K005K93j697
1776f74k9J506P73n90j552j289J574J506j144q75P73O40O31l61k336l39J933O49
1794G96r94l31j15J024J361j187k513P49J529L97k03r79k94J926M69k009j250
1811a624O74Q97Q82k19j419O35J238p73q07l81k87J345J053j569o70J408P13o94
1829D02o34j156O53J966k45j211j09O51M40j14j231r33J211J141n66l57Q7J39
1847A34P14o05j250Q4J114R6JJ68m57K95P18j472q93J226L17K14J18p85J64J044
1867I45n69j414L3P38K99N88l14r10P83N31r28l43r9K98Q92K00j005J12P91l48
1887B80m75m97j11P29P68o88m39O05M05n03j30r10L34J329O1q16j46K45M69M09
$$ plain form
1759 2366 1559 -1098 -1467 -924 361 1288 -450 -1527 271 1753 794 -575 -1584 -1275 730 1023 -674
1776 -674 -703 803 1576 986 -566 -1855 -281 1225 81 -794 -21 619 1250 889 -1447 -1786 147 796
1794 796 -198 -529 -644 380 1741 554 -1959 -1210 319 716 513 -466 -760 1166 1635 -374 -1624
1811 -1624 -950 -53 829 610 -809 -174 1064 291 -516 -897 -1184 161 1214 -355 -1025 383 1096 402
1829 402 -232 -1388 -735 1231 986 -225 -334 317 757 643 -588 -1521 -310 831 265 -92 -5 134
1847 134 848 243 -1007 -923 191 287 288 456 -1 294 1012 -460 -1353 -127 190 404 522 -263 -99 945
1867 945 376 -1038 -1005 -267 32 620 306 -604 179 710 -218 -561 -660 -362 530 730 -275 -163 628 280
1887 280 -195 -692 -803 -74 694 6 -433 172 577 74 -56 -966 -632 697 758 -58 -204 41 510 919
1907I19j216q22Q64J048j00n98l75J41O75K57j599l93J197N87J02o53o66O50P03
1926G21o43j062N75M35P37K09j182l79Q75K18p01n04N7M53J149l48j159OP75K38
1946D70n02n99k26J114P83p89n77l25N15N07j54q69R1P28P11k41q57m44N14P54
1966F04n12p45K45Q16J36j6o85l81O86K63o61k16N15L52L20l56p23K46M54l08
1986C4k50j18m3Q20N02j109k33M30n0k03K37j98N2O47k53k84j33J7n9L30j54Q
2008a0L42N9m34M9L6m89K36N4l27O08L38j58m97K33j79L42P7n51k04R13p7q4l06
2031b9j03J02L49l10l47J85N31n1Ko07k48N89M5l94n9L15L05L39k19j091L59Q92
2053E55m80k28j32K15O04K30q82l39L97K32J10l98p52Q82P48l66n04n77O02K32
$$ plain form
1907 919 -297 -1119 -255 793 693 95 -280 -139 536 793 -806 -1199 -2 585 687 34 -632 18 721
1926 721 78 -984 -409 26 763 972 -210 -589 286 504 -197 -701 -644 -191 958 610 -549 -543 232 470
1946 470 -32 -631 -857 257 1040 251 -326 -651 -136 371 217 -652 -561 167 878 637 -220 -664 -150 604
1966 604 92 -653 -408 408 544 528 -157 -538 148 411 -250 -466 49 401 721 365 -358 -112 342 34
1986 34 -216 -334 -377 443 945 -164 -397 33 -17 -220 17 -181 -129 518 265 -19 -152 -135 -194 136 -18 -10
2008 -10 332 391 -43 6 42 -447 -211 -157 -484 124 462 304 -193 40 -139 203 280 -271 -475 438 361 277 -29
2031 -29 -132 -30 319 9 -338 -153 378 327 329 -278 -526 63 108 -286 -345 -30 275 614 395 -696 -337 555
2053 555 75 -153 -285 -70 534 764 -118 -457 -60 172 282 -116 -868 14 762 396 -108 -685 -83 149
2073A49J98m59m99P47N79l82l13k59o8M02K35l51l34O47K02j32n44n28L25O92
2093C07j10m03M6K40K86m4p02j44N24M39j95k10l60L79L81L4r59r4L81K40K29
2114B65m06k81M49O48p25l09J06lN36J08m63K5K28j47k15j85nK95L99l11k49M99
2136B59r2ql9m56j89O59J57l50j76L51N1J52k93k49j27O45K6l37N7R3j72K34j84
2159A2n13M73J02P8Q8k78j25L25j41m68M62J73n9J98j88k56K50K5n53NL39J27
2181G6L18k87l63M37J96m93k50M00m19M87L01k84l75M23j09mj96o7J05L56j1m40
2203a99L19j03k9J11l24m0J48L51p6l55K2M3M55k28n16Q6M45J58K05m02j83R5
2225a7L80l89m85M49K88l7L02m44m87M85J25j15k15O5K08O5J30n93J83K61k69
$$ plain form
2073 149 347 -112 -611 136 715 333 20 -239 -307 95 330 -21 -355 292 494 362 -182 -710 -385 307
2093 307 197 -206 -160 80 366 322 -380 -524 0 439 244 34 -326 53 434 468 -491 -585 -204 36 265
2114 265 -141 -422 27 675 -50 -359 -253 -256 280 388 -75 -50 178 31 -184 -369 -374 -79 320 9 -240 259
2136 259 167 159 120 -336 -525 134 291 -59 -235 116 167 319 26 -223 -350 295 321 -16 41 134 -38 196 12
2159 12 -501 -28 74 152 240 -38 -163 162 21 -447 15 188 129 327 139 -117 133 158 -395 -390 -51 76
2181 76 394 107 -256 181 377 -116 -366 34 -385 102 403 119 -256 167 58 54 -142 -209 -104 252 241 -199
2203 -199 120 17 -12 99 -225 -265 -117 234 158 -197 -175 -132 323 95 -421 -335 110 268 473 71 -112 -17
2225 -17 363 -26 -511 -62 226 189 491 47 -440 45 170 55 -160 -95 113 178 308 -285 -102 159 -110
2246a10K55p8k35O90r4l96m04L15m0K40o5k77n8O57Kn44n3m4p1O52m01l10M17
2269D8N44k83j26l91n4K88K46o81J75L50M6O1Q0o31J44O65o43j23L07R1j0L78
2291D81q16q3L69L4j68K22K32k73M32k05n25J84l3p0M50m24n3L04R5j37l2J1k57
2314b62K08K97n64K34M76k64o9k25o1R7K84k57k59P71r2l99O7j48l7K93k6l56
2336b92K46L16l24K01k57j15J99J59m07L78OLo5J85n60J60L41l56k23N53k06K18
2358A60L74o79m41M83J0j01J99j68K81M01j00p37J16K36p4L80m35j57N86R3l29
2379I8k01j28J20K10J53k85J81K89k29m93J04j10K44M51m43P3Q2j9J69k51l90
2400c75Q2O04N8o87J82K62lq3l82l28O22L34o2l30O6j96M54J38p49j14N15J13
$$ plain form
2246 -110 145 67 -168 522 428 32 -372 -57 -97 143 78 -199 -257 400 402 -142 -195 -239 -310 342 -59 -369 48
2269 48 592 309 183 -208 -262 26 272 -409 -234 116 162 223 303 -328 -184 481 -162 -285 22 113 103 481
2291 481 -335 -418 -49 -15 -183 39 271 -2 430 225 -300 -116 -149 -219 231 -193 -246 58 153 16 -16 -5 -262
2314 -262 -54 243 -321 -87 389 125 56 -169 -230 -133 151 -106 -365 406 314 -85 -18 -166 -203 90 64 -292
2336 -292 -46 270 -54 147 -110 -225 -26 133 -274 104 110 113 48 233 -327 -167 174 -182 -405 148 -58 160
2358 160 534 -145 -586 -103 -93 -194 5 -163 118 519 419 -318 -202 34 -40 340 -95 -252 334 427 98
2379 98 -103 -231 -111 99 252 -33 148 437 208 -285 -181 -291 -47 404 -39 34 116 97 266 15 -375
2400 -375 -293 311 369 -318 -136 126 123 40 -342 -670 -48 286 224 -106 -40 -236 218 356 -393 -507 8 121
2422A21K8l4m06K34M47j94o45P1L33K5M46m46m26O36K07m47k74j59L93O19j42
2443C87p59R6M13J51j70k01n81O37M16l02k69N9J53n7J20o17K2O87M14l63l7k12
2465a3O8L73m37n72N47L71j98K58m40j24L42J84o38j61J74K46K88J01o86K28L38
2486B49l16j1q0N8J48O00m83j30J14j04r3L5j44n4N17p3k66J2Lj74Q0j12rL94
2510A61K2l32L50j39oj94N6o1k3N38m23K01J13m21Q1R4m20K10L89K3k47L09q7
2533A94n35K61k43M6K66J62N6m9q9q1K39J09m99j51M57p8J67L7n99L20J70l09
2555a49R5j42r7M48M77p75k96O31R6l92j03M3m6P44j85m65K8nK10j45k78j52M77
2578A9O65n70n5m14J56O07l79m66K31M73k28N9Mm43L83K16k55l96J68M00nK34
$$ plain form
2422 121 149 115 -291 -57 390 196 -449 -378 -45 -20 426 -20 -446 190 397 -50 -324 -483 -90 529 387
2443 387 -372 -276 137 288 118 -83 -664 -27 389 87 -182 -123 30 -27 93 -524 -502 185 599 236 199 -13
2465 -13 55 428 -9 -581 -34 337 139 397 -43 -167 175 359 -279 -440 -266 -20 268 369 -317 -89 249
2486 249 -67 -78 -158 -100 48 648 165 35 149 45 -48 -13 -157 -211 306 233 -33 -21 -18 -192 -112 -224 -233 161
2510 161 183 -149 201 62 56 -138 -82 -143 -166 372 -51 150 263 -158 -77 17 -403 -193 196 219 -28 281 194
2533 194 -341 -80 -323 -277 -11 151 207 158 69 -12 227 336 -163 -314 143 65 232 269 -330 -10 160 -149
2555 -149 -54 -196 -293 155 632 -143 -439 192 288 -104 -207 -164 -210 534 349 -116 -88 -93 117 -28 -306 -458 19
2578 19 684 114 59 -355 -199 408 29 -437 -206 267 39 98 102 -341 42 258 3 -393 -225 175 170 404
2600D04o65k04P44j00m32LL06nL72j93p43L98K01j43Q7r8k18M87L76o32J23M1
2622A09l67K12J59o38M24N95m80q2r3j82K58K45l63j22O72r8m69L09N7l29K84
2643A01j12j99L98k7j30K48q1m15j3K02m28L52K46J2q7J42l36O4K09l81j54O51
2665B62j81nR3l20O8J73j69l66K29K7K04M27m18n12L96J29j62k4J44l45Q10M2
2687E02n62K5n2k68N24k15m08N06M12j53m04k9l11M83J85o30pP30k0k90j15J5
2709h2m98J089k56o43J48K45K46K21j26q22L08M51k87n3o1K59M90m45k30k28J33
2730a41K3J34l9l49M35N08m67m87K88m1J00M12o30q2O54M39q39j17j47J14M62
2751B30j84n09K34N70j67k76o8l55M10M75l70k39L81J73k64J84o38J23N76j14
$$ plain form
2600 404 -261 -465 279 179 -253 -250 56 51 423 230 -513 -115 86 -57 30 -68 -286 201 577 -55 68 109
2622 109 -258 -46 113 -525 -101 494 14 -68 -161 -343 -85 160 -203 -325 347 249 -220 89 146 -183 101
2643 101 -11 -210 188 161 31 279 198 -217 -230 -28 -456 -104 142 154 67 209 -127 -63 146 -235 -389 262
2665 262 81 76 169 -151 -83 90 -79 -445 -216 -189 15 442 24 -488 -92 37 -125 -149 -5 -350 460 502
2687 502 -60 -35 -87 -355 169 -46 -454 52 464 311 -93 -122 -433 50 235 -395 -402 328 308 18 -97 -82
2709 -82 -580 509 253 -390 -242 3 249 470 344 -478 -170 281 -6 -59 -120 139 629 184 -46 -274 -141
2730 -141 -118 16 -23 -372 63 571 104 -383 -95 -136 -36 376 -254 -336 318 757 -82 -199 -346 -232 230
2751 230 46 -463 -229 341 174 -102 -170 -525 -115 360 -10 -249 132 305 41 225 -413 -290 286 172
2771A72k20J87k83j34P06n72m29N10J68j38N5m6j94M41J90q66K63K28j79L53O6
2792B78n67N10J36l58o3J23l12J82L22m99J40M75k65j85N1o6o1L62Rm10L59k4
2814A37j86J66k21j19L21j57K35j28J58k47K26p2k06j27M08l21K36N8l99K23M2
2835B7q0k46N63k07q8L24o8o9Lk94j64L26j35K84P8j63j73K25k27l3J60O2k81
2858a76J07Q3mM32l9m59ON7k43K32J34k90J91P8j94K58m01L6k5M67l12j17M14
2881B35k76j86J25l08j3P72j45k13N2NL25n6l45m68N97N6j26J37k44J66N6L7l24
2904a41j35K95o3J24j99R2P6N35n63l25J69n9N6L89k40k48M04J66n44k3O9rL86
2927B12k8n18L74K30l07p2J10l59K68L80l57j34N59m89L82j40m61J17N29j81k24
$$ plain form
2771 172 -48 139 -144 -278 428 -144 -573 -63 105 -33 22 -24 -218 223 413 -453 -190 38 -141 212 278
2792 278 -289 221 357 -1 -64 59 -253 -71 251 -248 -108 367 102 -83 -32 -98 -159 203 212 -198 161 137
2814 137 -49 117 -104 -223 98 -59 176 48 206 -41 185 113 -93 -220 188 -133 103 161 -238 -15 27
2835 27 -53 -299 264 57 -31 293 225 156 159 -135 -299 27 -108 176 254 91 -82 143 -84 -117 43 105 -176
2858 -176 -69 14 10 442 403 -56 -50 7 -236 -4 130 -160 31 109 -85 173 -228 -192 -217 250 -62 -179 235
2881 235 -41 -227 -102 -410 -423 349 204 -9 43 48 373 317 -28 -496 101 157 31 168 -76 90 146 183 -141
2904 -141 -276 19 -44 80 -119 -27 49 584 21 -304 -135 -194 -138 251 11 -237 167 333 -211 -234 -165 -174 212
2927 212 184 -334 40 270 -37 -109 1 -358 -90 290 -67 -201 358 -131 251 111 -350 -233 296 115 -109
2948a09M2O6k39L91l07n19O55K23j19O0l39m6L64K13o58K30L51l59M62kl19j66
2970a25J84j87M9P3q9J59M08n35k15M33j87l53N78m36o3O85m38J61K23k60j97
2991a32L80j68m23L73K90m93K44r4k81L55q2k18J87R9N5j91L59k45l9J43l96J22
3013a55O11l73L9J30j16j85K3mk69M19J11j17k63J72k58N02k11k33J00j81K72
3034A4J92j0k60J31L14n78JJ33j25K11J05j41j92K85j05o1kl83K79M49j42k14
3056i9J46r2k63L51k00k00M06M44l49r5k95J16K93ql76m0M52j27K13k13l78R9
3078b15M70n35K45k06L18R8Q4o09K55L40j16l48K57l58N57P9r5m38J84J1n9J53
3100G2j91r2L52J63l22o4K4qK03K31o11J89L28j01k97L73n19K02K12k99l1R9J0
$$ plain form
2948 -109 -67 -1 -240 151 -156 -675 -20 203 84 144 -195 -241 123 336 -322 -92 259 -100 362 360 41 -125
2970 -125 59 -128 -79 -6 -95 64 472 -63 -278 155 -32 -385 193 -243 -306 379 -59 102 325 65 -132
2991 -132 248 80 -343 30 320 -173 71 -23 -304 51 -31 -249 -62 37 92 -99 260 15 -24 119 -277 -155
3013 -155 456 83 122 252 136 -49 -26 -30 -299 120 231 114 -149 23 -235 267 56 -177 -77 -258 14
3034 14 206 196 -64 67 381 -197 -196 -63 -188 23 128 -13 -205 80 -25 -86 -88 -471 -192 257 115 -99
3056 -99 47 -45 -308 43 -157 -357 49 493 144 49 -246 -130 163 155 -221 -261 191 64 277 64 -314 -215
3078 -215 255 -280 -35 -241 77 175 259 -350 -95 245 129 -219 38 -320 237 316 221 -217 -33 -22 -81 72
3100 72 -119 -211 141 304 -18 -82 -58 -66 137 368 -243 -54 274 173 -124 249 -270 -68 144 -155 -186 -87 -77
3123g7j49L93l09o1J59L13m66N7K21j53K98j89m01K89R4l91L89J79k66K9M06n12
3145a47o5J60k54L78J56j79j04M24l56j60K43k03k00M54n7j50J24J39k42J81k26
3166h4l6kJ59j17J00J52m66L91k18J3K5J03k71J61M31m70R6J15k23J44K7l79L75
3189B6M43l15r0K09l36j66L66l37j04K60P7j84J58j16j31K19k68J63J26p5Q2K80
3211B87n1l74R1K40k30K10j05O5M3Q6m79j04L18j42J1R7k45m4P98m83j12j8J86
3234D5j51M21k92k93L69K70n22K81K3k38L5M08n53J94L74l31m0M0n25M17L04l19
3256h3m4K34r3L32q6l93k40L46P6j5K15l21R0K60l78j85L6K29k61M03j37k07L37
3279A15l1m22M32J52m36K64k3k7j8M97o18j47M35l77J05J73k79mL50j92Q4j5j87
$$ plain form
3123 -77 -226 167 -142 -203 -44 269 -197 -140 81 -72 226 37 -364 -75 19 -372 17 196 -70 -41 365 -147
3145 -147 -212 -52 -306 72 228 49 -55 369 13 -147 96 -107 -307 147 90 -60 64 203 -39 142 -84
3166 -84 -120 -122 37 -80 20 172 -294 97 -121 -108 -83 20 -251 -90 341 -129 -33 82 -141 3 30 -349 26
3189 26 469 154 64 273 -63 -229 137 -200 -304 -44 33 -151 7 -109 -240 -21 -289 -126 0 -75 7 287
3211 287 236 -138 -47 193 -37 173 68 133 176 262 -217 -321 -3 -145 -134 -37 -282 -326 472 -11 -123 -141 45
3234 45 -106 315 23 -270 99 369 -153 128 151 -87 -52 356 -197 -3 371 40 0 40 -485 -68 236 -83
3256 -83 -127 107 14 346 260 -133 -373 -27 49 34 249 -72 18 278 -100 -285 -249 -20 -281 122 -15 -222 115
3279 115 84 -338 94 246 -190 74 51 24 6 503 -115 -262 173 -204 -99 74 -205 -209 141 -51 33 18 -169
3302a69l4M07l28n8L39J78m64L77j03l95K72M1N3k64K26k65L58n3m21K59Q5q9
3324d8pK39m30N5N43m03p2K20j1j3L95j99k14L79l14j82n8M2m6K11j93q8J75r2
3348a11oK5O9k51L24K13m17J44J50j01J50L7m86L32J67k37o6K42n1k43L16l73
3370a73j78K58Q5OJ50p0j18J83j42m76M90J32k01K04K8k00K50j62j40j0K16m2
3392I0J0J82j79j72K00j70r3O0q7R1J62n3k46N28l15j19L5J09r7K27J36m09K60
3415A50j54j3J06k0l04M73j63l12J34K48j72J1J89m04J45J47k1q9M22k85o4J73
3437A97o1l50M30l65J46K23k67j87M13j97j70K01mj31M20k28k78L16j07m2o7L23
3459B15m26L46J43k31j06K37k43J62J42l18o1L47j72j06J96j14k61L24k73oM21
$$ plain form
3302 -169 -203 204 -124 -182 157 335 -129 248 145 -250 22 63 116 -148 78 -187 171 118 -303 -44 41 -48
3324 -48 -55 184 -246 -191 352 -51 -123 97 86 73 468 269 55 434 120 -62 -120 -78 -124 87 -106 -194 -19 -111
3348 -111 -117 -92 -23 -274 50 263 -154 -10 140 39 189 226 -260 72 239 2 -64 178 127 -116 200 -173
3370 -173 -351 -93 -8 -2 148 78 -40 143 1 -475 15 147 -54 150 178 -22 228 66 -74 -84 132 90
3392 90 100 282 103 -69 131 -39 -132 -72 -159 -68 94 41 -205 323 8 -111 -76 33 -64 163 299 -110 150
3415 150 -4 -17 89 69 -235 238 75 -237 -103 145 -27 -16 173 -231 -86 61 40 -49 373 88 24 197
3437 197 136 -214 216 -149 -3 220 -47 -234 179 -18 -188 13 9 -122 298 70 -208 108 1 -41 -108 215
3459 215 -211 135 278 47 -59 178 -65 97 239 -79 -140 207 35 -71 125 11 -250 74 -199 -205 216
3480B16j47k17L4K84n50N87j27j92J34K51l89O7K04m34K79J7m16J54J97OK60P9
3502B97o28K60M40n22j8L66j13j90L70o1p6J10l71o2K21N8o1K63j93k39J47R1
3524H9k32J13N6m6J53N6l96J75K22j75p4J58l35K17J93r6L9o3k29P6J53m7k48
3547b41J44K05k95J76K04l63L42j23l30L00K66l22K23o7m18L94j20j50J51N8m4
3568a0lL02l33k7K68k71k11K91o3J25K03k77p4K86j56j47M6J51l04J72K04r3l5
3591D4K9k03L14j34l90L61J75j66k88J90j40J65J5m0J1M83l38J07K7k07j25L22
3613B12k13j99L11QL9j99j27j13K53J8k78L59m1J50J91r4l15J03J10j45o3J40
3635A07j68J24K76n25J87l7ro2J44J1j44L76k98j0K66j92k77L10j66l3K96R0l61
$$ plain form
3480 216 69 -148 -114 170 -380 207 80 -112 22 273 -116 -49 155 -279 0 17 -399 -245 -48 -42 218 297
3502 297 -331 -71 369 -153 -171 195 82 -108 262 201 125 235 -136 -198 23 81 20 283 90 -149 -2 89
3524 89 -143 -30 26 -20 133 189 -207 -32 190 15 -59 99 -236 -19 174 78 117 54 -175 -99 54 7 -241
3547 -241 -97 108 -187 -11 193 -170 172 49 -281 19 285 -37 186 119 -299 95 -25 -175 -24 34 -10
3568 -10 -13 289 -44 -71 197 -74 -285 6 -57 68 271 -6 -80 206 50 -97 -51 100 -204 -32 172 79 44
3591 44 73 -130 184 50 -340 21 196 30 -258 -68 -208 -43 -28 -68 -57 426 88 195 222 15 -110 212
3613 212 -1 -200 111 119 158 -41 -168 -281 -28 -10 -288 71 30 180 371 277 -38 65 175 30 -33 107
3635 107 -61 63 339 -186 1 -36 -45 -107 37 48 -96 280 -18 -28 238 46 -231 79 -87 -120 176 266 -95
3658i5K84m5k92K51M3o14M96J1k01K37j70P6M4L8k94O6J90Q5r8K27l88J07J03
3681F1j69K12J10ok44L51l41j13J25j5K4N8J22k91K44j59NJ57k00j31O1K31k91
3704a99M15J27l16k4J63m35J26M36n48K50K52k59J34K4l06R6O4j28R0Q1r1o1L59
3727B50j05m83L22N0q3L55j25Pj80k2j16K02j12j92J35K07L8pn0l17P5K47l23
3750b27J76K10l35J25J66j18k32K02j28q1M51J3k39N5K13k80j87M99m75L49M7
3771B04l56J01L31l12n7J28l00M3L90k86qL56p0j30L46n29r9N35m53J43J34n2
3793E9j29L73l26k12J82K11j59K8J48o9k7Nn21M94M20m94J25j9m9j42K00l30J14
3816a18J41k87J64K53l01q1M82j99j81P6r1r3L75j22j17J76r3M6K29l62n9K89
$$ plain form
3658 -95 189 144 -148 103 146 -468 28 39 -162 75 -95 -19 25 63 -231 -165 25 110 12 239 -149 -42 61
3681 61 -108 104 214 208 -36 315 -26 -139 -14 -29 -5 53 175 -116 128 -31 -26 131 -69 -200 -139 92 -199
3704 -199 216 343 27 3 166 -269 -143 293 -255 -5 247 -12 122 146 -160 -64 0 -128 -38 43 -48 -109 250
3727 250 145 -338 -16 34 -49 306 181 188 8 -14 -130 72 -40 -232 -97 110 148 141 91 -226 -151 96 -227
3750 -227 -51 159 -176 -51 115 -3 -235 -33 -161 -242 209 222 -17 38 251 -29 -216 283 -192 157 204
3771 204 -152 -51 280 -32 -89 39 -261 -218 172 -114 -122 234 164 34 380 -149 -248 287 -166 -23 111 59
3793 59 -70 303 -23 -235 -53 158 -1 27 175 106 79 84 -437 57 477 -17 108 89 40 -102 98 -232 -118
3816 -118 23 -264 -100 153 -148 -229 253 54 -127 -51 -142 -235 140 18 -99 77 -16 30 259 -103 -162 127
3838A27Q8l01J26l6j62K21k33L5L0J5R6kLk50J80J36j06l4R6Lj58K29k70N3K69
3863A55q3j45J5K27n27M63j60j37K87m5l51M65j82j12N6K32p9j02K81k35P4ok89
3886a98J67K68r4k03M2R4k29Q6J5jJ50N5j86M4qL3P3j96Q2j1Q7n5L38l61j6Q7
3912F3J22k25L0J23QN2k00q4R5L15m82J27J92k42N7J35j30J08J1k11J63J79J11
3935C17n06K09o1L0O5J87o00K90J28k03L98k00k73K09K72m67K42N6l46K22K30
3956A99l98J26O6J74l28M00n76P6M21k50j86K88J27k33M7r2kK39K7k67K98j70
3978a4J07j07J75m48N38k98J0K64J49o90L60J9Lk02K50o1j92J72p5k44L42j54
4000i6o1M59l91N5Q6N6j41J18j14q2K05K59m44K07Q6m98L76m5n5K15l74K42J23
$$ plain form
3838 127 215 -86 40 4 -158 63 -170 -135 -105 -90 6 4 7 -243 -63 73 -33 -67 29 32 -126 103 -167 -114 155
3863 155 72 -73 -58 169 -358 105 -55 -192 95 50 -301 164 -18 -130 -74 158 79 -23 258 23 97 91 -198
3886 -198 -31 237 143 -60 -18 76 -153 -67 -52 -53 97 152 -34 10 2 35 108 -88 -6 -17 70 15 353 -8 -24 63
3912 63 185 -40 -10 113 121 173 -27 -111 -16 299 -183 -56 136 -106 -49 86 -44 64 75 -136 27 206 317
3935 317 -189 20 -41 -11 54 241 -359 -69 59 -144 254 54 -219 -10 262 -205 37 93 -253 -31 199
3956 199 -199 -73 -7 167 -161 239 -337 -261 160 -90 -276 12 139 -94 -47 -139 -141 98 125 -142 156 -14
3978 -14 93 -14 161 -287 251 -47 -37 227 376 -314 46 65 68 -134 116 55 -137 35 -40 -284 58 -96
4000 -96 -157 302 -89 -34 52 108 -33 85 -29 -111 94 353 -91 116 202 -296 80 35 -20 195 -179 63 186
4023A86Q4l07J25O4j71NJ55P4m7j15M4k23K70k05j67J02L20k72R7n8n1J01Q3k5
4047F9l98L08j36k2L72k92K03R0m54L93N0k23J00j11p6o2L54j74j49M29j99m69
4069c97M44j98K47n8j7k78J31J59j12J61m7Q5ko7j26J01J68o5J07j01q3k01L01
4092A52r9n5J9k62L73J02k98j51L58k88l0J88n4n8J1K80l44O8J86j39K80k59k27
4115b47K35K26j87m1jo4o7K64j59j3J87l65K12K6Q4j30K68k44k73L69N4l40L89
4138A83j97l36N45k13j06J25k25P5L27k22j0J02jo8p3L20l08K62q0k09J20Kp8
4161f5P9L11k84k50K13p5K8R7j20J89r9J23k27J45l5r2M4L2k56M70j59k45J46
4184c0K3J4J90j47j15K65j0k24P3q2j08j33L72p4j78K49k23p6L28j49p3L11l38
$$ plain form
4023 186 270 -37 88 152 -19 -14 141 215 168 53 97 -126 144 -61 -228 -126 194 -78 19 -39 -90 11 94 69
4047 69 -329 -21 -157 -179 193 -99 104 194 -260 133 183 -40 60 -51 -127 -189 165 -9 -158 271 72 -397
4069 -397 47 -151 96 38 21 -257 -126 33 -79 82 35 120 118 51 -75 26 194 129 236 135 52 -149 152
4092 152 53 -2 17 -245 128 230 -68 -219 139 -149 -179 9 -45 -103 -92 188 -156 -88 98 -41 239 -20 -247
4115 -247 -12 214 27 -14 -15 -79 -146 118 -41 -54 133 -232 -20 6 90 -40 228 -16 -289 80 134 -206 183
4138 183 -14 -350 195 -18 -124 1 -224 -149 178 -44 -54 48 47 -21 -94 226 -82 180 100 -109 11 13 -65
4161 -65 14 325 41 -209 4 -71 -43 54 -66 123 24 147 -80 65 30 -62 -18 14 -242 228 69 -176 -30
4184 -30 -7 7 197 50 -65 200 190 -34 39 -43 -151 -284 88 14 -164 85 -138 -214 114 -35 -108 203 -135
4207a35K27J81K5k32j94J75j44pK36l12J76J70k57nr6K99k57L96l84J17L05k71
4229A3l7J03J2k17J99j86O3K57o7m02K75j66j1K94j86j00J79km9J75k83m9K77
4252I2J11k49J03k0j04J81J34k80m7Q6k46N3M91m41Q6K53l5j33J24l72K55N0j26
4275c4N9Q6k2k02K36k52J88m8J64j42m9M54p65M32L6k97m0J97m1K03r3n8j75K01
4299C8n9j2L6j58K06J24k6j07Q4mk16J15Q3k05J98k13M1%L5M4Qk70j4L22m7j4
4325a1j37P4L3J58j20k70M4L81o1k1K60m45Q2J23j28p6O9N1n6Q8%k86L05j6q4
4350d3L64m10j6K37k8j11Q5oj34p1J40Q0O7j80j78K33l6l6mN2m7j9J47o7q7P1
4376CJ2j39K98k03K86j86j92oJ91r5q5O6OL0O5r2J19p0K02l51K01J20k66J07J68
$$ plain form
4207 -135 92 273 298 66 -128 47 -97 -104 132 -180 -4 166 -91 -96 -192 107 -150 246 -138 -21 284 13
4229 13 -24 79 91 -126 73 -113 -50 207 140 -262 13 -153 -164 130 -56 -156 23 21 -28 147 -136 -185 92
4252 92 203 -46 57 37 -67 114 248 -32 -79 7 -239 -186 305 -136 -50 203 168 35 159 -213 42 92 -34
4275 -34 25 111 89 -113 123 -129 59 11 175 33 -16 438 -327 105 141 -156 -196 1 -40 163 70 12 -163 38
4299 38 -21 -33 3 -155 51 175 149 42 126 122 -94 21 104 -101 97 -116 -75 -75 -40 4 12 -258 -272 50 3 -11
4325 -11 -148 -74 -41 117 -3 -273 -229 152 91 70 330 -115 -33 90 -38 -114 -45 6 -50 38 38 -248 57 41 -43
4350 -43 321 -89 -105 132 104 -7 78 72 -62 -133 7 87 154 -26 -204 29 -7 -43 -47 5 -42 -61 86 19 -68 3
4376 3 15 -124 174 -29 257 71 -121 -127 64 -31 -116 -50 -44 -14 51 -41 78 8 210 -141 60 180 -86 21 189
4401A89j44o5O5j75j85L48r0J22K02j83q2K29l01J19L4l10O5J73l5j57J17K9p8
4424a13K37J03k80rj01K26K81j23k78J64N6j58k03K8l6J64j25NJ73J52j09j94
4446a40J30j1j78M94j52m47N06ql57K49j51j4n0J59Q7j50M3l15L60k16r5L39O6
4469A49j50K73k14j15j05J89J53k97K43j29J11K9l81J24K70j86p7L65m13L3J14
4490a4P1j11N4R9m73O41k96q4J6J7K15j3j21j07Q1J39k20%K11k97J40J61nk58
4514a54J68k62j2M82l93J50L7R9k42R3j1K8J70j99L1q0J12l3J01p2P9L7j5k29
4538a15K12J15l57K06Q9j66j11M1J78j67J40j35k5K31Rlj44J09k47L99k06j38
4560h5M9J42k63J07j0N6j18J19Q1j90K50n08L11LK16j41k10K67J07j99r8N0K15
$$ plain form
4401 189 45 -20 45 -130 -315 33 -57 65 267 84 2 231 -70 49 83 -227 -162 11 -24 -181 -64 -35 -113
4424 -113 124 227 -53 -62 -163 63 344 221 -57 107 163 5 -198 -170 -206 -42 -167 -162 11 163 54 -140
4446 -140 -10 -21 -199 295 143 -304 202 194 -163 86 -65 -79 -129 30 117 -33 10 -305 55 -161 -256 83 149
4469 149 -1 272 58 -57 -162 27 180 -117 126 -3 108 137 -244 -120 150 -36 -113 252 -161 -128 -14
4490 -14 57 -54 0 99 -374 267 -29 -113 -97 -80 135 122 1 -106 -25 114 -106 -106 105 -192 -52 109 104 -154
4514 -154 14 -248 -260 222 -171 -21 16 115 -127 -34 -45 -17 153 -46 -15 -95 17 -16 85 13 92 129 114 -115
4538 -115 97 212 -145 61 150 -16 -127 -86 92 -75 65 -70 -95 136 145 142 -2 107 -140 259 53 -85
4560 -85 -36 106 -157 -50 -60 -4 -122 -3 78 -112 138 -370 -59 -56 160 19 -191 76 183 -16 -114 -64 151
4583A51j76J97l39K8N0R2K39k26J34k90j15J40J85k37K83K4j75J55p2p5J61l03
4605a69j34L23L73l33k21J26j38J89J17Oj31K54k08r8P7j62O3J9k24K68r5J47
4627D9NL5j64l7K85k17j33J07P9j28j3K98k57J67j74K3nM9K8M7J28k67J17J42
4651A64j85j8q9L7J98j96j2N2N9j53n0K88O0l59M23k82J34Q4k25P2j01K56j96
4674c9K46mk16J06J52o10L12K03l02J92Q1K0l40K42m6l5K00r2o5l1R9J10oL2j55
4699E4K95k72jk77K92KK04j90l15K66J02k59R5q4j48L89j33P0K3q4r6J21l9J59
4723A74j97K44n25K37J36j83J66p7J23k21J78k06O8r2L21k62J32nJ3K6L6n2K6
4746F0Rl22J09L29j60j14K85j04j32J49k46K08j09J44j09M0J42l78K89M1k59L41
$$ plain form
4583 151 -25 172 -167 -139 -89 3 242 16 150 -140 -255 -115 70 -167 116 140 -35 120 48 -27 134 -169
4605 -169 -303 20 393 60 -161 -35 -173 16 133 139 8 262 54 -44 33 -129 -66 -47 -271 -3 -98 49
4627 49 54 89 -75 -112 173 -44 -177 -70 9 -119 -132 166 -91 76 -98 -75 -80 -31 -3 44 172 -95 22 164
4651 164 -21 -39 -128 -91 107 -89 -101 -49 10 -143 -193 95 155 -204 219 -63 71 155 -70 2 -99 157 -39
4674 -39 207 203 -13 93 245 -365 -53 150 -152 40 121 141 -199 43 -3 -38 162 70 5 -26 73 183 177 209 54
4699 54 349 77 76 -201 91 93 297 107 -208 58 160 -99 -4 -88 -236 153 20 90 113 29 -67 54 15 174
4723 174 -23 221 -304 -67 69 -114 52 -25 98 -123 55 -151 -83 -175 146 -116 16 11 24 50 86 34 60
4746 60 69 -253 -144 185 25 -89 196 92 -40 109 -137 71 -38 106 -3 37 179 -199 90 131 -128 213
4768B13l64J88j1j13o0K98p1j85O3m9J15N1j19Jk9N24n57l4J38M9J65K24l80j24
4792f7Lj8K32j54n4P4j07L16j80J20q0P3q2O6l05K71J38k10l2OJ68k25J78n2j64
4817h5J92p1m1Rj72J85J20j17l2O8j58K52j4l7k71J48l6m2R0j50r5N29k05j34
4841f7P8m5N4R6k67J2J70K13l25j07L12k67J28jn3J46P0l37J88K81l28r7K49j13
4865a0k1J87q6j16J97K8l13J11K06j75j0j33k5J10L20k48j21M12l23k47K13j7
4887f1J44N3k49L82k73m5J34J54k40l1R8j19J44K3qj33J22M3k59J17m3k9k2MQ4
4912a0p8J5k20L69Pk77L05j34K49m51J47R9J29r2l01K33k2M4l7J07j48K05O5l32
4936a28M4J93k64J56J89j54j25J10J74j39MJ00n1J3P5k27J76l07J20R3pn6j33
$$ plain form
4768 213 -151 37 26 -87 -147 151 80 -105 -42 -91 24 75 -44 -43 -72 452 -105 -139 -1 48 213 437 57 -67
4792 -67 -64 -82 150 -4 -58 16 -91 225 45 165 85 158 76 142 -163 108 246 36 4 10 178 -47 131 79 -85
4817 -85 107 36 -5 4 -168 17 137 20 -12 56 -102 150 136 99 -172 -24 -60 -102 -12 -162 -257 272 67 -67
4841 -67 11 -34 20 116 -151 -139 31 244 -81 -188 124 -143 -15 -16 -69 77 147 -190 -2 279 -49 -146 103 -10
4865 -10 -31 156 70 -46 151 179 -134 -23 183 8 -2 -135 -160 -50 270 22 -99 313 -10 -257 -44 -61
4887 -61 83 136 -113 269 -4 -49 85 239 -1 -32 66 -53 91 114 106 -27 95 138 -121 -4 -47 -76 -98 -94 -10
4912 -10 -88 -73 -293 76 83 -194 111 -23 226 -225 -78 21 150 58 -243 -10 -32 12 -25 82 -66 139 204 -128
4936 -128 -84 109 -155 1 190 36 -89 21 195 56 60 160 109 122 197 -30 146 -161 -41 52 45 -11 -144
4959a44M1j03L31k45J11Q6Q7l87R5R1O5M3j72J83p5J43j47K2j24J55r9O2k19P0
4983a30L72j69j24P7r9L8nM2o1J95M5k08P8J29k79J36M8k1J4k32K35J7o4m8n2
5008f6K65k96j0LJ8J7j32L66l21K44j05m3J50Q5l99L41o8k23J07J14r8K45m2j14
5032C8j30J19j42K18j46L3m7Q2j17PN2P4j70P0K99m35K38p4q4K48k13Q0r7P4N5
5057C2p1J33j59K6J25r7j02P4j02L9O4q6J28K16j42j78N04m53k1R9k0o5m5J07
5081FJ01r8L6r1o7K28k55N0J8j59L23L8k81N2Q0J63j83J62j58j10J80j9K60l73
5105i7o3M32k26o6N3Po9O8r1k0J93j2O9k10J02j18l79O47k16j02J52Q9k63M4J2
5130f4j17M86j74l5j52L47m15J29m2j55J6L50j40k8J3j12M5J24J08j06J69k51
$$ plain form
4959 -144 -103 -206 125 -120 -9 77 164 -223 -128 -37 28 71 -101 82 7 150 3 25 -99 56 -43 19 -200 -130
4983 -130 242 73 -51 26 -73 -35 -40 2 -59 136 181 -27 51 180 -99 37 85 64 78 -154 81 98 34 -14 -66
5008 -66 199 -97 -107 -104 -86 -69 -201 165 -156 88 -17 -60 90 175 -224 117 49 -174 -67 47 -51 194 152 38
5032 38 -92 27 -115 103 -43 -10 -57 25 -92 -85 -33 41 -129 -59 240 -195 43 -31 -115 133 -80 0 -97 -23 32
5057 32 -39 94 -65 -39 86 -11 -113 -39 -141 -102 -38 -124 4 220 78 -100 404 -49 -70 29 9 -56 -101 6
5081 6 107 9 45 -46 -113 115 -140 -90 -72 -231 92 130 -151 -99 -19 144 -39 123 -35 -145 35 16 276 -97
5105 -97 -160 272 46 -20 33 40 -29 39 -52 -72 121 109 178 -32 70 -48 -427 220 4 -98 54 143 -120 -76 -64
5130 -64 -181 305 131 96 -56 291 -124 5 -37 -192 -176 174 34 6 19 -93 -48 76 184 78 247 -4
5152dj47K7J80j76K35k86J31Q7k4j34J61r9j90K17J10J5l32L38q3m0M6j48q4J82
5176a8N1j25O3P4k09J40J10p7R1K2j20K64m17m2L50q8q3K22j93l9N6j11q1K2K33
5201I5k15J55Q0j95J06j08o2q9K89j83J74j56J16J3l9k01J77M03l39j65K27j26
5223d3J47k9O1l40K79j91J64J57k43J9JK46n04L47O8j82J66J27j24jM9m12M15
5246A77r1J58k86k5J92k00J11j6r5J44l15k2L39M6j01J9j53J01Q4J04k78J31K18
5269B42m11K84J40j95j7r8q9R1K66l36Q9L3j91K46J69j80k89N08j42j78l2N4K0
5292a6qk9M6jM8k5J71p6l8j8j9qj2l22O6K27K06k82p3Q8L22l68L15j14j78J37
5318C9L4L4N9j67oJ44q0j83J41j20K86j49pl03J96J42j44K50n7j95n3J09J07K1
$$ plain form
5152 -4 -151 -124 56 -120 115 -171 -40 47 23 -111 50 -49 -239 -22 88 103 -229 109 26 -14 32 -116 -200 -18
5176 -18 33 -92 -29 45 -164 -24 86 9 100 122 2 266 -151 -193 157 69 -14 208 15 -24 32 -79 -160 -138 95
5201 95 -120 35 115 -80 26 -82 -144 -233 56 -127 47 -109 7 20 -19 -220 -43 360 21 -144 83 -43
5223 -43 104 75 136 -204 75 -116 48 205 -38 -19 -18 228 -276 71 139 -43 123 250 126 125 174 -238 177
5246 177 86 244 -42 -67 125 -75 36 20 -75 69 -246 -268 71 117 16 35 -118 -17 67 171 -107 24 242
5269 242 -169 115 255 60 43 -55 -144 -53 213 -123 -34 -1 -192 54 223 43 -246 262 120 -58 -90 -36 -16
5292 -16 -24 -53 -7 -8 40 15 186 110 72 54 35 27 15 -307 -241 -14 192 -90 -163 -75 247 -121 194 80 -98 39
5318 39 73 107 166 -1 -7 137 57 -126 15 -105 181 32 25 -278 -82 60 -84 166 109 -86 -139 -30 77 98
5342I8j55j25J99J68j99j00J23j62M3J76r1j6o1N4k53L82k58J75l4J54j75K6J07
5365G6j87K16j3n1n0J62k53K67j54L5j35J79l06L50m3j54J31K3j85r9M06k17K
5388@l6N9J28k06j0j18L82j3p2o1L4j21m4j4J04p0R6j23j8P3m8%J05j87K17j07
5414e0K3K20k21k1J95j07j54N8K17k9k57K29j98nKK31k38K50k86r7O8K03o1J07
5438G9k31K28j50j7NJ84k44J62k26M2K65m5O3k88K93J37l06J9O1j31P4j37Q3J6
5462f4L25k84L8P5K9o2J00j03p3j17K08j29N5l0p2R8R4k98l3M24k19m4j1O1JJ63
5488A32j81J70j96qQ0q1o4j3K47j65J73k76J98Nm0P8j91L00j82p7N7m1n9R9J07
5513G2O7k77J07j80R0L92k19j27J84J5k07L88k72r4Q9J93k16oj0m8J1j70J96J4
$$ plain form
5342 98 -57 -182 17 185 -14 -114 9 -153 -110 66 -25 -41 -102 -48 -301 81 -177 -2 -36 118 -57 -31 76
5365 76 -111 105 92 41 -9 153 -100 167 13 48 -87 92 -214 136 93 -61 70 93 -92 -191 215 -2 0
5388 0 -36 23 151 -55 -65 -183 199 186 114 53 87 -34 -78 -92 12 -58 38 -85 -103 -30 -78 -78 27 -160 57 -50
5414 -50 -27 193 -28 -49 146 39 -115 -57 160 131 -126 103 -95 -100 -98 133 -105 145 -141 -238 -170 33 -28 79
5438 79 -152 76 -74 -91 -86 98 -146 16 -210 -168 97 52 115 -173 120 257 -49 -30 31 -100 -26 -163 -80 -64
5462 -64 261 -23 15 90 119 57 157 54 -19 -136 72 -57 -2 -32 -104 -6 88 -210 -243 181 -38 -82 -93 -32 -31 132
5488 132 -49 121 -75 -83 -3 -84 -148 -161 86 -79 94 -182 16 21 -19 59 -132 168 -14 -91 -34 -75 -134 -35 72
5513 72 139 -138 -31 -211 -121 271 52 -75 109 124 -83 305 33 -61 28 221 5 -1 -11 -59 -48 -218 -22 -8
5537hk22K21J2oj08J7K44l57K43P4Rj79O0j36J55J02P8k61p1L21p5k9j14p9J45
5562C6j14j15K59k41R5P3q9j50P0J88j46R5J08n0P3j87p2K00J3n1K5j98K47j31
5586f2N2k26K79j8k20M10j83Nj10r6l1J98P5nj5K5k4m00N1K73n9J04k6m5j3J5
5612d6m5K0r0J55j0R0l54L57r3m5l9J34k36K60J05n2j95J91n3m1q6r2R0K01j05
5637B1n9J3J40j23n9J77l32K34jj93K86J82k00j41j12M2N4R2qj46Q9J93j46k60
5661b57M45j25J60k12p9J39j58J08l5rk93L44j60K3K10J19k59l7R6J8k2Jj51j0
5685a44L33k48J75J33n71M90j54j01K6J98j36L9M5j2o8L83o03o5M06k7k84R3K4
5708f8J8k0L8R4n4R0r3j18J01j5rK31l85O6K27j08P0o4j87R0J2Q7j57J36k60M77
$$ plain form
5537 -8 -230 -9 3 -3 -111 -94 150 -207 36 110 119 -60 0 -136 19 121 199 -62 -133 188 113 84 -30 -109 36
5562 36 -78 -193 66 -175 -80 -7 -96 -246 -176 12 -134 -39 69 19 92 -95 -167 33 46 -5 20 -178 69 -62
5586 -62 -10 -236 43 25 -195 215 32 37 -73 -169 -200 -2 73 68 53 78 54 -346 -295 -22 -81 23 -3 -48 -61 -46
5612 -46 -91 -71 -161 -6 -16 74 -280 77 -16 -61 -100 34 -202 58 163 111 -84 107 54 13 -73 -165 -75 126 21
5637 21 -38 -25 115 -8 -67 110 -222 12 11 -182 104 286 86 -55 -167 -125 -71 21 13 -133 -44 149 3 -257
5661 -257 188 63 223 11 -68 71 -87 21 -14 -23 -316 28 -132 -109 101 220 -39 -76 20 38 16 17 -134 -144
5685 -144 189 -59 116 249 -322 168 14 -87 -61 137 1 40 85 73 5 388 -215 -280 126 99 -185 -92 -68
5708 -68 -50 -70 -32 62 8 98 5 -113 -12 -27 -36 195 -190 -124 103 -5 65 1 -186 -96 -84 3 -154 -18 -278 199
5734A99l15J59K2J52l40j01J96Q1P6j17M2j9j68K02O7j71P2j79J45K8k23J89r9
5757a02J1J98k42k06K66K62j44l8J1L8M3R1o1r2P1j65N7m0KN7j33J27n4J66J72
5782B95m42J83j52K51j91l3J34K2p7O2o7Q3j71L09k96p2K13o6j35L15j87rj45
5805a76J64k29L07Q1r7P2j78j3L5J47j69kL99k35o4r1q1J76j58j00q4L40J93m14
5829a77R8K31m19J05P8O9j18K87k18N6J10k08J02pM6j11J81k31K19k00K03j20
5851b4J04j63j43J63L01j00l19J44n8J2M14j80k04j17K36o2K3j68K02M0j69Q3
5873A5n8K73l93K07j73J05J54k47j00J67M8j70J87J08k52K70j05k6J2J03k77K97
5895A45J48m16k3k4P6K6P8J85k94K21O9k17J51k00J49r1p1J24j9m9N2j4j36Q7
$$ plain form
5734 199 -116 43 65 217 -123 -224 -28 53 129 12 54 35 -133 69 136 -35 37 -142 3 31 -192 -3 -102
5757 -102 -91 107 -135 -341 -75 187 43 5 16 54 97 188 127 35 106 -59 -2 -42 -40 17 -116 11 -43 123 295
5782 295 -147 36 -116 135 -56 -89 45 67 -10 52 -15 68 -103 206 -90 -162 51 -15 -150 165 -22 -31 -176
5805 -176 -12 -241 66 147 50 122 -56 -69 -34 113 -56 -58 341 106 42 -49 -130 46 -112 -212 -296 44 237 -177
5829 -177 -79 152 -267 -162 -84 -15 -133 154 -64 -8 102 -106 -4 -11 35 -76 105 -126 93 -107 96 -24
5851 -24 80 -83 -226 -63 238 138 -181 -37 -95 -83 331 151 -53 -170 66 4 27 -141 61 101 -68 15
5873 15 -43 230 -163 44 -129 -24 130 -117 -217 -50 -2 -172 15 123 -129 141 36 10 22 125 -152 145
5895 145 293 -123 -146 -170 -94 -68 10 195 -99 122 191 -26 125 -75 74 -17 -88 36 17 -32 20 6 -130 -43
5919d3J39j71OL9ml5p4P5J49j70L28l01m1K22r9L6kJ4j98L17k08qK40l45J05J51
5945A22j57q6J18L6%O5k12J75j16m1J81j21J45m5j23L97l66j37L73q6j2QmK3q5
5970E2N0o2L1L3j38n7J87nj23m8M2J05k06o0K42j92j04K96n7j83K74n8lP4j41
5995e1qJ52j79j32K10J28k57K63Q9n14L96j6j73jk30L67j74J91j61l9J18ol7l5
6019i9P4O9M9l3k91L65J4nk34M25l67J38Q4j75J70k3k66J3K08j54J55k66Q8M7
6043a4J20j51M2J04p4n1r7N2r0L23j92J71p3l45L71j50J44j75K08n7j22J84k91
6066a63rL11j41j65R1J32j17l1J22k19J06%j1K25q6j29J01l1J81k45O1J39j35
6089a3J78L3k70P2Q8j66J98J4k57j18K92O5m6l01K06k2j10kR8pJ74J77j25m00
$$ plain form
5919 -43 96 -75 -69 -30 -34 -69 -143 -68 81 -89 239 -62 -103 119 20 56 54 68 -130 187 -21 -29 211 -134 -29 122
5945 122 -35 -121 -3 33 33 98 -114 61 -55 -96 85 -36 109 64 -59 338 -28 -165 208 122 110 118 114 137 52
5970 52 102 40 71 104 -34 -91 96 91 -32 -80 -38 67 -139 -199 43 -149 -253 43 -14 -197 77 19 16 90 -51
5995 -51 -59 93 -86 -218 -8 120 -137 126 215 -299 97 81 -92 -93 -323 44 -130 61 -100 -139 -21 -27 -64 -99
6019 -99 -25 44 93 60 -231 134 148 143 -91 334 -33 105 189 14 184 161 -105 -92 116 -38 117 -149 -61 -14
6043 -14 106 -45 -3 101 27 -24 -121 -69 -159 164 -28 143 70 -275 96 -54 90 -85 123 66 -56 128 -163
6066 -163 -172 139 -2 -167 -76 56 -61 -92 30 -189 -83 -83 -94 131 45 -84 17 -14 167 -78 -17 122 -13
6089 -13 165 198 -72 0 88 -78 120 134 -123 -241 51 116 70 -231 -25 -47 -157 -159 -61 -68 106 283 158 -242
6113b42J27N8K25k03J02J4l7m5K34l5j31k55K21J40k74l0J24Nl03J36K74j21l5
6136e1J46l4N0k8p3J20Lj87j7L76n95L22j55J71j27o7K38k62J81Q0q9j1j26K75
6160A40j72J10oK9j23j54K82j07o0Q9j76J71m1qP1J16j47j24R8J37j41j8J16r6
6184a4j36L59l51J04K37l16J67K00k90j2nJ31k17K15Q4k12k6%J18j24K68k7j75
6207b2K65j42k78L14k01J98n9q3k21M42j93L4L99m40j0N9j96J31r6J37m6j8N2
6230B6L6m1n7j91L36N1o8K25m43L15j56J94k80j6P4j68j3J63J21k65J67k75M27
6253A62J10m42O7L21j92q3J88R7k7l00R0K32q3j04j28L24l63P7J30j77l6J71j80
6276a46K46j75J36k01R1J8p8K79q1r4k16K42j50K08R1j29M2j1k24O4Q4J11o2j09
$$ plain form
6113 -242 -115 -57 168 -35 67 81 44 -1 233 198 67 -188 33 173 -101 -131 -7 -2 -305 -169 105 -16 -51
6136 -51 95 61 111 83 10 130 133 -54 -71 305 -290 32 -123 48 -79 -146 92 -170 11 91 2 -9 -135 140
6160 140 -32 78 72 101 -22 -176 106 -1 -61 28 -148 23 -18 -26 45 161 14 -110 -12 125 -16 -34 82 -14
6184 -14 -150 209 -142 -38 199 -117 50 250 -40 -52 -57 74 -143 72 156 -56 -82 -82 36 -88 180 153 -22
6207 -22 243 101 -177 137 -64 134 75 -8 -229 213 20 54 453 13 3 62 -134 -3 -99 38 -8 -26 26
6230 26 62 21 -36 -227 109 160 92 317 -126 189 33 227 -53 -69 5 -163 -176 -13 108 -157 10 -265 162
6253 162 272 -170 -103 218 26 -57 131 228 201 -99 -9 223 140 36 -92 232 -131 -54 76 -101 -137 34 -146
6276 -146 100 -75 61 -140 -49 -31 -109 170 89 -5 -221 21 -129 79 170 41 83 72 -152 -88 -4 107 45 -64
6300f4J88l22K15q7l2K09k26J96k0j50j32J94J39j57K40j31o7J12j57k4J36J09
6322A69j95l7J75j49J11j48J61j18R6p7N3q5P7o2j42k7L5K84k54R8j02L64l60
6345a33Q5R8p5K6R1j35J4K50j94o2J52j71k2qJ21J11l1l41P1L04m19L48j35j87
6369b42J75K28j36k4j18o6J29P4J65k13J23J20k04k4K19j65p0J53j77L4k6J7J17
6392H9P5j18p8j3J3K29k68jJ46J01j11n1J6j11L7j00K81j47K40k90J50n0n2m1
6416e4Q3r3N2o4J08j77J16J03j60j7K38j54j04K94k05m8K80l69P7K90l88J24K30
6439A62j32J01j84N8j38K67p4K0k3m3pO7K8j86k2O4K6L0p4J03nj24R9l4m7nJ62
6466H9k26K67j04m8J26j47L5L43l90J98l29K92m0m1k74L6PrK73j50L32l62K84
$$ plain form
6300 -64 124 -198 17 -70 -102 107 -119 77 57 -93 -225 -31 108 -49 191 60 -7 105 -52 -76 60 169
6322 169 -26 -63 112 -37 74 -74 87 -31 65 -12 41 -44 33 -29 -171 -198 -163 121 -133 -35 -137 227 -133
6345 -133 -48 50 -25 1 92 -43 -29 221 27 -35 117 -54 -76 -84 37 148 117 -224 -153 151 -268 80 -55 -242
6369 -242 -67 161 25 1 -117 -183 -54 20 185 -28 95 215 11 -13 206 41 -29 124 -53 -19 -45 -28 89
6392 89 164 46 -32 -45 -32 197 -71 -72 74 175 64 13 29 -82 -45 -145 136 -11 229 -61 89 39 -13 -54
6416 -54 29 -64 -12 -76 32 -145 -29 74 -86 -103 135 -19 -123 171 -34 -82 198 -171 -94 196 -192 -68 162
6439 162 30 131 -53 5 -133 134 60 80 57 14 7 74 102 -84 -106 -42 -16 14 -60 43 38 -86 13 -21 -68 -73 89
6466 89 -137 130 26 -22 104 -43 -8 335 -55 143 -186 106 66 25 -249 -213 -206 -215 58 -92 240 -122 162
6489A62j85q5J16K1l01K62j3k2L01l47L1J45k19L50j22k1j2k77nJ87J52k89L70
6512A99n5l5m5M7j11p7L8oK3j14K04m23L23Q1k14J21J26j14P8q6Q4j3J43k31K19
6537A62j30q5J70k21rJ41j13J38j10K6R1r2J35j46J7q7K27j83L3O3r1l6p5J50
6561b5q1J18J0J78l2k02J26r4p5J99l8j28l8M0L8k19L68j65l06M43j02o9L7J00
6585H3q3K9K30k25q3J43o6m0k2J13j94m1K66o9j58j75M3L63J5k43L58l03J25J2
6609G8K4N0j27MJ3P1j80j42K52R9j46n5L8J53q7j4k14L02K3j53j74L44l99K66
6633B6K50k70p3J80k33K38k5K1k01L23k25k57M07j48jN2j7J70j82N9j32J16j30
6656e2L6RK97l78l8J60Q8l5J73l28m2L61l04j34L36k57J3j11J9J37J57j25J14
$$ plain form
6489 162 -23 -108 8 29 -272 -10 -23 -45 256 -91 -60 85 -134 216 94 73 61 -216 -221 -34 118 -171 199
6512 199 144 109 64 111 0 -77 -39 -45 -22 -136 68 -355 -32 49 -165 -44 82 -32 46 -40 44 31 174 -57 162
6537 162 32 -53 117 -104 -113 28 -85 53 -57 -31 60 -32 103 -43 -26 -113 114 -69 -36 27 -64 -100 -175 -25
6561 -25 -106 12 22 200 168 -34 92 -2 -77 122 84 -44 -82 -42 -4 -223 145 -20 -326 117 15 -54 -17 83
6585 83 0 29 259 34 -49 94 28 -12 -34 79 -115 -156 110 41 -117 -292 -249 114 129 -114 244 -59 66 78
6609 78 102 152 25 29 42 113 -67 -209 43 142 -4 -59 -21 132 45 31 -183 119 142 -11 -185 159 -240 26
6633 26 276 6 -67 113 -120 118 93 114 -87 236 11 -246 161 13 12 64 47 217 35 94 -38 78 -52
6656 -52 -16 -7 290 -88 -126 34 122 87 260 -68 -110 251 -53 -187 149 -108 -95 -206 -187 -50 107 -18 96
6679I6r7p5Q7qp3J64p6p9O1Rk18J82M3R9J15j71k4N1j09P6K9j29K06Q6j14j05
6705B6J55j62q9kr7K34Q5j01k77J74J84n2k36j35J40J84n4j4j62K10N5j6r1r4
6729a35J23j9j06Q8n2n9K31j31j33J35K3L2Q4k00K36l3n4j22kK55q9K45l08q7
6753g8N8L8j05L54k04N0k26J12M6k36J99O6j94J52J4j34J50j17J13n6M0lK09m26
6777a78K19N1j38J67n7n8J0q9k12M14k59J40j68M51k75P1rO9m9j23j15O9j1K10
6801A30j63K42k59o6J32r9J12k46K54L7l3Pj07J3OJ46k39J87k18mK95n9j18K69
6825B19j65J11j96O6j68m1K19K2r4j40J08Pj27L7K02P6k39L5J09j45P0M4N4MP0
6850A38j49J38j20l3K7J6j04K4J26K6R8k19j66j29J87J16k9j25J73k07M6L70j90
$$ plain form
6679 96 -1 -76 11 3 -70 94 18 -61 0 9 -209 -27 16 115 230 59 35 86 -23 53 82 -47 159 245 131 26
6705 26 181 19 -70 -72 -169 65 150 49 -228 -54 130 78 -158 -293 -153 31 -23 -37 -199 11 66 50 -41 -135
6729 -135 -12 -31 -137 -49 -101 -160 71 -60 -193 -58 -35 -3 81 -119 117 84 30 -92 -94 161 72 317 9 -78
6753 -78 -20 18 -87 267 63 113 -113 -1 45 -191 8 74 -120 32 46 -88 62 -55 58 2 42 39 248 -178
6777 -178 41 92 -46 121 64 6 16 -73 -285 129 -130 10 -158 293 18 89 80 149 100 -23 -138 -69 -80 130
6801 130 -33 209 -50 -116 16 -83 29 -217 37 74 41 48 -59 -46 -40 106 -133 54 -164 -168 127 68 -50 219
6825 219 54 165 -31 35 -133 -174 45 67 -27 -167 -59 -52 -179 -142 60 136 -103 -68 41 -104 -34 10 64 68 138
6850 138 -11 127 7 -26 1 17 -87 -63 63 89 187 -32 -198 -327 -140 -24 -53 -178 -5 -212 -166 204 14
6873A4q4J40K8k9R0K8r6j02k14K43K32l14J67P8j34l3q7J30K26l0k60Prn4k3R4
6899HR0j26J36k8j6J29k69Loj08J77j28J21j33K45k09J72n8J50j94J24j45m9K96
6923A82l44Q0J06k8k41K57K08k63O1q2J41K8ml65K50j45j0K60j74k%M4J28o0j73
6948a46K20O4p2n0j21P6J16k50J12M07m35L1J82l08N1O2J83Nk74J83p1j9J2J05
6972F3m6O3Q2l42J54K4MK1j68K3R0N3l1J30j65j20K74m31L19j36J70Nl17M41q1
6997G9Kk7k7qj01K31M5o7Rp0j24j11N5Q2Q3kM5k77K2K73R6j33n4j09M8L2qj62
7025a78J52o4L56k18L0J8q4k2j84K01j67J49J65m0j54o3J05n8M5j09K4O1K16r2
7049H9rj0JK5j23J30j76L5n1K59j91q2J84j80jJ86k77J07J33j04N4N4o5J3J20
$$ plain form
6873 14 -70 70 98 69 159 187 91 -11 -225 18 250 -64 103 181 47 14 -73 57 283 253 -7 0 -9 -63 -86 8
6899 8 98 -28 108 80 64 193 -76 -73 -79 -187 -10 -138 -17 -150 95 -114 58 0 150 -44 80 -65 -114 182
6923 182 -162 -82 24 -4 -245 12 220 -43 18 -64 77 105 101 -264 -14 -159 -169 91 -83 -85 -85 -41 87 27 -146
6948 -146 74 138 66 16 -105 -29 87 -163 -51 356 -79 -48 134 -174 -123 -61 122 127 -147 36 -35 -54 -42 63
6972 63 17 80 162 -180 -26 -2 2 23 -145 -122 -32 21 -10 120 -45 -165 109 -322 -3 -139 31 36 -281 160 79
6997 79 81 54 27 19 -82 149 194 127 136 66 -58 -169 -114 -32 51 49 94 -183 -161 112 208 75 21 -88 -40 -8 -16 -178
7025 -178 -26 -90 266 48 78 96 12 -10 -194 7 -160 -11 154 114 -40 -103 2 -56 -11 -120 -96 -35 181 89
7049 89 80 70 71 96 -27 103 -73 -38 -89 170 -21 -103 81 -99 -100 86 -191 -84 49 -55 -1 53 -12 1 121
7074A21j84J6j96L46lK9k39L28j05k56J88j70K70k74M28k41j96KK45j77j9j0J63
7097F6p1N9R2j44J44l8k05K19k6o4j23P6R0j41J20r7j97L30J12m45Q3J70j5l00
7121c05J65l5J08Q2p7J17J05r3K54k26r8J45m09L26j21M9n6J01l8j07O9K3J57
7144A36%j82p3K17k62K96j81k9K02j19l0QJ29r4r3J34q6n4K9M8O9J97l26J35J17
7169A88j24k13J23J04k10K07kJ4K83j27k34j00nQ9j55J17M5J42q2j79o2K62k87
7192b06J78O0k5p2J90J2j62J64k28J61o0M7O0k58L85l07K46k19j09L44l46K08
7214F3R6l69J72l7N1J36r3O5Q0k35o8j48N80l95J80j58p6J65j75j95M18m0M2o2
7238cJ60K17l79n9J14j13P3J54q5J19n3m99K93J8K2o1j0n3K70o0k05J06j61K06
$$ plain form
7074 121 -63 -47 -243 103 100 129 -110 218 113 -143 45 -125 145 -129 299 58 -138 -136 109 -68 -87 -97 66
7097 66 -5 54 146 2 146 108 -97 122 96 32 -91 -15 75 -66 54 -43 -240 90 202 -243 -160 10 -5 -305
7121 -305 -140 -175 -67 15 -62 55 160 67 321 95 -3 142 -267 59 -62 -13 -69 32 -6 -113 -44 -21 136
7144 136 136 -46 -119 98 -164 132 -49 -78 124 5 -25 -17 112 18 -75 59 -27 -81 -52 -4 65 262 -64 71 188
7169 188 64 -149 -26 78 -132 75 73 87 370 243 9 -91 -96 -7 -162 -45 0 142 60 -119 -181 81 -206
7192 -206 -28 32 7 -65 125 137 -25 139 -89 72 12 59 119 -139 246 -61 185 -34 -143 201 -145 63
7214 63 159 -210 -38 -75 -24 112 19 84 164 -71 -139 -287 293 -102 78 -80 -156 9 -166 -361 57 17 59 -3
7238 -3 157 374 -5 -64 50 -63 10 164 79 198 145 -354 -61 -43 -21 -82 -92 -145 125 65 -140 -34 -195 11
7262A1K06l72Q3o0n2J76lMJ19k00L6L6J32j13Q4k46P2J72p4l6J89j21O9j5j01
7287drK73l80J25o5o6L6J27j55J1p4K81j4J9k7j75J57j72J40N9n0r9O4Q8j82R
7313h3K7M9j85K27J33k96K64k28J33P9j27P6p2Q8K4N1j28N7Jo3o5M0o1J53k48
7338a54J73J43j97J35m1lr7m1j0K95l15J3J98m57L73R0k49K95n4k24J58k7J46
7361A50j64O0m6L3j03R2j39J74j23J4o2K96l14k0R9J13m3N4k01J80o9j42J23j52
7385a90J51rl7J19k4l7l6K04m6J00k20J36j17N7n7L9q9K3L88l30m8M8N6O6k20
7410g3M1N8q2P9j65J50k7o5P8J8J0J93j86k34K35l7RN1q7k1J63P2k00J74pk26
7436g9K19l96N70l54J8r0O2P6j38L6J20r3J42n3k7j46K26k11O3L3J32k62K86m1
$$ plain form
7262 11 217 -155 -72 -132 -184 -8 -11 -7 112 -88 -52 -16 116 3 87 -159 -87 85 11 -25 164 43 112 97 -4
7287 -4 -13 260 -120 5 -60 -126 -90 37 -118 -107 -181 100 86 105 78 -97 60 -112 28 87 37 -62 2 90 -92 -83
7313 -83 -56 -7 -192 35 168 -128 136 -92 41 120 -7 69 -3 85 109 160 32 89 90 27 -38 2 -59 94 -154
7338 -154 19 162 -35 100 59 56 -41 -82 -92 203 -112 -99 99 -358 15 105 -144 151 97 -127 31 4 150
7361 150 -14 46 0 33 -70 22 -117 57 -66 -52 -114 182 -132 -152 -53 60 17 71 -130 50 -19 -161 -38 -190
7385 -190 -39 -48 -85 34 10 -27 -63 141 95 195 -25 111 -6 51 -6 33 -56 -33 355 25 -23 25 81 147 -73
7410 -73 -32 26 -56 23 -142 8 -19 -84 -6 12 22 215 29 -205 30 -7 2 53 -34 -55 108 180 -20 154 147 -79
7436 -79 140 -256 314 -40 -22 -112 -50 26 -112 -76 44 -49 93 40 13 -133 93 -118 -55 -22 110 -152 134 93
7460I3r5m6j38L08k15r9L29k54J42L6q9K1L7k4j5m7o3J02L7N0j64j7J22p2N5l3
7486c9J20j23o0Q4M5n9j50J45p3JL61l60O3J00R3k67k1o2n2L07q1O2jj82O7JJ6
7513f5J12j91K63r8j02j03J45J38o4j60L30k09n5n5k8J63n8N7QM4k0o2N6j14n6
7538a24J97KN1k06J68j94j7J21J63k41j0K23k16Q7p8K19k77R8R9J20k09j74J20
7561g8n5r2J40P3j26P2M7J20r4n5Q1k96M54j22k00K28k7N1j96K48j31j06j45J04
7585a05l7L9M20k82o0K01k00qJ90k10K67j36N9j48J16j67L04l84K57j36j03J95
7607G2L4j57j0P3j51J3J98qQ7k8j49N9j56O8l9O3J76m6k17K66m69N15p3j36J61
7632A46j29o1J21Oo3MNn9Q9j31j30J4J86j93K63j79L02j96r3K06j69N0R9j72j20
$$ plain form
7460 93 -2 -48 -186 122 -93 -192 137 -117 25 61 -28 -7 30 6 -9 -56 -119 -17 20 70 -94 -111 11 -61 -6 -39
7486 -39 81 -42 -102 -18 27 -32 -182 -37 -110 -109 252 -108 -45 55 148 -119 -140 -202 -254 53 -28 34 33 -149 -82 -81 -65
7513 -65 47 -144 119 21 -81 -184 -39 99 35 -125 205 -4 -59 -114 -142 21 -37 20 28 72 52 -10 46 -68 -124
7538 -124 73 75 126 -80 88 -106 -123 -2 161 -80 -90 133 -83 4 -74 145 -132 -34 65 185 -24 -198 -78
7561 -78 -133 -225 -85 -12 -138 -66 -19 101 7 -48 33 -263 191 69 -131 97 70 121 -75 173 42 -64 -209 -105
7585 -105 -142 -103 317 35 -25 176 -24 -32 158 -52 215 79 138 -10 106 -61 243 -141 116 -20 -123 72
7607 72 106 -51 -61 12 -139 -126 72 64 151 123 -26 33 -123 -55 -94 -31 145 99 -118 148 -321 194 121 -15 146
7632 146 17 -44 77 83 20 24 29 -30 59 -72 -202 -188 -2 -195 68 -111 191 -5 -98 108 -61 -11 88 -84 -204
7657b04L68j56J28o4l10K71j90K17j95O0k7K32l33K69K5J49k92K38k24m0J05J67
7679A94k75Q4m6j18K34l63M81k25J88j20k2J41q9M3j76K13l1k65m4Q9J60k11J90
7702C2R2j46M3j31P5j15J35k6Mq2J37p3nQ1%M6J68k29j22L11J1l64K31L1k34J90
7728F0J05l16Q0M6k1kO9j09J79k7j32J24k24K55k32K11J78j77O8j32j2j05jL60
7752B45l12Q4M7p6l3l6K51j40M4J5j14j0K38l26J79k12K13j39J43r0k3N6K44k62
7776a4O3q1r3K17j97K25j84j2p4K6J25j28J66l8j8m4r0J41O9rk8M7o9p7J73J49
7802B45l49J92N4l6r9Q7K4r2M6kp3r0M3j06J57j65K82j50K27l70K72k62K36j84
7826a13K26k2K77j92j67J06q9n8m0P1k9Q5o3l2R4n1r0L2n0R5J00L0o9q4NJN3J65
$$ plain form
7657 -204 164 8 136 72 -238 33 -157 60 -135 -75 -102 130 -203 66 91 240 -52 186 -38 -78 27 194
7679 194 -81 3 -43 -161 73 -290 191 -34 154 34 12 153 64 107 -69 144 113 -152 -196 -107 53 -158 32
7702 32 124 -22 21 -110 -35 -150 -15 -41 -37 -119 18 -55 -60 21 21 67 235 6 -116 195 206 -158 73 104 -130 60
7728 60 165 -151 -71 -25 -46 -48 21 -88 91 64 -68 56 -168 87 -145 66 244 67 135 3 -9 -114 -115 245
7752 245 -67 17 64 -12 -45 -81 170 30 74 89 -25 -35 203 -123 56 -156 57 -82 61 -29 -52 4 248 -14
7776 -14 49 -32 -125 92 -105 120 -64 -76 -150 -124 1 -127 39 1 -17 -61 -151 -10 59 50 22 69 0 -77 96 245
7802 245 -104 88 142 106 7 94 118 26 72 70 -3 -93 -50 -156 1 -164 118 -32 195 -175 97 -165 71 -113
7826 -113 113 91 368 176 9 115 26 -32 -72 -1 -30 55 -8 -40 54 3 -87 -55 -105 -10 90 120 51 -33 -28 -27 26 191
7854A91j41m5M0j17J86j13J02j10m6k9j53L4J58J6J30l2k6j77K28j47j03J10K7
7877a7K9J79j79M2N9M3j19J41k18j32N2J65r4Q0K32l96K72l09Q1L86m48j0K89
7900A28o9j30m0J97m5m5m8J53j05k17L09p3J72j77n6J82k49J5K46L4k96R5Jl2
7924e0p8K34k28j8O7pJ28m7O6l2j34p9K49p7k02K25r5lJ62j85O6j4q7K06q6M9
7950C0o9q2J22J06k22J32M8o5q6J46j51J6J6J17k4Pp7O4n6mn2K41%j92P2p6J86
7977A47j85R9q2J33k42J72J12k22N4P3n3l9J26k06K68j05rn6Q4O3r6r5n3J47O
8002D1o1O9j70J11j04L38j24R7k44P4j62J58M9j78k3L01p3j71L74l64k3K04j62
8025d3nj9j66L43k81J54n0J92o7l8j42Q8P5J86k64L2l6R3J10l43J93r7R8QJ51
$$ plain form
7854 191 50 5 45 -72 114 1 103 -7 -53 -82 -235 -201 -43 -27 103 71 45 -132 96 -51 -154 -44 -17
7877 -17 12 191 12 54 113 156 37 178 -40 -172 -120 45 -49 31 263 -133 139 -170 -89 297 -151 -161 128
7900 128 59 -71 -111 86 41 -4 -52 101 -4 -221 88 15 187 10 -46 136 -113 -98 148 182 -114 -19 -18 -50
7924 -50 -128 106 -122 -140 -73 -80 48 1 67 35 -99 -178 71 -6 -208 17 -78 -81 81 -104 -38 -52 -139 67 -19 30
7950 30 -39 -121 1 107 -115 17 65 0 -86 60 -91 -75 -59 58 34 41 -36 28 -28 -32 -84 157 157 -35 37 -39 147
7977 147 -38 61 -21 112 -130 42 154 -68 -14 59 6 -33 93 -113 155 50 41 -15 69 132 36 -59 -112 35 41
8002 41 -20 49 -121 -10 -114 224 100 197 -47 27 -135 23 72 -106 -129 172 99 -72 302 -62 -85 119 -43
8025 -43 -48 -67 -233 110 -171 -17 -67 125 58 20 -122 -34 41 227 -37 -5 -41 52 162 -181 12 -85 13 21 172
8050A72j80j66J43m6J02J12k43J40M7j43J01m3po0J22j36J57n9m7J73k99J76k57
8073b41K49p0N8L1J1p9J18j36k31K13J89n6R0M4k92L9j18J39J18j23o5K02K60
8096C50m22j53M51m10J63K4j77J29l4J88J54l82qR7q4J99n3N0k05q1J98q1J33
8119D6J56k42K67k86L03j23p1K05k79Q5Kj56%K34k84j7L07j90l1M8p1J8J19K5
8143F5j93J66l4k2j24K02P5J3j04j77J05l7J58ml39K46J15L7k52J59k88K23L20
8166C10k56k40L1K61j78J79j24M9j08O4J59J93k12Jj51Q4O8j95L2j82K34l8j04
8189a23L40k69
$$ plain form
8050 172 -8 -174 -31 -77 25 137 -106 34 81 -62 39 -4 -11 -71 51 -85 72 13 -34 139 -160 16 -241
8073 -241 8 -62 -4 27 38 -41 77 -59 -290 -77 112 56 146 190 -102 -63 -181 -42 76 -47 -112 90 350
8096 350 -72 -225 226 -184 -21 3 -174 -45 -79 109 263 -119 -127 -30 -114 85 32 82 -123 -204 -6 -87 46
8119 46 202 -40 227 -59 244 121 50 255 -24 61 63 -93 -93 141 -143 -160 147 -43 -74 -26 -97 -79 40 65
8143 65 -128 38 4 -18 -142 60 135 148 44 -133 -28 -65 93 89 -250 -4 111 148 -104 55 -233 -10 310
8166 310 54 -186 -155 106 -72 107 -17 32 -76 -12 147 340 128 129 -22 62 130 -65 -33 -215 19 -19 -123
8189 -123 217 -52
8191e2
$$ Imaginary data points
##PAGE= N=2
##DATA TABLE= (X++(I..I)), XYDATA
0@%%%%%%%%%%%%Qj6J6j6K4l2L4m2N3o1P2q8J04j20J36j57J81k08K40k72L09l53
34a88L98m45M98n58O24o97P76q60R54j056J167j290J426j570J727j905K098k310
52a211K547k812L109l444L826m265M776n381O111p012Q154r654J1719j4754J9661
67A1370k8868N1861k12567l64628N61335M40871k57800m58196J4816K88926J18894
78A66014j29567q0760q340p274J06473J79788j28731l23471J6808L50094R5456
89B36490l10436k17236K68700L47184j71894m20738M6551L74576N5788k69876
99f0891j27874J44499J88314J4891j37536j25342k8691Q9286J79475J8736k60120
110a05253j40556K58982K72315j26993l45833r4722K86303K45762j69009k74975
$$ plain form
0 0 0 0 0 0 0 0 0 0 0 0 0 0 8 -8 8 -8 16 -16 18 -24 29 -32 40 -48 56 -64 72 -85 96 -112 128 -144 165 -188
34 -188 210 -235 263 -295 329 -368 408 -452 502 -554 613 -677 749 -821 906 -999 1099 -1211
52 -1211 1336 -1476 1633 -1811 2015 -2250 2526 -2855 3256 -3756 4398 -5256 6463 -8291 11370
67 11370 -17498 34363 -178204 -542832 18503 459374 201574 -256622 -241806 47120 166014
78 166014 36447 -44313 -52653 -59927 46546 226334 97603 -225868 -209060 141034 236490
89 236490 -73946 -291182 -22482 324702 152808 -267930 -221379 153197 208985 -60891
99 -60891 -188765 -44266 144048 158939 21403 -103939 -132630 -43344 136131 154867 -105253
110 -105253 -245809 13173 285488 158495 -187338 -282060 4243 250005 80996 -193979
120a93979O8564K35661L5094j31841j03447K896Q1349N4271j5424l3376l0127
131c0359K2440Q7703j8828j55012k5888J49165O4622r8394r3707N4032J62678
142A18452K5526k03999j23613J48385J62029m2654j37762m4393J09895J14723
152A26589n7070j30256k7528L9612N4998O5498k2382r8792o892R4035M8616o4773
164B1655j18311o572J47514N5628j28201m0762J21906L3268j14600o6200P2369
175b2306R0455m0813r6036M5880J08891k9751p5820Q546j0703m1668M6571P6581
187E9827k0850q5584j7525J07819P4724j27909j40454R3934J47793l8047r5552
198d1824J4372O9262J2312o4121m1061M5309J8427m5936K1918O1025k6142l4534
$$ plain form
120 -193979 -125415 110246 145340 13499 -89948 -87052 -5703 48568 33144 -232 -30359
131 -30359 -7919 79784 60956 -94056 -119944 29221 93843 -4551 -98258 -44226 118452
142 118452 143978 -60021 -183634 -35249 126780 84126 -53636 -98029 11866 126589
152 126589 69519 -60737 -88265 -48653 6345 71843 49461 -49331 -56223 37812 86428 21655
164 21655 -96656 -103228 44286 99914 -28287 -69049 52857 86125 -28475 -94675 -22306
175 -22306 68149 27336 -68700 -22820 86071 56320 -19500 -10954 -21657 -63325 -16754 59827
187 59827 38977 -46607 -64132 43687 118411 -9498 -149952 -56018 91775 53728 -41824
198 -41824 -27452 41810 54122 -9999 -51060 -5751 12676 -33260 -11342 49683 23541 -10993
210a0993K8793k345n0181j6251L8571N3982j1815p6786J3758J07913n551j21686
222e2591l8075P0308O3042n510n5133q459O0502J1091m7389r091n748k8230L2783
235a2500N5481j7851l7840N140K3645P579m1260m6645M4272O1909l2770l5129
247b5969M3052K8842k6581l8493k2868K5453M2813j5994k5658K4553J3590q271
259A4469K241l2262m1581K9133M5714l967j5852n570J3761L4029j7914o4841R73
272d1667N0696J2468r247j0303o310L1962J6585n7940m0171L2833L0569L610q692
285D393k0809J5390M3829j8026n5599j3194J9090L6025K6899l6558l5893M7630
297A3177M3737l7543n5369j7600L3627N9877m800o1309J047N2429J3411k8505
$$ plain form
210 -10993 17800 15455 -34726 -50977 -12406 41576 29761 -47025 -33267 74646 69095 -52591
222 -52591 -90666 -20358 42684 37174 -17959 -26418 34084 45175 -2214 -11305 -17053 -45283 -12500
235 -12500 42981 25130 -12710 -7570 16075 23654 -17606 -64251 -19979 41930 9160 -25969
247 -25969 17083 45925 19344 -19149 -42017 -16564 26249 10255 -15403 9150 22740 14469
259 14469 16710 -15552 -57133 -28000 17714 13747 -2105 -7675 6086 40115 22201 -42640 -41667
272 -41667 9029 21497 12250 1947 -4363 27599 44184 -13756 -53927 -21094 9475 13085 4393
285 4393 -16416 -1026 42803 24777 -30822 -44016 -24926 11099 37998 1440 -34453 13177
297 13177 56914 19371 -35998 -53598 -19971 39906 35106 -26203 -25156 27273 40684 12179
309A2179m9033k9064N2340O6250k5710n5127N058M1337K9039k9877p7170o071
321f5849Q0754L4436l7248l1093R7L6251L4688m5722o9962J9605O7152K4891k5139
334B2861m6096o51O3004J1103p6105m0524L7067N0050K2705l1735n0584K5528
346a3377O1198j3969o0447k6579K6770O5511K3409o3622m0702M6757L7942k4421
358A8470n0133l2598L7165P4230l450o4085j2229L8640K7965j3568n8225k5145
370f2963O5385N4860l0245m3621l429K5911L0022k4568o5872L662O9257K9242
382D7641k7938l9320r004M5858K6332n8925m9559L7642N4616J2787k6155m2022
394b8047P609N3753m21n7446k3560K9838N1790K4237m9256n1704L6302M8877k5249
$$ plain form
309 12179 -36854 -65918 -13578 52672 26962 -28165 -23107 18230 47269 17392 -59778 -65849
321 -65849 14905 49341 12093 -19000 -18903 17348 52036 6314 -63648 -44043 23109 48000 22861
334 22861 -23235 -23886 39118 50221 -25884 -66408 -29341 20709 43414 11679 -38905 -13377
346 -13377 47821 33852 -26595 -53174 -26404 39107 62516 -1106 -41808 4949 42891 18470
358 18470 -31663 -64261 -27096 47134 43684 -20401 -32630 6010 33975 20407 -37818 -62963
370 -62963 2422 57282 27037 -16584 -20013 5898 35920 11352 -54520 -50858 18399 47641
382 47641 19703 -19617 -28621 17237 43569 -15356 -64915 -27273 27343 40130 13975 -28047
394 -28047 -20438 33315 32894 -24552 -48112 -18274 33516 57753 8497 -43207 -6905 41972 16723
407A6723n1037j7412L2194O0330O428n9468k2109L6164K3143j1079l6688k7533
419e0344M1827O0774j6463n0825o374K2824J9991j1453m6255m453N8635K8507
431D6391k9294k8623o057K2076K4639l3361m8650K4746N6542J1203k6717l5264
443b2369m884M2988J6716m5845k9910K4363M1456K6945k3243n5873N50M6045J653
456A8592l4279j5557J0496L6016K4122k8767l0076J1863R532o581k470p918P583
469g444L1699j576l0861j369J3532l183r239j5595K104M1942K0878l2743k2779
482a4634Q281J0034P475j2919l1897J0428M3876R982k0317j9100j1219J4305J7663
495A1958j8431j2351K3401J4279l269J96j0586p860O692j4150j8023K3470K7915
$$ plain form
407 16723 -34314 -51726 -19532 40798 47226 -12242 -34351 1813 24956 13877 -22811 -50344
419 -50344 -8517 52257 35794 -15031 -21405 1419 21410 9957 -36298 -40751 17884 46391
431 46391 17097 -11526 -17583 4493 29132 -4229 -52879 -28133 28409 39612 12895 -22369
443 -22369 -27253 15735 32451 -13394 -43304 -18941 22515 49460 26217 -29656 -29106 16939 18592
456 18592 -15687 -31244 -20748 15268 39390 10623 -19453 -7590 1942 -4639 -7109 -15027 -7444
469 -7444 24255 22679 -8182 -9551 3981 798 -8441 -24036 -21932 20010 40888 8145 -14634
482 -14634 -6353 3681 11156 -1763 -33660 -23232 20644 30626 10309 -8791 -20010 -5705 11958
495 11958 -6473 -18824 4577 18856 15587 15783 5197 -2663 4029 -10121 -28144 -4674 23241
508B3241m766j8697j7261N209L2940j862m9080j4545L8187L8795J0635l3732m5741
521c6677J5380M9126k470m1865k2400J7543M9954K2256m5937l9695K1126K5018
533A1359n866j8371j5586J7771M0551l709l7486o292J9210J0171r351l0560l634
546c1793N5052L2070m2517m4517O782L6449K4398l1880n7324J2136P1380L0172
558F0408l6260n6390j7606N1506M8728l6120n9573P456N3184L7614j6890o0981
570b4924k3390M5417L0802k2347k6305N0K9997L1003k0714m4437M882K9678r26
583H786j9238j1168J4200L8613M195m7782k4260K5877K6932P62l0071k7434L2996
596g592N8337o863n4613k8196J6192M0358J5959l9408l2293K8851M0579L412k9037
$$ plain form
508 23241 18475 -222 -17483 -12274 20666 18804 -30276 -44821 -6634 32161 42796 9064 -36677
521 -36677 -21297 27829 25359 -16506 -38906 -21363 28591 50847 4910 -34785 -13659 11359
533 11359 5493 -12878 -28464 -10693 29858 26149 -11337 -17629 1581 11752 2401 -28159 -31793
546 -31793 23259 55329 12812 -31705 -24923 11526 35924 4044 -53280 -41144 30236 60408
558 60408 24148 -32242 -49848 1658 50386 14266 -45307 -37851 15333 52947 36057 -24924
570 -24924 -48314 -2897 27905 5558 -20747 -20697 9300 40303 19589 -24848 -19966 9712 8786
583 8786 -10452 -21620 -7420 31193 35388 -12394 -36654 -10777 16155 16917 -13154 -40588 -7592
596 -7592 50745 43882 -10731 -38927 -22735 17623 33582 -5826 -38119 -9268 31311 34723 5686
609E686l9164k149M1096J4144k5484p275J5368J0378L530j3387j8386P940J0535
622B832j0311J503J6127N941J278j2341k5737M525K8263k638k3988o042J6782
635c806L0589P056m1077k8983K3570K3860m643j0143p723P802K4800M84k4500
648b714r639K022L173J0623l63p416J5057R596k1201j4016P623Q914K326j4856
662a0871j6110K7922L9435j6875m3166q342K1993K4344k190l2310r350L3626K4651
675C2757q040k5660k9964M225M2008R080l6288j4701K5936K9870j032m0053k5522
688c7384L1888K8534k1417k0273J2999K1734J0735j7435l1639N53K7331Q120j2060
701A686j5136l012L1836K7677l3773m8455P943M0361J8018k1914l6138Q385N1129
$$ plain form
609 5686 -33478 -35627 5469 19613 -5871 -13146 2222 12600 16130 2743 -15643 -7703 2832
622 2832 -7479 -5976 10151 16092 17370 5029 -20708 -16183 12080 9442 -14546 -20588 -3806
635 -3806 26783 33839 -7238 -36221 -12651 11209 6566 -3577 -11300 -3498 21302 21786 -2714
648 -2714 -12353 -10331 -7158 3465 3102 -4314 10743 20339 -862 -14878 -7255 1659 3985 -10871
662 -10871 -26981 941 40376 23501 -19665 -28007 -6014 18330 16140 -16170 -25520 8106 32757
675 32757 24717 -943 -30907 -26682 15326 24406 -11882 -26583 -647 29223 28191 -11862 -37384
688 -37384 -5496 23038 1621 -18652 -5653 16081 26816 9381 -22258 -21705 5626 13746 1686
701 1686 -13450 -16462 15374 43051 9278 -39177 -31234 9127 27145 5231 -30907 -22522 28607
714B8607J1894m3314l1826R450L0725J9917k0247k8135J5436L0668o14k1866k3516
727b2821m361L0949K0763k3881k0460J7460K4549J524k9411l0670J8820M1394
739B3855o931l3352o73K5764J8453j1454l5970j0644L1525J9548j0440j2049n442
752g810J0554K4609p107m0009j2348K6021K4119k661k7434j1262L3523K2582l2379
765C98l2286J1901K8193J1876j4367k0022J2357K5459q508k3819q606J005J4615
778a804J9228j1339k2321Q154K3062L301k3105k7919J0730M2684M379l7300o815
791a9065K9135J4033j5927k7723o604K6507J8582j3463j0883L343N291J1675n98
804A4303l0686j4418K7833K5600p268k5430r456K7699K3669k8881l5740J3691
$$ plain form
714 28607 40501 -2813 -34639 -25189 5536 25453 5206 -22929 -7493 23175 22561 695 -22821
727 -22821 -27182 3767 24530 649 -19811 -2351 22198 23722 -5689 -36359 -17539 23855
739 23855 16924 -16428 -17101 8663 27116 15662 -20308 -30952 573 20121 9681 -2368 -7810
752 -7810 2744 27353 20246 -19763 -32111 -6090 18029 15368 -12066 -23328 10195 32777 398
765 398 -31888 -19987 8206 20082 5715 -14307 -1950 23509 15001 -8818 -17424 -16419 -1804
778 -1804 17424 6085 -16236 -8082 14980 18281 -4824 -32743 -22013 20671 25050 -12250 -19065
791 -19065 10070 24103 8176 -19547 -26151 356 18938 5475 -5408 -2065 3226 14901 14303
804 14303 -16383 -30801 -2968 22632 15364 -10066 -19522 8177 31846 2965 -32775 -19084
816a9084L1094P527j2410j6837K835K2625J113k4394j1546O239J4170J6230p464
829A0098k3050N615K2950j764k1985j6031Q641L0324Q411k9378j2842K3264J4194
842A8447j2487k0758j0495J9158K6894o379k0436j59R919P416j363k0596j3616
855b4455K0072K1111n171j4511p910Q314J6437r441k5955M381K4624O811p663
868F644r039j498J2956L514k1117j0232J4274J2292L066o206j2323L914J6267
881A2512n723j9040m039Q710J6559R224j7330j5818J5005J4346j0826j6284m718
894a7422J3431K1418l005k0700P91J3663q83q074r283l620J4788J3854r315j1325
908e682K065N147N139o614j9182L709K7759O130j7120r191M925J2472K911k0452
$$ plain form
816 -19084 12010 19537 7127 -9710 -6875 15750 16863 -7531 -19077 -12838 1332 17562 10098
829 10098 -12952 -7337 15613 13849 -8136 -24167 -15526 14798 23209 -6169 -19011 4253 18447
842 18447 5960 -14798 -25293 -6135 20759 14380 -6056 -6215 3704 11120 9757 -10839 -24455
855 -24455 -4383 16728 11557 -2954 -10864 -2550 13887 4446 -21509 -17128 7496 14307 6644
868 6644 -2395 -3893 9063 12577 -8540 -18772 -4498 7794 10860 4654 -7669 -3755 12512
881 12512 6789 -12251 -16290 -7580 8979 18203 873 -14945 60 14406 3580 -12704 -17422
894 -17422 -3991 17427 14422 -6278 -5487 8176 7293 -781 -10064 -13684 1104 14958 5643 -5682
908 -5682 -3617 1530 6669 55 -19127 -15418 12341 18471 1351 -7840 -2915 9557 12468 -7984
922g984j3827J7730J8587k063j0271j1135J348J7473K04k2431p400J5050J6489
935A1770N015j5291j7336J1756J8727r589j8410j271J3178J7105O29k0950o901
948a1568J5403N056r801r101l493J3192J7982p531j9011P99J1013L389o235j4143
962a4049m1K4030J0107j7254j2002M734Q577M046j0825j4401R943K0145O92j0347
976C355r337k564J1693P223j5819j0773J3442J3717J085r184j2040K883J2850
989F531n471j2016M101R557N150J232q943o803R178L595j0574m721N173R108Q557
1004A3654p605j6507M050J3695l343j1450m971M831J7359P027j6579j1328Q424
1017b743Q145o58p058r263P119J8585p87j4345m578K342M246J824r847n624J4483
$$ plain form
922 -7984 -21811 -4081 14506 12443 2172 -8963 -7615 9858 10062 -12369 -19769 -4719 11770
935 11770 16785 1494 -15842 -4086 14641 5052 -13358 -14629 -1451 15654 16283 -4667 -11568
948 -11568 3835 8891 -910 -10011 -13504 -312 17670 10139 -8872 -8073 2940 6329 94 -14049
962 -14049 -14090 9940 20047 2793 -9209 -4475 4102 8148 -2677 -17078 -7135 13010 13702 3355
976 3355 -5982 -8546 3147 10370 -5449 -16222 -2780 10937 12022 2838 -9202 -6319 6531
989 6531 1060 -10956 -6855 2702 7852 9084 141 -6662 2516 6111 -4463 -9184 -4011 5097 13654
1004 13654 6049 -10458 -6408 7287 3944 -7506 -12477 -7646 9713 16740 161 -11167 -2743
1017 -2743 5402 4744 -2314 -11577 -4458 14127 13340 -1005 -5583 -3241 1005 2829 -7018 -12642 1841
1032A841J0259p774q588j720M702Q128o551j4435O575J8947L351r669j2207l708
1046a0849J4605R383j5828j4097Q672J6695Q606q674k0585k458J9107O221j2024
1059a226r450J219J4681J3379j1232j9360K378J2633K674n747q194K488J6991
1072A1234L881j6617p495O422N270N38p556p294J1259J5417n478j5185n741N262
1086f083J3130K384j7809p126J8468J3731n415j4405j1298O588J6910j400j4039
1099f364j822Q771Q193K766j1696j2722O722R799k062l491r4J626P133j106j1105
1114e452r48P443j181k612J302K066O662K716j1469o967O620M397j814k667l827
1129e731L991J1588k433j1287k987J869L154N061k632m820O098N427m785k925
$$ plain form
1032 1841 12100 4326 -4262 -5982 -1280 6848 297 -14138 -7563 11384 14735 5066 -7141 -10849
1046 -10849 3756 13139 -2689 -16786 -8114 8581 17187 8513 -12072 -14530 4577 10798 -1226
1059 -1226 -10676 -9457 5224 18603 7371 -11989 -9611 3022 5696 -51 -8245 -5757 11234
1072 11234 15115 -1502 -8997 -2575 2695 3233 -4323 -11617 -358 15059 9581 -5604 -11345 -6083
1086 -6083 7047 9431 -8378 -15504 2964 16695 11280 -3125 -14423 -7835 9075 7675 -6364
1099 -6364 -8186 585 8778 11544 -152 -12874 -6152 3647 1585 -1906 -2000 -374 6759 5653 -5452
1114 -5452 -6400 1043 -138 -2750 -1448 618 7280 9996 -1473 -8440 -1820 2577 763 -1904 -5731
1129 -5731 -1740 9848 7415 -3872 -6859 -4990 -1836 3225 593 -4227 1871 7298 2513 -412
1143d12j315k530K760J208k424N575N834o380n462J227J077K813j226q283J411
1158f127J3063K903p443o763m174N506R712m207r904L403Q749N041j864j0989
1172c094p096R285P303o444m881K061N248N775n152j1860K362Q783j234m117l55
1187c416K376Q227L499j2232q566O614P362Q26o490p620O483J5573j881j5806
1201e051o582N806J0192M137j0384r003J0364J1788l475r891p759J737J2781L943
1215H603j1269l944Q612O648j245r037r025O858J1330m076q033J485N902N342
1229H151k303j3518l455J2219N849n824n132m00P431Q242p871j3629J069J0273
1243A102N053k401q098j791J1865N460j1549q537K286O429O156k788r255K660
$$ plain form
1143 -412 -1727 -4257 -1497 -289 -2713 2862 8696 2316 -3146 -1919 -842 1971 745 -7538 -6127
1158 -6127 6936 9839 2396 -4367 -8541 -3035 6677 2470 -7434 -4031 4718 9759 7895 -3094
1172 -3094 -10190 -905 6398 -46 -4927 -2866 2382 8157 3005 -8855 -6493 2290 1056 -3061 -3416
1187 -3416 -1040 7187 10686 -1546 -10112 -3498 3864 4690 -1800 -9420 -2937 12636 10755 -5051
1201 -5051 -11633 -5827 4365 8502 -1882 -10885 -521 11267 7792 -2099 -9858 -8121 4660 8603
1215 8603 -2666 -6610 2002 8650 7405 -1632 -10657 -3799 7531 3455 -4578 -3093 2809 8151
1229 8151 5848 -7670 -11125 1094 6943 1119 -4013 -4413 3018 11260 3389 -10240 -9171 1102
1243 1102 6155 3754 -4344 -6135 5730 11190 -359 -8896 -6610 -181 5975 3187 -6068 -3408
1257c408J0176r84q973m555J022Q190N176p551m443P531N401l452o147o022L888
1272d151J0668r45r081K60N739K818j689q621n636R039Q039m115n244Q62M323
1287B266M811l795j0627L57R458K495k964l078j765N909M961q462q538M067O936
1302B031K512k129o356J066Q552k92r280l153K778O046M650m910o318M939O067
1317F203l409n636l044J812P971K128p769j963N742K092k623m868m229N287P962
1332E656k534n560Q33L043K402j388p420k693Q745M682l242k865j189J942M433
1347D845l388q092J759O357J773k88l194k541M167K019n969k354L004K500K527
1362C125j74m478R17M765l081m794L01K021L639K381m779k664M819J323m154k461
$$ plain form
1257 -3408 6768 5784 -3189 -7744 -6722 1468 6644 -907 -5350 2181 7582 4130 -2017 -8039 -4151
1272 -4151 6517 5572 -3509 -3249 2490 5308 3619 -5002 -10638 -1599 6440 2325 -2919 -2057 2266
1287 2266 7077 3282 -7345 -6988 2470 4965 2001 -1077 -2842 3067 8028 -434 -8972 -4905 2031
1302 2031 4543 2414 -3942 -2876 5676 5384 -3896 -7049 -4271 1775 6425 1515 -4803 136 6203
1317 6203 2794 -2842 -5886 -4074 3897 6025 -1744 -3707 2035 4127 1504 -3364 -7593 -2306 5656
1332 5656 3122 -2438 -1605 1438 3840 2452 -4968 -7661 1084 5766 2524 -341 -1530 412 4845
1347 4845 1457 -6635 -4876 1481 3254 2966 -228 -2769 1398 3417 -2552 -4906 -1902 598 3125
1362 3125 2951 -1527 -610 4155 1074 -3720 -3419 -1398 2241 4622 -157 -2821 1998 3321 -833 -3294
1378c294j157K945N894j033n616P79L095n56j311k844j635N735M116m151j809
1393h42J925L33j69j954l944K503N975j121l449R3J136J735l44o219k081P152
1409G29L792k546k673j480K300M697l446p031J312N647K781j54m392l227M979
1424A288L473n366m741J621L970M168j398o584P47N796p95m327j774Q04N545L638
1440F065m926m559L417L119j348l567l491K106P384J036o801k108K935K822O27
1455B711n280m376N990O796j928m166j833O95M011K74o039j658N363L294k89k920
1471F45l713K075M314l000m164J260L502K423j95m342k146M584O22l888j270J678
1487a615L018L077k375m921J522L440j122k294j721P21M976J905m679k732K092
$$ plain form
1378 -3294 -4451 -1506 4388 3355 -2261 -1482 1613 1057 -254 -3098 -4733 1002 5118 967 -842
1393 -842 1083 1416 1247 -707 -4651 -2148 3827 2706 -743 -650 486 2221 1877 -4342 -6423 729
1409 729 4521 1975 -698 -2178 122 4819 1373 -5658 -4346 1301 4082 3928 -464 -3691 1288
1424 1288 4761 -605 -5346 -3725 245 4413 3015 -3569 -2822 2974 2179 -2148 -3922 -3118 2427 6065
1440 6065 1139 -3420 -3 3116 1768 -1799 -5290 -3184 4200 5236 -1565 -3673 -738 2084 2711
1455 2711 -2569 -6945 -955 5841 3913 -253 -2086 -1391 2620 2894 -3145 -4803 560 3854 3565 645
1471 645 -3068 -993 3321 321 -3843 -2583 919 3342 3147 -1195 -3341 1243 1865 -2023 -3293 -1615
1487 -1615 1403 4480 2105 -2816 -1294 2146 1024 -1270 -2991 -2270 2706 4611 -68 -2800 -708
1502g08J195K57j371l433K046N951n56m289j050J167J531L04l465q72M887K117
1518C711k407j608n96L74K294j427m008J661M760K98j673l047j642L926K468m746
1534a662k967L639L919J622k973m844J217M885n24l769j086J539L426K298m132
1549E88m633K226L383l10k191k310J850N491R1n966j553K867K079m72k825k016
1565c701M597L952k674m195p19K022L063m24n105p97N771K883k600m301k268L366
1581a130M523k383m597J214M359J894j210m559j894L890K644k305k010M76J856
1596G68K765j503m984J0L625K79j053j241J03L096J385l732k374J616J926L97
1612A083q01k260J203M002m19l840j230N92J846J889k021k003K101K402j060j506
$$ plain form
1502 -708 487 744 -627 -4060 -2014 3937 3381 -908 -1958 -791 740 1044 -2421 -3293 1594 3711
1518 3711 1304 -304 -900 -526 1768 341 -3667 -2006 2754 3052 1379 -1668 -3310 616 3084 -1662
1534 -1662 -4629 -990 2929 4551 1578 -3266 -2049 2836 2312 -1457 -2543 -1004 2422 4720 588
1549 588 -4045 -1819 1564 1254 -937 -3247 -1397 4094 4185 -1781 -3334 -467 1612 1140 -1685 -3701
1565 -3701 896 4848 2174 -2021 -2740 -718 2345 1921 -3184 -3981 1790 4673 2073 -2228 -4496 -1130
1581 -1130 3393 1010 -3587 -2373 1986 3880 2670 -1889 -3783 107 2751 446 -1564 -1088 768
1596 768 3533 2030 -2954 -2944 681 960 -93 -1334 -1231 1865 3250 -482 -2856 -1240 686 1083
1612 1083 282 -1978 -775 3227 2808 -1032 -2262 -1670 176 2065 44 -1959 142 2544 1484 -22
1628b2k046m77K755J271j992l79J791J92j41p92j921R90J542r57j20J484k67j18
1646G93j81k019k07J930l6j028M20Q24L84R05j942k373J520J616r48K03J54K16
1664B31J341j70k268j15Q70k82L46L28m77R56R24k122j115N77O13K40j06j054
1682a283J048K568n98k769k90O13J401N78j492j351K422J581j424j634j274K43
1698a661K560K74k116j65J741Q08l19j823j868J870K312j285j044P46J023O66
1714A719p84k583l42K484O67j186l78o9J321J278j800k897P56K385M56o05j319
1731h97l19K873N35k740j321P35J319J235q04j775R24J802n35j628o18RJ771J009
1749A575j724j184J970Q43q59j297j426R83K547j73k452P78J200O26n77j863j204
$$ plain form
1628 -22 -2068 -2545 210 1481 -511 -890 901 1093 952 160 -1761 -771 771 -186 -306 1178 911 793
1646 793 612 -1407 -1614 316 280 -748 -328 496 880 1785 -157 -2530 -1010 606 -342 -139 15 231
1664 231 1572 1402 -866 -981 -111 -393 -47 281 -196 760 1684 -438 -1553 -976 -363 -123 -229 -1283
1682 -1283 -235 2333 1735 -1034 -1324 -711 690 1268 -224 -1575 847 2428 1004 -630 -1904 -1661
1698 -1661 899 1173 -943 -1108 633 1441 1122 -701 -2569 -699 1613 328 -716 30 1053 1719
1714 1719 935 -1648 -1990 494 1161 -25 -403 -472 849 2127 327 -2570 -1814 571 1027 422 -897
1731 -897 -1216 1657 2192 -548 -1869 -1134 185 1420 616 -1159 -235 1567 1032 -596 -1214 -1205 566 1575
1749 1575 -149 -1333 637 1480 621 -676 -2102 -1119 1428 1255 -1197 -419 781 1407 830 -1033 -2237
1766b237K057J695q48q10j95L39J350m62k657j62K165P94m48p19p38J334R91j852
1784d03j352Q70J404M91l85j066p4J844p7j873o96N56Q59J545j246j884J252J410
1802A175p52j047q02J76J931J173j745p81Q77L70n4p57j226Q39J896k03j082k40
1820b52L60K61O0j392n04J800Q46o14o56l95M20Q73m20j788J26J617O29m3r79
1839e1o70R81O43r81r58M81N81P24Q9j246j65J169n16n99j89J67O49J055j039
1858A25n96O52M30p10m61q2N61J371m92j155k75Q70q1m23k55m64R28J241r50l60
1878a26M4L10K7q1j136J09J588J30p36j73k04L71K85p92p25J442N16n04l46m50
1898d51M1Q97k45j354L59J076L93L43j096r18J009P21q80n18o1N41J009m2j191
$$ plain form
1766 -2237 -180 1515 667 -143 -338 1 1351 889 -1768 -1930 235 1029 581 -138 -876 458 1449 -403
1784 -403 -1755 -885 519 1010 625 -441 -515 1329 1252 -621 -1317 -761 98 1643 397 -1487 -235 1175
1802 1175 423 -624 -1426 -1250 681 1854 109 -672 205 575 521 -236 -1462 -623 1273 1070 -12 -252
1820 -252 108 369 429 -963 -1467 333 1179 565 -91 -486 -66 807 387 -1401 -1275 342 971 928 -51
1839 -51 -721 260 903 -78 -1036 -555 26 750 839 -407 -572 597 81 -518 -707 -540 109 1164 125
1858 125 -471 181 611 -99 -560 -642 -81 1290 798 -357 -632 238 157 -266 -521 -985 -57 1184 234 -126
1878 -126 -82 228 255 174 -962 -853 735 865 129 -44 -248 123 408 -384 -1109 333 849 345 -1 -451
1898 -451 -410 487 242 -1112 -753 323 716 1059 -37 -955 54 775 -105 -623 -684 -143 866 824 -367
1917c67l78J078J65l52m14m64O29J321o73j017J39N25Q6j91p04j13J223O10q93
1936B10m56jM08K51l18j098O78J169Q2n43r00l38P64J026j213p29N59J027J23
1955G01l78j149j60J331K75p88r5J21M37Q26p46j159M71L60L2j20k80j82R24J73
1975E94r05k55M11R7J85j5n03K54J007k36q37lk96M72L54n40j67Q00R6l77k84
1996a48l81j0M90k4k40L84M43k81p5j18m41L36K14m69L20N38k34Kk31k38p1O21
2018C87n68l79P38J41J27l28o12k55J014Pm68M4K55K73J53n26l74K50K76k31J81
2039A05j68QK92J30n76j97M24Q9j61q1r6K68O28n32o50L33P5N5M08n22l16R02
2061D18J52n56k41l92K46P99k7r05K48N31J94m6p91m22N16Q09k42l67j40M29L74
$$ plain form
1917 -367 -745 333 498 146 -268 -732 -103 1218 545 -472 -333 192 278 87 -617 -730 493 1103 210
1936 210 -246 -247 161 412 94 -1004 -326 843 925 382 -518 -856 -92 934 -279 -1008 -449 578 701
1955 701 323 -826 -986 345 620 -168 -263 -142 295 1121 375 -784 -313 47 79 -41 -321 -503 421 594
1975 594 -311 -566 -155 -58 127 112 -391 -137 870 634 -203 -206 -502 -30 324 -216 -383 417 513 136 -148
1996 -148 -529 -539 -49 -73 -313 71 514 233 158 40 -401 -65 149 -320 0 538 304 306 75 -163 -234 387
2018 387 -181 -560 178 319 446 118 -494 -749 265 272 -196 -152 103 376 529 3 -371 -121 155 -76 105
2039 105 -63 -55 237 367 -209 -406 18 107 -54 -135 -231 37 665 133 -517 -184 -109 -54 354 -168 -484 418
2061 418 570 14 -227 -619 -373 426 399 -506 -258 273 467 421 -370 -792 -276 533 291 -76 -216 213 587
2082E87l6j122j31Q03K67k19k17j84P2P81l23q97Q6N17K56J1m76k62Q06K27o69
2103a23m84K21K63P08j88r60L47N27j34k52k48k71N31O58k93n94L25p1J56j25
2123gn16k4Q97K88o09J6l5o1L90n94j41L02L68N7j58j66k7L82l58m94J03M64J87
2146B64K2l15O1l74M70j0m90K67J90Q2J27k84k49K47K1j52p2K39j14N07j17p32
2168d12K96N43n66o2J88q7L67J93k71k96L15j44m1q5k39J43N42j84l93P5K2L08
2190B12k21j30l11R09J29l36m04j28J76K64j94k65R4N50J77k35j92l58J10N86
2210D33m98m39M87J69J00k50l35J05K86K57n41j20M54J05K28j71o79L27J17j05
2230g0J06j18QM41L7k86l52P2j32L78P2m90L28K83J13n23J67k71K53K77l19l99
$$ plain form
2082 587 551 -571 -702 101 368 149 -68 -252 -180 601 278 -619 -533 -16 240 251 -225 -487 319 546 -123
2103 -123 -607 -386 -123 585 397 -563 -216 311 177 -75 -323 -594 -63 595 302 -292 33 -38 118 -7
2123 -7 -523 -547 350 638 29 45 10 -51 339 -255 -396 -94 274 331 173 7 -20 362 4 -490 -387 77 264
2146 264 286 -29 32 -342 128 118 -372 -105 85 167 294 10 -239 8 29 -123 -195 44 -70 437 320 -412
2168 -412 -116 427 -139 -201 -13 -100 267 460 189 -107 208 64 23 -62 -301 -158 384 200 -193 -118 -96 212
2190 212 -9 -139 -450 459 588 252 -152 -280 -104 160 -34 -299 -205 345 522 287 95 -263 -153 433
2210 433 -65 -504 -17 152 252 2 -333 -228 58 315 -226 -346 108 213 441 270 -409 -82 35 -70
2230 -70 36 -82 -74 367 404 118 -234 -162 -294 84 156 -334 -6 277 390 -133 34 -237 16 293 -26 -425
2252d25M75L94j86k04n65J91P84j70m35J65J13M7J99l96n19L85M63m10l7k3K11
2273E7N65k80o27j9M16J69m30M29n56M74L94n37l78M14k07N7J43k79k8M56J48
2294C81o67p9K59mK72J62m84J95L32l61j65J20k28M58K17m07j41K87O3j68j17
2315g5j66p3N53p0m40L31J21l6Jk99k02M17J41k88L10K9k40J56p9n56L25J90K4
2338G4N9j21k7J04K11o04K1L84J52o4o3j3Q8K64l56k00k25J75l4O13l66k03O69
2361E38l13o05J42K18k68M86n4k69J7M21k02k13J35k08K52L02m20j20L56pj87
2382Aj63k49L19O35m24m07K88P5N3J77o36l77O99K86l38J53k72R8M12Ln44j70
2404c81J77L81K76m27l11M81K15m09l94J69L9K51N12q35Q1M65Ql60j11k83L94
$$ plain form
2252 -425 50 444 258 54 -511 -320 464 294 -141 24 137 184 383 -13 -532 -147 316 -94 -131 -154 57
2273 57 622 342 -285 -304 112 281 -149 280 -276 198 592 55 -323 91 -116 -59 84 -195 -223 233 381
2294 381 -286 -365 -106 -110 162 324 -160 35 367 6 -159 -39 -267 191 408 1 -140 147 210 42 -75
2315 -75 -241 -314 239 169 -271 60 181 145 146 -153 -355 62 203 -85 225 254 14 170 91 -465 -140 50 74
2338 74 133 12 -15 89 300 -304 -283 101 253 189 126 113 201 465 109 -91 -316 -141 -175 438 72 -131 538
2361 538 225 -380 -238 -20 -288 198 144 -125 -108 313 111 -102 33 -175 77 379 -41 -161 195 188 1
2382 1 -162 -411 -92 543 119 -288 0 75 128 305 -331 -708 -9 277 -61 92 -180 -82 330 333 -211 -381
2404 -381 -204 177 453 26 -285 196 411 2 -392 -223 -184 67 579 -256 -175 290 298 -62 -173 -456 -62
2425f2P11j47q02M3M71M3l93q6l15O12O21q15J1L3j60M13j95o45K71O73M2j31
2447A93l93M1K31L58n21m25L25N03kK45o08m26Q36j85m68M8Q5J69N05l74m19J18
2469a64M39j78j39q6r9N06K05n81j78K14K55k68R9m03Q4N77l17j0k15p7M83J5
2491A62m87R8O49j10j80l00J73l12L76K3l24M10J07j91r6j6m1O5K29l65k15N27
2513A82k17J54N4l10L1K24l80j71N21Nm1L85j91m51M09n3o18L88K7j24N56n3m89
2536a62O2J81k54R7l0J53K79N5m41n7K46k33QJ01m82M44N31m30j04o9m0l8M89
2559C06l09m54N47K10l06l9j86Q7L08m2n85M89L81j70L6j51m17K16N03m77j83
$$ plain form
2425 -62 649 502 -300 -257 214 257 -136 -222 -537 75 696 -119 -108 -75 -235 178 -17 -662 -391 282 324 193
2447 193 -200 -159 72 430 -91 -516 -191 312 310 555 -53 -479 357 172 -296 -248 -163 6 511 137 -282 -164
2469 -164 275 97 -42 -128 -227 279 484 -97 -275 -61 194 -74 25 -378 -294 283 -34 -44 -259 -336 147 162
2491 162 -325 -227 422 312 132 -168 5 -307 69 92 -232 178 285 94 -2 -18 -59 6 235 -130 -345 182
2513 182 -35 119 173 -137 -106 118 -262 -433 88 93 52 437 246 -205 204 151 -467 -79 -52 -176 380 327 -162
2536 -162 -100 81 -173 -76 -106 47 326 381 -60 -117 129 -104 -96 5 -477 -33 498 68 -36 -105 -145 -183 306
2559 306 -3 -457 90 300 -6 -45 -231 -144 164 122 -463 26 407 237 273 122 -295 -79 424 -53 -236
$$ [...]
8191c37
##END NTUPLES=NMR FID
##END=
