##TITLE=1H_ANY-162a
 CDCl3, 8 sc, 
 18.10.2019
##JCAMPDX= 6.0         $$ Bruker NMR JCAMP-DX V2.0
##DATA TYPE= NMR FID
##DATA CLASS= NTUPLES
##ORIGIN= UXNMR, Bruker Analytische Messtechnik GmbH
##OWNER= root
$$ XWIN-NMR		Version 3.5
$$ Fri Oct 18 14:52:17 2019 Russian Standard Time (UT+4h)  she@DPX200
##.OBSERVE FREQUENCY= 200.1315
##.OBSERVE NUCLEUS= ^1H
##.DELAY= (6, 6)
##.ACQUISITION MODE= SIMULTANEOUS
##.ACQUISITION SCHEME= undefined
##.AVERAGES= 8
##.DIGITISER RES= 18
##SPECTROMETER/DATA SYSTEM= spect
##.PULSE SEQUENCE= zg30
##.SOLVENT NAME= CDCl3
##.SHIFT REFERENCE= (INTERNAL, CDCl3, 0, 15.7039)
##AUDIT TRAIL= $$ (NUMBER, WHEN, WHO, WHERE, WHAT)
$$ ##TITLE= Audit trail, XWIN-NMR		Version 3.5
$$ ##JCAMPDX= 5.01
$$ ##ORIGIN= Bruker BioSpin GmbH
$$ ##OWNER= she
$$ F:/spectra/data/she/nmr/H-F/1/audita.txt
$$ ##AUDIT TRAIL=  $$ (NUMBER, WHEN, WHO, WHERE, WHAT)
(   1,<2019-10-18 14:51:11.71 +0400>,<she>,<DPX200>,
      <created by zg, POWCHK disabled, PULCHK disabled
       configuration hash MD5:
       00 E9 B6 7A A2 85 ED C7 34 08 36 98 17 FE 4E 26
       data hash MD5: 16K
       62 31 F1 6F BB 39 C1 26 E7 87 64 61 60 68 A5 92>)
$$ ##END=
$$ 
$$ hash MD5
$$ 78 A7 DA D7 23 FF D9 23 79 2E 3F FB 34 C7 2A CD
##$RELAX= 
##$RELAX= 
##$RELAX= 
##$RELAX= 
##$RELAX= 
##$RELAX= 
$$ Bruker specific parameters
$$ --------------------------
##$DU= <F:/spectra>
##$EXPNO= 1
##$NAME= <H-F>
##$PROCNO= 1
##$TYPE= <nmr>
##$USER= <she>
##$AMP= (0..31)
100 100 100 100 100 100 100 100 100 100 100 100 100 100 100 100 100 100 
100 100 100 100 100 100 100 100 100 100 100 100 100 100 
##$AQSEQ= 0
##$AQ_mod= 1
##$AUNM= <au_zg>
##$AUTOPOS= <>
##$BF1= 200.13
##$BF2= 200.13
##$BF3= 200.13
##$BF4= 200.13
##$BF5= 200.13
##$BF6= 200.13
##$BF7= 200.13
##$BF8= 200.13
##$BYTORDA= 1
##$CFDGTYP= 0
##$CFRGTYP= 5
##$CHEMSTR= <none>
##$CNST= (0..31)
1 1 145 1 1 1 1 1 1 1 1 1 1 1 1 1 1 1 1 1 1 1 1 1 1 1 1 1 1 1 1 1 
##$CPDPRG= <>
##$CPDPRG1= <>
##$CPDPRG2= <>
##$CPDPRG3= <>
##$CPDPRG4= <mlev>
##$CPDPRG5= <mlev>
##$CPDPRG6= <mlev>
##$CPDPRG7= <mlev>
##$CPDPRG8= <mlev>
##$CPDPRGB= <>
##$CPDPRGT= <>
##$D= (0..31)
0 1.2 0 0 0 0 0 0 0 0.06 0 0.03 0 0 0 0 0.0002 0 0 0 0 0 0 0 0 0 0 0 0 
0 0 0 
##$DATE= 1571395871
##$DBL= (0..7)
120 120 120 120 120 120 120 120 
##$DBP= (0..7)
150 150 150 150 150 150 150 150 
##$DBP07= 0
##$DBPNAM0= <>
##$DBPNAM1= <>
##$DBPNAM2= <>
##$DBPNAM3= <>
##$DBPNAM4= <>
##$DBPNAM5= <>
##$DBPNAM6= <>
##$DBPNAM7= <>
##$DBPOAL= (0..7)
0.5 0.5 0.5 0.5 0.5 0.5 0.5 0.5 
##$DBPOFFS= (0..7)
0 0 0 0 0 0 0 0 
##$DE= 6
##$DECBNUC= <off>
##$DECIM= 24
##$DECNUC= <off>
##$DECSTAT= 4
##$DIGMOD= 1
##$DIGTYP= 9
##$DL= (0..7)
0 120 120 120 120 120 120 120 
##$DP= (0..7)
150 150 150 150 150 150 150 150 
##$DP07= 0
##$DPNAME0= <>
##$DPNAME1= <>
##$DPNAME2= <>
##$DPNAME3= <>
##$DPNAME4= <>
##$DPNAME5= <>
##$DPNAME6= <>
##$DPNAME7= <>
##$DPOAL= (0..7)
0.5 0.5 0.5 0.5 0.5 0.5 0.5 0.5 
##$DPOFFS= (0..7)
0 0 0 0 0 0 0 0 
##$DQDMODE= 0
##$DR= 18
##$DS= 0
##$DSLIST= <SSSSSSSSSSSSSSS>
$$ [...]
##$SUBNAM2= <"">
##$SUBNAM3= <"">
##$SUBNAM4= <"">
##$SUBNAM5= <"">
##$SUBNAM6= <"">
##$SUBNAM7= <"">
##$SUBNAM8= <"">
##$SUBNAM9= <"">
##$SW= 24.0689530833862
##$SWIBOX= (0..15)
0 0 2 0 0 0 0 0 0 0 0 0 0 0 0 0 
##$SW_h= 4816.95568400771
##$TD= 16384
##$TD0= 1
##$TE= 0
##$TE2= 300
##$TE3= 300
##$TEG= 300
##$TL= (0..7)
0 120 120 120 120 120 120 120 
##$TP= (0..7)
150 150 150 150 150 150 150 150 
##$TP07= 0
##$TPNAME0= <>
##$TPNAME1= <>
##$TPNAME2= <>
##$TPNAME3= <>
##$TPNAME4= <>
##$TPNAME5= <>
##$TPNAME6= <>
##$TPNAME7= <>
##$TPOAL= (0..7)
0.5 0.5 0.5 0.5 0.5 0.5 0.5 0.5 
##$TPOFFS= (0..7)
0 0 0 0 0 0 0 0 
##$TUNHIN= 0
##$TUNHOUT= 0
##$TUNXOUT= 0
##$USERA1= <user>
##$USERA2= <user>
##$USERA3= <user>
##$USERA4= <user>
##$USERA5= <user>
##$V9= 5
##$VALIST= <valist>
##$VCLIST= <CCCCCCCCCCCCCCC>
##$VD= 0
##$VDLIST= <DDDDDDDDDDDDDDD>
##$VPLIST= <PPPPPPPPPPPPPPP>
##$VTLIST= <TTTTTTTTTTTTTTT>
##$WBST= 1024
##$WBSW= 4
##$XGAIN= (0..3)
0 0 0 0 
##$XL= 0
##$YL= 0
##$YMAX_a= 310595
##$YMIN_a= -424772
##$ZGOPTNS= <>
##$ZL1= 120
##$ZL2= 120
##$ZL3= 120
##$ZL4= 120
##$ABSF1= 10
##$ABSF2= 0
##$ABSG= 5
##$ABSL= 3
##$ALPHA= 0
##$AQORDER= 0
##$ASSFAC= 0
##$ASSFACI= 0
##$ASSFACX= 0
##$ASSWID= 0
##$AUNMP= <proc_1d>
##$AZFE= 0.1
##$AZFW= 0.1
##$BCFW= 1
##$BC_mod= 2
##$BYTORDP= 1
##$COROFFS= 0
##$CY= 11.3945322036743
##$DATMOD= 1
##$DC= 2
##$DFILT= <>
##$DTYPP= 0
##$F1P= 20.1720416913024
##$F2P= 0.152960286110954
##$FCOR= 0.5
##$FTSIZE= 0
##$FT_mod= 4
##$GAMMA= 1
##$GB= 0.15
##$INTBC= 1
##$INTSCL= 1
##$ISEN= 128
##$LB= 0.24
##$LEV0= 0
##$LPBIN= 0
##$MAXI= 10000
##$MC2= 0
##$MEAN= 0
##$ME_mod= 0
##$MI= 1.114404
##$NCOEF= 0
##$NC_proc= 0
##$NLEV= 6
##$NOISF1= 3.799351
##$NOISF2= 2.8
##$NSP= 1
##$NTH_PI= 0
##$NZP= 0
##$OFFSET= 15.70392
##$PC= 1
##$PHC0= -9569.812
##$PHC1= 13.20089
##$PH_mod= 1
##$PKNL= yes
##$PPARMOD= 0
##$PSCAL= 0
##$PSIGN= 0
##$REVERSE= no
##$SF= 200.130013532006
##$SI= 16384
##$SIGF1= 3
##$SIGF2= 2
##$SINO= 400
##$SIOLD= 16384
##$SREGLST= <1H.CDCl3>
##$SSB= 0
##$STSI= 0
##$STSR= 0
##$SW_p= 3612.71676300578
##$SYMM= 0
##$S_DEV= 0
##$TDeff= 0
##$TDoff= 0
##$TI= <>
##$TILT= no
##$TM1= 0
##$TM2= 0
##$TOPLEV= 0
##$USERP1= <user>
##$USERP2= <user>
##$USERP3= <user>
##$USERP4= <user>
##$USERP5= <user>
##$WDW= 1
##$XDIM= 8192
##$YMAX_p= 0
##$YMIN_p= 0
$$ End of Bruker specific parameters
$$ ---------------------------------
##NTUPLES= NMR FID
##VAR_NAME=  TIME,          FID/REAL,        FID/IMAG
##SYMBOL=    X,             R,               I
##VAR_TYPE=  INDEPENDENT,   DEPENDENT,       DEPENDENT
##VAR_FORM=  AFFN,          ASDF,            ASDF
##VAR_DIM=   8192,          8192,            8192
##UNITS=     SECONDS,       ARBITRARY UNITS, ARBITRARY UNITS
##FACTOR=    0.0002076,     1,               1
##FIRST=     0,             0,               0
##LAST=      1.7004516,     0,               0
##MIN=       0,             -424772,         0
##MAX=       1.7004516,     310595,          0
$$ Real data points
##PAGE= N=1
##DATA TABLE= (X++(R..R)), XYDATA
0@%%%%Qj6J6j6K4l2M0n0N8p2R0j13J36j62J94k27K65l11L62m16M79n53O31p16
28c81Q13r19J037j169J314j470J640j832K040k266K516k791L093l424L791m195
44b203M645n152N719o361P097p945Q937j0115J1546j3327J5608j8657K2969k9577
58a6816M1098o6910K23893o4564m55053J55247L22076J68718k06947k71011l6370
69b06639K40236P0844j39375p6570R3330M9282m1117r4975J3107J76220J08579
80A92922j78918j59994J17823J77513j8202j24379q5292N1888J20330l7748j84090
91a28147p201J83258O2692j35638j41020R014J88453J55288j17643k07188L6731
102a01401J74400M7945o1397n6524p074M4490j5232j06596J2793J61946K0372
$$ y = [0, 0, 0, 0, 0, 8, -8, 8, -8, 16, -16, 24, -26, 32, -40, 50, -63, 73, -89, 105, -122, 143, -168, 194, -222, 257, -296, 335, -381, 432, -487, 550, -619, 695, -775, 865, -967, 1073, -1193, 1323, -1468, 1625, -1799, 1992, -2203, 2442, -2710, 3009, -3352, 3745, -4200, 4737, -5378, 6168, -7159, 8449, -10208, 12761, -16816, 24282, -42628, 181265, 116701, -338352, -183105, 138971, 307689, 100742, -170269, -206639, 33597, 104441, -34934, -111504, -18174, 31108, -10009, -104984, -91877, 84343, 192922, 14004, -145990, -28167, 149346, 131144, 6765, -78527, -26639, 93691, 55943, -128147, -135348, 47910, 110602, -25036, -166056, -157042, 31411, 186699, 69056, -138132, -101401, 72999, 120944, 59547, 3023, -4051, 40439, 25207, -81389, -68596, 93350, 113722]
113A13722j86821j38946O2516K04847J43362j37540k68906J877K60685J48642
123B03438q1365j55931p9348Q4319J41582j4189j09364j4105K3255l1568q955
134d2231K3972R025J5711k1666p6290K0653J18140Q664q5599j991O4478L5574
146F8440j4734p6480l7111J16478R5835j19530j62332J2405J30961J01659m2829
157G2762j80989p7261J53469J39413n0457r0200j3650L2468N1204O741l8528L5542
169D0514O3157q0919j21827M1825J29101M3033q3807j50575m4131J61363J38348
180A36082r1727j43689N748R2033O6405r883p2050l251Q7039m053r7211M192R0109
193E9744J5212o4658p2289j5790Q9250O6623r6126r6381P6102J01147k9513q4878
$$ y = [113722, -73099, -212045, -149529, 55318, 198680, 61140, -207766, -205889, 54796, 203438, 122073, -33858, -113206, -28887, 112695, 98506, -10858, -24963, -1708, -33276, -42231, -18259, -9234, 6477, -15189, -91479, -70826, 47314, 55978, -29621, -31612, 32866, 68440, 53706, -22774, -59885, 56593, 152428, 32898, -129434, -117029, 13932, 115591, 72762, -108227, -185488, -32019, 107394, 56937, -33263, -46913, -14445, 36759, 43500, 4972, 40514, 103671, 22752, -99075, -57250, 71851, 114884, 31077, -119498, -163629, -2266, 136082, 44355, -99334, -93586, -1553, 64852, 54969, -17081, -20332, 66707, 62654, -34557, -30365, 59744, 74956, 10298, -61991, -77781, 11469, 78092, -18034, -114415, -38313, 62834, 33321, -51557]
205e1557k5269Q4537J21859l7643j79401k8609J72132J01675q3792j42242n7155
216a25465R7326J34001m1865j46531j0493Q9987J9054l2858j0277K2487M7491
227D2857j0007r3556k226J38381N3077j10955r6736J6990R1339P2246o4547j36074
239i9211O502J19663J9420p6190l3504K9331N7414K1191p0531m3903R1161P4194
251I5537o5396p2515J6428M9871L4341k8119q1146r63Q6071o18q8144j4924O2136
264g441M4347j1841p3114m1500R6113J03944n8404j07343N743P2399N0923j3587
276F0239q3365l9646P2507M1238o4861l7194L7193K5901r187l4566l0149N3890
288h000Q3449l9004r5375J6991Q3741L3080k8112o6478l1239P1709N7690o8486
$$ y = [-51557, -76826, 7711, 129570, 91927, -87474, -116083, 56049, 157724, 73932, -68310, -125465, -28139, 105862, 63997, -82534, -93027, -3040, 16014, -16844, -27121, -4634, 42857, 32850, -60706, -62932, 75449, 128526, 17571, -79165, -62175, 29164, 101410, 36863, -99211, -92709, 26954, 46374, -29816, -63320, -33989, 23425, 44616, -25915, -69818, 21343, 95537, 30141, -42374, -25946, 23925, 58266, 30147, -50999, -51962, 34109, 33491, -54653, -69577, -7441, 36906, 25065, -48049, -89549, 6564, 110508, 52104, -55239, -49496, 22903, 73826, 60239, -23126, -62772, 9735, 50973, -13888, -51082, -13889, 12012, 2825, -31741, -61890, -8000, 75449, 36445, -58930, -41939, 41802, 74882, 46770, -19708, -50947, 20762, 78452, 9966]
300I966p1481L1214M8125P08l2167m3863J7411Q1376L225q3984q154P2380L0660
313E5416k3758l6687j8866M7738M9607n7911p2461M0845O2204k1101n8077l3991
325f7042K8601Q1294N651j02822l1616R6364O2876l7759n8674j7328N5385P0895
337H5825l8938r7147J4202Q2534K153o2147m2929J2196O4887K4808q3355n4668
349i2579P7096P1988l3505n5181o738M5017O0726j7235q3283j02Q1458Q628o4939
362h649l2396J6468M0103J5668o2069n2366O2942O8072m3510o0806J5551N3845
374A2853L9629k0952o9723M240R2424J9620q1272m1192L4002M4677Q257n9666
386a7103o4557M5396Q3221k8609p8510J487N5102M0251o711n8139j9166P6971
$$ y = [9966, -61515, -30301, 17824, 18532, -13635, -57498, -40087, 41289, 44514, -39470, -47624, 24756, 55416, 31658, -5029, -23895, 23843, 73450, 15539, -56922, -16077, 46127, 25026, -33051, -67042, -38441, 42853, 48504, -54318, -85934, 10430, 73306, 35547, -23127, -40455, 14930, 85825, 46887, -50260, -36058, 46476, 48629, -13518, -56447, -44251, 20636, 45444, -37911, -92579, -15483, 56505, 23000, -32181, -38919, 6098, 66824, 49589, -33694, -33796, 47662, 56290, -8649, -41045, -24577, 15526, 31194, -30875, -83241, -20299, 47773, 4263, -56543, -40992, 12853, 52482, 31530, -38193, -33953, 58471, 78091, -3181, -44373, -10371, 34306, 42563, -17103, -81660, -36264, 46957, 18348, -60162, -58675, -3573, 36678, 29967, -28172, -47338, 29633]
398B9633M6526n7611m7526K5717L5462J0158l0024n5497P794O4283p991o6097
410d5173n296M3049J9234o073k7189j3924M9770M2176m4351l9911L8202L7898
422D8412r286k8851l2159Q681N3763o814p6094j4384N6585K1867k6315l3729j0190
435d8514M8229N3062l7455n9957L1422O2034K882l3787l4098O26N5425J9777p0717
448a1071m4703M5312L7206k0430l5354k2119K5042N6129r379o2190O893O0865
460B6201J4769k3789k1411n648L4015L1788m2351m6630L1157L1493k7992l1237
472b9635k995J6588K9303j3306n5340J0739P3067J2285n0179k2613K0764M5234
484C3912K8614m5275n9079L3519N9619k0720n2869j2577K1004K9869o446n7763
$$ y = [29633, 76159, 18548, -28978, -3261, 32201, 42359, 12335, -43162, -35368, 28915, 20924, -45173, -50469, -7420, 11814, 5741, -21448, -35372, 14398, 56574, 12223, -27688, 10514, 48412, 39126, 10275, -21884, -13203, 40560, 33746, -42348, -56732, -147, 21720, -4595, -38324, -48514, -285, 52777, 15322, -44635, -13213, 48821, 51703, 17916, -16182, -15556, 39869, 59646, -11071, -55774, -10462, 26744, 6314, -29040, -51159, -26117, 30012, 20633, -41557, -34664, 26201, 40970, 17181, -4230, -9878, 24137, 55925, 13574, -33056, -1899, 29594, 1602, -29635, -32630, -16042, 13261, -45, -55385, -44646, 28421, 40706, -9473, -32086, -11322, 33912, 62526, 17251, -41828, -8309, 51310, 30590, -22279, -34856, -13852, 16017, 9571, -48192]
496d8192j2429O8811L0429n0894l3567K3548M5041L0369l0235n9293J8678P0501
508E2767l586n8562j8629K2370K6789k39m9800l2189N0973M3683l9044m1372J5288
521c1551L3634K5835n570l9352j7N0414L531m2238J281L1203K62k4614l2404o391
535c5977N1940L2596o3363o1387L4299O4600J8154l0096n1124k402O9881L4093
547F1214m9193l0467K6117J9336m705j9271k0891J9671L4263l3456n6390J7974
559c5798M9847N943k5243k8954k114M9946L2201m1833l1122L7199L0382j5278
571B5176k6967j5801K0988M4391j7173p0280q853N2049K2081j8250k8416j9872
583d0927K1604L7982j0838k0682K5739J4776l1562j6890K2884L3910J9120m0093
$$ y = [-48192, -60621, 8190, 38619, -12275, -45842, -22294, 22747, 53116, 22881, -36412, -17734, 52767, 49181, -9381, -28010, -5640, 21149, 20910, -28890, -61079, -10106, 33577, -5467, -46839, -31551, 2083, 27918, 22348, -17004, -17021, 33393, 36924, -5314, -4033, 27170, 27432, 2818, -29586, -35977, 15963, 48559, -14804, -76191, -41892, 22708, 40862, 10766, -40358, -42760, 27121, 61214, 12021, -18446, 7671, 27007, 22302, 3031, -17860, 1811, 36074, 2618, -53772, -35798, 14049, 19992, -5251, -34205, -36319, 13627, 45828, 3995, -27127, 10072, 40454, 25176, -1791, -17592, 3396, 47787, 30614, -39666, -48519, 3530, 25611, 7361, -21055, -40927, -19323, 18659, 7821, -12861, 12878, 27654, -3908, -20798, 2086, 35996, 55116, 15023]
595A5023p4336O512Q6894L0870o0424o1720o589N1525N7820k0542o5910J944N0937
608A2004J0336j8041o197O887K0863L115m3846j8680N1083K8150m3060l9770L409
621c3747K6807K5696j5640m4201J3076N2896o160m6461k366L9853L7449m063o2401
634a9262m0554N9480O9883k5533o7233k4256J9290M0228J6789l5406k4090K1480
646i184K347k3212J9611M3773N717l3334m5040m773P3804O2477n4943r2504m115
659e9376O4687M8447j4020o7654l6220N0499M5234k8646l1975J6906K4525N311
671A7718j8433k5394K3010N3625r198n8224r030L3879J6746q550k3455j4851K4110
684A953J4322m0924k0770M8485L9012k3156m9083k4717M0944P9137O163q1784
$$ y = [15023, -59313, -52801, 34093, 64963, 4539, -57181, -63770, -12245, 45575, 25033, -40877, -38933, 12004, 22340, 4299, -1898, 4989, 25852, 28967, -14879, -33559, 17524, 45674, 2614, -37156, -33747, -6940, 18756, 3116, -41085, -28009, 24887, 18727, -27734, -30100, 9753, 47202, 43139, -19262, -59816, -336, 69547, 44014, -23219, -47475, -28185, 12043, 28832, -6574, -30664, -9184, -6837, -30049, -10438, 33335, 39052, 5718, -39322, -44095, 29709, 92186, 37243, -55261, -59376, 5311, 53758, 39738, -27916, -64136, -13637, 31597, 2951, -29024, -12118, 12407, 17718, -715, -26109, -3099, 50526, 41328, -16896, -25926, 7953, 24699, 16149, -7306, -22157, 1953, 16275, -24649, -45419, 3066, 42078, 18922, -30161, -54878, -13934, 65203, 71366, -10418]
696a0418m4235L9077M8674J4637k2350m4258j2552K3389K992m126K5909N363m4530
709b2428l0034K1025M9715M2614k4574q0325j6618P6969N2906k8721n3569k5019
721c8059K6479M6731j1002n3894p79M0742J905l0375j6433J1308L8262K1212l9204
734c107l6579L0866L8059o934j4046k322j633K148j0992j8213K5130M0612k9985
747A3004o7347q140N2149N3257J331o6443n4140M4138P7305O393m1053k6241j881
760a7668K1218J8582j0214m640J5124k1836m7382Q174N3753K4688k7235n6731
772d4167k6379N7698P2565k0603o9587j0060M4803L7027n527m4532j8483M6803
784A9558K8509m7312m2729K1067L9067J1335k9429m7509L048N5095J7199l1849
$$ y = [-10418, -54653, -15576, 33098, 47735, 25385, -18873, -31425, -8036, -5044, -9170, 16739, 22102, -22428, -52462, -31437, 18278, 60892, 36318, -44007, -60625, 16344, 69250, 40529, -13040, -38059, -11580, 35151, 24149, -29745, -30524, 10218, 12123, -18252, -34685, -23377, 14885, 36097, -3107, -39686, -8820, 29239, 22305, 8259, 5937, 4304, 6452, -4540, -22753, 2377, 42989, 13004, -54343, -62483, -10334, 42923, 44254, -22189, -76329, -32191, 45114, 51507, 10454, -15787, -17668, 3550, 22132, 11918, 7278, 22402, 566, -46816, -38642, 15111, 39799, 12564, -44167, -70546, -12848, 59717, 39114, -30473, -40533, 4270, 41297, 35770, -8762, -27245, 19558, 48067, 755, -41974, -20907, 18160, 29495, 66, -47443, -44395, 10700, 27899, -3950]
796c950r085J4917P73l241L537J2467K6452o391o1396k6418N9915N5494k2604
809D0470o6997m4329K9526P7853J6298o7041m0427L1135L7241P278j1628j2908
821c529J2911J8712k5613k8173L5138M2710k1929n2037k3282K4929N2304N870
833C8011o2972l5798M4294M2447j2496l0011r300K7782L7487j7283n1040R105
845a9774N5342J1169l6615l3642m714L1316K8515k4720l7041Q916J7119j0948
857a5077j448J8642J1734l247k5164k3363L5503O3347j0134o8704k8620L4303
869a2228N0610J4263n1534n5864K1193N3726j936l5558j0453J2594J8872Q60k6286
882b1741R74M6024J3775m2579k2889K4349L1058P458k9368l8106J3595M1696q285
$$ y = [-3950, -13035, 1882, 2655, -586, 2951, 15418, 41870, 35479, -25917, -52335, 7580, 63074, 40470, -26527, -70856, -41330, 36523, 52821, -14220, -54647, -23512, 13729, 21007, 9379, -3529, 9382, 28094, 2481, -25692, 9446, 52156, 30227, -21810, -45092, -20163, 32141, 38011, -24961, -60759, -16465, 25982, 13486, -16525, -25825, 1957, 39444, 22161, -28879, -19774, 35568, 46737, 10122, -23520, -28234, 3082, 31597, 6877, -30164, -21248, -4129, -15077, -16525, 2117, 13851, 10604, -14560, -37923, -2420, 60927, 50793, -17911, -46531, -12228, 38382, 52645, 1111, -54753, -33560, 20166, 18230, -17328, -27781, -15187, 3685, 4545, -21741, -20767, 25257, 39032, -3547, -26436, -2087, 28971, 36429, 7061, -31045, -17450, 24246, 15961]
895A5961m0106k364K4186J2081j0470k8317l850M5532K7739l7495l3415K0627
907i891L2798J0497j5192k9484p29K8881j612l0955L406K4228m997k4497j6226
920c3773J1836M2377J6870n0010l9554L7892N4630L315l6348l3869R573M9255
932C2194J3008m7347k5562K6218J9323j2343k1506j0329K1357K7419k1644l8029
944c7241J7343M1366K302k2949j4675P640K9425R002l5265j6937L2386J6493k6764
957B126k4312K141K3235K1070k3157m2946J2420M8208N101l0417j4618J1626K6683
970A7160J1930k7755k0215K9455K3218k7635k7772Q086K3767J3272k2413m1550
982d0452O609N1859J0564m1585k1786J8077L1215J4800k6161k9655K2806L7441
$$ y = [15961, -24145, -26509, -2323, 9758, -712, -29029, -32879, 12653, 40392, 2897, -30518, -9891, 22907, 33404, 18212, -11272, -12001, 16880, 15268, -15687, -12281, 11947, 6950, -17547, -33773, -21937, 20440, 37310, -12700, -52254, -14362, 40268, 43583, 7235, -26634, -17061, 32194, 45202, -2145, -27707, -1489, 17834, 5491, -16015, -26344, -4987, 22432, 788, -37241, -19898, 21468, 23770, 821, -13854, -6214, 23211, 32213, -3052, -19989, 12397, 28890, 2126, -22186, -20045, 3190, 24260, 1103, -41843, -29423, 18785, 23886, -6531, -21149, -9523, 17160, 29090, 1335, -18880, 10575, 33793, 6158, -21614, -13528, 10239, 23511, 1098, -40452, -33843, 18016, 28580, -13005, -34791, -16714, 14501, 29301, 3140, -26515, -3709, 33732]
994C3732j3437l2492m66J8610J2311r220l1726o703L6899J3840l3993j8630J9922
1007a1353K1044L810j7339j8969J9558L4784j3428l5111N274K7825Q015j5029
1019I081k7030o956L3906J7918l5822k7024K2063K5676p59j8138j7261J4401L6305
1032B6360m403l8728o94L4265J1655j7113k3686o715K8244K2742l1590l5483J8202
1045a6944L2311j743k1875j7328R908L4400N475l7495r785L4188J7560j6406j9136
1058f870m969J9891K1867k1313l6072J1992L2584l881k4336j1535Q791K5481P241
1071A8871l1421j3791L3312K0884j9274j8537K216J7019J7821j4871l3707P108
1083a4370L4921k691l0556j0969J2702K0771N417k8380j8685L1463K8743j9124
$$ y = [33732, 20295, -12197, -12663, 5947, 18258, 9038, -22688, -29391, 7508, 21348, -12645, -31275, -11353, 9691, 13501, -3838, -22807, -3249, 31535, 18107, -17004, -11730, 16095, 24110, 9081, -17949, -24905, 9001, 26919, -8903, -35927, -13864, 11812, 11053, -7085, -24346, -9945, 26360, 21957, -16771, -17465, 16800, 28455, 11342, -12344, -19059, 9185, 31927, 337, -35146, -16944, 15367, 13624, -8251, -25579, -15671, 18729, 24204, -13291, -23076, 11112, 28672, 12266, -6870, -11839, 8052, 29919, 8606, -27466, -15474, 17110, 13229, -11107, -22642, -13851, 11630, 18871, -12550, -26341, 6971, 27855, 8581, -9956, -7740, 9279, 27100, 12229, -21478, -14370, 20551, 17860, -12696, -23665, -10963, 9808, 15225, -13155, -31840, -377, 28366, 9242]
1095I242k5255M836K0209J7354j0458l3250j053L7639O920l3544j6903J3344J9174
1108H255N700k2993k4037K1881L3845j2593k8806L675K0613J4339m098k5015p224
1121a6458L0507J2969k9229j7146J4657J3185r49j5561j7709J4070K9098j1164
1133F270l0043O090K5942Q236r402j7687l485K8403J6080k8816k2703J9166J9675
1146A7726n709j8884j7274J0412L0699m404l6345l389L0152J3485r608j6935o293
1159a6367K2733K3317j9384k7816J3923K3487l521j8125j4010M379K5006L217
1171A6839l3888j2492K7083J6431r922j3014n498J2459K1939p308k2696R334K1161
1184B0428p718j6865j677P925J3239k789l0480j0212L2471J6872k2738k0497K892
$$ y = [9242, -16013, -11177, 9032, 26386, 15928, -17322, -18375, 19264, 26184, -7360, -24263, -10919, 8255, 13955, -9038, -33075, -11194, 22651, 10058, -18748, -15073, 5540, 19879, 15781, -9234, -16458, 14049, 27018, -2211, -19357, -4700, 8485, 7536, -8025, -25734, -11664, 17434, 6270, -23773, -17683, 8259, 16495, 7093, -10594, -14079, 14324, 30404, 1588, -21115, -1949, 17726, 12017, -6867, -24141, -13729, 16970, 12566, -23779, -27168, 2984, 16469, 6861, -10074, -16367, 6366, 29683, 10299, -17517, -3594, 19893, 16372, -1753, -15763, -11384, 13622, 16839, -17049, -29541, -2458, 13973, 4051, -8963, -14461, -2002, 19937, 12629, -10067, -733, 20428, 12710, -4155, -5832, 2093, 15332, 12543, -17937, -28149, 4322, 21194, -1544, -22041, -19149]
1197a9149J9984K0166j0455k9568P271L3835K568k4918j0231R473J7780N874k6922
1210d292k4111K1641K6863j3292k3514k657J1444J5483J134k0683k503K6686N325
1223A7524k1360m925J4070J2741J456k0044k2390J6556K9830j0195k9225n436
1235b1398J0565J2452N223j4185r372J7082Q767j6430j827J9680P939q349j5155
1248e008j0649J8304K8380j4346l8796k662K5006J3258p557k2069j1505K4131
1260c513K1851j9281k0355J4545K0840K687j1619j8555K888L0668P024k9130j4393
1273a6343J2324P892l09m952j0137L650R794j1485j0367K0829J7808j1283j7346
1286i925n900J2841K8938N680l4179j9984K0072J8320k490j0222j3626k340J2648
$$ y = [-19149, 835, 21001, 10546, -19022, -11751, 22084, 24652, -266, -10497, -1024, 16756, 22630, -4292, -28403, -6762, 20101, 6809, -16705, -19362, -7918, 7565, 8699, -11984, -14487, 12199, 17524, -3836, -8761, 5309, 18050, 19506, -538, -22928, -6372, 23458, 13263, -15962, -21398, -10833, 1619, 6842, -7343, -16715, 367, 9134, -7296, -9123, 10557, 18496, 10147, -5008, -15657, 2647, 31027, 16681, -22115, -24777, 229, 13487, 5930, -16139, -27644, -3513, 18338, -943, -21298, -6753, 14087, 16774, 5155, -13400, -10512, 20156, 27180, -1950, -16343, -4019, 3873, 3564, -1388, -11525, -7875, 1919, -9566, -19933, 896, 18704, 7421, -9925, -15825, -2984, 25954, 31634, -2545, -22529, -2457, 15863, 13373, 3151, -10475, -12815, -167]
1299a67j194j2199J0240J4977j1412j6099L007J5333J9071J707k9625j5874K7295
1312E060K2780j2748j9597o668P296J5829m464k6228N17K7138L267k0413j1025
1325a9256O147K0366J7434j4700k6615P059K2524J616n880k272n992k634L71n628
1339g460O483J8068j0493l2484l516K6137K2028J937k5379k7081J6727L8813L121
1352B6901k3735j1179K674Q972Q267q576r665J1382K594k1949p243J8366J3572
1365A0381k510j5283j7677J1375L1873J258k5882n132J4983Q259j479j2214q524
1378a0572J7982J5291k3156k6106J0343K3325Q286j0450k6268q535K7876K1635
1390A9651j1437j2247P8j202L752R025J918K602p88k1754j4609K3717K7236r085
$$ y = [-167, -1361, -13560, -3320, 11657, 245, -15854, -12847, 2486, 21557, 23264, -6361, -22235, 5060, 27840, 15092, -4505, -11173, -3877, 11952, 7488, -18740, -18223, 8915, 12182, -8231, -19256, -13109, 7257, 24691, 9991, -16624, -9565, 12959, 14575, 8695, 6423, 431, -2203, -1832, -7460, -977, 17091, 6598, -25886, -29402, -3265, 18763, 20700, -4679, -31760, -15033, 23780, 26901, 3166, -8013, -5339, 3633, 11900, 3324, -6341, 5041, 7635, -14314, -21557, -3191, 10381, 7871, -7412, -25089, -13714, 18159, 19417, -6465, -11597, 3386, 11645, 10166, -2048, -10572, 7410, 22701, -455, -26561, -16218, 7107, 15393, 4943, -21325, -29860, -1984, 19651, 8214, -4033, -3955, -5157, -1405, 7620, 9538, 12140, 11352, -10402, -25011, -1294, 25942, 16857]
1404A6857k7105k0160O362L4001J7897k6884k4801J0898J8694N545k685q770j312
1417a463J2448l525j8513O280K0507k760j6416j1262k13J6140J4031j5090j8585
1430a8421J1193J4644n700n749K307P100J1147o252k5144Q89L0629J0623j9980
1443G286k1185p534J4516K5716j981k7051p922J0161M475O518P881m499p121l797
1457d537o154R945K6337q81l1844j5495J3394K0863J1387j6258k9793J064K7159
1470E187N625j4348m533L549O282M736r825p223J8333J3841j6934j6156M557J0995
1484D086P999k619j7765n805J5337K270j2951J340J1454L94o056r684k775K2091
1498G316K0311j8170k7334K924J9224J3604l82k0541j7021J2452J4475n742l640
$$ y = [16857, -10248, -30408, -24046, 9955, 27852, 968, -23833, -12935, 5759, 11304, 8619, -151, -1463, 10985, 7460, -11053, -4773, 15734, 12974, -3442, -14704, -14917, 1223, 15254, 164, -18421, -7228, 7416, 1716, -4033, -1726, 5374, 16521, 10269, -14875, -13986, 16643, 27266, 7286, -13899, -21433, -6917, 18799, 16818, -10233, -18155, -7994, -3519, 2999, 10880, 6381, -740, -4537, -10691, -746, 25591, 24710, -7134, -22629, -9235, 11628, 23015, 6757, -23036, -21972, 5187, 10812, -3536, -8069, -4520, 1762, 6498, -3327, -10550, 7783, 21624, 4690, -11466, -6909, 4086, 12085, 9466, -8299, -14104, 1233, 3503, -9448, -8108, 3346, 3740, -2316, -12000, -14775, 7316, 27627, 9457, -17877, -14953, 4271, 17875, 17493, -3048, -20069, -7617, 6858, 1116, -2524]
1511b524L508n966o392J684M969J3146R739j8444k3064J3816K7231L916j4485
1524G134j8283m809K0339J5380j7885j8838J0449J1346l271p800o827O467J9359
1537A2761j281k3754k645K0011R723m486q611r104N562J3417o410j2102Q193O751
1551H025j1593r096K836R624J3405m548k5464m670K6706J5752r944j4054o802
1564i823P033J7491r35j6910M4R487o669q325M893N923M358m436j7925l000K5168
1579F374J3465j7019j4864L437J2814J3320n476k0465K46K0232J49j6665m936
1592i388O209Q790K793j4951j4688J4823J9473p081j3729k11N670Q789L726j0560
1606c35l523J3332k19j5185p47J2251L188m778j2774j0600J4139K0019r305k0906
$$ y = [-2524, 984, -4982, -11374, -9690, -4721, 8425, 18164, -280, -23344, -9528, 17703, 21619, 7134, -11149, -15958, 4381, 19761, 1876, -16962, -6513, 4833, 1562, -6238, -13065, -6598, 12761, 11480, -12274, -14919, 5092, 14815, 10329, 1718, -7386, -1824, 11593, 5183, -6919, 1274, 8025, -3568, -12664, -9828, -204, 13201, 8653, -16811, -21481, 5225, 20977, 11033, -3021, -9823, -2790, 14701, 13766, -3144, -3100, 6387, -282, -8607, -3714, 2209, 6567, 2131, -15794, -18794, 6374, 19839, 2820, -12044, -8607, 4207, 17527, 12051, -8414, -8168, 12064, 12213, -4452, -9388, -3179, 5611, 8404, -6547, -21235, -6412, 13061, 5980, -7749, -7960, -2290, 6499, 10225, -335, -3858, 9474, 9255, -5930, -6677, 5574, 8762, 3984, -8790, -19390, -5251, 14768, 5463, -15443]
1620a5443J274J2666Q348J203j0527o336J4228P777j4127n612J1469N217o334
1633C803r327q201R452J7314q132k2112R45J7824O204n199r954m322J5675J2416
1647A6386j3809j3438J1317J2353l179r527r246K230J6434J239k0848n976J4358
1660a706O024m314n212l765P333J1540p787j1804J1038J3029o203j0332k792M805
1674a46J2109K39k0460p825J7067Q414j0388p856j193P849J0833n970j4570P790
1688d107J7316k971j2538j975O123R863K278j7417j0529J5959J1866j2156j2071
1701a0359J13P703R612l646j6363J598K0061K461j3552l579O641P763M445j0676
1715B222j2520J0216J4048r693j2857J640O468M015k294j2333q51J7042M057j5696
$$ y = [-15443, -14169, -1503, 6845, 8048, -2479, -8815, 5413, 13190, -937, -6549, 4920, 10137, 3803, -5524, -13725, -4273, 13041, 4909, -17203, -16258, 1566, 7770, 2571, -7383, -11705, 3970, 16386, 2577, -10861, 456, 12809, 9630, 103, -9143, -6913, 9521, 10760, -10088, -16064, -1706, 4318, 4, -5208, -8973, -1640, 9900, 2113, -9691, 1347, 14376, 8173, -2159, -4951, -146, 11963, 12202, -8258, -16083, 984, 9398, -990, -8846, -10039, -2190, 8643, 2673, -11897, -4107, 13209, 10238, -2300, -4275, 1848, 11711, 13989, -3428, -13957, 2002, 13868, 1712, -10359, -10246, -2543, 7069, 3423, -12940, -11342, 8719, 11180, -2372, -5951, 690, 8453, 12898, 2222, -10298, -82, 13966, 4273, -8584, -6944, -476, 3539, 1245, -11088, -11939, 5103, 9160, -6536]
1729f536l074J0912P177L91q275r027R804J5108r436j6875L068J0577K385n293
1743I06j1635k443J5822P047j6479q263J2464R836r23p026q247O523J7949l916
1757A1615j9171n18J3361L236n641r493n755J1409J0821j2523j2774R711J0931
1770E209j946n476m767L043J4358O06j6330j849J4322L208q532o564j680P608
1784A210Q550j1470j3959R197J4047m732r557k371N640J2292J221j5803m433J7670
1798G502P438j1039r235P53P986Q666q740j7292M895J7501j751j2653m349M897
1812e421R931N419j2630q781J3804J1721r019q999J507O118O388l750j5064Q8
1826h688J6218N65j3908l870N547O601L564q418q714J0441J2750q418j0032N117
$$ y = [-6536, -9610, 1302, 8479, 8870, 595, -8432, 1372, 16480, 7044, -9831, -6763, 3814, 6199, 906, -10729, -13172, 2650, 9697, -6782, -15045, -2581, 7255, 6332, -694, -8941, -2418, 15531, 11615, -7556, -8074, 5287, 8523, 2882, -6611, -12366, -957, 9864, -2659, -15433, -5722, 5209, 3263, -2213, -6980, -3937, 10421, 11027, -5303, -7152, 7170, 10378, 1846, -4718, -6398, 1210, 9760, -1710, -15669, -6472, 7575, 2843, -6714, -9085, -3445, 8847, 10068, -5735, -10168, 7502, 14940, 3901, -5334, -4581, 3405, 12071, 3331, -13961, -9066, 8435, 6684, -5969, -10318, -5421, 4510, 9929, -2701, -11482, 2322, 14043, 5024, -3975, -2468, 3650, 10038, 6288, -8776, -8688, 7530, 8095, -5813, -9683, -4136, 2465, 6029, -2389, -11103, -662, 12088, 3670, -6362, -1245]
1840a245P298L132l887j1596r26J6040K283j6880o117R369O809J20q294q392Q895
1855c391J4892p243j4296M372J2227L297n009j0655l106J5478Q082j5365j1449
1868a2166P851P699L76n344p902K670J2614j662j3246K621J2323R51n865n664
1882d744q82J1500Q467j3331j2998Q313J0748k415o722o054Q30J0995R21j3205
1896h577m49J3288K270p868m265J609Q706P982j0036j3637P834J3211m022r705
1910c659k902K788Q140M28j3508l367J5840O586j1208q206K242J0593J0603o613
1924G757j7846J758J6333K748r014m663j009L963M512p277n639J0375N500j1281
1938c783o968P305Q852N086n948j4223K008J8313K707j2870n672L831M453K516
$$ y = [-1245, 6053, 9185, 5298, -6298, -7224, 8816, 11099, -5781, -11898, -2529, 4280, 4400, -3894, -12286, -3391, 11501, 4258, -10038, -5666, 6561, 9858, 4849, -5806, -8912, 6566, 14648, -717, -12166, -4315, 3384, 3760, -1584, -9486, -6816, 5798, 4136, -9110, -6489, 5834, 6785, 920, -4744, -5626, 5874, 14341, 1010, -11988, -3675, 7073, 4658, -2064, -8118, -7288, 3707, 4628, -8577, -9026, 4262, 6532, -1336, -5601, -3992, 4714, 12696, 2660, -10977, -3143, 10068, 6046, -3659, -6561, -3773, 4367, 4795, -8713, -12080, 3760, 10346, -862, -9068, -6826, 3767, 14370, 7757, -10089, -8331, 8002, 10750, 1736, -2927, -3936, 27, 4539, -2738, -8377, 1998, 7498, -3783, -10751, -3446, 5406, 10492, 4544, -9679, -7671, 10642, 13349, 479, -5193, -1362, 3091, 5607]
1952E607o357q096Q141R186r821j0399O203R818L327m267j0968p92J5641N878
1966A3101j2409o042O724M054j240n496o143P412J0734r080j6445L532J4807O332
1980I841m713j3979o268J4883J5002p277j1849R89L739K683J420l514j454M715
1994D218m727j1272N450J2711k46r324p370k70J2668J0787r711j2203N970R653
2008F334j275l853k897J195P517j442j4366j303J4280M243q815q401k785Q488
2022c080J1434m110j1994K876Q872j310l371J351K612M352j907j3843k444J6213
2036E651Q429j1554j2764l251P983J4308N70j5282n444R025M661L38K036j167
2050C539k249L0l828j42J1492L923j4137r467M963Q067N057l620j2850j222J2966
$$ y = [5607, -750, -8846, -705, 8481, -1340, -11739, -5536, 4282, 7609, 3342, -7626, -8418, 7223, 13101, 692, -5350, 1374, 5428, 4188, -1308, -7451, -39, 10695, 1615, -14830, -11298, 3509, 9841, 5128, -8851, -15119, -236, 14766, 7489, -4360, -3371, 368, 3051, 4471, 957, -497, 4218, -509, -11781, -6331, 6380, 6134, -3190, -10560, -10830, 1838, 12625, 2914, -9289, -3319, 6334, 5059, 1206, -1691, -496, 7021, 5579, -8787, -10090, 4190, 8433, -382, -8783, -11568, -3080, 8354, 4244, -7750, -4874, 3998, 2688, -683, 668, 3280, 7632, 5725, -8118, -10562, 5651, 14080, 2526, -10238, -13489, -5506, 8802, 9372, -5910, -11354, -2329, 2332, 2670, 4706, 3539, 1290, 1320, -2508, -2650, 8842, 12765, -1372, -10839, -5876, 2191, 7248, 3628, -9222, -10444, 2522]
2065B522L398q771q94N338L667j13o723n928J0857J2320q426j4413o54P419O580
2080F179J615j0452p859P041N765m997K76N819m39l576l524j605J0344J1972q318
2095H241j7490mJ1664P496j71j0874j1358N650J0997k612m648K831j300l370O40
2110d308K433M904P059n821j3469L099J3572K946o128p454m476O384Q005o817
2124g1q746N875O372l835n816j469M478J2102J037j5359o469J2300R587j065n899
2139C022q605n73R174J850o674O53K615n719m397L854N702N254j395j3329m529
2154a3097J4837J1150n160q714m728J682R691L212r217l313M897k077n071L235
2168b673L575J538p43p910m286J1221J0363o903p847N00L423N801N54p859j666
$$ y = [2522, 5920, -2851, -3745, 1593, 5260, 5147, -1576, -7504, 3353, 15673, 7247, -7166, -7820, -401, 6179, 7794, -2658, -10517, -3476, 2289, -2708, -2432, 3387, 2948, -628, -4152, -5757, 4587, 16559, 8241, -9249, -9253, 2411, 9907, 9736, -1138, -12496, -6846, 4151, 1539, -3109, -278, -1578, -4948, -4308, -1875, 3029, 10088, 4267, -9202, -6103, 7469, 10415, 4287, -3167, -7643, -1259, 6746, -71, -8817, -2942, 3430, -405, -6221, -7690, -3212, 8890, 9927, -5432, -11901, 399, 9986, 8921, 3022, -5583, -6156, 3018, 4868, -1806, -1153, 1462, -4257, -8654, -4800, 902, 6156, 4761, -8568, -13097, 1740, 12890, 7730, -984, -5712, -4030, 5661, 8873, -344, -3657, 1240, -837, -5908, -2673, 902, 2440, 1697, -6213, -10499, 722, 11085, 4182, -3665, -3165, 258, 6059, 6613, -1246, -2912]
2183b912Q576l27j0104j871O128M681J178q568j0005O937J4672or360m050J341
2198c690N083O362k600n823K685J394o591M15P333R32m415n916n399N911J3096
2213H777k224j2087k631O201N328L014l560o214L503N371n101l344N681K488m265
2228I37l908l523K326R740p1j1473k530P795L379l16k163l502L648O352n381p386
2244f076O389P831l256o367n436K87J0442N000j1009q301N446N775J251J51m374
2259b247j460N014P27m831L806O154m790n717j02K234N453K156r608p204P343
2274c072O859k776k951j461K45M737J325o139J073P896j075p059n24K641L687
2289C406L187o472q865N600Q316l509n160J65R89L499J396o026j101R523K072
$$ y = [-2912, 5664, 5337, -4767, -6638, -510, 4171, 5349, -3219, -13224, -6287, 8385, 8379, -981, -5031, -3690, 1393, 7755, 5155, -668, 2017, 3411, -3180, -2765, 4568, 5500, 1085, -4831, -10230, -4319, 8777, 6553, -5534, -8165, -1964, 3364, 6378, 2818, -3396, 107, 5478, 377, -2967, 2714, 5202, 937, -2971, -6494, -4168, 5572, 5501, -5972, -8502, -707, 2672, 2356, 193, -3309, 339, 6691, 1310, -6076, 313, 8144, 4888, -1479, -6915, -6628, 3814, 8814, -2195, -10496, -5050, 725, 1976, 2127, -2247, -3707, 1307, 2034, -2797, 1009, 7163, 2373, -3344, -3446, -1212, 4241, 6397, -3211, -10415, -3072, 3787, 1011, -1940, -3401, -3156, 1581, 2906, -3233, -2160, 5736, 4661, -2398, -2922, -281, 3406, 6593, 121, -8744, -3144, 5172, 1663, -3497, -3332, -2343, 1156, 2552, -3474, -4575, 4948, 7020]
2304G020p777l377L400M120L783l671r562J157R353o21n702n40P2P03L202k263
2320g03k602N987K518p186j834O018K629n91k953n683J828Q942j363q770k57M065
2336D5Q02j88k795l310N124O329o647n412N785N224m49k449m929m97Q545J752
2352F930r253l303N594J879q49k583m061L214P128l366p882L482O287J57j853
2367A521l464j543O222M607p097m884M900K466k741j327j588M45M719j743p062
2382f569K510P877j551m411m06N27M920L738o632o265O498N431l978l848j125
2397c284J142M702j9q622o94R395J163n838j974J403L745M911l827p634M234P403
2413F206k631m821q82Q33K877K125o638l635P151L047n713k124K365J848L259
$$ y = [7020, -757, -4134, -734, 3386, 7169, 3498, -6064, -4907, 4446, 3825, -1877, -2417, -2345, -1642, 1560, -703, -3305, 2682, 5200, -1986, -3820, 2198, 4827, 4236, 1283, -4400, -2572, 6370, 5007, -3763, -4020, 45, 847, 659, -2136, -5446, -322, 6007, -640, -6052, -267, 4957, 4508, 2059, -2870, -3367, 5178, 6930, -2323, -5626, -32, 1847, 998, -1585, -5646, -2432, 4696, 1330, -6552, -3070, 3217, 3374, 1521, -1943, -3486, 2736, 7343, 246, -4638, 262, 2728, -13, -1340, -2928, -2483, 2236, 493, -6569, -4059, 3818, 2267, -2144, -2550, -2023, 2897, 6635, 3, -6262, 236, 5667, 1689, -2159, -3284, -2142, 2560, 2541, -6081, -6775, 2620, 3783, -2055, -4029, -2626, 1119, 6030, 2203, -5431, -1197, 6206, 3575, -1246, -2128, -1295, 1582, 3707, -2931, -6566, 585, 3632, -2081, -4205, -1840, 8, 3267]
2428C267q74o158K249P379j518n497P18K316K89Q74m044l879N821L844o654l918
2444e785M075K981J015j270n268J085Q662N91p721o09M626J460k53l115m787M482
2460A69O058n190p202L191M198K93j432m126o88P526L128p247k521N651K182j050
2476B940j655l498J838N785l029p425K290M517q58j992k009j353M656L939o401
2491b255k988O573K802l013j299j281J139N870j811q184P21P342j230m244j985
2506c843j32L573M120n450n969O346O001l223l327L3J353N410N38q458j825P945
2522C092K015n623k481l53K080M408l187o646L622O458k595l778J182J578L177
2537B949J556n458l158O957L266n928k541J824P80J925j614n988K021P035k231
$$ y = [3267, 2393, -3765, -1516, 5863, 4345, -1152, -434, 1882, 2171, 3045, -999, -4878, 943, 4787, -1867, -5785, -1710, 1271, 2286, 1016, -4252, -3167, 5495, 6086, -1635, -2244, 2382, 3842, 3589, 474, -4313, 169, 6227, 1037, -6165, -2974, 1224, 1517, 85, -4041, -4729, 2797, 5925, -1322, -3843, 1808, 3990, 2940, 1285, -2213, -375, 5410, 2381, -5044, -2754, 1763, 905, -1087, -3096, -4449, 207, 4146, -2255, -5243, 1330, 4132, 1119, -180, -1461, -322, 5548, 3737, -4447, -3726, 3616, 2386, -1858, -3843, -3975, -402, 3718, -1732, -7701, -1355, 4646, 1423, -1904, -1871, -518, 4892, 5430, -3028, -4853, 3092, 5107, -516, -2997, -3350, -1270, 3138, -49, -6695, -3073, 3385, 790, -2988, -1806, -228, 2949, 4505, -953, -4111, 2846, 6112, 184, -2357, -533, 247, 2172, 558, -5430, -3409, 3626, 1395]
2552A395o106J274M040K244P24m612l696O563N618n246m931K690K199M66r97n313
2568c688pP451m52q313n61N589K881M36l879n501M856Q978k947p413J448K795
2584A673Q53N61l380k726M876J777p082j456N408J290j711j567k784K541O913
2599E186j782o759K347M240q83j035j178j392L547K074p018l741O843L591l540
2614E00l354k222J728P346K22p688n97N718R70k128o15l98J875K962n531n220
2630f432O305N713l933n533j241J449O003K536p215l644N727K707k143O76p20
2645B55l86K328j236m262L279N694m695m818N12J893K778J740n307l388N586L253
2661C226m271j046L136Q79O26k326m553L415Q187k708q374j403L956L607K136
$$ y = [1395, -4711, -3437, 603, 2847, 3571, -1041, -4737, 1826, 7444, 2198, -2733, -43, 2156, 2622, 1625, -3688, -3695, 3756, 3304, -5009, -5570, 19, 2900, 3336, -543, -6044, -1188, 7790, 4843, -2570, -1122, 1673, 2526, 3087, -293, -3019, 1857, 3634, -3448, -4904, 504, 1794, 83, -1484, -4268, -1727, 5186, 3404, -3355, -1008, 3232, 2349, 1314, 136, -1256, 2291, 4365, -2653, -6394, 449, 4040, 500, -2854, -5076, -3348, 3998, 4220, -3468, -4065, 1653, 2623, 495, -120, -518, 1357, 4319, -1212, -6432, -127, 5586, 1653, -3880, -5121, -3672, 2331, 4867, -2348, -5992, -265, 2442, 299, 975, 255, -131, 2197, 961, -3301, -22, 5672, 977, -3841, -3329, -1436, 1342, 3082, -2225, -5613, -27, 3226, -1045, -2091, 1045, 1924, 2550, 224, -4329, -914, 7273, 4565, -3809, -5212, -1256, 2351, 4487]
2676D487m850o101L716N776k454k629K762Q80q64m60k621J612P438j261q692j881
2692e142N361K606J127l144o395J444P085j133m144J899J092j313M27l58j31N448
2708D729P55p820k116N759K438j070k019l810p4N855r57n456K350M174k283k751
2724b296l03J057N990K481q625n116O124O130p71l285n049j539O448K742n501
2739a513j111L606j805k017J402J189K457K097n452n520N588O869j912l814k509
2754b445j440M711L470m693l057L852k63l415J035K285P16J857l127n514L986
2769b042P244j443m512q74J42J958K965l433l123M162J387o109q64M475K530P04
2785C167l861o294K177J0193J382o928k825L56K506M907r86o142Q78L018k848
$$ y = [4487, -363, -6464, -2748, 3028, 574, -2055, 707, 1587, 723, 263, -2358, -746, 6692, 5431, -3261, -5142, 219, 2825, 3952, 808, -5587, -4143, 2942, 1809, -2335, -436, 656, -657, -230, -588, -719, 4729, 5484, -2336, -4452, 1307, 3745, 2675, 656, -3154, -3228, 2627, 1670, -3786, -1436, 2738, 455, -2296, -2599, -1542, 4448, 6929, -1696, -6812, -688, 5442, 4671, 1386, -3663, -5202, 1246, 3988, -1513, -2624, 982, -823, -2840, -1438, -249, 2208, 4305, -1147, -6667, -1079, 5790, 3878, 64, -2445, -3885, 826, 4296, -397, -3454, 398, 135, -3280, -2245, 40, 756, 2613, -514, -6028, -2042, 5202, 3759, -753, -1627, -1485, 473, 3438, 5, -3118, 1044, 2431, -3678, -4542, -67, 2463, 3167, -694, -6988, -4811, 5382, 6764, -164, -2989, -2633, -127, 4780, 3794, -2348, -1470, 1548, -1300]
2800a300j539M071P00j578j627k984M14P622J624o538k418K663J834K191p4m315
2816a254K56M064k697l601M088K044k274j827k348n63O421L108o416l433L765
2831f67J991K61J040k370p28L731k037m437L496M429k306l815k440n56N914M676
2847F182n513o947L049L969J643N14k392k760K732J832l160Q83L942k379m107
2862b512L59O47J930L092l626n940L182M921j140j404L06j193J569K247l496j31
2878a189N191l69n660o58J852J465L040k590o564Q83O332o87k282M66p58L17K801
2895A590k545j305M995K116n920k200K969K022J859j221o923j164O640J829l469
2910g27q15l33o92L201L09k720K620K456l955j974L731J669n87o25l389j541N093
$$ y = [-1300, -2839, 1232, 1932, 354, -1273, -4257, -3843, 3779, 5403, -1135, -3553, -890, 944, 3135, 3061, -1254, -998, 3066, 369, -3232, 856, 2900, 626, -1201, -3549, -4112, 2309, 5417, -999, -4432, -667, 1324, 1585, 2625, 255, -473, 3258, 1221, -3216, 280, 4709, 2403, -1412, -3852, -4408, 1506, 6182, 669, -6278, -3229, 740, 2383, 2897, 505, -2255, 477, 2309, -851, 32, 3974, 1595, -2512, -2153, -1506, 424, 3516, -110, -6050, -2868, 2053, 913, -491, -185, -1378, 191, 2438, -1058, -1189, 4002, 3633, -2027, -2685, -833, 632, 3672, 1082, -5482, -4599, 1733, 1046, -1236, -770, -1528, -1211, 1590, -955, -2260, 2735, 4851, -1069, -3269, -300, 1722, 3581, 2360, -4563, -5727, 913, 2742, -727, -1542, -1875, -2567, 634, 943, -1777, 843, 3299, -656, -2630, 1101, 2770, 2183, 1558, -1831, -3372, 1721]
2927A721J431m826p11K508n68k61K29j647K261L726l549m325M031L740n22j171
2943B067l010k133M136M010m555l220K450N8m58P34j683P9L850j010m973J814
2959a844N200k05j649j417k402K569M824l097m178J442J213j079Q71n44j713J957
2975e2J170m101N32M976j05l255J51j79J160L411j932m372K234K766k266j197
2991a059O11o18J436R60m283j128N409J496l706j066M99R73L687m77m817J96M445
3008B558j284k058P01n73k1J949k344k880L806K954l906j498J620K73J894J458
3024B649l611j519M328M08k595L41P07j603J261n21k522K079L415l599k705K738
3040g49J190j01O52k078j470M552J408m152j52K296k49p63J90k574Q73M095k139
$$ y = [1721, 3152, -1674, -2385, 123, -445, -706, -477, -2124, 137, 3863, 314, -4011, 20, 3760, 3238, 2067, -943, -3076, 1060, 5070, 515, -2705, -255, -197, -655, 79, -1604, -1525, 2325, 1315, -3658, -1844, 3356, 3151, 1502, 85, -2317, 252, 5076, 1979, -2199, -757, 456, -623, 248, -296, -2009, -52, 1118, -2983, -2451, 2525, 2420, -835, -684, -863, 297, 3708, 1776, -2596, -362, 2404, 138, -1059, -448, -1066, 370, 1330, -2953, -4081, 1328, 2824, -882, -1948, -1449, -476, 3211, 2734, -2083, -1887, 2558, 1274, -784, -83, -656, -677, 1272, -1072, -3952, -146, 2808, -1098, -2596, -976, -703, 1191, 2649, -962, -2481, 1847, 2255, -340, 1, 708, -895, 366, -155, -2677, -598, 2817, -782, -3487, -749, 441, 340, 992, -1086, -2556, 1996, 3404, -748, -900, 1396, 1147, 384, 574, -2000, -1127, 2968, 829]
3057H29m163J609K807m42J73j449k074L352K800l146j958K916K58r03P38j799
3073d52n33L220l48m444M57L890q61r83L0k146J518L232j985k882K965J366k013
3090C1M88l7j016K095M64l999n50M311m6k923q1R7L86L277j649l922K155L604
3108B685j852j455P13n17J527K081l949k366M107J572l001j100L75k16K722M15
3124A741m348L23L869m15k149Q36j3J50K168j443l410L055K448l279r96J003l39
3141g99J130R66l513o72L859K38k995R45J693n40Q33m91k709J827L508l019k696
3158b435J850P68j49P71k213j936L762J922l643n41K034K48J82O01k596K11M307
3175C143j111l755R61J609o31R02p49l311K430K668k588j790J951O75j55O12r33
$$ y = [829, -3334, -1725, 1082, 640, 813, -636, -2710, 642, 3442, 296, -1662, 1254, 1512, 609, 1347, -452, -985, 2235, 1887, -2557, -2100, 1790, 929, -54, -24, -2170, -652, 2580, 595, -2287, 678, 2044, 31, 519, 482, -534, 1561, 2025, -1974, -2524, 1787, 1741, -1182, -1263, -1166, -780, 2497, 848, -3074, -919, 2685, 833, -622, 91, -426, 1101, 3182, -767, -3133, 974, 2546, -455, -1555, -1180, -1396, 1326, 1741, -2607, -2284, 1585, 1170, -979, -143, -156, -6, 2162, 719, -2691, 364, 2812, -467, -1463, -460, -799, 331, 1297, -2216, -2888, 971, 1209, -1786, -841, 852, 312, 1145, 654, -2055, -228, 3280, 261, -2435, -585, 183, 34, 805, -1408, -3344, 418, 2340, -1303, -1844, 190, 438, 620, 1221, -1375, -1164, 3143, 2032, -1723, -762, 847, 216, 1118, 369, -2942, -512, 2156, -432, -2222, -271, 404, 249, 861, -72]
3192g2j038L166L63l825R01K326j031n94K92j748R51K208k318k413K862J489j944
3209d25k55K00r50L072J259m059m67L567M08k121j92p62R9K564j018l614J069
3226a625L202j195j306J38o77J715K612k885k696L325J649j667l63N0j067J621
3242H31J105l660q2L444j221k386R83J23L78J593j257k414K384K207k266q42J858
3259G78l32%Q96k738o20M122M4m356r6K040P2J045m96l522J442L906j450k055
3277a320J413L74k36J356j698j971L174J676l688j240K021M29K54L80l032q54
3293b962M337j84k260Q71J113j154Q34K26j919J660K446l103k240K619O11n76
3309C19K72j506j345K442J525l158M98K390r08j154M10k41J274K602k867l347
$$ y = [-72, -1110, 2056, 2419, -1406, -505, 1821, 790, 196, 488, -1260, -309, 1899, -419, -2832, 30, 1519, -425, -680, -480, -1430, 1642, 2901, -1158, -1625, 1942, 2350, 229, 37, -725, -626, 1938, 920, -2694, -1625, 1577, 382, -924, -786, -1463, 252, 2864, -21, -2717, 608, 2257, 590, 227, 277, -790, 831, 1936, -1724, -1806, 1638, 417, -1969, -986, -863, -485, 1108, -149, -2563, -179, 2028, -238, -1080, 778, 446, 446, 1342, -1396, -2016, 2106, 2150, -2206, -2302, -262, -190, 855, 359, -3163, -1721, 2185, 735, -1320, 93, 467, 231, 1587, -111, -2082, 1092, 2768, -920, -2160, -139, 290, 544, 924, -2108, -2962, 1375, 1191, -1069, -198, 915, -239, 595, 821, -1098, 562, 3008, -95, -2335, 284, 895, 319, 591, -915, -2260, 182, 1707, -1451, -953, 1437, 529, -625, -215, -456, 818, 3420, 553, -2794]
3325b794K610K303m98j009j172j579J755K556k487j916K567J36j250J222m14l31
3341c01K800o16l841J258K822n26q55l10k168J018K675j295k645J889O07j834
3357a322N79P95j75J417K82l254q0L835R1k332J68n98qJ772k55k562J368J531
3375A252k858o38K043N55N53n30k657l69M325J812l692j040L46J80J856R70l324
3392a216m20K437q04j821J927j57m34O24j452j257K784K599k561j689J303l35
3408d72R19J448j810j286K092o72k204J960J057q38r28k87j615K497K698k171
3424C88k525K010O19l02J279q04j762J497Q03k923O69L281j095k244K25j123J644
3441c63L631k062l781R46K112K70O83m88k224R55K114j706o67K174j42k356M91
$$ y = [-2794, -184, 2119, 1621, 612, -560, -2139, -384, 2172, -315, -2231, 336, 472, -778, 444, 30, -301, 2499, 1883, -1958, -700, 2122, 1596, 741, 431, -1737, -719, 1956, 661, -1984, -95, 512, -1322, -743, 52, -123, 1294, 1576, -1678, -1758, 2077, 2168, -164, 4, -594, -602, 1170, 915, -1647, -279, 1252, -1606, -2244, -201, 354, 907, 377, -2280, -2649, 1676, 3488, -204, -1244, -898, -718, 1138, 2108, -1216, -1636, 801, -3, -1824, 103, -54, -488, 136, -1316, -2573, 211, 2810, 249, -1440, -137, -472, 447, 1895, 85, -1201, 891, 219, -1985, -25, 1032, 194, -734, -1021, -2636, -139, 2559, 388, -2137, -127, 492, 190, 1469, 665, -1097, 400, 1203, -1720, -1051, 2230, 1135, -1109, -884, -2007, -363, 3268, 1206, -2575, -1629, 483, 753, 1436, 948, -1276, -321, 1793, 87, -580, 1594, 1452, -904, -413]
3458d13m62M76J987J02l476m4K359J76k72N98j118o70K245j395r17K676K59k899
3476g88l42N46Q24J216K14l553o38K987P14j273K99m36p55J716r8j555J329K089
3494B496k673j665J278P68R58O66l089k111L101K182j911k61l94r80J578J444
3510A387j859k6J976j516j767J750R87l61P57j547k623K214K205j835p80J124
3526H6r15j17R53l26J54J907q96k828R08K608j86n90q64k518J534K970j091k454
3544a665J153J31n28J302k20j026J621N42k595k19K874Q1q40m69j210m9L377k96
3562A964l376P03M41n21J198O16j718M55J275j862n88K694K92j692L03k77l98
3579d91J941M98k590m73K050j233j35Q57l48n64J295j523j040K787J380k239o37
$$ y = [-413, -875, -399, 1588, 1690, -1786, -1830, 529, 705, 433, 1031, -87, -757, 1488, 93, -824, 1852, 2111, -788, -1130, -584, 240, 1456, 1670, -1883, -2521, 466, 1180, -93, 206, -230, -985, 731, 633, -922, 407, 2496, -177, -1842, -564, 204, 1162, 1828, -1261, -3372, -271, 1911, 0, -261, -655, -1635, -57, 1387, -472, -498, 1478, -38, -1805, -55, 932, 571, 1328, -219, -2842, -628, 1577, -258, -1038, 86, -829, -946, 7, -319, -165, 1742, 846, -1982, -1074, 1534, 1348, 758, -106, -2624, -1090, 1880, 789, -1665, -512, -381, -909, 393, 173, -853, 768, 1310, -1285, -1504, 1370, 1451, 611, 142, -1068, -1117, 2260, 1964, -1412, -709, -268, -789, 409, 1025, -693, -238, 1037, -825, -1413, 1281, 1573, -119, 184, -93, -491, 1450, 1948, -642, -1115, 935, -298, -433, 424, 76, -488, 807, -716, -1756, 1031, 2411, 172, -465]
3596d65K07j47J301J302k400j645K626k24j470J112m0r60J129k46j954J557K035
3613A718j540j595J065j59P31J635j197k184J569Q17j124J97L29r10j24P00r82
3630a054K76K082j290k180J727R90l16Q53n99j927J320J715j750n41J382m78j052
3647h42P68p69k71K013m29k465M16J914M3N26n33j854P21K573p89j785J218K10
3665F65j071O38m23j137J764P70k449p34K560l55l26O43j312n70K509N1j757P77
3683B43P66j376L29O53r78M49J007k276r00K837L92j587N1K76o49J432Q39k224
3701g16l6K243j355l84P78l81N8J221j061k182J571J876j981k53Q5p17J501J518
3719A785j809j285K118K1j131R33J68j020J061J09k159P50K072j616r64R57q18
$$ y = [-465, -258, -405, 896, 2198, -202, -1847, 779, 555, -915, 197, 157, -803, 326, 80, -1874, -317, 1718, 178, -1417, -352, -511, 220, 1855, 658, -1526, 43, 860, -264, -67, 262, -648, -772, -72, -1054, -778, 1304, 14, -2166, -439, 551, 235, 1088, 489, -1438, -118, 1597, -153, -694, 688, 210, -842, -74, -843, -1114, 899, 470, -1995, -1579, 335, 378, 904, 371, -1483, -762, 1811, 1022, -763, 455, 665, -406, 232, -191, -1328, 436, 1206, -1243, -1977, 583, 228, -98, 545, -767, -1337, 1172, 1223, -534, 243, 1009, -367, -38, 615, -363, 86, 1093, -1183, -2083, 754, 1146, -441, -390, -114, -763, 669, 1508, -716, -752, 1491, 136, -248, 530, 149, 207, 1428, 367, -1815, -244, 1632, -349, -602, -517, -1234, 267, 1785, -24, -1309, 809, 830, -301, 632, 800, -220, 841, 950, -1209, -459, 1613, -3, -967, -10, -828]
3736h28J53J560p69j419J556L75j656J005J052j168J21R26j433K12K093j470j801
3753a491J070Q79r20Q21k42j760J241J697j939n28J731l49j38R20j308r80K538
3770A242Q2k374O1J367o74M62L39j759J07J820p31q96P52J64l73O03J9j038J359
3789E32Q65k097l58J870n45o85R04p95r03J780l77j420J104J088j534n4Q93m90
3807b22L13J102j352j201K179K21j113J73l16n92J349K96j743K53J537j040k89
3824d45Q33l64r7J480r93j810J550J712j631j01N49j277O34J229j474r21J670
3841E44J10j755J328L7m97M68K75j403O54J521r13p53J040k82o06J540j122j217
3859a031J448N13j766J69R82n56J78M13j089j17J757j58j757Q18Q98p72J061m71
$$ y = [-828, -675, 885, 116, -1303, 253, 628, -1028, -23, 1029, -139, -18, 908, -525, -313, 1780, 310, -1491, -421, 458, -462, 359, 117, -1643, -402, 1295, -644, -1172, 559, 210, 72, 992, -316, -1296, 1242, 1324, -1050, -989, 378, -296, 166, 505, -1254, -1147, 673, -58, -954, -202, -38, -411, 192, 211, -827, 532, 1397, -700, -1058, 812, 267, -418, 486, -309, -1212, 568, 191, -1229, -125, 963, -571, -625, 268, -222, 91, 1193, -159, -1360, 819, 1040, -73, 100, -216, -808, 541, 837, -906, -653, 884, -156, -445, 388, 24, -73, 1407, 414, -1396, 154, 1866, 235, 134, 683, -594, 40, 1269, -205, -1126, 544, 654, -1101, 227, 264, -233, 235, 510, -893, -239, 1282, 369, -384, 656, 374, -232, 1308, 186, -1031, 417, 930, -836, -667, 315, -241, -63, 350, -739, -856, 901, 743, -1014, -196, 702, -70, 991, 520]
3877E20j644R52J174j299r88J303j94l40R44r19j094J989N60j743L74R26q13R9
3895a93Q33j138l18J802r04j486J288L77q36P13j48j248J112J024j699j88J527
3912E18m59k82P24o11o53J471k01j435M77J557j175k08K57p89K69J737j005j354
3930a162J136O55o49M41m05r38J623P11k191K41J399m38o97O99m40p78J621rj858
3949a039R52J164j408J47J171j215j98J510r73o36J571k35j483P95N56j408Q40
3966A11Q06j677L03J266j029p72J355k16l90R78o06j422K001R67j617p95J167
3983D30m10j4J190j757o53J683mj584J105L91q09O44O17j929P46K001j508o96
4001e57R87o91k63J180l01j439J090N87j798P96J308j383q6R52p20j53J713p05
$$ y = [520, -1124, -172, 1002, -297, -1285, 18, -176, -516, 428, -491, -1585, 404, 964, -779, -405, 521, -292, -193, 640, -498, -816, 986, 82, -1404, -116, 261, -575, 138, -10, -1258, -146, 878, -821, -1009, 518, 59, -223, 501, -110, -763, 708, 507, -928, -451, 1106, -69, -277, -20, -809, -540, 1197, 192, -1162, -26, 629, -20, 421, 16, -922, 701, 1412, -779, -538, 861, 423, -274, 425, -15, -793, 828, 819, -1039, -87, 1077, -331, -184, 987, -228, -426, 1084, 111, -525, 1046, 811, -672, 123, 679, -729, 111, 917, -760, -457, 809, -220, -992, 363, 147, -243, 735, 129, -1293, 708, 1675, 58, -737, 430, 20, 6, 1196, -561, -1214, 469, 465, -1119, -14, 377, -432, 212, 829, -1100, -354, 1647, 139, -557, 430, -261, -524, 656, 355, -1084, 6, 593, -1205, -409, 899, -484, -570, 382, -338, -491, 1222, 517]
4019E17j519J008M20q81N69K32j293Q26P06j693r7K141p70j254O14k66j78J670
4037G52J78j951K11J879p99j59O82j342k36J661r89p56J425k01q74J71N28j407
4055a227J216J027j263p79J407k51l62J236r26n56R93O0j044O18P27j289k63N90
4073h6j63l41J362j248q14J709K75j244R18P6j261J264M72j076j25J451p72j135
4091g38J016k28l48J257o82j594J123J283j018m4O63j315M60J134p51p02J278
4108G94k08j327Q53M83j148P05N28j600J16J662o89p29Q57o41o83J433J91q86
4126b89Q37K50j856Q87J153o78n48N19q63l1J668p70j106N89L68r39Q54L31r55
4145e79O95R25j489m10J390k9q77N94o49j086J778L87j514MQ94o05K94J068j157
$$ y = [517, -1002, 6, 426, -455, 114, 346, -947, -121, 585, -1108, -1205, 936, 166, -1088, -474, -740, -918, 752, 930, -1021, -810, 1069, 270, 111, 793, -549, -785, 876, -113, -869, 556, 355, -519, -348, 180, -1227, -11, 1016, -247, -1026, 381, 130, -232, 1004, 78, -478, 515, 575, -469, 149, 876, -413, -676, -86, -249, -590, 772, -476, -1290, 419, 694, -550, 368, 444, -817, 447, 919, -157, -282, 1169, 397, -738, 278, 50, -298, 959, 277, -1317, -194, 1089, 71, 27, 690, -625, -165, 969, 218, -484, 794, 586, -741, 112, 595, -553, 152, 680, -920, -804, 858, 169, -560, 297, -344, -1027, 406, 597, -289, 548, 798, -1058, -171, 982, 304, -244, 275, -588, -619, 1049, 279, -827, -238, 130, -809, 45, 376, -579, 116, 1041, -448, -858, 532, 503, -374, 220, -429, -1515, 263, 650, -864, -860, 34, -571, -277, 791, -366]
4164c66l28J474q00r55J519K42j263Q74J24j308P34J106j504k58Q56m00l14J131
4182E64l52j118J478n12j073J187J112j274p03J158p00M81J110j366j154J392
4198B30O27j216L82O31j250O18M66j133K38J587m59j547J092k17j97J339o1k182
4216a052O58J217r92L04Q05j503n9J177o83m77J400Lj453R72J73n10N20K90j304
4235e14k60J702r62j29O36l00j019J092j84q83J258L91j670j17J552n67J56L61
4253E43j036n26J926l59j000L19M29r45O38P23j224k2J307j416m81J212n1q9N12
4272D60l73j242J103J034j254k35J071j050l3J037n36j6M57o26j008J332O80j166
4290c65M68J29j049P00J094j041k10J102j029k49R43J44j134Q18O7j635J170Q20
$$ y = [-366, -694, 780, -20, -975, 544, 786, -477, 397, 521, -787, -53, 1053, -451, -709, 147, -253, -567, 564, 212, -906, 572, 60, -1013, 174, 1286, 12, -691, 467, -233, 248, 1358, -8, -1162, 230, 857, -359, 23, 654, -596, 22, 488, -645, -407, 1180, 721, -826, 266, 49, -148, 1191, 1130, -1052, -394, 823, -169, 135, 940, -563, -622, 555, -128, -605, 795, 798, -655, 317, 490, -20, 500, 790, -514, -774, 928, -34, -163, 473, 173, -846, 246, 62, -821, 437, 828, -842, -959, 593, 26, 182, 543, -493, -1019, 907, 548, -452, -133, 296, -649, -11, 712, -512, -534, 773, -643, -1124, 88, 37, -52, 460, 87, -1155, -52, 982, -272, -507, 564, -486, -519, 518, -18, -34, 423, -203, -1211, 121, 801, -365, 103, 232, -817, -117, 977, -64, -274, 828, -201, -450, 493, 637, -497, 321, 388, -1247, -77, 743]
4308G43o74m46N71p22J70J520q00j137R49J75o64P01L11r42K26O40r64l33J455
4327G79j67j076N59l70m78J524k57j061K46R06r61J43J342r90o16J264j127j82
4345e22J392m20j276M58N97n68O22M74j163M3J357r61n14J023L74j225P02l7q32
4364d76J078L63j168m25R05k70j36P44p84q46J604m1q73L93L13r47L76R62j340
4383e68O66O10j005m49J026j00q27Q83o1j079O51R98j242O01M90j017n27J354
4401D04m94k89J161p76r79N42J177q39p6L67r82M46J136j267l83J404k96q52Q91
4420B95k08m74J011p1j496L37J821r75l52L47q90Q3J143o60p17Q60K88j115O64
4439a09P91r15k9R28j035j35J284l26n90M82Lj288J240L23j094N16N49j110p7
$$ y = [743, 69, -377, 194, -528, -358, 1162, 362, -775, 174, 349, -315, 386, 697, -245, -19, 621, -343, -676, 779, 612, -464, 95, -275, -753, 771, 514, -547, -301, 605, -356, -213, 1129, 139, -477, 787, -340, -522, 870, 450, -826, -368, 229, -339, 283, 757, -406, -363, 994, 33, -481, 542, 916, -309, 393, 356, -476, 602, 965, -203, -628, 277, 7, -129, 615, -169, -1015, 589, 548, -325, 68, 381, -566, -190, 772, -568, 98, 708, -297, -746, 280, 180, -647, 236, 175, -904, -253, 745, -497, 104, 594, -423, -950, 404, -90, -379, 782, 6, -973, -431, 746, -93, -169, 198, -784, -338, 798, -469, -852, 552, 256, -596, 295, 87, -387, 624, 553, -943, -606, 1215, 240, -112, 235, -655, -572, 571, -89, -806, 54, 342, -773, -109, 682, -233, -262, 666, -369, -504, 780, 454, -136, 346, 349, -939, 301, 624, -470, 46, 595, -515, -592]
4458e92J085l06m39M82m25p62J529N59j551K49M95o25L75P73j018m37J216n57
4476E1q46R15N73j109R22o9j266R70J000j215k01Q34p74l5J025o03q91R86k10
4495E7m92O29L12q54K77L01r50J16J174n24p86J010Qp26N94O2r34R83M51j523
4515h15O46Q93n68p95N44r6j16Q86j79j497Q91R49r39J49M14q83J41J190j156
4534c41l64J322n11o71N71Kp58J276n2j499O68P39m28m87J065p58k03J003o89
4553a15n60R17K84j226L27Q32j070M23P01o80k68J165l32q20N65K84q16O69J34
4572D14o62N0J358r21p59Q80j35k32N16p27q68J179N60j149K65Q14q85R6P89r46
4592c63L20J014p38r16J074Q7p52Q57o2j345O57J210j170j21P00n40m20J139l62
$$ y = [-592, 493, 187, -252, 230, -195, -957, 572, 1131, -420, -171, 324, -301, 74, 847, -171, -608, 608, 51, -795, 120, 693, -416, 506, 437, -829, 141, 1141, -74, -275, 559, -215, -250, 775, 172, -719, 267, 57, -435, 194, 506, -348, -71, 230, -720, -604, 570, 46, -740, 270, 278, -448, 146, 208, -726, 257, 708, -815, -169, 724, 156, -639, -95, -191, -307, 579, 400, -1097, -206, 743, -196, -47, 367, -516, -375, 815, -341, -705, 617, 106, -565, 6, 8, -750, 526, 474, -1025, -357, 382, -46, -533, 532, -226, -429, 574, -115, -675, 242, 526, -700, -373, 459, -611, -188, 513, -167, -435, 730, 398, -422, 143, 427, -389, 280, 414, -248, -198, 1160, 239, -520, 360, 225, -7, 509, -218, -1086, 93, 653, -496, -231, 583, -302, -206, 583, -363, -43, 971, 233, -683, 391, 478, -274, 583, 521, -824, -167, 1043, -127, -248, 452, -88, -508, 631, 269]
4611B69p71R00r8j165P92P53p94k63P61o25j32Q56m24r14J135K84r83M19L04q63
4631e59O65N41j384J30J211l97n06Q77q85m34J513n72o45N6O23n83K96J73p09
4650e89O9R76o46p46J289o9o96K99L32r42Q37L02q36N0P62r97J1J001k04r16R86
4671B73m58n65R02L87j292N36P51q47L0O72n16m46Q89j82o82O90L13q50N73M8
4691B26o03J78P87m53o10P50m44j11J064m90r04P33L52p48M86L38p94j49J029
4710F37p27l27J079l38q43Q43k0q26J045K53j220J81Q87p85j10R49n54o88J002
4729D38m13l60Q86m43p81J98R82n14J13M19q81J60O68m74p28J094k50m31M69M41
4749E93q62M33M11r87P4P56m42m89J033n90n11O93L42p36J30M79q82M74O43j034
$$ y = [269, -502, 398, 300, -865, -73, 680, -114, -377, 384, -241, -373, 483, 59, -855, 280, 564, -419, 0, 304, -559, 106, 647, -737, -607, 604, 207, -299, 578, -307, -741, 772, 200, -445, -389, 234, -349, -53, 120, -589, -520, 456, -190, -936, 353, 284, -412, -113, 219, -723, 114, 416, -420, -370, 392, -605, -594, 407, 203, -713, 273, -185, -750, 152, 539, -753, -217, 534, -313, -283, 389, -127, -573, 316, 134, -548, 142, 455, -395, 178, 226, -377, -199, 588, 135, -475, 275, -169, -280, 784, 294, -610, 123, 475, -273, 213, 551, -243, -392, 637, -90, -417, 662, 324, -519, 324, 304, -522, 523, 776, -444, -263, 624, -161, -271, 678, 124, -564, 438, 25, -335, 551, 108, -673, -475, 507, -7, 106, 525, -356, -196, 472, -2, -730, 364, 114, -317, 152, 593, -269, 164, 575, -412, -338, 418, -24, -513, 520, -70, -581, 112, 454, -282, -152, 327, -555, -81, 562, -472]
4769d72j5J069r04n46Q64M89j133M72L79j110N87P55o61k63J066o90n77J005k30
4788H5m16K62M0p67O33P18r35J17M18n12M7P23m75m11N93mo80O46K38o72L93N03
4810E44r34k6J199m39q17P93o86j59J278m31p13M95l3n71L53Q79p30l55P66o06
4830a93j40O61p8m01K69L11q01L38O39q08N4M32k77n08J318m45o62N08l13m66
4850e62O36O79j028J27M52n62L36N45q06q2M63l26k05O96J22o55M67O8m51Q2P75
4871G71r47P3P66r74j74Q84m1j021Q51K41q17K98P35j051K03O71n56M0M62n16
4891a02k60O65L6q32M72M86o77q6N62p85K25R48o34n35L53j6k62Q02r1r94O40
4912h5K27m05J66N99q11p7N75l06n82Q09p7o19M77K48n84O95N23j300K4Q32l65
$$ y = [-472, -487, 582, -322, -868, -4, 485, -648, -176, 203, -907, -320, 435, -226, -489, 577, -113, -690, 315, 85, -331, -69, -29, -796, -163, 555, -380, -263, 155, -357, -310, 413, -62, -473, 120, 116, -564, 82, 320, -352, 41, 544, -390, -416, 783, 344, -473, 320, -366, -525, 753, 322, -391, 104, 71, -500, -147, 732, 2, -353, 413, -193, -333, 328, 250, -151, 118, 429, -372, -34, 605, -203, -149, 283, 6, -502, 816, 371, -291, 217, -96, -562, 74, 753, -275, -148, 304, -258, 78, 623, -183, -265, 198, -128, -333, 363, 485, -170, 297, 365, -86, -4, 771, -176, -103, 663, -311, -485, 399, 358, -663, 188, 429, -388, -90, 645, -406, -203, 468, -88, -48, 414, -102, -362, 303, 339, -493, -21, 465, -212, -298, 264, -521, -296, 652, 18, -517, -164, -180, -442, 360, 269, -725, -85, 142, -263, -97, 502, -309, -386, 189, -117, -699, 110, 33, -586, -109, 139, -445, 250, 773, -527, -503, 329, -36]
4933c6j11Q61q84o33R72k3l83M21K62q06K76N27n66J03L73l77m99R00l14m61P18
4954C20p1m16J45M05o61O05K57j165K03P05k16l03O09m18p37R47N40r26J14N31
4974D68n81p4N51l85l44J038o96m80N88J97l98L34K23j125K87Q06p01P1P85p21
4994a57m16O44P89j069K73J67q43M22N07m26L9L77m91m14J100k99j61N4j49o70
5014g23N39O52m70j37M07n62r4Q85l52q99J124k97o67P60L22q92J75K73n02J45
5034c13P57p39M3O59q14r7L93M10o84N71k58n28N05O65p51k07O21m34n1O16J64
5055E28j055P18j72m99L37M59n57j88M19l85J96M84k64l10L79l1n87P82J92r58
5075e12N82K99o96J11R20o76l19L54j22L8M33k05m01K66K26m71K59M94p03j45
$$ y = [-36, -147, 714, -170, -803, 169, 146, -237, 184, 446, -360, -84, 443, -123, -20, 353, -24, -523, 377, 63, -398, 320, 249, -167, -22, 383, -278, 327, 584, -581, -378, 327, 111, -192, 417, -1, -738, 209, 749, -177, -63, 468, -113, -187, 364, -21, -365, 673, -23, -503, 85, 282, -116, 218, 441, -684, -397, 409, -292, -221, 564, -157, -573, 71, 860, -209, 64, 231, -612, -190, 317, -109, -70, 307, -184, -598, 502, 203, 42, 96, -53, -723, -184, 468, -2, -139, 268, -294, -388, 497, 145, -754, 370, 73, -594, 166, 488, -404, -229, 44, -458, -313, 444, -295, -252, 407, -407, -504, -111, 299, -385, 186, -72, -600, -95, 570, -181, -388, 233, -201, -252, 364, 528, -527, 191, 19, -480, -143, 316, -241, -429, -10, -395, -199, 285, 21, -289, 90, 59, -528, 254, 446, -512, 70, 369, -327, -216, 704, 28, -291, 63, -59, -21, 412, 207, -194, 72, 298, -173, 86, 580, -123, -268]
5095b68P11p67nP98j89p71O04K88p56M15M42n55N3J10m91K88N35k65q23J089k82
5116A61m10O81J46r02K90L74p01J72Q45p50m01P91m74j26K35M41o89K41J51o42
5136e67M69Q89p71n19P71m59j68Q57m35m41L67K85n42N69K44j151L03K79j14k87
5156d21R08n37n93O67L10o04L85K42p53j3O02j78k27R39o63n01N22j5l20M46k94
5177i8o26O54O87q12j79Q21n43k87P09k47l00N74k52m30L92M59r94M29M79n87
5197a51m25R59j79n30P23n61m67J063j33m24J78M29q05L21O06r31K2O25l93m68
5217e41J011r1p37L65K95p09J59P81p42K42L94m30n21Q84l16o7l8N32q73O62K3
5238B83o83QQ38o25j18Q31m64m03M89k23j11M45j15l00K75L34j018M08N41k43
$$ y = [-268, 443, -324, -329, 469, 280, -491, 113, 401, -355, 60, 502, -53, 0, 110, -381, -93, 442, 177, -646, 443, 161, -249, 432, 578, -324, -34, 340, -361, -189, 656, -94, -495, 296, -178, -304, -69, 372, -317, -76, 75, -567, -98, 791, 20, -499, 272, -187, -355, 502, 67, -374, -7, 278, -264, 305, 549, -602, -299, -20, -134, -421, 487, -50, -643, 24, 334, -270, 115, 357, -396, -409, 193, 15, -212, 727, 64, -437, 85, 70, -250, 196, -98, -724, -70, 617, -195, -374, 447, -96, -383, 326, 79, -221, 353, 101, -329, 63, 522, -472, -43, 436, -151, -576, 383, 204, -326, 397, -164, -631, 432, 299, -125, 53, 482, -323, -2, 604, -327, -305, 320, -73, -541, 470, 379, -358, 7, 302, -407, -248, 533, -209, 33, 427, -3, -524, 360, 44, -23, -61, 471, -402, 260, 283, -400, -392, 446, -179, -297, 534, 70, -333, 156, -67, -178, 267, 152, -148, 127, 461, -557, -149, 392, 149]
5258A49l81L76p3m19O56k08n66M69j1l86K90N13p93p6Q04m31j35N14k40n61Q56
5279C47j53n73M72k9m17K00L28m14j4O73l80m15M10j00j41M40P7q06J81J009q17
5300a22j1N41o40k87Q05l66j09L70l6m64L50J99l64p8N16o89J51R07p79k43P58
5321D09l82o94P46K84j36k13O86j075K11O65l50k53O88n62m50Q62l14k86M03J93
5341D32q49P1Q40q60L43L49m28p19J341l3n93K49j04l20K98M41p11K42M48l29
5361A08m35M71m7k03L30j4q94P22L61m59L63J0o98J65N97l03j16J82q6l09M75
5382B20K97q16N19j8n62K80J79R3n19M78m58k54J024m73m65N68k56k49K00O48
5402D36n40n3K84m89q7Q20l00l13L0K21n93P39J06l36lP1j51J58P12m93l70O82
$$ y = [149, -232, 144, 71, -348, 308, 100, -466, 3, -8, -394, -104, 409, -384, -460, 344, -87, -222, 292, 52, -509, 347, 194, -379, 93, 64, -353, -153, 175, -239, -253, 420, 40, -375, 35, -65, -206, 234, 311, -495, -314, 695, -122, -133, 408, -232, -519, 286, -80, -189, 181, 145, -319, 31, 230, -134, -212, 304, -385, -234, 673, -106, -349, 409, 27, -667, 79, 363, 227, 14, 700, -375, -164, 501, 151, -102, 586, 24, -426, 436, 122, -164, 239, 432, -417, -346, 494, -366, -23, 326, -102, -821, 520, 487, -106, 143, 39, -281, 17, 458, -253, -11, 437, 108, -327, 144, 97, -106, 224, 210, -684, 38, 399, -60, 303, 313, -385, -220, 377, 74, -42, 140, 54, -255, 220, 517, -299, 220, 202, -360, -80, 99, 192, -327, 151, -307, -561, 463, -10, -475, 93, -163, -412, -212, 436, -104, -157, 127, -362, -449, 371, 71, -242, -212, 9, -584, 155, 261, -75, -78, -7, -158, 0, 712, 219, -151, 531]
5424E31l62l05N92l0n78jN24o74O01K75q20j68J85K5O0N31p5o62K77k00j49O55
5446B32K73q67k23O73o7l93Q36j5o40L36j19k02L72L25p23O21k02n33K98N95k93
5467B84o03J78J74l70O74p1o78Q8M49r5J56P8n32r1Q75k85l90L22K11q37M03L10
5489B50k12K64M9m70k51N64m31K05N58m96m65J51N01l79N91j9r33l6Q85j8k89
5510A9J00j99m95P59N4m81M91Q9q33K93P74o42K69K75n98m45L34K17L8L77k06
5531A90o88L31M12m32J99M85q63k66P92J05l87K47j98l72M17M67k40J2m9o30J32
5552c36L66l25L04L13l27n93R57L5l55m7j5o96Q66L98o37l2K19l08j48Q62k97
5573B04n82N25l34m55K80M48j56O5L65m95k12P15J46p58K21j32k51O00K96m35
$$ y = [531, 169, -136, 456, 426, -152, -153, 371, -303, 298, 573, -247, -415, -230, -205, -145, 386, 311, -351, -74, -274, -423, 232, 505, -362, -585, 88, 21, -372, 464, 449, -191, 145, 26, -176, 196, 521, -202, 419, 217, -316, -18, 577, 284, -319, -141, 33, -337, 337, 266, -412, -324, 125, 30, 186, 264, -268, -359, 516, 231, -159, 163, 374, -463, -60, 250, 38, 302, 351, -119, -370, 194, -237, -32, 526, 30, -435, -284, 217, -162, 429, 410, -523, -559, 326, 308, 19, 119, -80, -575, 184, 238, -243, 248, 337, -496, -203, 571, -71, 198, 473, -125, -570, -236, -19, 19, 396, 190, -498, -167, 245, -187, 12, 497, -366, -632, 160, 265, -122, 125, -73, -445, -28, 439, 199, 211, 162, -468, -336, 30, -295, 9, 322, -5, -598, 359, 394, 39, -8, -23, -719, 147, 545, -92, -124, 95, -213, -361, 501, 204, -378, 147, -187, -642, -362, 86, -70, -5, 360, -135, -347, 368, 514, -244, -23, -155, -406, 194, 490, 55]
5593E5k50L84n24J55O16m8l44J24r7k03L29j24j33K41K61o67J76N60m29m60M65
5614H7k85k32Q91k81l54N0N7n59O52O00p79P7K45m65L04K88O3n69L74l47k17P25
5636C25M1l64l0K60q54K55O99j18o63L92O0l67O83N42j207J29J66l19M41K96m90
5657a23j79M73n68J9R06m26n58Q32k41n79N50M80o08l68M08k94kN98N3p42K9L67
5679B7n44M66km38K18M44j65j0J07J0m24L72Kl38M12J86p30M81m4k01J68O32o40
5702a1j86L66j48r9Q5J6n73K30K95o8L99Q4m78j05M07l5j39L88k19m86L86J48
5724B57n18K54N0m05J51O37l76r8K13q0m29OM53k85K91K14l90l9M68k95q1L84
5746C82k92n02P20l87k79M56L50p33M98M3l84L01J61p22J0M93r1M0J36j65m39
$$ y = [55, -195, 189, -335, -180, 436, 388, 44, 168, 71, -132, 197, 73, -60, 181, 442, -225, -49, 511, 82, -378, 87, -198, -430, 461, 180, -174, -124, -67, -626, 26, 626, -153, -76, 169, -296, 8, 296, 359, -210, 164, -183, -400, 325, 366, 2, -28, 232, -622, -367, 332, 214, -449, -57, 3, -364, 319, 861, -346, -217, -51, -370, 71, 367, -123, -302, 171, -397, -378, 528, 102, -456, 376, 135, -444, 106, 586, -22, -390, 18, -276, -278, 320, 373, -369, -340, 27, -517, -51, -53, -491, -273, 171, 6, -4, 103, 113, -311, 61, 63, -275, 137, 323, -407, 74, 30, -171, -3, 629, -11, -197, 169, 21, -78, 7, 23, -550, -320, -25, -93, 306, 390, -88, -193, 214, 179, 40, 428, 209, -277, 109, 257, -261, -7, 43, -362, -211, 426, 50, -48, 165, 85, -344, -338, 115, -170, 121, 335, -55, -94, 374, 79, -2, 382, 90, -412, 308, -79, -358, 98, 448, -285, 213, 256, -128, 173, 334, -388, -378, 115, 24, 64, 200, 35, -404]
5767d04M23K17n09K68K21m86K6P52m96l69M24K17o20M72N1n13N61k34l55Q6N81
5788C13m29j08M77l90k63O92q7m23K98o2l68O35m2m50m6O46n61k14Q72l81m08
5809b99O35k52n94N42J62n23O6M51o39J45N88l37l7K57j12n94L69N31m30O7J40
5830A36k70L45L66m56r9L31l92k01L17J33l32N05j94k52K6N05m86j87M35m28j04
5851c02O82k04p3k1J98m99Q1O74p97K55M53o90J01M82l77o8K60rn65L87K86n28
5873b74J29L61j6j07L04p87L74L12l69j13L38j12j94J46j67j28K68M26n77k89
5893d75Q43l25m37L41O6m95M10J46l85k3N56n54J8O61n78J52K07K3n76O02J42
5914C19o52L94P8m84J47J94q1o4L79n95J37M34l31P4J04j66k01N5R38j002L4M88
$$ y = [-404, 19, 236, -273, -5, 216, -270, -244, 508, 12, -357, 67, 284, -336, 136, 187, -326, 235, 1, -354, -268, 313, -116, -224, 253, -137, -400, 292, 205, -218, 80, 18, -350, 285, 243, -207, -253, 393, -168, -382, 490, 109, -299, 336, 84, -510, 32, 194, -329, -263, 188, -451, -306, 282, -55, -92, 165, 53, -541, -172, 359, -71, -4, 136, -134, 211, 577, 121, 22, 353, -39, -240, 77, 210, -122, 383, 189, -63, -37, 468, -18, -205, 230, -198, -302, 380, 176, 103, 82, 280, -219, -138, 536, -261, -6, 447, -243, -142, 340, -37, -105, 155, 146, -419, -32, 254, -274, -145, 216, 200, 93, 397, -390, -16, 296, -73, -186, 152, 40, -154, -8, -175, -303, -35, 391, -186, -475, 368, 43, -394, -53, 13, -482, -72, 74, -311, -334, 222, -332, -314, 347, -231, -79, 128, 151, -425, 177, 319, -333, 61, 139, -345, -198, -4, -85, -149, 230, -365, -228, 206, -125, -51, 53, -113, -314, -259, 679, -323, -289, 199]
5936A99j70p0R3j97j77L57L2k52K37L67m57K72J65p37K36M36n37O7N84l44m45
5957c41N11R3n11N95k03o00K78L77k70J81J60l80j55K76L07m29q8L30o89N68K31
5978B41j75k1K18m62l05O94j51k23K19m8k58M26K92o28L68k6m07J55O49l68l94
5999b04N89m10k89Q49l55k31J46j43j40K20J19j64k55M25j08l07N91k25m37J53
6019a76J79q5N5L58l95j81K57k47J19K68P3l25K63k58j71J76M84m91o1K48k05
6040a15l80O23j33q4k08O2j9N43m96r2J08J19Qn0M81m32m7L66j29m40L61M3m00
6063c11O01l3k51o1J73k95j20J32J30l15R96p42j91L19j54J84J75L05j011K15
6083b54L24m39QQ04p41k41M72M6j92L84j61l84J45M64l04K99n7m28k07M08K48
$$ y = [199, 29, -41, 52, -145, -322, 35, 67, -185, 52, 419, -38, 234, 399, -338, -102, 334, -203, -136, 448, 104, -341, 170, 263, -248, 347, 144, -456, -178, 199, -71, 110, 270, -110, -265, 11, 318, -111, -199, 131, -558, 10, 241, 66, 45, 263, -199, -504, 190, 39, -184, 35, -13, -271, 155, 447, -181, 187, 161, -246, -91, 558, 190, -204, 385, -25, -314, 535, 180, -51, 95, -48, -188, 32, 151, -13, -268, 157, 49, -258, 333, 108, -329, -176, 3, -82, -27, 331, -64, -245, 12, -235, -116, 152, 225, -100, 163, -95, -266, -90, 394, -97, -158, 90, -115, -495, 128, -5, -89, -297, -235, -254, 289, -207, -299, -191, -72, -64, -114, 367, -65, -112, 254, 125, -315, 46, 89, -311, 290, 257, 6, -55, 118, -177, -297, -165, -35, -350, 646, -96, -287, 32, -122, 62, 237, 542, -469, -254, 70, -369, -361, 443, -298, -539, -67, -21, -213, 171, 10, -374, -229, 235, -69, 230, 173, -255, -462, -54, 194]
6104A94k25K98k9p59O23M0k43J80K36m74j16M49J49l63M43p02k20N06N85l8l37
6125A97R8n92R0M73k81k48L79l02m9M40J09j42j45j6j81%M17k36j43O1l58j94
6147f23Q45k35R0J75k02n25L99K78j47j10P2k26j07N48k78l43O02o12n2M77J9
6168D5m6P6J00p26K84N41j26r9j30l02L17R6J40q0j14j21l73P55J81k64k99K29
6190H4j4m56Q18m20o7J86k63p2O43K41p48%K8j27m14O61N9n78O26m34j10M73J33
6213B49k08O4l08j84P15K7k33j53O7J7m90O37L74p39K62m7l44M60L48j52o57L51
6235E6K00n45P73k57p62N11Lp1L12J51l25k93K21k37J47L89o8m38O2J21m4O05
6257E11l39j53k70N03j36p4M43m08m00K60j81K38M58l12l98J83J62k09L15K12
$$ y = [194, -31, 267, 238, -521, 102, 142, -101, 79, 315, -159, -275, 174, 323, -40, 403, -299, -519, -13, 572, 534, 197, 295, -297, -207, 266, -15, -263, 116, -186, -235, 205, 314, 172, 27, 11, -170, -170, 247, 11, -132, -71, -429, -623, 222, -13, 77, 252, 50, -475, -76, 202, 55, -55, 17, -209, -316, 232, -46, -389, 213, -399, -451, 26, 45, -1, 75, 175, -551, -267, 274, 148, 49, -81, -383, -66, 30, 170, 90, -24, -145, -518, 237, 418, 154, -145, 84, 70, -386, 432, 12, -55, 131, -132, -204, 439, 680, -68, -68, -40, -167, -581, 80, 139, -439, 187, -247, -357, 116, 249, 41, 105, -203, -387, 328, 355, 122, -31, 36, 53, -437, 200, 574, -165, 97, 50, -294, 166, 514, 362, -295, 56, 256, -289, 484, 227, -535, -24, -21, -92, 220, 371, 46, -247, -26, -263, -116, 273, 205, -233, -171, -50, -94, 511, 172, 19, -251, 252, 116, 42, 485, 77, -323, -63, -244, -6, 452, 140, -258, -75, 87, -122, 193, 405]
6277D05m58k53K38j43L39K99m85l20j63N89k65J46M59l71l05M11k12P7n5N1n10
6298e26M15L15j1l12K60m25J68O2j50N7M05k50p25O48Q8j28J83K4j52q4K64j06
6320B0m5K63m22k92M18J16j53k2K10l15l0K78j65K12J82o07M1J99J61r2O8j91
6342a66k63L05M60l44K32k54k65q4L08L46m84J88o3j55L83J35m45M72j46m19J15
6363a44K28j48J00L77m15j07J45J98l85J73K36n96P28k28j32P0L00n33j27M91
6383B31l0K15m43J72m30K51M67m27K04j94J3p4M17k76m06M61k99m4P11k53q9l
6405A74m93Q2R2K75j90J41J65l21k0P3J39k57M4l3k46J04M09k81J27n9J69k02
6427a08N13j67j59K53k24k15R6K98n17M11k60j97LN36n25K98J70k85L1J41j5k1
$$ y = [405, -53, -306, -68, -211, 128, 427, -58, -378, -541, 48, -217, -71, 388, 17, -288, 123, -89, -12, -67, -16, -526, -111, 204, 193, -119, 141, -284, -116, -54, -204, -147, 258, 8, -717, -69, 19, -109, 74, 98, -54, -138, 126, 20, -25, 238, -184, -476, -58, 58, -95, -117, 93, -222, -252, 26, -139, 73, 255, -352, -311, -112, 49, -43, 25, -166, -429, -124, 336, -8, 224, -30, -295, -379, -71, 275, -209, -21, -84, -239, 144, 279, -166, 306, 160, -259, -144, 84, -64, 36, 413, -2, -109, 36, 234, -151, 22, 258, -338, 390, 162, 30, 100, 400, -133, -260, 231, 201, 416, -27, 145, -285, -34, 433, 6, 210, 16, 29, -45, 372, 96, -310, 151, -148, -192, 519, 266, 177, 174, -319, -237, -145, 130, -60, 81, 246, -75, -95, -22, 117, -140, -96, -129, -375, -271, 138, -143, -16, -75, 94, -108, 405, 238, 79, 332, 108, -107, -11, 287, -230, 181, -79, -276, -273, 263, -262, 36, 206, -79, -48, 93, 78, 57]
6449E7m95N41m97L21L27j09m11M36l04n2M02K4m61J50K69m63J34K62k19k96K10
6470a74R7j12K71P6k48M9K02m91N71j1k9m90K13r3j36K70J10j39RJ19K45j29j42
6493C8j65k4O95p45N68p2k95o7J12K1j40K38j96j87M06J76n65K52M9k70j22M58
6515A65k79l65N51N1l73K70J62k66q0L18r8k7K21k36J4J53k02K3K02j78k60J07
6537a27J61m17L28L31n24L33J47k96j99N40k35k34k5K56j2j41J40K8O7q6k79J13
6559a31M0J36k62J12r4Q0J05p4j54K31K18m39R3L54m55k5L74J53n38M16o1m83
6581d04M04k36k6K57R1L4j40J63j98k19L63l36J56N1J46m33L55J70n06J76K13
6602H1j20P3M04o11j50M79m0j45l9J66k2k56J72r9o8M42q0lQ3l16m3j11K44k14
$$ y = [57, -438, 103, -394, -73, 254, 145, -266, 170, -134, -186, 216, 240, -221, -71, 198, -265, -131, 131, -88, -384, -174, -77, -189, 82, 158, -90, -41, 161, -330, 241, 230, 201, -289, -76, -169, -305, -35, 75, -64, -55, 64, 309, 180, 38, -127, -151, 544, -201, 367, 295, 0, -67, 45, 66, -74, 164, -32, -219, 187, 363, -202, 50, 99, -171, -293, 165, -114, -479, 72, 123, -250, 20, 182, -84, -164, 154, 56, 29, 250, 14, 28, 181, -21, 2, 204, 26, -234, -127, 34, -383, -55, 276, -248, 85, 232, -64, -263, 277, 42, -192, -217, 39, 27, -114, 26, 54, 121, 35, -244, -131, -91, 45, -217, -105, -199, -119, -14, -88, -242, -11, 207, -232, -139, 215, -240, -265, 109, 262, -276, 140, 79, -404, 0, -236, -262, -5, 86, 120, -20, 143, -55, -274, 89, -247, -91, -40, 106, -327, 28, 198, -308, -132, 81, -39, 34, 438, -173, -323, 156, 116, -29, -68, 98, 76, -180, -8, -107, -175, 267, 187, 184, 267, -49, -92, -203, 41, -173]
6626a73M75j67k12J54Q7k91N3J19j77M06m2k28r6n4L85m38M21j39l03J21J57m0
6648A8q1K06Rj07k53Q2j38L94N1k91K05j58J6N4j64L01k31K67m40j73O01m2m14
6671b88K16j80R0Q7N08o03k07N13m75K98N31p63J09j25K92k19J88K13m14n8M34
6692A47m9k49M44l15l40K20J83k36K66k17j58K71K46k26j84M45k59r9J36K53m72
6713a93M65k21k10K90J83m74J0M56l38k76O11j52n07L64L12m08M3q5J30j90M57
6734B67m97L44K05j11k25k34K13j72Q9L38j12J21j85m80K53L62l5j22O2j53k13
6755b85N65j08m8k54M13m99R2M69k58j82J43p0m3K83l47K43J25k50m58N82K6k
6777A37r0J44l42k1K35N5k32Jl49K64K21J61l53J36m5k85K97L11l05j98J70l6
$$ y = [-173, 302, 135, -77, 77, 164, -127, -74, 45, -132, 274, 232, 4, -92, -146, 239, -199, 222, 83, -220, -99, 58, 18, -63, 143, 152, 45, -208, -126, -264, 130, 181, -110, 95, -63, -47, 7, -157, 144, -87, 180, -260, -433, 168, 126, -288, -72, -252, -162, -75, 433, -170, -377, 136, -339, -41, 490, -273, -164, -289, 3, -216, -28, 185, -229, -287, 147, 98, -151, 293, -22, -362, -142, 41, -195, 71, -146, -304, -33, 213, -13, -197, 248, -11, -110, 26, 279, -193, 272, 51, -159, 131, 314, -160, -150, 306, -32, -308, 303, 151, -356, 8, 320, -88, -45, -130, 0, -190, 267, -230, 114, 319, 208, -17, -251, -38, -210, -121, 217, 105, 226, 41, -439, -186, 176, 141, 19, 81, -72, -285, 280, 172, 124, -130, 283, -216, -124, 345, 87, -95, 48, -22, -65, 218, -129, 114, 239, -11, -469, 113, 139, 137, 47, 191, -151, -172, 63, 118, -114, -113, -462, -198, 23, 184, -169, -33, -78, -363, -66, 245, -60, -258, -88, -124]
6799a24K02L18J29o83J47k25k6J95M63l92j08j2J19k71N25M26r14RK99m99P64
6820C42m2k83m53K13J28j55O75l39j82J73O5L4p9K50k26l58Q4M44j25M32m84p4
6842D0j86J63j17L56J28n71m5R9MK04rQj78K16Q2n1K00n17p0M96l07k36R0M46
6866B45q96K42L22K60L0M9l42l00L11K28r6O1k4m58L58P9l92N41K41k63l80M1
6888a43J97J45k2j2m08J07K52N2l13K91o0j01k10K79K0j5mj02o4K77k39M92n6
6911C63n91J43K68k41P5J66l61j87M48J60j49p1jk68J01L01j31L27m55mm41N19
6933b9rP5N3k00j14J40J82j55L69m18j39L3L63K9j90K38k74j71nJ69M00j12m06
6956a71k6K35K99M5j74k01j77JJ72J78l87L01K00m12j55N34l62O5J73l07l6K52
$$ y = [-124, 78, 396, 525, -158, -11, -236, -262, -67, 396, 4, -104, -116, 3, -268, 257, 683, -231, -222, 77, -422, 342, 300, 17, -436, -223, -95, -250, 425, 86, -96, 77, 142, 176, 97, 347, 121, -237, -153, 291, 166, 598, 114, 40, -146, 17, -100, 256, 384, -187, -232, -133, -129, 75, 66, 74, -104, 112, 194, 143, 343, -174, -244, 252, -55, -291, -201, 245, -651, -409, -87, 173, 203, 252, -90, -390, -79, 149, 53, 114, 90, -368, -10, 69, -323, 218, 459, 196, -184, -143, 54, 199, 177, 165, -243, -136, 116, 168, -145, 146, 86, -15, -225, 54, 74, 59, 55, -47, -111, 166, -73, 419, 363, -228, -85, 183, -58, 17, 183, -178, -365, 83, 243, 94, 23, 22, -246, -145, 156, 25, 352, -103, -107, -548, -29, -38, 37, 90, -110, -224, -84, 98, -57, 312, -106, -245, -212, 151, 180, -10, 228, -46, -217, -222, -53, 347, 235, -171, -197, 38, 337, 382, 208, 7, -170, -169, 3, 181, -206, 95, 295, -117, -272, 262, -100, -35, 138, -169, -205, 47]
6978D7L18n61J65J23l86M82l0qj59nl61K09L08M8j52j24L04m18K05K46j47j04
7000@L4j31R7J14J9j35J14k52R1K23R7m34R1K76m27%O62m9m02j86P7N2p0K81j27
7025A5j36J27j22M5R4l38J8M50k99J21L8j28K99l38J9j77M88m13J56k75J58J89
7047ir8L37j53m43L76J3n6K05k89o1J52k58p4N31L7J78n58K58J61j97K27k34j56
7070a11j45L25k4R2Q5m87q3L37l0J6K97k9m31J2R5j43K90K34n57j79M87M5o3N2
7094H5K22k35K8m5q5J51kk41m2j73K77n7L87l29J18j1k83m8K77M7j60N16k31j79
7118a3j60L09l29K0M38l11J53p3J88k74J19j17l1m2J63k38K13J35k31J07M5Pq
7141G0N3j81j7n2K49j69J64J18k9l36J93K74n22M47l18K3K58k58m2K5Q7j71o2
$$ y = [47, 365, -196, -31, 92, -294, 188, 158, 150, -9, -14, -375, -166, 142, 190, 38, -86, 218, -200, 5, 251, 104, 0, 34, -97, 0, 114, 133, -2, 112, -140, -49, 174, 271, -163, -72, 204, -223, -223, 439, 390, -12, -198, -121, -69, -139, 142, 15, -121, 6, -116, -71, 23, -315, -297, 153, -146, -25, 13, -115, 184, -154, -135, -312, 176, -237, -81, -356, -198, -9, -107, 230, 77, -366, 10, 23, -33, 172, -117, -178, -26, -284, -358, 173, 210, 388, -170, 88, 249, 52, 279, 45, -111, -256, 69, 45, 137, 222, -265, -348, -11, -41, -25, 272, 243, -188, -176, -81, -224, 66, 300, -257, -436, 51, 96, 33, 85, 307, 72, 100, 55, -30, 121, 119, -122, -164, -337, -60, -117, 270, -59, 59, 48, -235, -283, -6, 41, -119, 397, 166, -13, -173, 136, -193, -173, 265, -46, 107, 34, 222, -52, 67, -50, -81, -123, 40, -198, 15, 150, -81, 26, 71, 78, 70, 123, -58, -75, -127, 122, -47, 117, 235, 206, -130, 63, 337, -185, 262, -56, -33, 225, -33, -75, -50, 37, -134, -196]
7164a96K72k50O6J31k37O8P7J39k30L4L32j88PK79j65j19Q2k84j27N72j97m0o5
7187c9L45n40J38M29n10k29N28k8j76J38j49q9L64m8j69J71j6m10J28N2k66K85
7209i1K47j06j82K98J13l43j36K12j83K4Q3jk08J44J74j82K38P5k13o4J87k04
7231a18J20K59m72L37j47mK26j87k20K75K28m47j4N09j40k74J8J9L1J93o7j29
7253do8L73k03k74K82K20n69J69N06o19K18K9p2n2KN3j39O6J2k37L22J67j1j35
7277C6k66o0J65K29j02l6K63j22n5L63m30q8K97j39j55k2K64k40J10O8Qj61N88
7300E15o48J9R5K06m09K71J19j41J01O6m16K6M95k24k02L36l61k83P60m47p0J55
7322c7LQ1l0Q2j80JJ32k17k02K34o2K09N9Q9q9r1L7l16M27j72K33j23L96l38k45
$$ y = [-196, 76, -174, -108, 23, -214, -146, -69, 70, -160, -126, 206, 18, 25, 304, 139, 20, 102, -182, -309, 263, 66, 26, -39, 306, -234, -96, 333, -177, -406, 122, 94, -82, 56, -93, -182, 182, 134, -35, 136, 120, -290, -162, -110, -376, -91, 156, 50, -132, 166, 279, -64, -200, 12, -171, -147, -64, -65, -273, -129, 45, -137, 101, 176, -37, -101, 86, -118, 2, 261, -211, 126, -21, -25, 201, 14, -206, 69, 297, -150, -164, 345, 205, -69, -51, -32, -1, 192, 125, -4, -72, 301, 98, -176, 106, 326, -243, -74, 432, -187, 31, 60, -12, -64, -62, -9, -148, -82, -70, -307, 15, 182, 171, 36, -230, -290, -125, 104, 2, -34, 229, 107, 52, 415, -15, -103, 194, 55, -100, -122, 142, -98, 12, 80, 88, -73, 515, -133, -114, -19, 187, -222, 49, 168, 27, 128, 194, -222, -196, 299, 75, -127, 209, -152, -435, 325, -122, -192, -37, -34, 47, 17, 99, -81, -80, 52, -165, -367, -133, -195, 14, 73, 162, 73, -18, 19, -297, 130, -42, 191, 68, 464, 126, -119]
7347a19K13o7k91R4R9K15k3K07k35j16M29j24j36R2l67%J26l0L5K24j25m65K81
7370h3L11m67L40J45j13k67J99Q0k45j99K54P1Lj9M8R8k89j85J32L04K36m92R8
7393d0k7K8k6M83m23J71l1k22J45k24K07j78K69l12p9K75j50J20kJ88o74L82M23
7416C03k98k17J48k15J36K88r4R0J7k8k92q6J01J81l23J18O7R2J5J2j33K10m11
7439c19K2M31k44M3k11K92K5j29J63J49j52Nj62N4L64l56P5l67J56k8N47o8l38
7462d8L5n7m2m5L25J46o26q1O74l17J37o7k1k00L55q1l10O33m44J89r0J54k16
7485CK00o2m5k85L27J46k04O6j21m50M51M4q3J38m2j94P3K0K28k0l76J15j2L06
7509B23l36K9K55Kk87K28l2j84j34L84j53k64K59M34k84j29N6j03J49k18K95j74
$$ y = [-119, 94, 27, -264, -170, -71, 144, 121, 328, 93, -23, 406, 282, 146, 238, -129, -129, -3, -33, 2, 226, 101, -364, -83, 228, -239, 101, 246, 133, -134, 65, 145, -100, -299, -45, 26, 29, 10, 58, 156, -133, -318, -186, 118, 354, -138, -40, -67, -39, -65, 418, -5, 166, 135, -87, 58, -166, 41, -137, 132, -180, -259, 16, -134, -14, -16, 172, -502, -120, 303, 5, -212, -64, -279, -143, 145, 51, 141, 158, 130, -162, -248, -147, 34, -289, -171, -104, -12, 3, 15, -118, 92, -319, -297, 134, -110, -67, -278, 14, 39, -90, 73, 222, 70, 75, -87, -33, 331, -25, 50, -317, -161, -189, 358, 290, -48, -13, -70, -112, -157, 168, 314, -312, -393, 281, -36, 101, 34, 13, -187, 168, 87, -223, 410, -34, 155, 65, 219, 3, 203, 141, 96, -189, 138, 284, 80, 146, 25, -425, 26, 70, -13, 125, 83, -111, -38, -18, 210, 190, -186, -71, -83, 223, -113, -84, 171, 173, -114, 114, 82, -102, -236, 148, -5, -269, -10, 424, 140, 11, 67, -36, 113, -105, 190, 16]
7531A6J93l89K6K02J5L5j83O2m3L39p8P6l84n1k8M9L01j69j51jJ48k17N60m34
7555a06J17J35j75j66J64M4j92j09M64m55j11N78p1k49J36r3l43M51M1pm2L3M2
7578H6k23o5J8J30m1J01q5N50m39j63J22k1p7r1L67l53pL10j55m03Q07K9l48L23
7602C72l04k61K48Jj56K97r5r8k17N38p4n18P4n7J61K17JJ16j35n58J48j67P57
7625B90J85p55M05N0j55q6L06j89l19J74R5k71N00l88l1l07N73k47K85l33K62
7646D4j03K40l92M33R6l99L3n7R3O6J68k9m45J55K87l03j9L28n00K65J97Kj12
7669D8K92n24j88N61k67N9L1K56j47r0J28j46J91L06k56k94m0K3J94l2Q5k24P0
7692C6P6j65M31k51j72kP9j75O0M14k52k11K11n9M4J34n7l12K0O11k53k23Q2p1
$$ y = [16, 209, -180, -154, 48, 63, 98, -85, -23, -66, 273, 195, 271, -113, -164, -192, -143, 158, -11, -162, -163, -15, -232, 328, -106, 11, 146, -29, -195, -31, 13, -179, -288, 176, -279, -390, 188, 117, -132, 4, -89, -432, 19, 60, 53, 11, 44, 86, -137, -202, -184, -54, -95, 6, -79, 471, 32, -131, -9, -30, -107, -198, 169, -184, -191, 119, -36, -439, 368, 397, 49, 372, 68, -193, 55, 56, -100, 197, 102, 4, -213, 325, 251, -267, -193, -250, -89, 128, 129, 245, 110, -448, -300, -467, 290, 475, -280, 125, 175, 20, -66, 240, 51, -268, -94, 1, -270, 230, -158, -189, -496, 77, -170, 115, -218, 44, -59, 181, -211, 222, 318, -81, -48, -105, -12, 54, 222, 193, -252, -97, 190, -113, -132, 196, -304, -39, 158, 160, 48, 340, -184, -372, 189, -78, -19, 12, 268, 121, 31, 159, 13, 204, 510, 254, -40, -80, -57, 137, 105, 190, -34, 36, 112, -53, 378, 127, -45, -47, 32, -143, -83, 331, 79, -132, 79, 20, 64, 198, 141, -171, -151, 460, 207, -16, 66, -5]
7716er0M41l76j80K34K72l81l5K21j9k37K27j72M0N9J37k29K33K5m18J26K7J01
7739Aj90R8j58L69M4p0l79J75J13l21L87k54K44j20K51k39o2L94m8l53k2N7K48
7762A65K53n05pJ03jj6k6K06m27M3J64LR1Q5j92N7K25k28j65Q7K29M3p7J7k9l6
7788F2N5P1n86M54Lk35K63k00J10k23P5kJ06J54P9l49nL71m61L37n34K85J50o9
7812h9P8j29K77l2O1k66L12l47J48l1p6J78M1l75M07N9j40l7j30L01m10m9K25
7835b4O7j90L38j24l13L25J89k68j53l13K82J78J20l57K27P2j58J29l4J8l96M28
7857D3l9p9Q3j55K8K43j3n02N56J81m04N7P0j0j14K39l20J24J63p2QJ77m9r3k19
7882i7K18k47K0P8j48J27J14j99k6Q1L3L07j19m5l0j3j81O5J32R6j46J59lj39
$$ y = [-5, -95, 346, -30, -210, 24, 296, -85, -120, 101, 82, -155, 72, -100, -60, -1, 136, -93, 140, 165, -253, -127, -100, 1, -189, -91, -249, 120, 164, 94, -285, -110, 3, -318, 69, -185, 59, -61, 190, -49, -111, 283, 235, -118, -140, -83, 165, 418, -87, -94, 9, 8, -8, -34, 172, -255, -212, -48, -45, 46, 131, -61, -4, 221, -7, -172, -85, 144, 187, 110, 127, 98, 62, 117, 188, -398, 56, 59, -176, 87, -113, -3, -226, -151, -153, -47, 107, 186, -163, -168, 203, -258, 79, -455, -170, -20, -89, -11, -140, 137, 105, 166, -100, 212, -135, 13, -18, -94, 84, 125, -250, 157, 216, 76, 39, -91, 210, -200, -249, -24, 43, -147, 191, 67, -246, 79, 268, 0, -153, -466, -184, -6, 114, -243, -16, 56, -102, 27, -7, 11, -385, 43, 4, -75, 8, -147, -119, 124, 111, -391, 165, 346, -58, -1, 69, 59, -55, 184, -136, -12, 151, 79, 87, 264, 215, 122, -97, 121, -126, -106, -28, -176, -49, 65, -134, -160, -79, -46, 261, 142, 97, 67, 54, -127, -62, 70, 166, 20, 179, 176, 37]
7906C7l5K8O7k46J83j1r9K54L3r4k17L33l70j57J98o1rK50l49L70N5l9k78o3J77
7931d3o4M2L06j81j39Q1j35J45K0J26j96J74k08K13l45M31j37j09j42L42J9p5
7953A25kj59q0R3L62o98O79j97k43J01n9K28j94K15k85R4j00l8J22l9%k8K33k75
7977a45J53J69k11K0n6k36M39l79M36j14j01J78l09J92k16j52K13L39j63l10R6
7998a57K66J85l96K89j68q4K10l5p0o9K26k57R7j68J48k6K4J8j10N0q5J14N8Q2
8022A42m3j4J90m78J67J50l41L41j63j99M14j9k8k24K60m3l93J56K18q8p0J62
8044I7k08j21K50K00j76O1l86P2J88K56m60K95m7l38L57J62k41K28j37k72J7K53
8066E0l8j03Q2k28q9K81j0k3J55k41K72k09J05J22j3r9k64J32J51q0J2M23l27
$$ y = [37, 2, 30, 97, -149, 34, 23, -76, 178, 211, 117, -100, 233, -137, -294, -96, -157, -166, 84, -265, 105, 160, 121, -157, -220, -43, -107, -65, 241, 60, -79, 2, -133, 12, 32, 158, -38, 136, -72, 141, -204, 227, 90, -19, -161, 181, 200, 125, 123, -36, -116, -23, 339, -359, 320, 123, -120, -19, -78, 150, -44, 171, -114, -20, -120, -158, -36, -75, -75, -103, 130, -145, 8, 177, -34, -14, -70, -306, 133, -246, 190, 76, -25, 153, -156, 36, -180, -332, -119, 220, 57, -253, -157, 109, 294, -102, 187, 19, -65, 145, 110, 40, -29, 197, -60, 37, -131, 17, -9, 15, 33, -77, -27, -112, 2, 60, 142, 99, 85, 275, -203, -36, 114, -227, 114, -49, -248, 166, 147, 119, -105, 155, 112, -281, -125, 93, 5, -65, 97, -111, -232, 18, 218, 42, 103, -283, -211, -23, 233, -227, 68, 21, -317, 40, 202, -39, 189, 52, -220, -203, 50, 12, -91, -9, -237, -326, -45, -55, -78, 77, -164, 108, -101, 4, 126, 113, 14, -250, -118, 33, -47, -35, 388, 61]
8089F1q7K3K23M5l01Q4l01M12q1M1l39L47m17j33K93J4J93J79k02q1j54K11Rp5
8113c6j74L05m84M49J24Rm0q8J00l95N71l84l8P2pj87J82O5q3r3J46N5R1Q2P4
8138C16J41j97j66Q5k79K13r8M3k20J3K32Q0j47j93M65m70K9O6K65Mr2K1l30N69
8162C50j20k74j00K3n1r9K18J25j35l4J87k73J94K11j95O8j48m8J1K66k68K46
8184A54m6k46m5j04P13n76n8
$$ y = [61, -26, -3, 220, 265, -36, 48, -253, 159, 78, 119, -220, 127, -290, -423, -130, -116, 77, 256, 54, -27, -181, 30, 39, -36, -210, 95, -389, 60, 184, 193, 153, 65, 165, -230, 341, -43, -81, -9, -16, -203, -21, 44, -39, -132, 14, 69, 160, 242, 316, 457, 260, 94, 179, -100, 113, 15, 58, -162, -149, 83, 163, 16, -177, 288, -182, -153, -87, 178, 182, 90, 111, -219, 350, 230, -44, -144, -121, -172, -271, -53, 72, -63, -97, 90, -183, 11, 222, 27, 95, -53, -101, -90, 176, -92, 154, 108, -138, -183, -287, 426, -150, -208]
8191b08
$$ Imaginary data points
##PAGE= N=2
##DATA TABLE= (X++(I..I)), XYDATA
0@%%%%%%lJ1qQj6J6j7K5l2L8m6N6o7P5q8J03j18J38j60J81k06K35k66L00l38L80
32B01m26M74n28N91o56P26q07Q92r85J093j211J338j484J651j833K043k288K570
50A361k906L314l816M456n302O476q219J1064j6502L0471j28904l16265K87672
63a37100M00750M6945k79439k29877O8853K71143N7446j97268r7416R8975L9451
74D2463p7329p6366K7983J34131M8906j83757j30788J67560J92929n6293j41421
85e1982k7269R5073J10190l9633j56854J2536J79381J7999j83627j16606O7285
96i3507J63875O9218j66707j95727Q2269K11333K3301j06182m4673L0768N8856
107C2824J2531o2840K1886J34225j1360j96693q7577J29152J71584K7028j97717
$$ y = [0, 0, 0, 0, 0, 0, 0, -3, 8, 0, 8, -8, 8, -9, 16, -16, 22, -24, 32, -35, 40, -48, 55, -63, 75, -85, 96, -110, 125, -141, 159, -179, 201, -225, 249, -279, 312, -344, 382, -425, 467, -518, 575, -636, 702, -782, 869, -964, 1079, -1209, 1361, -1545, 1769, -2047, 2409, -2893, 3583, -4636, 6428, -10074, 20397, -108507, -424772, -137100, 263650, 310595, 31156, -198721, -129868, 141275, 198721, 1453, -95963, 3012, 42463, -34866, -111232, -83249, 50882, 99788, -83969, -214757, -47197, 145732, 89439, -51982, -79251, 15822, 126012, 86379, -70475, -57939, 121442, 139441, -44186, -160792, -93507, 70368, 139586, -27121, -222848, -140579, 70754, 94055, -12127, -56800, -26032, 32824, 45355, -17485, 4401, 138626, 127266, -69427, -157004, -27852, 143732, 170760, -26957]
118b6957k30641P0994K86283Q6130j75080j59652K967J39116J37928l2915j25483
129b7310j922O6908p136j3074K7907k348k0937k8333n8453J2821R5919j0151j08291
142g4400m183Q0754K3169l0898m2810J811J10265P4413j21467j30464P6013J55006
154A17209M0293j02652j62297l0620J68699J10856j12860j28940R443O0846M2453
165A2430J763l6117J7710N4862n3673q4078P7938J37318l564j18924j07006J6395
177h4946J59842Q9645j43507j61481M0054J18150L4129m7377p0231J977Q6435
188B2690R339q3230J6318J04115P380p8275m2622K4504Q0728L7864j03047r4041
200i8277P9718R2552o2091r7780L219Q6640P5256o0936j50713J5425J95063P5712
$$ y = [-26957, -257598, -186604, 99679, 185809, 10729, -148923, -145956, -6840, 131088, 98173, -27310, -29232, 37676, 30540, 17466, 45373, 43025, 22088, -6245, -64698, -51877, 44042, 33891, -74400, -78583, 2171, 25340, -5558, -48368, -46557, 63708, 138121, 16654, -113810, -37797, 117209, 157502, 54850, -107447, -138067, 30632, 141488, 28628, -100312, -90869, -30023, 12430, 14193, -21924, -4214, 50648, -3025, -87103, -9165, 128153, 124589, 5665, -101341, -84946, 74896, 164541, 21034, -140447, -100393, 17757, 51886, 4509, -65722, -63745, 22690, 32029, -51201, -34883, 69232, 76612, -1663, -44285, -19781, 60947, 98811, -4236, -98277, -18559, 73993, 11902, -85878, -82659, 3981, 79237, 18301, -132412, -116987, 78076, 153788]
212A53788j30389j25126J6305J28382J03660p3543j55322M094J14375J1641o5025
223a7160j8957J9344K1479j6574o6618J1997J27755L2738j26896p1067P5459J05184
235G6684L3617q0700j12847L1647J30173L332j07153l4164M5404L9161p050o5616
247d7512l3539Q6010O5011p7134o9655N0324P0560J5517l4083n8405J2748Q5159
259F5001k385r3841j0994P1204K1052m6033o4328j6728Q7081P6333q0430j07928
271a01996L9018J01258L1426l7255o5507j2725Q3146M5865p0525m3491M7045K3287
283C9546l1295l4812j5674M0525N5155n1661r3948L3255R9073J3478n3047m5961
295d5366L257P7371N2445p0294o7398N0544N7714k0956m5870k8963J7699N8964
$$ y = [153788, 23399, -101727, -85422, 42960, 146620, 73077, -82245, -78151, 36224, 47865, -17160, -36117, -16773, 4706, -11868, -78486, -66489, 61266, 94004, -32892, -103959, -28500, 76684, 110301, 29601, -83246, -51599, 78574, 81906, -25247, -59411, -14007, 25154, 18104, -47512, -81051, 4959, 69970, -7164, -76819, -26495, 44065, 59582, 25499, -32906, -20158, 65001, 62616, -31225, -42219, 28985, 50037, 4004, -60324, -77052, 10029, 86362, 5932, -101996, -62978, 38280, 69706, 32451, -33056, -45781, 37365, 83230, 12705, -30786, 16259, 39546, 8251, -26561, -42235, -1710, 53445, 1784, -92164, -58909, 40164, 53642, 595, -45366, -42109, 35262, 87707, 17413, -49985, 559, 58273, 37317, -8553, -37516, -19817, 39147]
307C9147j1617r0137p348Q2417K1432m6017k8828P835M8872M2592m8620n9236
319d9508N3904O9739l5226o4972r132L9144N2914j8692j02891k4272J01247M7378
331E9633p0324o0662J3694O3774N3556m1165q1342L2797R7391l977p3920k3263
343c3808L4900N0287J324q3612m8460P7944O0746o1359o7585J4165N2905L9212
355C6659k6044o9006J4653R2574R802p0698j6985M3343L5203k013n6095m1048
367d9655N7922N5766o2478p2067K7721N6280J1331l6083n2890J7559R0907J4806
379E9119q4170k5180O5561M7430j1710n3250m0757N0293P1951m4813r1312R199
391d7639O3397J4889l4100n1826o423P3458M0166o4437m2502N0322M8857k388
$$ y = [39147, 27530, -62607, -69955, 12462, 33894, -12123, -40951, -33116, 15756, 58348, 9728, -49508, 4396, 74135, 38909, -26063, -35195, 3949, 56863, 38171, -64720, -88992, 12255, 59633, -10691, -71353, -57659, 6115, 59671, 18506, -62836, -30039, 67352, 63375, -10545, -33808, 1092, 51379, 52703, -30909, -79369, -1425, 59321, -2038, -69623, -55458, -2553, 36659, 10615, -58391, -43738, 48836, 58638, -12060, -29045, 14298, 49501, 47488, -8607, -49655, 8267, 64033, 1555, -70512, -42791, 13489, 24820, -11263, -64153, -46594, 44313, 59119, -25051, -50231, 15330, 62760, 51050, -2200, -42957, 7336, 79287, 34474, -56838, -47639, 15758, 30647, -3453, -55279, -61702, 11756, 51922, -12515, -55017, -4695, 44162, 41774]
403D1774k9090l2509J8758O1154j1395p2736m749N0041M904l1281k8205q063L7490
416c907L0140m6616l8829M8853M6252j8375k6829n775K3446M6619o630o8967p295
429b7913O5053J2199n0198l4429J832L6187K9414m6521n9862L8371O7216j0675
441B0674m3483j2533K4416N1923J5428o2575l2995O0420L9815l8148m2290p523
453b6871K4038L4970k3426o6304N856O3018M576m0688j3736J4704L4977K6194
465C7308l2748l6095M1676M2409l0872l2791J0060J8685J0334k1673m9599P656
477c5650O2011l531o6416j6652L9424L8960R843m0860m0297M6999O7545k3901
489C7475n5609N243L5894J8625j7004m9481r582N9912J6200o8098l5804L7903
$$ y = [41774, 12684, -19825, -1067, 60087, 48692, -24044, -28793, 21248, 26152, -5129, -33334, -41397, -3907, 26233, -20383, -59212, -10359, 35893, 17518, -9311, -15086, 8360, 54979, 48349, -20618, -27913, 37140, 49339, -859, -35288, -33456, 2731, 32145, -14376, -74238, -35867, 31349, 20674, -22809, -35342, -10926, 40997, 56425, -6150, -39145, 21275, 61090, 22942, -19348, -26871, -2833, 32137, 8711, -57593, -51737, 11281, 15857, -24831, -38567, -23863, 11114, 37308, 4560, -31535, 10141, 52550, 21678, -11113, -1053, 17632, 27966, 6293, -43306, -35650, 26361, 22830, -43586, -60238, -20814, 18146, 27989, -12871, -53168, -6169, 61376, 37475, -18134, -12891, 23003, 41628, 24624, -24857, -34439, 25473, 41673, -26425, -62229, -24326]
501b4326M0646M882l5964m2793L0636P4703n725o1890l338M4347K3624j0996m0564
514f758k0467M7244L4302n3119n0320K4087L5496L095k0347l3478L878N0876Q115
527B2604m1330M830M1793J691k5968j2897J0754M1492J5874o5798n3966M7938
539a2983O1450j3545n3972l9926J2158O4843K3019n8948l0584M3134L0415r757
551A5304j4181m795K0440K7874k8774m9172K3856N1731j2045m4807k2646P493
563b9722L8828J7534m7351l2487M3274L5140k2935k3539N906K8229L3812j8820
575B7869n9494M237O3105J3228m1719l1687o938K1600K8987j6953l2779J6449
587a4095J7460k7559r808L5094K9602m49l6504m5019K8630Q8120J1637q1090n2799
$$ y = [-24326, 16320, 21202, -14762, -57555, -26919, 47784, 42059, -19831, -23169, 21178, 44802, 33806, -6758, -27225, 20019, 54321, 1202, -49118, -25031, 10465, 13560, -6787, -40265, -36387, 14489, 22604, -18726, -13896, 27897, 29588, 3620, -9277, 1477, 42969, 58843, -6955, -60921, -12983, 48467, 34922, -19050, -58976, -46818, 18025, 41044, -17904, -48488, -5354, 25061, 15304, 1123, -3672, 16768, 44642, 15868, -33304, -9448, 42283, 30238, -14569, -37215, -29722, 9106, 26640, -20711, -53198, -9924, 25216, 2281, -21258, -15352, 12877, 46689, 27869, -31625, -27388, 35717, 48945, 7226, -24461, -31399, -9799, 19188, 2235, -30544, -14095, 3365, -24194, -34002, 1092, 30694, 30245, -6259, -51278, -22648, 65472, 77109, -3981, -56780]
600e6780K4346N6595L2151m1485p0703P177N9321N529l2591n213J4199J4923K441
613I910k7972o471N2976K6218m9696l6361K3289L2116R281k4293m0976R586M6442
626B4049j2278n2132M352M6285K0427k1966m8628j3962O9694O2594m3204p1929
638c6698J31M5002L5272n36m3761k8786K3144J1700k2950R795L2599j2048m2112
651b9248k3158K1274O7970L7766o6736p9982L0016Q7008L0110m0957o4375j7125
663d7437N8215M1203m2262m3730J9358K4837p906k0724j3581K3732M3449j4512
675B0642n6105L344N1881J6518j8803j9981n278K1039J3074l5243j9582M3475
687A4981K5368m3423m8533Q32M8677N5938j7943q4540k4577O8524N5088p337l5406
$$ y = [-56780, -32434, 24161, 56312, 14827, -55876, -48699, 10622, 16151, -16440, -21653, -7454, 7469, 9910, -18062, -24533, 28443, 54661, 4965, -31396, -8107, 24009, 33290, 8997, -31979, -22393, 24049, 11771, -40361, -36009, 10276, 30703, 8737, -39891, -53853, 15841, 78435, 35231, -36698, -36567, 8435, 43707, 43171, -590, -29376, -6232, 5468, -17482, -7687, 24912, 12864, -29248, -52406, -31132, 36838, 74604, 7868, -72114, -42098, 44910, 75020, 34063, -30312, -47437, 10778, 51981, 9719, -34011, -14653, 10184, 2278, -18446, -32027, -8295, 35154, 20642, -35463, -32119, 19762, 36280, 17477, -2504, -7782, 13257, 26331, -8912, -28494, 14981, 40349, -3074, -51607, -50775, -2098, 53840, 35897, -48643, -73220, -4696, 50392, 43055, 7649]
700G649l3388K811L6955J1310j4281P547l162m3467j9383L5742M0474Q410m2208
713d991o5437O322Q8744M1388n2504n3794L323M4111M1031j6264n2639K485M5541
726B7316k659l9944j0907J8944K4878K377m2813l1708L7985M1913j5213k3935
738a3766M178P676N840J199o257J9763K8070l2897n8770J1437O2477K8098l2779
751B4269o8695l2661N8354P2140j8139o2183j7745K1754K9995J9265j0253j2163
763C938J1938r674l1259J8708N3090L492m9265m7025k437N8872N0718m3609p7091
776e9604M867O1025K7804k0861l8268m508N0203K7002m5831l4836L7151M1948
788D6092p973l9281l5011J2996N1614N260m8457j8392K1070M772n205O860J0515
$$ y = [7649, -25739, -22928, 14027, 25337, 11056, 18603, 15441, -28026, -47409, -11667, 28807, 37217, -4991, -70428, -64106, 24638, 66026, 13522, -40272, -36949, 7162, 48193, 31929, -20710, -18225, 27316, 24657, -15287, -26194, -7250, 17628, 20005, -22808, -54516, -16531, 25382, 10169, -13766, -9588, -1912, 3928, 5127, -1130, 18633, 46703, 13806, -44964, -33527, 28950, 57048, 24269, -44426, -77087, -18733, 53407, 35268, -26915, -44660, -22906, 7089, 26354, 16101, 3938, 15876, 6202, -25057, -6349, 46741, 50233, 968, -46057, -48494, 10378, 61096, 17487, -59604, -54737, 6288, 34092, 13231, -25037, -29545, 20658, 47660, 1829, -33007, 4144, 46092, 38119, -1162, -36173, -23177, 28437, 33697, -14760, -33152, -12082, -7310, -12515, -5655, 4860]
801D860J2419q423m1875m356O9577M4364m5908o6943j2937M9718O2779r579q1965
814b8269l6509M7564L9861j1056k3836j1718J1156J8498j4823j8151L6572L8880
826D8169k9493m7593J280M1285L9453j2593o4704k7019N2326L7322l1516l9491
838c2574r71K8135K3878k0795m2121J7049N9875L919m5222k0218J9566L5791J8735
851D5047k9931l8502J3146K4712j2221j0875J2147J190j5939j8904p652L4612
863c170M6791k2863o7351n343N9543M6389p376n2860l8928L6711N8033j2972m9656
876a3052q975J8875J1498p435k3594j132L6579O665m5223j5336L9703L1564m892
889B5245k8503k2026K3631M3439j0539m3682O09K9093L206k1188k3293O50L6145
$$ y = [4860, 17279, 8856, -33019, -37375, 32202, 76566, 30658, -36285, -49222, 496, 63275, 53696, -28269, -64778, -17214, 22647, 11591, -12245, -23963, -12807, 5691, -9132, -27283, 9289, 48169, 18676, -28917, -27637, 13648, 53101, 40508, -24196, -51215, 1111, 38433, 6917, -32574, -33545, -5410, 18468, -2327, -44448, -27399, 32476, 36395, -8827, -29045, -9479, 26312, 45047, 15116, -23386, -10240, 14472, 2251, -8624, 3523, 4713, -11226, -30130, -37782, -3170, 43621, 20758, -46593, -51936, 7607, 53996, 46620, -6240, -45168, -8457, 49576, 36604, -13052, -22027, -3152, 8346, 911, -22683, -23815, 12764, 19429, -25794, -41130, -1427, 30137, 25245, -3258, -25284, -1653, 41786, 31247, -12435, -11826, 17267, 20473, -715, -24008, -23358, 12787]
902A2787J4811m4473l1259L2429L7292j323k1669j8324R002L3788L021k9042K242
915g18K6589p598k7911o588J6524K5848j797n1656l1012M6803N0251j6765m6456
928b4486j7623K6381M8283O103m7953j8862L8841K3055k0581k1194j161J8620
940I423J5837k5456l6804J7875L9815q721l3538p553J6583K5345M909l0714j0849
953b3848L7668J9151k9752j9603J5037K3009P355k6682l6802J5440M5540n719
965B0794m3492j1322K1280K1831K344k5291j4392L2270K4257k6914k3256K0963
977i28K6797J363k4527l0046J2794M6791j300n1887j8938K8817K6599r97k8585
990a4047k2457K6347L7963j5908l3630R706K7646P818j3228k2546K81L4016Q756
$$ y = [12787, 27598, -16875, -48134, -15705, 21587, 20264, -1405, -19729, -10727, 23061, 26082, -2960, -718, 25871, 18273, -9638, -16226, 298, 26146, 24349, -27307, -58319, -11516, 38735, 21970, -24486, -42109, -15728, 32555, 38658, -9295, -28157, 10684, 33739, 13158, -8036, -9197, 9423, 25260, -196, -37000, -19125, 20690, 11969, -21569, -29122, -12539, 12806, 17715, -12999, -23848, 13820, 32971, 3219, -16384, -1347, 21662, 29017, 2335, -34467, -19027, 26513, 20794, -22698, -34020, -12740, 9091, 11435, -13856, -28248, 4022, 28279, 1365, -21891, -928, 25869, 27232, 2705, -27341, -14547, 32244, 30944, -20943, -39881, -11064, 15535, 14538, -14047, -36504, -10157, 27806, 11898, -21732, -12026, 15620, 23438, 10210, -12336, -12055, 21961, 30717]
1003C0717l9338j9437K5781J7901r973k0465j2684J9221K9550j5182l4112J2857
1015a5164L5294K960k0590j6236M859L2151J2545l7976k5708K8153K4828j4297
1027A0819k4466j0159J5394K7562r436l8274M055L9915P884k3940j5838P095K8374
1040A8985J6071l1268l1307K5259L3298j2909l0124j0116J3816K5371k986l7852
1052b3762p632L7975J5609k4621j6412Q172K2006J5819j9932k9562J7203L5249
1064C0112r111l1867n553J4836J6751k603l0952j2130L2811J8043k6250j8849
1076b4762J3168K0304J0023j4239k5125J2477L6526m953l5043m953K0390J4205
1088A8018n288k7454j4670K9548K3948k7213k7565J3539K4873Q038j3670k3951
$$ y = [30717, -8621, -28058, -2277, 15624, 5651, -14814, -27498, -8277, 21273, 6091, -28021, -15164, 20130, 23090, 2500, -13736, -8877, 23274, 35819, -2157, -27865, 288, 25116, 10819, -13647, -23806, -8412, 19150, 9714, -28560, -24505, 15410, 23294, -646, -16484, -9389, 18985, 35056, 3788, -27519, -2260, 31038, 18129, -11995, -22111, -8295, 17076, 14090, -23762, -31394, 6581, 22190, -2431, -18843, -10671, 11335, 27154, 7222, -22340, -5137, 30112, 21001, -10866, -16419, -1583, 15168, 12565, -18387, -30517, 2294, 20337, -5913, -24762, -11594, 8710, 18733, 4494, -20631, -8154, 28372, 23419, -11624, -16577, 3813, 18018, 12730, -14724, -29394, 154, 24102, -3111, -30676, -17137, 7736, 15774, 2104, -21847]
1100b1847O375L8778N420l6062j2117K3608J7095n055k3491j7934K0639K8949
1112B4358j9485l3902Q467K5654O175j0858j8707L64L0742J2745k9098j4225K3679
1125E909J5224q316j5564j0451J3155K1965j4753l2924P914K8231K01j7918j2300
1138a9627M097K5291J2893k7565j7915K6537K3235j2257j9679o087J4057K2933
1150B5913r359l6862j611L2912O989k2129j6336J530K1040J7247j9626k4808J9757
1163e343K8599p560k0188l868J1692J9764j865l2193j0245K9825J2918k1315j6983
1176a6762Q23J1949J4491q990k1715R676K4555o986j7021N885J4090P811n281
1189A2525k2568m397L1224J2334l1454k2432J1851J9201P653j5965k6512Q929
$$ y = [-21847, -15472, 23306, 28726, -7336, -19453, 4155, 21250, 16195, -7296, -25230, -4591, 24358, 4873, -29029, -20562, 5092, 11267, 409, -18298, -17934, 12808, 25553, -3545, -17770, 5909, 21133, 12817, -2747, -13198, -43, 21922, 7169, -25755, -17841, 10390, 10591, -7327, -19627, -15530, 9761, 22654, -4911, -22826, 3711, 26946, 14689, -4990, -11077, 2980, 25913, 16554, -20308, -21919, 10993, 17982, -4147, -20483, -18953, 2087, 19334, -292, -25100, -5343, 23256, 15696, -4492, -8360, 3332, 23096, 21231, -10962, -21207, 8618, 21536, 221, -16762, -15939, -3990, 10501, 1511, -20204, -10528, 14027, 7041, -9980, -4095, 9995, 17806, 12525, -10043, -14440, 16784, 29118, -2336, -24768, -12917, 6284, 13937, -2028, -28540, -19611]
1201a9611L4579m77k8928l649J9715J6034l72k1594j5093K5392K5809j9802k8151
1214a6148L250J5603P662o252k0837l922K4098M714k3852l245K1144J0695m985
1227G925j5251j0272K1119K8369j4250l1886R91J9255P422m012j5675j1072J3639
1240c698R007j7445m350J9547N098j3352r131J881K0284K2153j6398l4586O432
1253a4558L3466P615j8572k0250m802K1250J5591k3531k3162J6862K1145o098
1265D956j4945r467J0166K7916M519k9797j0349K2908J2694n954p129p323J182
1278f23Q164r103j1763J5272J2824j8681j9517M928J7546J9862k108l1932j1685
1291b6816L0501K2815r614j4771o957K277J2819P32j4518L387J1047j4426j7555
$$ y = [-19611, 14968, 14491, -14437, -18086, 1629, 17663, 17291, -4303, -19396, 5996, 31805, 12003, -16148, -12898, 2705, 10367, 4115, -16722, -20644, 3454, 8168, -15684, -18929, 2215, 12910, 7925, -7326, -17598, 3521, 31890, 17640, -14246, -13255, 6000, 13422, 9410, -6265, -17337, -3698, 5309, -12136, -16486, 3061, 8159, -5193, -14324, -12443, 7841, 29994, 13596, -20990, -14558, 18908, 26523, 7951, -12299, -17101, 4149, 19740, -3791, -26953, -10091, 11054, 4956, -9989, -19456, -9290, 18626, 23145, -6652, -17001, 5907, 18601, 12647, 5518, -1805, -623, 7541, -1562, -13325, 1947, 14771, -3910, -23427, -18499, -953, 18909, 16801, -15131, -26816, 3685, 26500, 16886, 2115, -4842, -2565, 10254, 10986, -3532, -145, 10902, -3524, -21079]
1304b1079Q269J6757P475o212k4848p838L2431K3293j8817k1134M111J4398J1633
1317A8439o353k1504P17K4912n13k7426r103J3518J5057N334j8905k3276J2535
1330a6568K8221k20j2457j015L12L04O084O67K676J0253j1482k8726L407K9877
$$ y = [-21079, -12810, 3947, 11422, 5210, -19638, -27476, 4955, 28248, 9431, -11703, -7592, 6806, 18439, 12086, -9418, -8701, 16211, 15698, -11728, -20831, -7313, 7744, 13078, -5827, -29103, -16568, 11653, 11433, -1024, -2039, -1727, -1423, 4661, 5328, 8004, 18257, 6775, -21951, -18544, 11333]
$$ [...]
8191B8
##END NTUPLES=NMR FID
##END=
