##TITLE=1H_ANY-162-12
 CDCl3, 72 sc, 
 2.7.2019
##JCAMPDX= 6.0         $$ Bruker NMR JCAMP-DX V2.0
##DATA TYPE= NMR FID
##DATA CLASS= NTUPLES
##ORIGIN= UXNMR, Bruker Analytische Messtechnik GmbH
##OWNER= root
$$ XWIN-NMR		Version 3.5
$$ Tue Jul  2 13:57:14 2019 Russian Standard Time (UT+4h)  she@DPX200
##.OBSERVE FREQUENCY= 200.13155
##.OBSERVE NUCLEUS= ^1H
##.DELAY= (6, 6)
##.ACQUISITION MODE= SIMULTANEOUS
##.ACQUISITION SCHEME= undefined
##.AVERAGES= 72
##.DIGITISER RES= 18
##SPECTROMETER/DATA SYSTEM= spect
##.PULSE SEQUENCE= zg30
##.SOLVENT NAME= CDCl3
##.SHIFT REFERENCE= (INTERNAL, CDCl3, 0, 15.7039)
##AUDIT TRAIL= $$ (NUMBER, WHEN, WHO, WHERE, WHAT)
$$ ##TITLE= Audit trail, XWIN-NMR		Version 3.5
$$ ##JCAMPDX= 5.01
$$ ##ORIGIN= Bruker BioSpin GmbH
$$ ##OWNER= she
$$ F:/spectra/data/she/nmr/H-F/1/audita.txt
$$ ##AUDIT TRAIL=  $$ (NUMBER, WHEN, WHO, WHERE, WHAT)
(   1,<2019-07-02 13:56:03.48 +0400>,<she>,<DPX200>,
      <continue with go, POWCHK disabled, PULCHK disabled
       configuration hash MD5:
       00 E9 B6 7A A2 85 ED C7 34 08 36 98 17 FE 4E 26
       data hash MD5: 16K
       52 68 38 7A 88 5B 3D 2B 80 82 0F 99 CA 4B 2E 02>)
$$ ##END=
$$ 
$$ hash MD5
$$ 1B 89 9D 39 DF F0 BF D5 C4 3A 53 BF FE 68 28 88
##$RELAX= 
##$RELAX= 
##$RELAX= 
##$RELAX= 
##$RELAX= 
##$RELAX= 
$$ Bruker specific parameters
$$ --------------------------
##$DU= <F:/spectra>
##$EXPNO= 1
##$NAME= <H-F>
##$PROCNO= 1
##$TYPE= <nmr>
##$USER= <she>
##$AMP= (0..31)
100 100 100 100 100 100 100 100 100 100 100 100 100 100 100 100 100 100 
100 100 100 100 100 100 100 100 100 100 100 100 100 100 
##$AQSEQ= 0
##$AQ_mod= 1
##$AUNM= <au_zg>
##$AUTOPOS= <>
##$BF1= 200.13
##$BF2= 200.13
##$BF3= 200.13
##$BF4= 200.13
##$BF5= 200.13
##$BF6= 200.13
##$BF7= 200.13
##$BF8= 200.13
##$BYTORDA= 1
##$CFDGTYP= 0
##$CFRGTYP= 5
##$CHEMSTR= <none>
##$CNST= (0..31)
1 1 145 1 1 1 1 1 1 1 1 1 1 1 1 1 1 1 1 1 1 1 1 1 1 1 1 1 1 1 1 1 
##$CPDPRG= <>
##$CPDPRG1= <>
##$CPDPRG2= <>
##$CPDPRG3= <>
##$CPDPRG4= <mlev>
##$CPDPRG5= <mlev>
##$CPDPRG6= <mlev>
##$CPDPRG7= <mlev>
##$CPDPRG8= <mlev>
##$CPDPRGB= <>
##$CPDPRGT= <>
##$D= (0..31)
0 1.2 0 0 0 0 0 0 0 0 0 0.03 0 0 0 0 0 0 0 0 0 0 0 0 0 0 0 0 0 0 0 0 
##$DATE= 1562061111
##$DBL= (0..7)
120 120 120 120 120 120 120 120 
##$DBP= (0..7)
150 150 150 150 150 150 150 150 
##$DBP07= 0
##$DBPNAM0= <>
##$DBPNAM1= <>
##$DBPNAM2= <>
##$DBPNAM3= <>
##$DBPNAM4= <>
##$DBPNAM5= <>
##$DBPNAM6= <>
##$DBPNAM7= <>
##$DBPOAL= (0..7)
0.5 0.5 0.5 0.5 0.5 0.5 0.5 0.5 
##$DBPOFFS= (0..7)
0 0 0 0 0 0 0 0 
##$DE= 6
##$DECBNUC= <off>
##$DECIM= 24
##$DECNUC= <off>
##$DECSTAT= 4
##$DIGMOD= 1
##$DIGTYP= 9
##$DL= (0..7)
0 120 120 120 120 120 120 120 
##$DP= (0..7)
150 150 150 150 150 150 150 150 
##$DP07= 0
##$DPNAME0= <>
##$DPNAME1= <>
##$DPNAME2= <>
##$DPNAME3= <>
##$DPNAME4= <>
##$DPNAME5= <>
##$DPNAME6= <>
##$DPNAME7= <>
##$DPOAL= (0..7)
0.5 0.5 0.5 0.5 0.5 0.5 0.5 0.5 
##$DPOFFS= (0..7)
0 0 0 0 0 0 0 0 
##$DQDMODE= 0
##$DR= 18
##$DS= 0
##$DSLIST= <SSSSSSSSSSSSSSS>
$$ [...]
##$SUBNAM2= <"">
##$SUBNAM3= <"">
##$SUBNAM4= <"">
##$SUBNAM5= <"">
##$SUBNAM6= <"">
##$SUBNAM7= <"">
##$SUBNAM8= <"">
##$SUBNAM9= <"">
##$SW= 24.9336996594482
##$SWIBOX= (0..15)
0 0 2 0 0 0 0 0 0 0 0 0 0 0 0 0 
##$SW_h= 4990.01996007984
##$TD= 16384
##$TD0= 1
##$TE= 0
##$TE2= 300
##$TE3= 300
##$TEG= 300
##$TL= (0..7)
0 120 120 120 120 120 120 120 
##$TP= (0..7)
150 150 150 150 150 150 150 150 
##$TP07= 0
##$TPNAME0= <>
##$TPNAME1= <>
##$TPNAME2= <>
##$TPNAME3= <>
##$TPNAME4= <>
##$TPNAME5= <>
##$TPNAME6= <>
##$TPNAME7= <>
##$TPOAL= (0..7)
0.5 0.5 0.5 0.5 0.5 0.5 0.5 0.5 
##$TPOFFS= (0..7)
0 0 0 0 0 0 0 0 
##$TUNHIN= 0
##$TUNHOUT= 0
##$TUNXOUT= 0
##$USERA1= <user>
##$USERA2= <user>
##$USERA3= <user>
##$USERA4= <user>
##$USERA5= <user>
##$V9= 5
##$VALIST= <valist>
##$VCLIST= <CCCCCCCCCCCCCCC>
##$VD= 0
##$VDLIST= <DDDDDDDDDDDDDDD>
##$VPLIST= <PPPPPPPPPPPPPPP>
##$VTLIST= <TTTTTTTTTTTTTTT>
##$WBST= 1024
##$WBSW= 4
##$XGAIN= (0..3)
0 0 0 0 
##$XL= 0
##$YL= 0
##$YMAX_a= 260637
##$YMIN_a= -412777
##$ZGOPTNS= <>
##$ZL1= 120
##$ZL2= 120
##$ZL3= 120
##$ZL4= 120
##$ABSF1= 10
##$ABSF2= 0
##$ABSG= 5
##$ABSL= 3
##$ALPHA= 0
##$AQORDER= 0
##$ASSFAC= 0
##$ASSFACI= 0
##$ASSFACX= 0
##$ASSWID= 0
##$AUNMP= <proc_1d>
##$AZFE= 0.1
##$AZFW= 0.1
##$BCFW= 1
##$BC_mod= 2
##$BYTORDP= 1
##$COROFFS= 0
##$CY= 11.3945322036743
##$DATMOD= 1
##$DC= 2
##$DFILT= <>
##$DTYPP= 0
##$F1P= 18.9103706918063
##$F2P= -1.10871071338519
##$FCOR= 0.5
##$FTSIZE= 0
##$FT_mod= 4
##$GAMMA= 1
##$GB= 0.15
##$INTBC= 1
##$INTSCL= 1
##$ISEN= 128
##$LB= 0.24
##$LEV0= 0
##$LPBIN= 0
##$MAXI= 10000
##$MC2= 0
##$MEAN= 0
##$ME_mod= 0
##$MI= 1.114404
##$NCOEF= 0
##$NC_proc= 0
##$NLEV= 6
##$NOISF1= 3.799351
##$NOISF2= 2.8
##$NSP= 1
##$NTH_PI= 0
##$NZP= 0
##$OFFSET= 15.70392
##$PC= 1
##$PHC0= -8500.275
##$PHC1= 14.80097
##$PH_mod= 1
##$PKNL= yes
##$PPARMOD= 0
##$PSCAL= 0
##$PSIGN= 0
##$REVERSE= no
##$SF= 200.130013532006
##$SI= 16384
##$SIGF1= 3
##$SIGF2= 2
##$SINO= 400
##$SIOLD= 16384
##$SREGLST= <1H.CDCl3>
##$SSB= 0
##$STSI= 0
##$STSR= 0
##$SW_p= 3612.71676300578
##$SYMM= 0
##$S_DEV= 0
##$TDeff= 0
##$TDoff= 0
##$TI= <>
##$TILT= no
##$TM1= 0
##$TM2= 0
##$TOPLEV= 0
##$USERP1= <user>
##$USERP2= <user>
##$USERP3= <user>
##$USERP4= <user>
##$USERP5= <user>
##$WDW= 1
##$XDIM= 8192
##$YMAX_p= 0
##$YMIN_p= 0
$$ End of Bruker specific parameters
$$ ---------------------------------
##NTUPLES= NMR FID
##VAR_NAME=  TIME,          FID/REAL,        FID/IMAG
##SYMBOL=    X,             R,               I
##VAR_TYPE=  INDEPENDENT,   DEPENDENT,       DEPENDENT
##VAR_FORM=  AFFN,          ASDF,            ASDF
##VAR_DIM=   8192,          8192,            8192
##UNITS=     SECONDS,       ARBITRARY UNITS, ARBITRARY UNITS
##FACTOR=    0.0002004,     1,               1
##FIRST=     0,             0,               0
##LAST=      1.6414764,     0,               0
##MIN=       0,             -412777,         0
##MAX=       1.6414764,     260637,          0
$$ Real data points
##PAGE= N=1
##DATA TABLE= (X++(R..R)), XYDATA
0 0 0 0 0 0 0 0 0 0 0 0 0 -65 72 -72 72 -72 84 -144 144 -155 216 -222 282 -304 364 -424 473 -540 611
29 611 -692 777 -877 984 -1100 1223 -1362 1521 -1697 1871 -2080 2307 -2554 2830 -3126 3467
45 3467 -3843 4273 -4752 5303 -5946 6699 -7594 8692 -10065 11833 -14231 17663 -23024
58 -23024 32664 -55583 260637 -66940 -291741 226576 72513 -64114 125120 12785 -185883
69 -185883 128843 95191 -174516 48821 136787 -244137 -60005 251036 -116332 -249836
79 -249836 162619 45513 -216996 36864 66014 -167540 38622 86179 -206324 -8923
89 -8923 208991 -168455 -168508 236889 20065 -245847 80707 118248 -130051 39072 77579
100 77579 -172831 35357 210438 -139083 -110012 216115 -21605 -159638 194421 99943
110 99943 -199795 65998 187390 -87652 11240 137648 -95409 12920 225086 -94791
120 -94791 -144298 244249 71359 -234741 79088 170566 -148046 -35336 121628 -109209
130 -109209 -45069 131026 -120976 -122866 169231 -43448 -222702 122345 83572 -237704 3067
141 3067 167215 -155772 -103656 143945 -56097 -100223 111722 -60650 -133226 170018 34690
152 34690 -239633 68180 184816 -158294 -65123 164921 -63937 -79736 152853 -25241
162 -25241 -115252 154073 46733 -149309 117832 134330 -158256 29744 213004 -90397
172 -90397 -82987 190080 12040 -102967 125470 30055 -113454 121911 71190 -184073 48295
183 48295 174944 -154421 -100534 169195 -41261 -146331 92708 -2298 -141297 74917
193 74917 28836 -175556 38993 104376 -174233 -41944 162193 -110973 -140325 156487 8300
204 8300 -174163 68198 67868 -125502 36944 73133 -138684 21168 154622 -128292 -89695
215 -89695 191526 -7287 -149572 122045 78538 -126663 68032 114042 -107670 29527
225 29527 151273 -86019 -27942 178793 -39221 -104549 168963 49818 -153622 84123
235 84123 119099 -122928 1689 112850 -98020 -31571 128022 -94440 -110460 146050 -8864
246 -8864 -180289 71372 74517 -155372 -4774 93320 -120163 -42943 107684 -90940 -88382
257 -88382 122208 -39535 -140198 109508 43531 -170788 38866 122092 -124121 -43249 123396
268 123396 -55377 -60297 110693 -34269 -86181 133649 26980 -140838 91591 124231 -121198
279 -121198 3481 154153 -57211 -46089 141165 -10905 -73112 125605 28817 -104799
289 -104799 95575 75503 -130770 35228 131447 -111924 -58265 137180 -42647 -107749 91482
300 91482 -3927 -118130 70727 28635 -148733 31750 94694 -138495 -49046 121471 -74015
311 -74015 -101799 101888 -16328 -121026 75423 30680 -129313 42895 76469 -125317 -5404
322 -5404 123807 -89921 -75408 135471 -11666 -110865 92927 49501 -96943 61135 75374
333 75374 -93744 37707 124608 -84345 -29085 155386 -19676 -88193 122116 45440 -101972
344 -101972 70425 79961 -94187 22607 96689 -84134 -22212 112094 -65525 -82928 114376
355 114376 -7346 -133555 65159 56108 -125549 2127 74383 -99199 -30234 87367 -81429
366 -81429 -74036 102176 -31036 -120918 77788 34553 -127480 26795 77894 -104426 -18270
377 -18270 97984 -69498 -54478 106386 -28828 -87142 102193 28285 -112393 65340 91819
388 91819 -95148 6563 115791 -51266 -25261 116172 -22759 -56615 117943 20311 -95860
399 -95860 85920 77080 -103436 21052 108062 -74776 -35331 105801 -38964 -72596 87161
410 87161 -7393 -97666 66440 28595 -120963 27507 77912 -111687 -38169 97754 -61171
421 -61171 -82970 79236 -17716 -95367 59899 16443 -109426 36822 61382 -107623 -11088
432 -11088 96142 -70994 -58686 99369 -19190 -84858 80106 28073 -88461 53016 65861
443 65861 -82563 22590 101604 -63968 -24615 118835 -15582 -65669 99132 31857 -76184
454 -76184 67083 61123 -80875 32700 88845 -75004 -18961 105465 -42090 -69893 91869
465 91869 2122 -97384 54789 38031 -99318 15154 61054 -90782 -20667 78574 -72587
476 -72587 -65464 87914 -25679 -104353 61479 27967 -106491 18972 57964 -89152 -12987
487 -12987 75172 -66905 -45161 90090 -29017 -78191 82288 22932 -93611 50485 69193
498 69193 -80657 9000 93215 -49438 -23677 98127 -18253 -49622 95570 19112 -75784
509 -75784 69728 63357 -79278 23334 87499 -59673 -19293 90830 -34306 -54329 82219
520 82219 -2496 -83739 58388 33812 -95343 16880 63897 -82886 -27253 74850 -54062
531 -54062 -61509 68221 -21814 -83612 54585 11634 -97790 27630 53536 -92378 -17510
542 -17510 78601 -57717 -52064 75506 -19406 -69775 64589 15329 -79428 47748 54297 -78607
554 -78607 14656 86846 -55342 -23912 98123 -13988 -55139 84170 25187 -64035 58337
565 58337 53829 -66296 29611 78420 -60286 -12977 91983 -32501 -54916 80662 3949
576 3949 -77314 52308 32925 -82240 18517 56755 -75819 -20099 69516 -53889 -56223
587 -56223 68612 -20019 -83557 49182 16456 -89029 18607 44954 -79012 -11259 63722
598 63722 -59690 -43633 73967 -23988 -71287 61211 19031 -76990 35804 50866 -65239
609 -65239 9251 71340 -48131 -17899 83563 -18958 -45876 80632 19397 -63299 57891
620 57891 55156 -62803 20581 74255 -45994 -12640 77534 -26186 -39642 74194 -1978
631 -1978 -67773 55411 31469 -78816 19218 56327 -68713 -19686 65524 -46878 -50814 61702
643 61702 -17461 -72441 46367 12628 -83900 21512 42664 -77266 -12997 62617 -54617
654 -54617 -44049 63925 -23474 -62961 55165 11179 -72770 36667 46373 -66879 6626
665 6626 68863 -45769 -21625 78000 -14846 -41495 71750 16660 -55213 53271 46951 -58505
677 -58505 23566 70029 -47894 -10483 79008 -21692 -42732 67438 5795 -58049 46313
688 46313 28687 -65736 20016 49442 -63346 -14406 62898 -44029 -47892 58853 -14168 -68870
700 -68870 39964 14800 -74342 14886 37305 -68413 -11079 51228 -52119 -39396 59485
711 59485 -23113 -61491 50148 12020 -69590 30001 41732 -60901 4373 61347 -43860
722 -43860 -19418 71819 -16145 -42219 65925 16457 -54025 48736 45195 -52863 21988 65412
734 65412 -42182 -7167 72821 -22310 -36228 67716 4960 -56603 48312 31638 -63582
745 -63582 16778 49663 -53949 -13971 55184 -39026 -39391 55323 -16191 -62221 42094 12975
757 12975 -71510 16111 36920 -65181 -13564 50108 -46064 -38238 50713 -21656 -54767 44758
769 44758 6183 -64202 29332 35535 -60813 4138 57243 -41950 -20900 64737 -14480 -39385
781 -39385 59265 13712 -47371 44463 39904 -49368 21065 59373 -39517 -6906 67882 -18943
793 -18943 -31965 62296 5184 -49447 44483 28325 -56247 19520 46578 -51327 -10510 55813
805 55813 -35334 -38043 51673 -13525 -56960 37392 10614 -64698 17146 32255 -63935 -10550
817 -10550 47710 -46860 -37039 49304 -20073 -54834 40729 7229 -60605 24841 31244 -56737
829 -56737 3683 50150 -42557 -19472 60528 -17866 -38937 57108 12575 -48110 39208 37996
841 37996 -45364 18032 54592 -34911 -5956 62267 -17275 -28040 60129 4795 -45719 43607
853 43607 28664 -52155 19682 45197 -45882 -9632 52261 -31211 -33315 48741 -10907 -51397
865 -51397 36150 12262 -60658 13903 30683 -56367 -9740 44124 -42821 -33975 45295 -20943
877 -20943 -50943 39511 6596 -59565 20804 30076 -54281 132 46175 -38395 -19641 53874
889 53874 -17246 -36147 51243 9636 -45528 39150 33905 -46650 17444 54091 -34998 -7570
901 -7570 60640 -15234 -27879 55475 6490 -41154 42086 26159 -47705 20992 43481 -44122
913 -44122 -6099 52303 -29656 -31566 48337 -8975 -49195 33938 11646 -55158 13873 29404
925 29404 -53093 -7787 40018 -39987 -30667 43056 -19733 -48773 35072 4162 -55387 19982
937 19982 26509 -51642 669 43623 -38217 -19864 50324 -16142 -35683 45483 7669 -43014
949 -43014 34022 31368 -42494 15120 48114 -32650 -5228 56836 -15338 -26024 53230 7060
961 7060 -39567 38569 27617 -42599 18536 41627 -38184 -5006 49265 -27130 -26875 47147 -8920
974 -8920 -46305 33855 12994 -54048 13889 30130 -50194 -8714 39351 -38016 -28774 40595
986 40595 -18595 -45692 34788 3600 -53681 19041 24300 -51738 -876 40507 -37913 -21051
998 -21051 46378 -17669 -34764 44022 6212 -42792 31179 30026 -41889 14028 45684 -30968
1010 -30968 -5680 54322 -13763 -23185 51148 6657 -37180 37486 27626 -41435 17508 41680
1022 41680 -35180 -5599 47375 -22601 -26399 43851 -6051 -41933 33018 12097 -49216 14609
1034 14609 27309 -47905 -7499 38229 -35312 -29262 38685 -16770 -43935 30373 3501 -50592
1046 -50592 16525 22233 -48033 -632 37252 -37236 -20368 43797 -16578 -34419 40959 6195
1058 6195 -41754 29092 27750 -40146 11991 42581 -30549 -5684 49913 -13773 -23574 48922
1070 48922 6025 -35036 36671 24605 -37765 18120 40018 -33766 -3174 46368 -21338 -24022
1082 -24022 44162 -4185 -39219 32503 12395 -45503 14942 27513 -44028 -7182 36615 -33298
1094 -33298 -25831 38401 -16175 -42524 29562 4031 -48858 14461 21553 -45950 -1954 33399
1106 33399 -34708 -19582 39916 -16681 -33417 37374 4405 -40962 25907 25392 -39962 10995
1118 10995 40413 -28983 -8033 46789 -13430 -22349 44820 6748 -32379 35310 24311 -37028
1130 -37028 18564 38807 -31373 -2267 44963 -20145 -21917 42674 -2517 -36854 32226 14130
1142 14130 -43365 15559 27791 -41206 -5056 35027 -31889 -24124 37854 -15772 -40620 29946
1154 29946 2699 -47632 14451 20617 -45159 -2885 32481 -34095 -20190 37843 -17522 -33386
1166 -33386 34401 3468 -39780 25571 22442 -39591 9295 38416 -29481 -8483 45314 -13263
1178 -13263 -23126 42244 6226 -31395 33135 23526 -34495 16714 36612 -29862 -2149 43306
1190 43306 -18192 -20796 42090 -2187 -34130 31037 13931 -40093 13704 27324 -37481 -5232
1202 -5232 34615 -28023 -23477 34594 -12750 -36591 27083 2605 -44864 13641 18216 -43172
1214 -43172 -2941 30939 -33379 -19374 34183 -16080 -32555 33068 2499 -38285 21906 19448
1226 19448 -37363 9525 34413 -28352 -7248 42959 -13440 -21433 41706 5128 -31186 31243
1238 31243 22739 -32944 15823 36612 -27766 -1829 41918 -17242 -18144 41488 -2318 -31305
1250 -31305 30630 13994 -37688 15551 27203 -37142 -4583 34017 -27121 -22196 33504 -12534
1262 -12534 -35886 26084 3150 -42845 13858 18215 -41340 -2281 30432 -32329 -19847 33310
1274 33310 -16152 -32725 30494 1981 -38102 20206 19462 -36602 6590 33892 -27385 -7780
1286 -7780 38904 -13595 -21413 38588 5112 -29923 30524 21451 -32961 16016 34858 -25703
1298 -25703 -1522 40655 -15678 -17360 39528 -765 -29890 30338 13716 -35379 15536 26696
1310 26696 -33994 -2158 34144 -25676 -20276 33460 -11712 -33782 27125 4071 -41215 12990
1322 12990 18422 -39897 -2631 27668 -31339 -18192 31597 -17361 -31670 29410 1178 -38177
1334 -38177 19810 18269 -36533 5837 31326 -27816 -8759 37278 -13404 -21854 37154 4223
1346 4223 -29319 28677 20132 -30178 15108 33533 -26014 -1406 39248 -15660 -16962 37700
1358 37700 1162 -27602 29040 14334 -33041 15156 25983 -32100 -1565 31627 -23992 -19162
1370 -19162 32961 -11278 -31473 25100 4340 -38919 11983 18317 -37412 -3638 26240 -30509
1382 -30509 -18450 30080 -16359 -29614 27162 185 -36794 18189 16381 -35219 6036 28972
1394 28972 -27473 -9778 36616 -13935 -20971 34561 3072 -27974 26525 19973 -30679 14444
1406 14444 31027 -26476 -491 38463 -15162 -16191 37865 -574 -26670 30040 14470 -32713
1418 -32713 15831 25798 -29325 -1362 33223 -21727 -17242 31790 -10794 -30375 24809 5250
1430 5250 -36507 13105 16702 -36843 -2626 25657 -29168 -18802 28384 -15118 -29062 25803
1442 25803 819 -35083 15572 15607 -34350 3721 26590 -26974 -9597 33172 -13801 -21025 33648
1455 33648 2545 -28071 24856 18245 -28980 12268 30140 -22602 -1827 36806 -12478 -14635
1467 -14635 35851 -134 -24625 28974 14690 -30086 15580 26331 -27208 -81 31866 -19623
1479 -19623 -16619 31409 -8280 -28602 24843 4702 -34493 12338 16669 -35520 -2295 24789
1491 24789 -27617 -16885 27930 -15293 -28770 24511 185 -34661 15583 14678 -33170 2539
1503 2539 25126 -27253 -10395 30686 -13930 -21018 30821 1074 -27674 23609 16898 -27664
1515 -27664 11829 28472 -22464 -2564 34479 -12208 -13992 33787 969 -23946 27268 13961
1527 13961 -27525 14941 24192 -25613 1098 31260 -18035 -14872 29685 -6541 -26267 23436
1539 23436 5115 -31782 11411 15958 -31582 -2270 23675 -26179 -16371 25857 -13717 -27153
1551 -27153 23224 125 -33218 13559 13691 -31737 1458 22919 -25510 -9968 28730 -13362
1563 -13362 -20672 27716 1093 -26481 22264 15497 -26939 11760 27361 -21637 -1731 33091
1575 33091 -12150 -13406 32585 1081 -21482 27092 13165 -26186 14626 24129 -23639 1237
1587 1237 30430 -17284 -13444 29223 -6221 -25628 23259 5517 -30364 12223 15954 -30706
1599 -30706 -1594 23024 -24513 -15899 24353 -13333 -26248 21287 -992 -31279 13828 11987
1611 11987 -31419 2289 21984 -24254 -9777 26916 -12948 -19385 26768 758 -26366 20069
1623 20069 13902 -26570 10199 24934 -20769 -857 31133 -11749 -12918 30616 1880 -20828
1635 -20828 24964 14141 -24969 12987 23339 -21961 476 28130 -16027 -12241 28851 -5669
1647 -5669 -22966 22689 5800 -29358 12583 16504 -28856 -709 23037 -22485 -15394 23813
1659 23813 -13009 -24425 20743 -996 -30468 12958 10618 -30820 2103 20042 -24519 -10151
1671 -10151 25719 -13929 -19948 25106 -57 -25271 18870 12509 -25240 9533 23331 -19394
1683 -19394 -1662 29145 -12436 -11941 29344 1179 -20230 24013 12189 -22683 13807 22282
1695 22282 -20426 1247 27974 -14416 -11150 27123 -4037 -20732 22672 5790 -26180 11898
1707 11898 14901 -26266 -950 21610 -21864 -13337 23039 -12021 -22812 19242 162 -28660
1719 -28660 11994 10513 -29155 1161 18541 -23210 -9873 23425 -12916 -18743 22223 -998
1731 -998 -24778 17927 11228 -25103 9926 21944 -20486 -3406 27036 -10648 -11767 27674 -295
1744 -295 -18651 23498 11563 -22572 13777 21764 -21037 760 26531 -13190 -10578 26655 -3399
1757 -3399 -19440 21853 6107 -24150 12689 15134 -24944 236 20843 -20927 -12381 22468
1769 22468 -11576 -22012 19525 -1151 -27427 10050 9833 -27996 59 17550 -22940 -9612
1781 -9612 22162 -12625 -18305 21750 -1453 -23590 15519 10903 -24528 7134 20794 -19681
1793 -19681 -3134 25362 -10430 -11388 25589 294 -18296 21084 11453 -20961 12479 20739 -17841
1806 -17841 1924 25929 -12027 -8763 26251 -3697 -18027 20839 6266 -23042 11618 15108
1818 15108 -23612 -372 19761 -19455 -11505 21304 -10361 -21047 18099 -980 -26141 10160
1830 10160 8956 -26813 297 16483 -21641 -10315 19855 -13007 -18578 19854 -2067 -23445
1842 -23445 14889 8761 -23516 6195 18122 -19204 -2899 24575 -11183 -11616 24697 391
1854 391 -17337 20812 10674 -19743 12692 18526 -17404 2290 24793 -11946 -8033 24579 -3315
1867 -3315 -16516 20134 6505 -22054 11417 14760 -21670 786 20291 -16548 -9787 21625
1879 21625 -8899 -19815 16563 -1053 -23858 10126 8881 -25271 126 15925 -21619 -9634
1891 -9634 19839 -12641 -17636 18208 -1844 -22221 13412 8222 -23764 6626 17428 -18371
1903 -18371 -3315 22761 -11343 -10877 23332 -1156 -17245 19870 9210 -19052 11875 18325
1915 18325 -16514 2452 24066 -11150 -7585 23781 -2367 -15548 20103 6788 -20335 11727
1927 11727 14447 -20372 1697 19042 -16769 -9457 20843 -8841 -18151 16750 491 -23187
1939 -23187 9754 8409 -24335 1284 14368 -19292 -8907 16973 -11881 -16338 17241 -2126
1951 -2126 -22025 12196 7724 -22237 4314 16350 -18029 -3276 20797 -10168 -10427 22062 -396
1964 -396 -16467 18160 8757 -17851 10681 17533 -15503 1660 21595 -8772 -7386 23328 -2026
1977 -2026 -14221 18986 6776 -17979 11432 14240 -18584 1995 19386 -14742 -8517 20315
1989 20315 -7835 -17108 16155 540 -22047 9508 7657 -21833 888 15187 -18834 -8484
2001 -8484 17352 -12026 -16493 17062 -3014 -20417 11002 6071 -21742 4949 14918 -18434 -3586
2014 -3586 19565 -10238 -10481 20354 -894 -16031 16883 8543 -16963 11053 15884 -14623 2263
2027 2263 21884 -9205 -6591 22961 -1294 -13198 17808 6332 -17048 10978 14214 -16194
2039 -16194 1885 17663 -13138 -7191 18298 -6605 -15646 15957 720 -19762 8662 8716 -21123
2052 -21123 44 13599 -18035 -8346 16187 -11451 -15928 14596 -2359 -20002 10684 5691
2064 5691 -20886 3144 13138 -17356 -3429 18573 -9662 -10385 18977 -840 -15715 15702 8565
2077 8565 -17297 9241 15305 -14828 1377 19861 -9152 -6168 20416 -1978 -12692 17719
2089 17719 5963 -15882 11683 13919 -15927 2504 18826 -12133 -6041 18633 -6071 -13489
2101 -13489 15334 515 -18319 9849 8593 -19880 1349 13084 -17436 -7161 15125 -10143
2113 -10143 -14072 13670 -2523 -19180 8684 5461 -19882 3021 12667 -16045 -3975 15990
2125 15990 -10147 -10723 17656 -2493 -14806 14814 6977 -16117 8110 15235 -13733 1650 19072
2138 19072 -9530 -6253 19868 -1607 -11167 16797 6986 -15061 9706 12492 -14811 2773 17756
2151 17756 -11937 -6519 18162 -5653 -12816 14900 1535 -17981 7845 7472 -18111 1039 12388
2164 12388 -15519 -6529 14092 -10485 -14073 13608 -2730 -18230 9489 4698 -19476 2470
2176 2470 10932 -15933 -4083 15778 -9956 -10119 16105 -1664 -14584 13262 6775 -15911 8273
2189 8273 13175 -13600 1119 17434 -8546 -6187 18919 -192 -10842 16064 5596 -13514
2201 -13514 10741 12535 -13360 3120 15771 -10600 -5140 17280 -4245 -12374 14468 2387
2213 2387 -16076 8644 8306 -17030 1318 12204 -14713 -6409 13965 -9306 -13540 12918 -2444
2226 -2444 -18081 8471 5212 -18371 1588 10752 -16507 -4289 13667 -9514 -10240 15028 -881
2239 -881 -14104 11929 5557 -15506 7507 12736 -13566 514 16961 -9248 -6539 18402 -788
2252 -788 -10315 16239 6082 -13319 10555 11546 -11793 3387 16659 -9977 -4904 17114 -4350
2265 -4350 -11745 14523 2031 -15650 9259 8383 -16636 1861 11614 -14534 -5933 13812 -8846
2278 -8846 -12115 12114 -2776 -15666 7645 4316 -18621 905 10056 -14451 -5466 13183 -9442
2291 -9442 -9911 13448 -2093 -13856 11340 5754 -15429 6862 13030 -12423 -717 16959 -8123
2304 -8123 -6344 17203 -785 -9740 14951 6109 -12617 8985 12840 -10945 2385 15352 -8353
2317 -8353 -4665 15693 -4049 -10582 13558 2622 -14054 8559 7850 -15417 2022 11204 -12635
2330 -12635 -6331 12584 -7634 -11896 12037 -2718 -16389 6918 4837 -17284 999 9878 -14806
2343 -14806 -4711 11816 -10472 -10246 13226 -3559 -14618 10482 5371 -14755 6087 11315 -12533
2356 -12533 512 14784 -7997 -5346 16665 -1127 -10305 14677 6308 -12654 9459 11650 -11320
2369 -11320 3244 16044 -7943 -3340 16511 -3292 -9666 14327 3207 -13069 8629 7862 -14759
2382 -14759 1923 12156 -12943 -5192 12994 -6953 -12250 11742 -1042 -16299 8728 4704
2394 4704 -16006 1260 9073 -13567 -4918 12800 -10130 -10594 12751 -2991 -13938 10305 4382
2407 4382 -14281 4992 10277 -12626 -554 14672 -6917 -6668 16077 -919 -9670 12914 5022
2420 5022 -11522 9358 11570 -11121 2310 15732 -7838 -4582 15428 -3233 -8932 14660 2965
2433 2965 -11706 8300 8626 -14258 2036 12046 -11955 -4433 13893 -6647 -11091 11595 -1381
2446 -1381 -14304 6435 4058 -14971 2259 9759 -13478 -5114 11392 -9811 -10363 10605 -2844
2459 -2844 -13132 9142 4370 -14946 4197 10396 -13633 -999 13540 -7519 -6087 15145 -1497
2472 -1497 -10186 12792 5958 -12062 7300 9894 -11145 1857 14038 -7143 -3197 15831 -3003
2485 -3003 -8870 13489 3663 -12550 8321 8463 -12812 2452 11836 -10795 -5108 12355 -6545
2498 -6545 -10823 11100 -1477 -14458 6876 3940 -14871 1300 9361 -13300 -4058 11552 -9106
2511 -9106 -10455 11835 -3290 -14312 8892 3996 -14260 3922 8671 -13004 -897 12385 -7332
2524 -7332 -5748 14237 -867 -10750 12188 4885 -11156 7421 10631 -10583 2769 14462 -6861
2537 -6861 -2961 15974 -1519 -8600 13460 4048 -11520 9183 8775 -13166 2032 12425 -10018
2550 -10018 -4505 13303 -6905 -9984 11406 -959 -14123 7279 5259 -15620 1754 9820 -12693
2563 -12693 -4781 11181 -8985 -9599 10052 -2908 -13788 8237 3057 -14868 4440 9096 -12376
2576 -12376 -1486 11257 -7613 -6617 12859 -1919 -10387 11627 4565 -11232 8177 10189 -9971
2589 -9971 1829 14552 -7250 -3200 15815 -2974 -8443 13899 3927 -11360 8651 8472 -10891
2602 -10891 2625 12061 -9901 -4258 13130 -5651 -8928 11108 -910 -12989 7302 4889 -13719
2615 -13719 1306 8581 -12549 -4190 10863 -7201 -9935 10408 -3293 -12974 8387 3549 -15022
2628 -15022 2960 8459 -12225 -1749 11958 -8187 -6587 12821 -2174 -10319 10297 4309 -12728
2641 -12728 7911 10190 -10358 2680 12795 -7152 -3084 14220 -2366 -7793 12629 3906 -10624
2654 -10624 9205 8042 -11437 3209 11823 -9312 -3495 13528 -5202 -8878 11298 188 -13846
2667 -13846 7479 4113 -14313 1873 8640 -11724 -4719 10540 -8183 -10220 10232 -3006 -13554
2680 -13554 7582 2420 -13822 3258 8218 -12316 -1382 11480 -9200 -6141 12886 -2549
2692 -2549 -9510 11193 3414 -10816 6865 8751 -11239 2419 13203 -7344 -3318 13935 -2950
2705 -2950 -7348 12985 4119 -10741 7963 8797 -11079 2907 10991 -8885 -3013 13110 -4469
2718 -4469 -8211 11116 -562 -12445 8455 4668 -13408 2155 8551 -12308 -3859 10304 -8439
2731 -8439 -9880 9294 -3068 -12184 6672 2814 -13346 3911 6992 -12521 -1713 11467 -7679
2744 -7679 -7683 11774 -3843 -10406 10713 2758 -11600 6475 9631 -10387 1887 12084 -7135
2757 -7135 -2620 13897 -1998 -7486 12967 2150 -10069 9043 7682 -9688 3537 11205 -7216
2770 -7216 -3046 12786 -5059 -7852 11419 -274 -11264 8016 4994 -13123 2939 8432 -11384
2783 -11384 -3799 10586 -8618 -9514 9999 -3339 -13322 7612 2294 -14131 3176 6420 -12720
2796 -12720 -3193 9916 -7893 -7119 11797 -2822 -9647 10261 3513 -10652 6134 8591 -10277
2809 -10277 1099 12534 -7443 -2759 13620 -2397 -7084 13028 3108 -9989 7945 8384 -10176
2822 -10176 3204 11425 -7672 -2930 12856 -4010 -6675 11620 310 -10829 8357 5260 -11710
2835 -11710 2525 8373 -10911 -2818 9851 -7123 -7574 9575 -2325 -12094 6906 1438 -13397
2848 -13397 2803 7361 -12558 -2213 9588 -8692 -7209 10474 -3054 -9300 9650 2918 -11926
2861 -11926 5828 7351 -10254 2347 11682 -7583 -3231 12704 -3328 -8131 12499 2874 -10132
2874 -10132 8972 7333 -9584 2837 11159 -7959 -1298 12449 -4525 -6090 11614 857 -10150
2887 -10150 7754 4981 -11029 2915 8653 -10146 -2295 9949 -7689 -7870 9185 -3169 -12257
2900 -12257 7869 1586 -12826 2390 6656 -12247 -1903 9485 -8646 -5802 9615 -3992
2912 -3992 -10098 9254 1748 -12291 5423 7293 -9837 1538 10879 -6538 -2591 12537 -2965
2925 -2965 -7315 11781 3005 -9679 7784 7285 -10096 3652 11820 -6977 -1852 12771 -3101
2938 -3101 -5934 11629 431 -9698 8068 5086 -11089 2739 8284 -10828 -1382 10362 -8033
2951 -8033 -6588 9612 -2785 -11459 7022 2408 -12393 3444 6963 -11805 -2191 8554 -8640
2964 -8640 -6399 9775 -2795 -10550 7758 2383 -12268 4273 6805 -11018 1110 10384 -6669
2977 -6669 -3508 12031 -2876 -7476 11627 2098 -8672 8431 8311 -8278 4313 11057 -7332
2990 -7332 -1632 12321 -3685 -5665 11025 877 -9337 8196 4515 -10764 3301 8112 -9828
3003 -9828 -1422 9831 -6496 -7170 9632 -2915 -11391 7405 1481 -12228 3686 5846 -12758
3016 -12758 -1940 8710 -8420 -5873 9572 -4016 -9490 8990 897 -11218 5707 6040 -9923
3029 -9923 694 9763 -7115 -3479 10982 -2695 -6919 10594 1139 -8814 8534 6608 -9822
3042 -9822 3901 9926 -7835 -1156 11263 -3162 -5617 10511 873 -8472 7558 5837 -10284
3055 -10284 2947 8747 -9838 -2693 9548 -6751 -7042 9792 -2449 -10248 8075 2318 -11587
3068 -11587 2701 6027 -11051 -991 8053 -8308 -5968 9179 -3869 -10856 8054 619 -11256
3081 -11256 5607 6362 -9983 855 9230 -7446 -3616 10567 -3052 -6626 10436 901 -8791
3094 -8791 6251 6928 -8638 3711 9739 -7178 -1572 10476 -4402 -6161 10286 1380 -8319
3107 -8319 8226 5288 -10629 3760 8917 -8699 -1179 9358 -5795 -6407 9954 -2059 -9688
3120 -9688 7580 1971 -11076 3036 6072 -10386 -1509 7895 -8096 -5522 8621 -3418 -9553
3133 -9553 7986 855 -10513 3756 5315 -10070 538 8502 -7283 -4211 10532 -3311 -7250
3146 -7250 10042 1144 -8054 6722 6701 -8737 4002 9890 -7229 -1920 11255 -2810 -5504 11074
3160 11074 1115 -8299 8612 4947 -9453 3112 7763 -8861 -248 9015 -5461 -4947 9557
3173 9557 -1708 -9785 6888 1592 -10557 2848 5651 -10838 -968 8479 -7918 -5819 8791
3186 8791 -4293 -8338 6816 568 -10329 5245 5423 -10076 891 8392 -6776 -3463 10144
3199 10144 -3549 -6652 9475 953 -7277 7064 5643 -8418 3838 9024 -7018 -878 10012
3212 10012 -3180 -5121 10085 255 -6625 8165 4472 -8622 3537 8121 -7925 -975 9933
3225 9933 -5383 -4864 9121 -1697 -7844 6402 1636 -9893 3108 4824 -9616 -2665 7591
3238 7591 -7348 -4913 7813 -4223 -8881 6439 835 -10653 4428 4764 -9442 317 7767
3251 7767 -6350 -2635 8902 -2748 -5890 8537 881 -8036 6719 4784 -7900 2836 8527
3264 8527 -6978 128 10014 -3899 -3740 10150 1447 -7214 7551 4100 -7938 4092 7586 -7437
3278 -7437 -968 9167 -5021 -4802 8636 -1927 -8397 6936 2197 -10021 3531 4555 -9272
3291 -9272 -1678 8103 -7354 -5862 7291 -3349 -7917 6523 290 -9970 3967 4731 -9896
3304 -9896 1294 6899 -6971 -3121 7923 -3997 -6094 8087 410 -7128 6236 4575 -7989
3317 -7989 2796 7426 -6125 -1134 10175 -3122 -4627 9531 482 -6689 6775 4777 -7768
3330 -7768 3305 6384 -7486 690 8654 -4329 -4275 9007 -1312 -7625 6568 1832 -9400 3474
3344 3474 5180 -8275 -50 7510 -6679 -4699 8582 -3681 -7919 5816 -963 -10060 3864
3357 3864 3220 -9268 600 7255 -6948 -3124 7418 -3778 -5779 8267 236 -7069 6321 4655
3371 4655 -8461 3214 7378 -6471 -1155 8913 -2878 -4154 8179 776 -7034 7947 4091
3384 4091 -6877 5143 7267 -5819 -132 8715 -5384 -4420 7773 -1367 -7066 6629 1390 -8379
3398 -8379 3855 4448 -8597 -339 6586 -5620 -4570 6950 -3983 -7223 4801 346 -8852 2616
3412 2616 3186 -8565 67 6496 -7169 -3829 7761 -4515 -6271 7292 -143 -7267 5097 4170
3426 4170 -6828 1678 6072 -5871 -519 8226 -2724 -3494 8541 392 -5152 8099 3620 -7591
3440 -7591 4288 6934 -6426 -4 8261 -3614 -3224 7853 -1148 -6423 6209 1382 -8027 3316
3454 3316 4703 -7754 691 6632 -6384 -3532 6280 -4124 -7041 4985 246 -7939 3505 2699
3468 2699 -8322 -191 5438 -6743 -3241 6091 -3813 -6148 5624 -550 -6993 5558 4399 -7157
3482 -7157 2098 6801 -5256 -877 8273 -2676 -3062 8252 -486 -5317 6183 4773 -6494 3372
3496 3372 5726 -5766 203 7953 -3562 -3119 7426 -1634 -6213 6400 2286 -7292 3139 3631
3510 3631 -6825 -790 4841 -4894 -3291 7026 -2938 -6893 5416 -553 -8535 3245 2404 -8368
3524 -8368 357 4726 -6922 -2526 5895 -3688 -5656 6391 -330 -6776 3988 3633 -6727 2055
3538 2055 5596 -6011 -195 7727 -2209 -3073 7861 -61 -4838 6035 2780 -6105 2683 5037
3552 5037 -4645 -557 7036 -3504 -2775 7681 -447 -4888 6686 2113 -5345 3724 4891 -6323
3566 -6323 -363 6256 -6032 -3994 5253 -3088 -5627 5364 -618 -7042 2754 3406 -7793 -1115
3580 -1115 5168 -6237 -2580 5955 -3928 -5345 5050 -713 -6238 4185 1842 -6971 1855 5847
3594 5847 -5039 -606 7423 -3088 -3480 7089 323 -4747 5720 2762 -5045 3555 5135 -4949
3608 -4949 222 7300 -1754 -3086 6724 -1745 -5445 6171 2921 -5894 3633 4581 -5738 443 5878
3623 5878 -5535 -3513 6266 -2772 -6203 4977 31 -6492 2054 3267 -7727 758 4010 -6156
3637 -6156 -3338 5374 -3652 -5403 6147 -789 -6600 3461 3023 -5962 1306 4674 -5513 -981
3651 -981 6438 -3205 -3940 7153 1101 -5617 5996 3925 -4649 3416 5826 -4516 613 6375 -3174
3666 -3174 -2129 7074 -340 -5086 6223 2126 -5598 3252 4415 -5600 294 5452 -4575 -3278
3680 -3278 6508 -2166 -4900 4783 -264 -6474 3406 2107 -6232 405 3984 -5465 -2592 5166 -3030
3695 -3030 -4331 5407 -527 -5935 2589 1786 -5708 995 4451 -5529 -880 6921 -3342 -3084 5511
3710 5511 -164 -4513 4457 2728 -5682 3155 5478 -3697 -242 6856 -2984 -1769 6568 -695 -4808
3725 -4808 4799 2381 -5017 3336 3919 -5722 -178 6061 -3670 -2218 5454 -1642 -4995 4105 623
3740 623 -5583 2573 2258 -6402 -711 4717 -5096 -2972 5631 -2775 -4779 4857 -734 -5956 2850
3755 2850 2737 -6130 1758 5289 -4876 -1252 5988 -3063 -2957 5608 760 -4388 4674 3556 -4761
3770 -4761 2268 4577 -5405 -471 5840 -3315 -1703 5961 -149 -4111 4951 1506 -5805 3167 4318
3785 4318 -5026 -211 4624 -4073 -2103 5119 -1248 -5106 4530 -256 -6470 3195 2580 -6249 380
3800 380 3009 -4619 -2779 4674 -3129 -3479 4061 -301 -5972 3351 1949 -5790 820 3460 -5022
3815 -5022 -1302 5554 -2349 -2588 4894 -319 -4448 5024 3433 -4276 2413 3863 -4217 106 5309
3830 5309 -2197 -1220 6617 -716 -4296 5087 1843 -4567 3603 3588 -5219 847 4577 -2657 -1514 5552
3846 5552 -2126 -3639 4242 544 -6168 2322 1618 -5755 365 3437 -4708 -1736 4734 -3080 -4709
3861 -4709 3867 -8 -6283 1913 2520 -6456 -12 3798 -4499 -1357 5055 -3161 -3511 3687 264
3876 264 -4096 4121 2335 -4268 2520 4761 -3408 -75 6133 -3337 -2056 5234 -20 -4144 4667
3891 4667 2772 -4093 3336 3917 -4214 411 5512 -2978 -2954 4531 -1992 -3488 4246 508 -4941 2589
3907 2589 1842 -6202 -396 4373 -4065 -2388 3113 -2767 -4201 4027 -1006 -5737 2777 661 -6093
3922 -6093 823 3360 -4476 -1559 3978 -2801 -2787 4979 -228 -4154 3180 1993 -4785 2339 4516
3937 4516 -3463 444 5624 -2445 -1443 6015 -638 -3844 4491 1787 -4272 3213 4048 -3852 702
3952 702 4873 -3318 -1460 4186 -1385 -3591 3856 115 -5013 2747 2599 -5032 -331 3813 -4183
3967 -4183 -1296 3534 -2575 -3094 3733 -1044 -5826 2178 1701 -5325 419 2759 -4499 -902 5222
3982 5222 -2324 -2503 4764 -763 -4309 3914 1977 -4664 2619 4387 -3325 -42 4730 -2923 -2730
3997 -2730 5422 152 -4322 4546 2116 -4410 3760 3126 -4019 657 4270 -3152 -1966 5498 -1409
4012 -1409 -4212 3842 679 -4375 2042 2978 -4995 322 3916 -4300 -1914 4504 -2519 -3700 3977
4027 3977 96 -5197 2509 1893 -6300 450 3158 -3377 -2469 4482 -2862 -2975 5111 -1103 -4323 3071
4043 3071 1766 -3924 1909 3719 -3426 603 6064 -3442 -1977 5430 -454 -3456 4462 1837 -4127
4058 -4127 2901 3633 -4517 38 5253 -2659 -865 5667 -200 -2853 4674 1160 -4253 2692 3030
4073 3030 -3719 656 4209 -3481 -2090 3617 -2669 -2853 4098 98 -4037 2832 1108 -4629 798
4088 798 2658 -3603 -2075 3810 -2115 -3311 4747 340 -4856 3127 1276 -5048 1949 3278 -3577
4103 -3577 197 5650 -2373 -1057 4359 -290 -2372 5099 2009 -3993 2007 4361 -3934 998 4110
4118 4110 -2865 -920 4896 -214 -2666 4342 129 -3828 2819 3144 -4764 632 3775 -3760 -1200
4133 -1200 4399 -2451 -4247 3242 -618 -4956 3139 895 -5190 -56 2467 -4910 -2690 3130 -2672
4148 -2672 -2717 3453 -820 -3711 2696 1286 -4369 1638 2563 -4301 469 3909 -2130 -1905 4946 5
4164 5 -2509 4143 1787 -3039 3006 2943 -3613 373 4022 -1872 -1310 5402 -936 -3620 4381 1120
4180 1120 -3584 3276 3319 -4108 106 3748 -3761 -865 4778 -1878 -3331 4233 -377 -5401 2284
4195 2284 773 -4486 1446 3319 -4217 -831 2949 -3135 -3474 3878 -378 -3984 2284 1434 -4230
4210 -4230 1502 3290 -3101 -647 3753 -2594 -2181 5162 -359 -3341 3354 1250 -3970 2144 3452
4225 3452 -2743 720 4613 -1748 -1310 3920 -212 -2802 3779 1697 -3944 2862 2498 -3663 770
4240 770 3695 -2795 -1212 4051 -2421 -3380 2415 591 -4689 1985 1383 -4591 578 2180 -4241 -1285
4256 -1285 3133 -3139 -2510 3517 -727 -3763 2600 1311 -4525 727 2812 -4155 -801 3554 -1976
4271 -1976 -2782 4211 232 -3043 2716 1402 -4440 1993 2809 -3458 1981 4451 -1825 -1135 4443 -298
4287 -298 -2217 3384 966 -2786 3207 2250 -2766 674 3857 -3078 -680 3761 -1811 -2427 3965 -439
4303 -439 -4359 1500 1476 -4146 -45 2813 -3550 -2004 3002 -1933 -3976 3236 -502 -4387 2793 1292
4319 1292 -4566 1180 2571 -3961 -740 3429 -1478 -1464 4385 -708 -3360 2818 1516 -3652 2411
4334 2411 3503 -2867 632 3936 -3118 -559 5045 -1003 -2019 3771 272 -3238 1850 1919 -4144
4349 -4144 1623 4124 -3013 -1339 3473 -1204 -3539 2353 -12 -3635 3139 1682 -4455 74 1943
4364 1943 -3791 -1893 3154 -2045 -2648 3380 384 -4275 2147 795 -4160 139 2743 -2847 -1502
4379 -1502 4140 -2101 -2601 4275 -411 -3322 2794 1168 -3571 2222 3466 -2456 267 3944 -1249
4394 -1249 -1103 3856 -817 -1858 3778 1418 -3183 3146 2722 -2756 708 3967 -2306 -587 3211
4409 3211 -1024 -2780 2788 821 -3818 2746 1768 -3764 -394 3537 -2588 -1832 3393 -872 -3464
4424 -3464 3499 -915 -4070 2447 874 -3294 452 2839 -2216 -934 3221 -2302 -2334 3867 -1183
4439 -1183 -3156 3725 841 -3626 1218 2873 -2597 -236 3342 -2045 -761 4068 -576 -2494 3920
4454 3920 870 -2107 2459 2786 -2533 378 4507 -2363 -1054 3681 -990 -2775 2484 -407 -3555
4469 -3555 1843 1617 -3415 1669 2357 -3688 -1023 4133 -1432 -3217 3757 -756 -4107 2014 984
4484 984 -4114 1688 1728 -2609 -766 3163 -1994 -2465 3906 -707 -2070 1995 1299 -3786 974 1943
4500 1943 -2200 971 3455 -1540 -1496 3955 -697 -2820 2886 1769 -2616 2255 3115 -2330 1455 3087
4516 3087 -1769 -628 3931 -1149 -2378 3187 601 -2687 1935 1597 -3095 52 2670 -3088 -335
4531 -335 2675 -1957 -2904 2300 554 -4001 2353 869 -3262 12 2020 -3940 -1436 3691 -2446
4546 -2446 -2121 2692 -22 -3670 2946 578 -2749 1241 2415 -2828 417 3051 -3017 -1381 3475
4561 3475 26 -2291 3022 986 -2971 1947 2234 -2913 -818 3454 -2092 -739 3601 -718 -2162
4576 -2162 3012 75 -3388 2404 1698 -3649 609 2150 -2468 -1503 3393 -2117 -2744 2490 -1 -3458
4592 -3458 1481 1232 -3757 -582 1956 -2343 -1601 2723 -1897 -1750 2873 -174 -2516 3063 1520 -2894
4608 -2894 1826 2340 -2756 125 3047 -1327 -1402 2891 360 -2091 3005 1054 -2326 1740 2346 -2643
4624 -2643 -180 3171 -1034 -512 3587 -927 -1820 3154 881 -3905 1115 2228 -4526 202 2122
4639 2122 -2893 -1205 2943 -675 -2723 2666 -631 -4597 1826 1188 -3719 1041 1920 -3430 -1688
4654 -1688 2358 -2333 -2165 3400 601 -3224 2411 868 -3704 1335 2667 -2556 -874 2794 -1215
4669 -1215 -1328 3325 -375 -2331 3327 1107 -2576 1949 1869 -2589 15 2861 -1286 -1384 3182 -261
4685 -261 -1561 2444 1075 -3041 2176 2225 -3120 -900 2955 -1946 -1160 2812 -1171 -3024 2277 -207
4701 -207 -3576 2401 717 -2330 681 848 -2013 -543 1891 -1204 -1766 2081 -708 -3528 1980 1896
4717 1896 -3416 2330 2063 -2186 -778 3158 -1243 -1387 3047 114 -1840 3395 754 -2444 1835
4732 1835 3041 -2526 414 3208 -2068 -715 2836 -1335 -1680 3344 1433 -3086 1870 1569 -2472
4747 -2472 832 2251 -1473 -623 3432 -464 -2233 1870 -41 -2983 1824 837 -2241 851 2145
4762 2145 -2549 -1495 2320 -1702 -1883 2583 -980 -1828 2511 1465 -2922 765 1591 -2944 51 2516
4778 2516 -709 -731 3527 -295 -2576 2055 1675 -2295 1432 2042 -1543 -531 3539 -1249 -905 3478
4794 3478 -560 -1944 2842 -100 -2610 2045 1757 -1741 690 3222 -2235 -392 3438 -679 -927
4809 -927 2286 -154 -2260 1270 298 -2477 305 2956 -2434 -1282 1980 -1721 -2605 1745 -1381 -3458
4825 -3458 840 1310 -2672 -61 1777 -1921 -439 2805 -1040 -1463 2974 -733 -2517 1900 1169 -2336
4841 -2336 678 1560 -2662 65 2735 -1709 -976 2619 -219 -1440 2090 361 -1604 1628 1536 -1613
4857 -1613 486 2542 -1658 -422 2806 -493 -1642 1531 -359 -3432 1480 1713 -2648 -573 1583
4872 1583 -2091 -1624 1760 -1231 -1729 2302 -514 -2075 831 718 -2865 505 1574 -3107 -327 2023
4888 2023 -749 -1742 2862 377 -2078 1147 436 -2740 1346 2191 -2183 844 2019 -716 -884 2568
4904 2568 -250 -1696 2801 384 -2401 969 1958 -2800 621 2354 -1457 -1637 2342 -617 -1611 2615
4920 2615 1018 -2319 2090 1266 -2964 -166 2267 -1979 -583 2387 -1625 -1524 2108 -146 -1774
4935 -1774 1957 903 -3354 132 2034 -2017 -439 2749 -1015 -1318 3000 -260 -2401 1760 556
4950 556 -1889 1040 1667 -1411 -382 2987 -1503 87 2820 327 -1712 2048 867 -2203 1356
4965 1356 1839 -865 1146 2129 -2261 -462 2817 -570 -1930 2051 314 -1740 1466 905 -2070 321
4981 321 1469 -1713 -1227 1976 -2001 -1792 1458 -320 -2125 1308 768 -2826 470 313 -3009 -428
4997 -428 3514 -856 -2549 1614 -51 -1757 2430 831 -2411 1176 2042 -1615 282 2166 -830
5012 -830 -661 1569 -643 -1388 1501 721 -1510 1394 1672 -1701 -627 2686 -665 -900 2212 -129
5028 -129 -2248 2147 365 -2644 792 753 -2092 253 2142 -2734 -1912 1507 -1372 -2868 2030 -963
5044 -963 -2118 1113 435 -2687 -128 1635 -2840 -903 2098 -1480 -1377 1938 203 -2311 1955 1381
5060 1381 -2504 771 872 -1044 -512 2042 -941 -1677 3240 -484 -1718 2309 1030 -1437 1170 2341
5076 2341 -1050 -349 1565 -807 -886 2500 -928 -1216 2381 555 -1550 1447 1747 -2928 -320 2907
5092 2907 -906 -836 2541 -1984 -1436 1283 -771 -2414 1052 1209 -3398 -1353 1462 -2210 -1457 2932
5108 2932 332 -406 2477 466 -2147 652 862 -2450 452 1674 -1825 -282 1316 -1162 -1550 3114
5124 3114 -226 -2213 1226 1468 -1287 688 2214 -1703 1029 2456 -1619 -927 2176 -629 -1473 1128
5140 1128 524 -1971 1220 1443 -2575 312 1911 -1471 -933 2158 -546 -2032 1788 -341 -2844 1191
5156 1191 1049 -1940 760 1384 -1255 -1255 1674 -803 -2134 1322 154 -1883 1602 62 -1740 1084
5172 1084 1591 -1022 -214 2579 -1503 -750 2274 -206 -1710 1257 1211 -1771 588 1778 -1424 537
5188 537 1530 -1043 -1063 1368 -1227 -1338 1735 29 -1446 1546 1690 -2408 392 1364 -1352 -1185 1976
5205 1976 -392 -1564 1323 -515 -1863 1129 247 -2484 -76 1696 -2104 -1175 1198 -1362 -2347 1475
5221 1475 13 -3233 1186 1097 -1780 296 1262 -1883 -985 1984 -1139 -722 2316 611 -1179 1236
5237 1236 656 -942 504 1222 -915 549 1727 -1166 -847 1822 -719 -798 1640 1016 -1559 1074
5253 1074 1436 -1765 312 2186 -1253 -684 1165 -814 -1557 1748 -860 -1451 1055 1721 -2808 -929
5269 -929 727 -1763 -649 2335 -946 -1092 2166 -564 -2423 1168 1111 -2084 -504 1126 -1436 173
5285 173 1872 -673 -208 1138 413 -1545 1750 1125 -1192 405 1165 -2450 684 2591 -787 -399
5301 -399 1604 282 -1283 1924 1275 -2119 937 1763 -1051 218 1957 -1314 -730 1152 -1282 -1488
5317 -1488 1386 -132 -2225 1193 257 -2436 -818 1681 -1208 -1569 1034 -1045 -1779 1778 -857 -2310
5333 -2310 638 -225 -1824 595 884 -1802 -116 1626 -1058 -1598 2724 -16 -2871 1497 808 -2025
5349 -2025 814 2337 -1880 -1073 2107 -1079 -876 1788 15 -1340 1752 1018 -1382 386 1485 -1864
5365 -1864 215 1758 -1102 -695 1964 43 -1110 1944 50 -1895 1149 1381 -1056 56 1166
5380 1166 -1399 -2346 1373 -33 -1764 1700 700 -2507 1068 32 -1883 71 1123 -1895 -184
5395 -184 2173 -992 -1452 966 -364 -1747 1215 1411 -1648 -20 1761 -1313 1158 2645 -735 -1137
5411 -1137 2682 818 -1658 1125 547 -1400 588 1214 -1552 267 1903 -1371 -341 1831 -673
5426 -673 -1508 1116 -134 -1331 -499 1158 -1484 -101 2338 -1600 -1658 1728 -571 -1772 1754 -294
5442 -294 -2220 194 46 -1114 242 411 -1547 -1007 1907 -835 -1426 1048 137 -2168 1164 782 -2259
5459 -2259 833 1748 -856 -414 1470 -1188 363 1653 453 -1255 1287 -541 -2225 960 1693 -1227
5475 -1227 465 1284 -958 -762 1314 -192 -1226 1567 604 -1523 450 1699 -2140 -346 1983 -1193
5491 -1193 -1156 1109 -992 -1834 1683 -395 -1189 1054 1044 -1615 -142 1820 -1915 -498 840 -1228
5507 -1228 -1180 1606 423 -1839 962 468 -1947 979 972 -1526 359 1586 240 -894 1283 -145
5523 -145 -1652 2608 751 -1206 797 1366 -1867 -54 2051 -932 -746 1278 -1261 -1469 1746 461
5539 461 -235 198 210 -2174 -62 1264 -860 -9 1484 -1155 -2306 298 179 -1894 356 971 -1853
5556 -1853 239 1301 -2055 46 1978 -743 -1511 1327 -33 -800 1459 1141 -2643 -108 1207 -1029
5572 -1029 -356 1654 -279 -528 2595 640 -1434 1188 570 -828 1176 1478 -1851 -159 1670 -1362
5588 -1362 -965 804 -690 -1601 1501 1234 -1862 1254 736 -1904 297 951 -251 -552 1324 -561
5604 -561 -2235 1973 -36 -2659 895 1248 -1283 141 1412 -1272 -245 1844 -1977 -1889 1970 -868
5620 -868 -1731 1638 672 -1866 772 1565 -1184 279 2060 -1376 -392 1757 -597 -819 1379 869 -1796
5637 -1796 630 1314 -1659 -722 1655 -310 -220 1860 -314 -997 1879 1073 -1161 1325 320 -1931
5653 -1931 -468 803 -1714 -211 863 -683 -1326 1043 -262 -1967 1012 184 -1844 128 1612
5668 1612 -1280 -1363 1465 -1310 -1631 1572 225 -1083 797 -435 -1712 1113 1368 -2411 -109 2228
5684 2228 -1229 -1270 1935 -199 -1638 1593 333 -1829 1378 1364 -108 188 1647 -1256 -586 1774
5700 1774 653 -943 754 787 -1501 915 801 -1175 -186 1589 -736 102 2577 71 -1532 1483
5716 1483 240 -2355 594 1414 -2707 555 1537 -1490 50 1157 -1250 -1365 2126 40 -998 2410
5732 2410 -4 -1739 -8 914 -1346 -209 1945 -1014 -349 2216 -799 -820 406 818 -1778 1244
5748 1244 1722 -1012 -186 1897 -828 -697 723 -1039 -693 1668 -62 -1198 1904 358 -1014 656
5764 656 1568 -1628 -985 1003 -1364 -664 1090 -201 -1728 1372 320 -2614 175 1100 -467 -879
5780 -879 1257 -136 -1261 1469 -127 -640 1094 239 -2326 719 923 -1297 -820 1201 -395 -556
5796 -556 1660 -11 -1025 1434 455 -1781 805 1045 -1358 -153 1611 -1845 -566 1922 -33 -1973
5812 -1973 1257 211 -1316 2107 806 -2039 -124 707 -1582 -818 1433 -1033 -2321 1148 72
5827 72 -1156 -454 860 -2219 168 1523 -1446 -257 1119 -1059 -1570 945 -613 -2058 712 465
5843 465 -2415 862 1232 -2094 33 1713 -911 250 1802 -272 -1218 1303 91 -1261 566 2283
5859 2283 -2364 -148 1846 -1603 -169 2415 465 -874 2222 1271 -977 841 919 -1180 -129 2256
5875 2256 -2181 512 1792 -508 -1517 1668 392 -2619 1011 -279 -2205 83 1396 -1900 -567
5890 -567 1478 -842 -1278 1247 150 -2455 1593 420 -2442 -140 1288 -1106 101 1590 -1271
5905 -1271 -195 898 -427 -1519 1256 1016 -1298 1030 948 -1047 272 1735 -864 -219 1997 253
5921 253 -606 2153 753 -1504 1465 1210 -1321 838 2283 -1630 -274 1616 -277 -690 1273 961
5937 961 -1583 971 632 -2134 -266 1305 -1382 -130 1942 -1555 -1492 907 -226 -1780 1065 890
5953 890 -1734 1007 790 -1628 -73 1583 -1931 -47 2240 -94 -1166 2405 115 -1376 1316
5968 1316 1324 -721 41 1808 -1720 -134 1315 -1002 -662 1656 1276 -1058 1051 2421 -1614 596
5984 596 1738 -894 -153 966 -927 -1155 2384 28 -983 859 714 -1098 965 1739 -2069 -1058
6000 -1058 223 -830 -1245 1484 196 -1328 572 -470 -2404 898 716 -1684 -600 1031 -526
6015 -526 -1113 634 242 -1743 43 162 -1260 1451 284 -1436 40 1288 -408 -439 1722 -25
6031 -25 -1304 909 564 -1041 1141 1611 -1062 254 1826 -933 -292 1673 -1023 -800 -16 -151 -1562
6048 -1562 454 1140 -2571 810 1838 -1874 -297 1618 -882 -916 915 -610 -2449 245 356 -1171
6064 -1171 1090 260 -1642 -706 1990 -780 -1213 679 -822 -1896 1065 896 -1208 1389 1588 -1254
6080 -1254 400 1892 -1074 -1052 2191 -580 -1471 1466 -161 -1911 679 679 -1411 343 1678 -1496
6096 -1496 537 1967 298 -1700 1059 92 -1780 1161 1060 -1876 522 1510 -590 -327 1081 -594
6112 -594 -846 788 -869 -1751 789 -508 -1654 571 1135 -1689 -1 725 -1388 -652 1531 -852
6128 -852 -1736 328 792 -1439 -16 1335 -2031 574 746 -853 -1017 1613 47 -2141 1204 80
6144 80 -441 1157 1410 -437 806 2497 -1769 -377 1735 -823 -1358 1229 503 -1174 396 608 -1482
6161 -1482 710 1210 -1355 -173 2127 -1294 -1651 685 -362 -1789 1083 654 -1564 872 600 -1721
6177 -1721 -679 1028 -1447 -1480 1168 -29 -1400 1493 575 -826 58 971 -1560 19 1469 -171
6193 -171 -924 1068 356 -1193 1062 -62 -515 951 337 -1650 107 1655 -1360 -449 1299 -640
6209 -640 -752 1911 191 -847 1672 710 -1319 411 385 -1444 -1062 1272 -675 -466 1891 545 -631
6226 -631 1208 -660 -1119 569 1338 -2588 -666 927 -1738 -755 107 -373 -642 1294 -724 -1487 182
6243 182 936 -1707 393 1058 -845 -965 1167 719 -803 799 995 -1694 -156 539 -1213 115 1995
6260 1995 -201 -672 1425 -2089 -555 2494 482 -1123 1552 191 -1408 326 1084 -994 -14 2008
6276 2008 -1615 -273 1266 467 -1277 548 487 -729 459 769 -1377 -1154 1838 -522 -766 1902
6292 1902 89 -1505 1541 -341 -1102 897 1228 -1993 -108 1160 -1110 -548 1478 -703 -320 1722
6308 1722 -552 -1730 897 -546 -849 881 1679 -1596 536 1396 -540 -728 749 384 -1444 959
6324 959 525 -1754 -95 1132 -840 321 1394 -502 -458 -185 99 -604 861 376 -2394 931 -379
6341 -379 -641 -345 728 -1283 -23 1924 -627 -22 622 -353 -1814 -393 1529 -1211 -108 1078
6357 1078 -1124 -490 1463 -381 -1123 933 1018 -399 157 694 -1173 529 1533 -1429 610 529 -326
6374 -326 -861 1261 -266 -1338 537 53 -1724 824 659 -1691 -930 1718 -470 -313 360 -819 -1053
6391 -1053 1681 800 -1237 69 1076 -1272 305 1287 -611 -558 1169 -865 -1790 1591 48 -1363
6407 -1363 596 1048 -1717 926 2119 -857 15 815 388 -21 1681 -12 -1152 1198 685 -1246
6423 -1246 976 2202 -601 -646 1389 -909 -931 636 439 -1061 380 690 -1321 437 1430 -1086 437
6440 437 1025 -394 640 423 -1068 -1332 435 508 -1292 391 608 -1171 -712 952 -1235 -1044 795
6457 795 -212 -1998 2162 4 -2055 82 1320 -1241 71 847 -523 -616 1183 -473 -436 1539
6473 1539 635 -513 834 838 -1754 299 777 -836 456 1215 -1071 -439 1898 -310 -1684 1826 1182
6490 1182 -478 917 846 -1463 -996 1305 -677 -809 373 -880 -673 1481 909 -1441 1157 449 -1364
6507 -1364 348 1377 -677 -78 979 373 -255 -55 -269 -1358 654 -8 -1109 701 354 -914 307
6524 307 1306 -316 -731 1095 456 -1164 1177 1088 -877 649 967 -660 -639 2442 -509 -1286 2209
6541 2209 124 -1292 943 524 -808 -590 139 -1363 221 1469 -627 -1194 371 -373 -211 1032
6557 1032 319 -1368 344 -169 -1454 189 850 -2167 -95 495 -643 -482 665 500 -726 288
6573 288 125 -1432 0 351 -873 -891 1240 -286 -840 793 -262 -1397 683 103 -938 -132 769
6590 769 -367 278 1087 -573 -1081 505 279 -1152 966 1181 -1176 343 1983 -607 199 1594 80
6607 80 -605 593 -886 -536 1016 635 -570 -384 162 -479 -217 1259 -913 -1382 795 -554 -267 1420
6625 1420 -14 -859 47 165 -1020 684 462 -1267 -997 1623 -191 -923 1076 475 -515 1408 941
6642 941 -497 582 856 -773 591 581 267 -285 1579 187 -662 272 -349 -1170 1263 444 -819 225
6660 225 32 -887 -1567 1152 -294 -564 657 565 -1134 -331 570 -388 481 1334 -1032 -789 1301 -997
6678 -997 -1212 481 -332 -925 678 598 -1087 -461 360 -1004 -478 477 -377 -31 530 -961 -623 420
6696 420 1035 -1114 -388 1197 16 -287 1527 -64 -224 647 -809 -1548 926 971 -1274 428 1542
6713 1542 -519 867 963 -637 -226 1030 -245 -301 1659 -102 -1812 427 720 -1469 231 754 -1049
6730 -1049 -760 121 80 -1795 348 -314 -1921 480 418 -311 -1101 327 -509 -493 904 -955 -751 961
6748 961 -607 -1095 -167 1090 -373 -239 843 -1051 -62 1498 948 -333 638 717 -169 1617 844 -1030
6766 -1030 124 334 -649 264 915 -932 -850 1635 -210 -1074 1607 -553 -570 1240 684 -1003 208
6783 208 1070 -1016 -1275 1039 -128 -789 -197 247 -1062 667 1175 -1224 513 525 -814 -219 1040
6800 1040 -462 -240 101 823 -547 379 -287 -1351 173 -127 -612 -599 1139 -44 197 775 -97 -437
6818 -437 1327 1436 -1239 -250 931 -425 919 1950 443 54 688 103 -589 579 835 -697 485
6835 485 -251 -933 -97 662 -786 -1048 1018 -415 -964 540 144 -450 470 581 -1108 21 1175 -1100
6853 -1100 -802 294 -306 -422 -228 -877 -1049 -107 -141 -485 -109 371 -984 -685 682 177 -595 -487 -408
6872 -408 -695 1517 75 -1033 985 212 -334 564 433 -384 -148 687 605 -901 976 -96 -478 591
6890 591 1800 -593 -448 570 -1192 20 686 -601 -1315 1314 -358 -1277 57 -301 -1114 194 888
6907 888 -619 -483 1728 -1042 -691 1623 27 -1530 1354 -129 -1787 766 765 -1716 -238 185 -53
6924 -53 -477 866 -296 -936 2141 1292 -763 -230 303 -133 -620 1140 -263 -130 1277 474 -874 1073
6942 1073 562 -103 1138 1169 -459 -154 877 -400 -857 1484 -204 -1064 1030 271 -1280 587 6
6959 6 -1114 -555 386 -222 -645 508 -56 -1310 -71 -107 -1045 115 942 -860 60 646 -1106 -541 664
6978 664 -143 -226 500 100 -1467 1739 -53 -686 467 153 -534 195 2216 90 470 875 -127 -1451
6996 -1451 -76 703 -805 -492 751 -818 203 982 -872 -548 607 185 -865 1023 -366 -715
7012 -715 110 -184 -1296 -408 1627 -730 -644 1186 -911 -1351 1531 215 -479 146 169 -1471 86 162
7030 162 -972 272 746 -588 172 692 -64 -691 836 1090 -1393 -579 547 -628 14 1172 -1184
7047 -1184 -600 1521 894 -391 668 332 -1065 677 931 -516 -203 311 -27 -513 751 2 -596
7064 -596 1347 -91 -1364 584 392 -1291 299 834 -1017 -665 955 -1214 -888 556 -273 -691 120
7081 120 -18 -796 58 826 -62 602 708 -573 -710 1010 -430 -986 599 350 59 -702 1462 -330
7099 -330 286 1161 -8 -1153 806 969 -806 883 355 205 232 783 -505 -395 485 -1487 -1411 2067
7117 2067 116 -1176 885 1153 -1321 -635 221 -423 863 1176 -663 -501 1060 -419 -729 836 50
7134 50 -443 -382 -50 -1169 85 865 -544 -379 -274 -360 23 389 57 -261 -313 281 -1065 -92 344 -1099
7154 -1099 -356 887 -200 52 267 26 -1269 659 971 -1006 310 784 -746 163 873 -159 -393
7171 -393 303 -720 -300 375 431 -1255 245 -124 -18 -270 1038 -776 133 201 165 -435 -466 640 -880
7190 -880 703 -43 -408 -304 -166 -858 299 846 -652 -898 438 86 -406 756 -213 -1032 -595 373
7208 373 -787 215 882 -554 -133 531 -12 -1146 -60 -200 -586 195 271 38 832 5 -669 -678 1098
7227 1098 58 -1315 492 284 -835 1267 489 -465 90 268 -1433 -144 306 887 -789 321 -235
7244 -235 -845 -246 -230 585 -78 821 -913 95 1341 -1668 -1600 1094 -49 -1156 249 494 -1093 217
7262 217 558 -1411 669 635 753 655 435 319 -850 952 410 -828 469 580 -536 349 469 -528
7280 -528 365 798 58 -576 681 -88 -1027 945 334 -37 308 674 105 -178 243 23 -15 493 -519
7299 -519 -262 -69 162 -696 351 1247 -688 -754 1057 -113 -473 415 280 -1150 794 654 -874 806
7317 806 265 -862 -169 737 -649 -29 794 588 -226 657 71 -589 90 1010 -526 71 1480 -643
7335 -643 81 392 224 -255 633 927 -766 849 475 -629 -1122 560 -395 45 432 -979 -1156 356
7353 356 294 -1246 417 730 135 396 632 -293 -684 637 -1070 457 589 -333 -1002 36 1842 -62
7371 -62 1794 -184 -3 -276 491 852 214 561 -255 625 693 500 -1028 579 1130 -755 -263 -141 -379
7390 -379 133 1504 -104 -872 890 -131 -855 38 428 -942 -412 949 -491 542 713 -110 -63 157
7408 157 274 -848 862 511 -856 495 889 69 -700 452 -753 -551 191 -308 -1001 163 635 -1117
7426 -1117 779 513 -797 212 977 469 -889 260 538 -663 1357 953 -1244 1341 12 -1035
7442 -1035 164 -120 -143 -532 648 -841 -895 1131 412 302 720 548 -134 1444 1081 -103 234 777
7460 777 370 -1050 710 232 -187 245 96 -1200 39 603 -578 2 814 151 -188 22 -324 -306 316
7479 316 638 -1497 90 -52 -555 -521 1119 -1044 -48 446 770 -1367 955 711 48 422 1014 -355
7497 -355 141 470 -520 -280 135 -873 173 1102 694 411 141 244 -103 59 485 162 -77 781 -281
7516 -281 -556 1419 65 -399 173 1058 -699 -223 -131 -590 -984 556 87 -31 605 -35 -725 939 -449
7535 -449 585 38 1038 -259 -359 1349 -981 -591 875 -233 -1419 387 202 -890 265 155
7551 155 -696 260 255 -669 558 996 409 -1571 -109 326 -167 -134 -5 -609 -441 899 -446 -1152 329
7570 329 267 361 894 -49 -1137 -389 167 -902 186 678 -1417 -366 687 84 -344 747 574 -955
7588 -955 613 444 -157 -443 147 -706 16 -719 -230 -606 62 -240 -315 1387 658 -1207 -1268 -26 -310
7607 -310 289 240 -211 765 496 -245 -534 720 -295 -380 172 982 169 749 1685 -667 423 536 457 -115
7627 -115 514 -194 -80 663 830 -264 597 852 -716 -1297 1114 382 -425 345 229 -1021 513 672
7645 672 -527 432 595 370 -548 1039 -399 -960 579 -912 -301 15 681 -564 -535 1556 -780 -389
7663 -389 377 -591 -430 -63 -311 728 902 241 -1172 417 -50 100 -519 629 -916 -255 952 -309
7681 -309 69 490 -51 -1215 204 275 -368 -824 496 -488 -103 350 20 -1195 -348 -455 -1387 563 96
7700 96 -803 858 860 -162 73 1540 -322 -707 -280 280 -693 839 14 -1015 75 56 -509 427 878
7719 878 333 176 69 1205 -1376 903 390 102 654 367 -414 -605 1053 -595 -298 524 547 -988
7737 -988 371 -341 -320 380 130 -74 632 -294 -39 -402 451 -1063 -880 849 246 -1394 -6 671 -934
7756 -934 862 503 -12 257 454 -317 -513 971 165 -920 809 286 -1371 199 737 -172 555 11
7774 11 -426 -699 597 -630 -970 1190 -185 539 462 322 -1005 -386 428 -354 599 658 -103 -353 597
7793 597 454 -345 443 547 -1277 -814 109 -270 -49 -72 -708 -21 696 3 -460 231 4 -164 115 772
7813 772 92 -17 800 -330 -320 387 1109 -597 -391 -75 -955 627 1197 -571 422 422 -1256 -383 1227
7832 1227 198 -762 651 250 -348 286 1331 -1403 912 1442 819 -632 1006 -443 -686 345 443
7849 443 -843 448 -457 -505 86 -351 -436 -335 705 -442 -932 -38 -62 -532 -321 35 -327 658 1290 -840
7869 -840 -249 1273 728 -864 -215 -159 -944 100 773 -605 639 576 442 240 899 -49 -772 243 -518
7888 -518 58 72 521 -184 -380 -48 -309 134 932 -14 -651 -30 -135 -70 207 758 -257 566 603 -880
7908 -880 -714 -24 -807 350 205 -697 -678 -71 575 -48 54 -403 -379 49 506 -498 -143 658 15 -347
7928 -347 369 526 -534 282 -243 -970 -59 153 -1372 88 120 667 277 760 125 -729 1700 -48 341
7947 341 153 1306 308 -83 305 77 -906 404 -75 -308 49 -404 -1833 492 797 118 -710 240 -923
7966 -923 -942 -370 -274 -360 386 -10 302 -721 -683 211 119 552 46 51 -96 99 -429 884 -736 -495 277
7987 277 327 -1206 -623 276 -1153 170 947 292 -410 208 1013 -156 705 935 -354 533 695 -847
8005 -847 -846 562 562 286 -252 798 -422 275 -88 -149 -676 34 -1510 106 927 453 -1463 -447 -280
8024 -280 -451 275 628 -545 538 493 -609 126 19 -660 -72 555 -528 76 81 -159 -791 712 606
8043 606 -640 -332 -434 -178 385 795 -93 -1186 941 -446 -1602 -157 -362 -699 323 509 -12 -533
8061 -533 824 1 -626 -67 -757 -226 504 754 -358 -136 1442 39 699 431 -621 337 774 465
8079 465 -1298 178 296 -370 266 516 -1253 -315 538 116 -743 701 300 144 533 212 75 -233 -348
8098 -348 -1111 759 452 555 -559 262 534 -148 264 756 -784 396 37 -600 235 79 370 -195 1117
8117 1117 -160 381 556 113 29 642 780 -196 -124 515 -194 492 1377 42 -528 572 350 -225 572
8136 572 1016 -878 47 513 484 -193 119 730 -481 1290 505 -1855 701 -590 -882 15 383 554
8154 554 639 129 221 -655 947 747 -464 -368 443 -1298 -389 563 -724 -411 697 -852 -420 453 -871
8173 -871 117 648 850 83 527 619 -846 -177 221 -336 -662 807 269 -567 -60 415 -490 -21
8191b1
$$ Imaginary data points
##PAGE= N=2
##DATA TABLE= (X++(I..I)), XYDATA
0 0 0 0 0 0 0 0 0 0 0 0 0 0 0 3 -65 72 -72 72 -72 73 -107 139 -144 152 -195 215 -241 281 -311 357 -400
31 -400 450 -497 554 -621 696 -771 853 -945 1049 -1164 1286 -1423 1573 -1750 1939 -2154
47 -2154 2409 -2693 3032 -3432 3926 -4527 5297 -6333 7776 -9941 13535 -20557 39197 -184938
61 -184938 -412777 181611 147624 -163433 10076 36975 -194109 47013 133295 -170907 -44214
72 -44214 151185 -178693 -121540 245968 -42837 -288156 128113 133892 -216933 -16272 136204
83 136204 -128002 -20433 136497 -132718 -54879 228376 -68648 -183859 230213 118591
93 118591 -229485 66133 223354 -86249 -9161 148549 -83041 3266 233145 -65047
103 -65047 -149521 205925 61865 -187702 123517 140951 -211813 -19157 202315 -91554
113 -91554 -103756 113319 -69815 -84141 160021 -66049 -212075 164017 102203 -265439 -8347
124 -8347 199661 -136679 -121491 130583 -59189 -107913 115757 -56271 -157574 136235 28042
135 28042 -224421 70659 147164 -203455 -52035 207647 -91422 -144087 164576 28091
145 28091 -123679 105120 40360 -113989 144087 116082 -190981 43986 252679 -93226
155 -93226 -103873 198703 21695 -110270 138620 45728 -132276 106936 96233 -157871 37382
166 37382 152652 -148416 -61026 190782 -72281 -164650 140938 36627 -167624 53168
176 53168 59955 -142503 36846 88646 -175159 -28300 175401 -120148 -160588 156225 12693
187 12693 -186075 58451 59589 -143902 26544 78633 -147872 -8007 141604 -118994 -82894
198 -82894 177053 -33953 -155283 151294 88752 -163227 50990 148632 -85383 6145 131351
209 131351 -71254 -6654 181604 -55730 -110371 187608 60116 -165845 82598 130552
219 130552 -125769 2663 132508 -95198 -46211 137066 -65339 -102510 135280 -12970
229 -12970 -159573 101932 72185 -181637 8763 133534 -123576 -73816 114029 -68510
239 -68510 -92837 107313 -47188 -143435 111868 38986 -189707 28751 121136 -136387 -52277
250 -52277 123595 -72275 -78937 120503 -26258 -105537 119084 34876 -130515 90462 112909
261 112909 -132338 16067 174699 -68376 -66494 153073 10808 -79542 108870 30915 -92155
272 -92155 103276 72378 -135503 42264 145831 -109712 -60897 147520 -34848 -108999 104044
283 104044 12458 -122349 66691 48680 -131631 26473 86991 -131443 -33331 127695 -91366
294 -91366 -113584 120595 -7218 -144731 58697 40970 -127369 25669 65649 -130236 -10411
305 -10411 119692 -99773 -83700 133593 -17134 -119519 96396 49397 -113854 58832
315 58832 91844 -97720 20578 126032 -73509 -27176 150672 -27689 -88001 136804 49902
326 49902 -116647 69748 96412 -91979 16293 100049 -77818 -17959 121121 -63513 -82885
337 -82885 125950 2532 -134117 71600 65739 -126010 7046 89394 -98221 -40030 92817
348 92817 -69659 -75352 93344 -34924 -117531 82311 26945 -146614 26405 86835 -115859
359 -115859 -37499 97200 -64496 -64691 94761 -31820 -89989 97494 25112 -115595 62968
370 62968 90246 -101034 7760 122548 -58689 -36765 123345 -12176 -66962 108910 29086
381 29086 -89641 83616 74891 -103367 29796 117592 -79146 -38850 116908 -28975 -75045
392 -75045 91125 2012 -95972 72222 37494 -119039 28967 86236 -108311 -37947 104863
403 104863 -60976 -85915 86458 -13577 -107000 55994 21312 -112235 27897 56117 -112170
414 -112170 -12402 95385 -83375 -70803 105374 -17998 -100309 72646 34456 -92675 45434
425 45434 66387 -84848 17446 101285 -65159 -26976 121031 -18787 -67376 104788 35155
436 35155 -84996 65534 73276 -79161 23231 92598 -64894 -16325 105256 -40804 -65208
447 -65208 100327 7223 -98178 60503 49553 -97488 14728 69195 -85304 -22237 84426
458 84426 -64829 -67621 87641 -23451 -104144 61433 27504 -112807 16919 60805 -94869
469 -94869 -22878 75131 -65533 -52591 82617 -33506 -83645 81091 18505 -103711 48014
480 48014 73958 -86237 1272 95349 -48593 -28122 98404 -17602 -52277 95306 20570
491 20570 -76988 71663 65066 -82090 25936 96387 -61715 -23548 100618 -25446 -56699
502 -56699 83048 5593 -77211 61073 36016 -92996 24958 72109 -83116 -26120 83537
513 83537 -49584 -65526 73821 -15864 -87790 52787 17727 -99896 21590 52345 -92777
524 -92777 -19868 74140 -63838 -58085 74878 -22388 -78632 60888 18022 -83446 41305
535 41305 52487 -80137 11615 86273 -57468 -30032 98599 -12210 -58807 83580 28541
546 28541 -66889 56516 56451 -66813 27416 81527 -58384 -12192 95909 -31699 -53844 87530
558 87530 9094 -78802 55063 44140 -79859 16698 62320 -69655 -15743 73963 -51769
569 -51769 -54858 75214 -17641 -86550 50857 21555 -93910 16186 47703 -82595 -19167
580 -19167 63628 -60549 -49941 69963 -26239 -75102 59290 14679 -84154 34702 51564
591 51564 -73839 3125 74169 -48585 -23975 83279 -18429 -49153 80589 20290 -68523
602 -68523 55992 58709 -64410 18771 77645 -45872 -13705 81852 -22844 -41944 76626
613 76626 5482 -65422 57189 37764 -76287 21596 64504 -65902 -20037 70835 -39765
624 -39765 -51313 61568 -13580 -69887 45905 12318 -84138 21300 43273 -82226 -17107
635 -17107 63872 -56402 -51005 62979 -23655 -69975 51296 11487 -76611 30787 42603
646 42603 -70467 4759 68424 -50108 -25506 79558 -17385 -49879 71349 19805 -59630
657 -59630 50629 49097 -60760 22949 72680 -47409 -12588 82862 -19699 -42230 72538
668 72538 10432 -58841 51135 34798 -65772 22584 56870 -59887 -12648 68347 -40972
679 -40972 -47308 63941 -10517 -70912 41916 19099 -74516 13319 39057 -68701 -14159 52442
691 52442 -53916 -42363 59137 -24485 -67250 48478 12714 -74427 24573 41075 -64959
702 -64959 -1107 59223 -44711 -24312 68158 -17069 -44417 64986 14152 -58183 47732
713 47732 47339 -56663 18788 68648 -40510 -11470 73225 -17688 -35991 68142 8131 -55248
725 -55248 50047 35794 -60243 19908 55007 -52599 -10966 63126 -35640 -40257 59095 -11139
737 -11139 -62012 44067 15729 -72665 15623 39961 -66494 -15025 51710 -46554 -41554 50512
749 50512 -21873 -59338 43126 4965 -69150 26045 35200 -65091 -340 57590 -44114 -27103
761 -27103 62852 -15471 -42621 57097 13854 -51325 42333 39849 -50884 19703 60149 -39681
773 -39681 -9129 71946 -17628 -35129 64128 11283 -48307 45651 33242 -53467 20611 50511
785 50511 -46968 -7829 60084 -31267 -37409 56025 -7743 -57273 39182 15631 -65670 15462
797 15462 35981 -60594 -11559 47770 -46396 -38949 50054 -21449 -58766 38728 6396 -64659
809 -64659 21414 31919 -59915 837 50330 -44416 -24441 59742 -18155 -43820 53773 11347
821 11347 -51828 38619 38936 -49019 15805 57068 -36397 -7812 65015 -17513 -29799 61855
833 61855 7429 -47365 45512 33174 -52227 18866 50286 -43168 -7531 56375 -27775 -33199
845 -33199 51889 -7510 -50801 39699 14692 -59824 15737 34710 -56784 -11518 44938 -41311
857 -41311 -35891 45362 -19138 -53249 35698 4669 -61994 18999 29353 -56945 -3011 45671
869 45671 -41046 -23777 52682 -17046 -40776 48439 10099 -47973 36225 35096 -47429 14338
881 14338 54256 -33945 -8537 60932 -13764 -28804 56433 8080 -42622 42593 29693 -47388
893 -47388 21200 46909 -40979 -6366 56378 -25912 -31031 51644 -4190 -46616 36931 15932
905 15932 -54221 16282 31547 -53926 -9568 43331 -40036 -33145 45171 -19365 -51930 35192
917 35192 6133 -58408 16801 27265 -53992 -3601 41726 -39000 -23450 48267 -18378 -39550
929 -39550 45300 8285 -47551 31958 32390 -44592 13255 49823 -33866 -8286 56788 -14598
941 -14598 -27007 53563 8367 -40073 39364 28643 -41984 19256 45050 -37460 -3990 52674
953 52674 -22819 -27391 49763 -4886 -44226 36326 17009 -52015 14791 32549 -47785 -8804
965 -8804 40393 -35848 -30506 41048 -19023 -46911 32788 3456 -56793 16689 24814 -52858 -3434
978 -3434 40600 -38642 -24030 44976 -17522 -38271 41108 5293 -46286 29987 28803 -45006
990 -45006 12208 47344 -33786 -8955 54642 -13619 -26849 51585 7871 -37541 37731 28934
1002 28934 -41258 18970 43383 -35190 -2754 50744 -21697 -24113 47704 -2467 -40984 35332
1014 35332 15868 -47716 15501 32096 -45306 -8283 39780 -33299 -30216 38520 -15529 -45076
1026 -45076 30468 3957 -51835 14913 22567 -48502 -5199 36621 -37201 -23463 42471 -17277
1038 -17277 -38856 38419 6335 -44760 25644 26500 -42118 8820 41699 -31397 -8490 50685
1050 50685 -14575 -25003 48404 7220 -36973 36776 28156 -38585 17255 43311 -32854 -3909
1062 -3909 48818 -19939 -22975 46527 -2177 -37957 35561 16903 -45137 16184 31257 -43454
1074 -43454 -6549 40419 -32379 -27059 39135 -14395 -42890 30058 4737 -50409 12855 21895
1086 21895 -47585 -4047 33472 -35942 -22207 39588 -18549 -37758 36561 3570 -44168 23762
1098 23762 24871 -42294 8136 40934 -29790 -8648 45776 -13044 -24459 44483 6073 -33468
1110 -33468 34104 24925 -36234 17812 41111 -30902 -2634 47508 -17390 -21684 45069 179
1122 179 -34572 32503 16878 -40932 15413 29383 -39540 -4562 38686 -29499 -24696 38103
1134 38103 -13538 -40662 28149 4595 -47448 12919 21066 -45234 -5090 32214 -35084 -22576
1146 -22576 36817 -18860 -37222 33359 2595 -42859 23950 22097 -41267 6942 37449 -30636
1158 -30636 -9777 45685 -13830 -25629 42655 5286 -33357 32181 25136 -34984 17221 38384
1170 38384 -28002 -1898 45681 -16567 -20507 44554 -29 -33907 31864 17618 -38702 15467
1182 15467 30826 -35275 -3915 37021 -26224 -23477 35400 -11780 -37994 28012 4972 -45802
1194 -45802 12838 20411 -42908 -5496 29902 -32590 -22310 34413 -17151 -34453 29923 2721
1206 2721 -41744 20134 20273 -40134 5157 35317 -29794 -10611 42248 -13093 -24541 40084
1218 40084 5341 -32603 30398 23219 -33433 15660 37022 -27528 -1405 44078 -14471 -18645
1230 -18645 42408 648 -31108 33325 16168 -36766 16637 30437 -34134 -3052 37184 -25257
1242 -25257 -21467 35306 -10743 -35518 26710 4942 -43246 13473 19269 -42451 -4331 30285
1254 30285 -32859 -21220 33981 -16194 -35223 29359 1509 -41517 18073 18940 -39106 4447
1266 4447 31403 -29361 -10788 39166 -14372 -24486 36991 4146 -31489 28575 21592 -32715
1278 -32715 13603 35811 -26045 -2576 41697 -14579 -17221 40066 1755 -28872 31018 16632
1290 16632 -33560 15931 29083 -33588 -2018 35507 -22592 -20222 35235 -9663 -33922 26213
1302 26213 5536 -40611 13678 18526 -39465 -2481 29085 -31608 -19730 32257 -17096 -32468
1314 -32468 28259 665 -40245 17463 17627 -37459 3045 29316 -29369 -11585 37154 -14940
1326 -14940 -23035 36143 2910 -31382 27815 20309 -31996 14117 34817 -25257 -2732 41377
1338 41377 -13346 -16565 38930 1850 -28033 30210 16731 -31906 16184 29084 -30081 -1036
1350 -1036 34886 -21156 -18551 33316 -7762 -32302 26601 6305 -38949 12374 18995 -37195
1362 -37195 -4060 28927 -29149 -19596 30239 -15270 -32065 25712 572 -37510 16549 16687
1374 16687 -36751 2670 28986 -28046 -12667 34258 -15170 -23716 32947 1923 -30279 24883
1386 24883 18969 -30799 13682 31690 -24286 -2713 39849 -12851 -16298 37517 2462 -26381
1398 -26381 29737 16395 -30530 16268 28685 -27946 -103 34114 -21122 -16484 34348 -8359
1410 -8359 -30418 26359 6073 -36538 13848 19507 -36507 -4419 27410 -28488 -18152 28994
1422 28994 -14863 -30422 25141 -6 -37736 15018 15649 -35848 2413 27103 -28184 -12537
1434 -12537 32071 -14607 -24235 31431 2081 -29812 24276 17975 -30348 11822 30432 -24237
1446 -24237 -2393 36942 -11725 -15150 36448 2301 -25469 28471 16459 -29119 15756 28014
1458 28014 -26199 -912 33522 -17572 -15541 33199 -6275 -26691 26468 7139 -34463 13000
1470 13000 19803 -34022 -2295 26108 -27766 -17562 28788 -14315 -30060 23562 1166 -35817
1482 -35817 14954 14168 -35431 1792 25319 -28007 -12437 30836 -14792 -23268 29406 1776
1494 1776 -30070 22781 16209 -30374 9836 28821 -23794 -3184 35420 -12645 -15394 34325
1506 34325 1944 -24328 28376 15927 -27590 16053 26773 -24949 425 32798 -15935 -14530
1518 -14530 31124 -5055 -26283 24733 7585 -32349 12507 18571 -31160 -1404 24851 -24554
1530 -24554 -16431 26960 -12761 -28799 21772 -189 -33627 12846 12725 -33294 -407 23418
1542 23418 -26078 -12047 28125 -14105 -23855 27386 836 -29237 20676 15285 -27925 9353
1554 9353 27121 -22505 -3251 33411 -11473 -14824 32827 2090 -23099 25627 14848 -26159
1566 -26159 15239 25829 -24101 499 32011 -15758 -13168 31104 -4133 -24755 24663 8228
1578 8228 -29661 13148 18067 -28786 -1197 24796 -23603 -15212 25556 -13324 -26898 21758
1590 21758 565 -33296 13014 13354 -32484 326 21869 -25737 -12130 25429 -14071 -21720
1602 -21720 25530 437 -27402 18380 13924 -27342 7366 24342 -22404 -2677 31348 -11045
1614 -11045 -15137 29962 1585 -21763 24198 15380 -24683 13751 25571 -21004 606 30476
1626 30476 -13834 -13238 29997 -3268 -21386 23898 7482 -27222 12022 18503 -27679 -1050
1638 -1050 24712 -21770 -14685 24754 -11703 -25376 21136 -957 -29509 10965 12297 -30806
1650 -30806 313 20878 -25479 -11717 25154 -14190 -21647 23581 -582 -27663 16829 12454
1662 12454 -27318 8418 22375 -22041 -3352 29859 -11586 -14454 29208 1198 -20954 23679
1674 23679 14043 -23277 13179 23647 -20932 1011 29343 -13345 -10838 29709 -3193 -20715
1686 -20715 23474 7330 -25686 12568 17532 -25181 -1 23128 -20133 -13643 23757 -10703
1698 -10703 -23244 19933 831 -28635 10223 11485 -28856 368 18959 -24278 -11319 22328
1710 22328 -13622 -21304 21644 98 -26069 16342 11365 -26014 6974 21690 -20721 -3116
1722 -3116 27632 -11547 -13972 27012 123 -19977 21827 12340 -22295 13429 22110 -19596 780
1735 780 27985 -11477 -10372 28501 -2508 -19954 23333 8805 -24513 12362 16141 -23841 614
1748 614 23333 -18843 -12061 24472 -9823 -22622 18831 1295 -27611 10834 11783 -28521 -82
1761 -82 17645 -22952 -10549 21450 -13724 -20270 20341 -1895 -25097 14644 10829 -24167 5575
1774 5575 19198 -20474 -4589 25213 -11302 -12628 25294 972 -18644 20131 12323 -19897
1786 -19897 12549 21024 -18653 730 25611 -11122 -9137 26679 -1735 -18189 21163 8225
1798 8225 -22382 12306 18062 -22118 575 21243 -17547 -10979 21418 -9692 -20090 19036
1810 19036 746 -26884 10609 10988 -25705 -61 17528 -21450 -10841 19881 -13368 -19558
1822 -19558 18832 -2415 -25157 13817 9628 -24570 5079 17274 -21055 -3783 23281 -11621
1834 -11621 -13426 24342 -421 -18791 19535 10466 -21794 11608 20682 -17760 1221 25162
1846 25162 -11202 -8202 26681 -2306 -16781 20512 7815 -20850 12631 16947 -20096 878
1858 878 21305 -16048 -9436 21986 -8529 -18864 18349 967 -24694 10236 9603 -25191 -313
1871 -313 16296 -20716 -10049 19373 -12140 -18740 18133 -1585 -23634 12381 8627 -23478 5662
1884 5662 16773 -18746 -4766 22397 -11845 -12110 23095 -595 -18259 18849 10713 -20052 10771
1897 10771 19793 -16254 722 23917 -9655 -7066 24948 -1394 -15873 20752 8434 -19892
1909 -19892 12911 15763 -18691 2467 20937 -14697 -9338 21346 -7719 -17675 17431 1175
1921 1175 -23287 9451 8952 -24018 818 15052 -19963 -9395 18615 -11087 -18447 17377 -1923
1934 -1923 -23185 11569 8079 -22492 3209 15162 -19978 -5300 20220 -11314 -12362 20315
1946 20315 -956 -18032 17337 9613 -19324 10128 18004 -16321 1288 23160 -9246 -7621
1958 -7621 23329 -417 -15014 18885 7954 -16687 11945 15324 -17510 2709 19925 -14778
1970 -14778 -7438 20438 -7094 -15887 16945 2056 -21241 10026 9586 -21586 -325 14328 -17887
1983 -17887 -8704 16994 -11232 -16206 15636 -2308 -21727 11544 7374 -22482 3488 14516
1995 14516 -18440 -6322 18664 -11760 -12096 19220 -2017 -17578 15896 9164 -17904 9392
2007 9392 16848 -15348 1273 21268 -9184 -7176 22933 -2071 -13742 18565 7340 -16761
2019 -16761 11880 14352 -16626 2925 18782 -11354 -6428 20130 -6062 -15109 16065 1960
2031 1960 -20195 9375 9541 -20148 556 13647 -17493 -7521 16581 -10290 -15744 14533 -3088
2044 -3088 -21027 9850 5624 -22144 2456 13102 -18242 -5332 17819 -9602 -11950 17459
2056 17459 -1556 -15970 14016 7682 -16622 7940 15122 -14766 705 20009 -9240 -6487
2068 -6487 20792 -1693 -12484 18395 7280 -16547 12078 15016 -14771 2588 18093 -11013
2080 -11013 -6356 20170 -4910 -13494 17007 1695 -18178 9577 9210 -19345 976 14423 -15926
2093 -15926 -9124 16134 -9554 -15310 15131 -1609 -19766 9152 6227 -21575 2542 11431 -17700
2106 -17700 -5295 15853 -10610 -11564 17278 -2195 -16945 13775 7700 -16985 7958 13543 -14439
2119 -14439 -54 19227 -8759 -6466 19287 -802 -12111 17216 7611 -14749 10164 14530
2131 14530 -13323 2369 19073 -9569 -6281 18655 -5246 -12130 15765 2838 -17147 9900
2143 9900 8579 -18042 883 13595 -15668 -7275 15477 -9484 -15232 13492 -1317 -19269 9080
2156 9080 5938 -18681 1663 10714 -17965 -4321 14336 -10657 -12338 15790 -2091 -15997 11964
2169 11964 5051 -16658 6827 13458 -14151 356 18641 -8309 -6842 18773 -1881 -11137 15677
2182 15677 6378 -13549 10772 14507 -13674 2954 17650 -9189 -5855 18528 -3154 -11797 15236
2195 15236 3786 -16007 8677 9012 -17972 2368 13160 -12597 -7074 14624 -8194 -13248 13246
2208 13246 -1547 -17371 7143 6185 -19464 2310 10128 -16259 -6457 13719 -9812 -12034 13671
2221 13671 -2371 -15178 11132 5246 -15529 5683 13081 -13735 -926 17097 -7844 -6921 17661
2234 17661 -895 -12095 16021 6596 -13545 10405 12210 -12502 2659 17963 -8784 -4434
2246 -4434 17749 -3319 -11706 14982 3313 -14624 9555 9440 -16107 1494 13997 -12684 -6469
2259 -6469 14768 -8144 -13296 12545 -2030 -18209 8885 4411 -18162 1480 10971 -15350 -6131
2272 -6131 13873 -10324 -11751 13301 -2393 -15426 9621 5006 -15778 5095 11177 -12983 -1014
2285 -1014 15787 -7520 -7189 16987 -1394 -11363 14423 6089 -13076 9701 12658 -12214 2097
2298 2097 17574 -7978 -4662 17051 -3142 -10705 14075 2925 -13822 8882 9530 -14344 2143
2311 2143 13293 -12644 -6245 13834 -7042 -12694 11586 -938 -16437 7604 4583 -17162 1358
2324 1358 10538 -15616 -5305 12084 -10213 -10771 12860 -3183 -15226 9398 4571 -15619 4528
2337 4528 11823 -13406 -933 14865 -7467 -7665 15702 -1236 -11588 13021 5094 -13160 7836
2350 7836 11945 -12140 2262 15944 -7038 -3607 16712 -2591 -9792 15166 3336 -12518 9330
2363 9330 8742 -13548 2920 14020 -11075 -5672 13284 -6868 -11149 11528 -698 -15301 7635
2376 7635 5126 -17524 1481 9953 -14132 -5250 12274 -9887 -11146 11593 -1997 -15959 8758
2389 8758 4928 -15768 4477 10292 -13448 -1688 14175 -8189 -6599 14892 -1294 -10943 13251
2402 13251 5238 -12877 8622 11388 -11789 2462 15123 -7504 -3596 16636 -1863 -8892 14306
2415 14306 3757 -12345 9170 8790 -12614 2755 13183 -10861 -4519 13965 -6691 -10802 12826
2428 12826 -879 -16041 7646 4420 -16282 1431 9815 -13754 -5221 11409 -9458 -10710 11566
2441 11566 -2327 -15498 9078 4088 -14968 3786 10045 -13329 -1661 14241 -7944 -7902 13868
2454 13868 -2597 -10599 11380 5474 -12374 6582 12003 -10395 2746 15284 -7261 -4526 16089
2467 16089 -3628 -9094 13480 3904 -11670 9397 9091 -11651 1638 12547 -8670 -4231 12880
2480 12880 -5603 -10793 11582 -223 -14058 6893 6035 -14862 1658 9212 -13492 -4634 11670
2493 11670 -9964 -10488 11848 -2328 -14749 7684 3752 -14961 3870 9096 -13352 -2342 13944
2506 13944 -8075 -7336 13252 -2269 -11119 11315 4380 -12517 8099 9925 -10634 1189 13684
2519 13684 -7501 -2818 16441 -1451 -7762 13479 3752 -10648 9004 9658 -11801 4353 12823
2532 12823 -8942 -3754 13246 -5372 -9472 11182 89 -13447 7086 5872 -14386 1545
2544 1545 9694 -12773 -4977 11103 -8801 -10786 10175 -2694 -13843 7922 3919 -14418 2587
2557 2587 9343 -13144 -2689 11871 -7889 -7087 13600 -2437 -10246 11304 5103 -12365 7063
2570 7063 10268 -10630 2386 13846 -7598 -4345 14807 -2340 -8704 12912 4187 -10919 8525
2583 8525 8395 -11734 2723 12929 -9819 -3395 13377 -3860 -8601 11608 118 -13828 7686
2596 7686 5740 -13954 1460 9004 -11865 -4669 11448 -8131 -9803 10444 -2325 -13801 7580
2609 7580 2842 -15063 2571 8450 -11965 -3013 12126 -8166 -7637 12197 -2295 -10716 9896
2622 9896 3698 -11880 6378 9885 -10702 2094 13307 -7707 -4069 13991 -969 -7789 13085
2635 13085 4258 -10983 8707 9691 -11130 2742 12341 -8140 -2349 13552 -4002 -9064 12203
2648 12203 1387 -12347 8069 5329 -14022 1123 9164 -12107 -3328 10650 -7868 -9835 10293
2661 10293 -1892 -13556 7549 2876 -13691 2496 7975 -13088 -2170 11202 -8845 -8149 11934
2674 11934 -2796 -10435 10378 4195 -12282 5898 9146 -11319 939 12511 -7573 -3463 14318
2687 14318 -1877 -7582 12339 3666 -11722 8134 7675 -10786 3002 12162 -8334 -2430 14701
2700 14701 -4003 -7391 12420 290 -11226 7949 5941 -12731 1337 9241 -11656 -3137 10727
2713 10727 -8095 -8887 10364 -3009 -12593 6849 2915 -14386 2209 7488 -13134 -4106 9633
2726 9633 -8556 -8543 11434 -2861 -10755 9177 3680 -12308 5820 8731 -10670 1365 12351
2739 12351 -6924 -2960 13968 -1966 -7912 12641 4473 -8979 8519 8821 -9893 3065 12377
2752 12377 -7424 -2661 14031 -3961 -8230 11804 1576 -11282 8687 5381 -12912 3065
2764 3065 8798 -10842 -2291 10416 -7667 -8929 10375 -2759 -12262 8159 2364 -13969 2137
2777 2137 7201 -12721 -2676 9836 -9061 -7635 11221 -4046 -11984 8812 2409 -12797 5962
2790 5962 8307 -10386 1083 11426 -7834 -4502 13058 -2112 -7974 12387 4485 -10178 7936
2803 7936 8984 -9770 3128 11614 -7806 -2705 13706 -3312 -7296 11954 1060 -10873 7742
2816 7742 6449 -12422 3786 9792 -10110 -3326 11023 -6587 -8316 10448 -2623 -11926 6206
2829 6206 2827 -12712 2265 7962 -11335 -2472 9616 -9144 -7814 10171 -3563 -11261 9227
2842 9227 2527 -12076 5331 7415 -10983 1120 11394 -7435 -3850 12561 -3016 -8597 11570
2855 11570 3372 -9817 9128 8316 -9974 2710 12996 -7932 -2908 13342 -3537 -7411 12240
2868 12240 1135 -8951 7269 6722 -12100 2625 9471 -10470 -2517 10243 -6498 -7677 10429
2881 10429 -2007 -12355 7126 3099 -13244 3228 6478 -11446 -2066 9604 -9139 -7098 10176
2894 10176 -3682 -11818 9487 2041 -12750 5198 6497 -11012 246 11432 -7860 -4387 11860
2907 11860 -2911 -7760 10851 2683 -10685 8182 7821 -9812 2969 11530 -7129 -960 12431
2920 12431 -3314 -6259 11662 1050 -10803 8858 6128 -11045 3747 8765 -10161 -1807 9870
2933 9870 -6782 -7166 11009 -2143 -11202 7502 2094 -12679 2899 6016 -12013 -1778 8765
2946 8765 -8857 -7617 10283 -3491 -9592 7607 1847 -11793 4480 7304 -10891 794 10198
2959 10198 -8150 -4423 12378 -2845 -7697 10638 1971 -9845 7601 8408 -9036 2415 10151
2972 10151 -7732 -882 13093 -3283 -7281 11197 1010 -9581 9020 6111 -9833 3273
2984 3273 9364 -8741 -1568 11228 -5538 -7082 9909 -1895 -10826 6368 3057 -12551 3051
2997 3051 6560 -11675 -2297 9285 -8281 -7330 9270 -4222 -10684 7672 646 -12409 5538
3010 5538 5077 -10353 296 10492 -6719 -4805 11181 -2771 -6999 10396 2317 -9150 7229
3023 7229 7103 -9418 3954 11114 -7187 -565 12438 -3206 -6084 11299 2115 -9039 8762
3036 8762 5098 -10396 4260 9288 -8447 -1437 10196 -5317 -6858 9143 -1505 -10612 7327
3049 7327 2252 -10851 3086 6860 -10654 -1488 7971 -8231 -6938 8641 -4555 -10862 7172
3062 7172 1273 -11851 3924 5923 -11273 -310 8654 -8349 -4751 10429 -3162 -6701 9952
3075 9952 2018 -9328 6821 7633 -7821 3303 11097 -6093 -1240 12601 -3135 -4460 10313
3088 10313 811 -7716 8069 5534 -9829 4206 9008 -9047 -1357 10455 -5669 -6205 9306
3101 9306 -2323 -9520 7166 2923 -11034 2905 5302 -10054 -2059 8525 -8097 -6689 8814
3114 8814 -3533 -9837 7007 309 -11127 4150 4932 -10274 -1000 8309 -7472 -4039 9871
3127 9871 -3076 -7743 8584 1163 -8841 6726 7064 -8063 2705 9485 -6966 -398 11629
3140 11629 -2159 -5356 11582 1830 -6909 8535 4872 -7974 3306 8803 -7487 -283 10548
3153 10548 -5614 -5884 9052 -1309 -8983 6642 1904 -10730 3363 6273 -10337 -2677 8526
3166 8526 -7771 -6028 8403 -4047 -9460 7581 1171 -10664 3359 5829 -10202 -382 8277
3179 8277 -8331 -3628 9947 -3454 -8256 8661 1123 -9077 5906 5861 -8968 2534 9817
3192 9817 -7019 -224 10825 -2875 -5159 10065 1362 -7287 7731 4907 -8559 3660 7393
3205 7393 -6968 357 10200 -4595 -5140 10063 -1360 -8613 6774 2714 -9613 3377 6031
3218 6031 -9417 -918 7354 -6461 -6007 8695 -3440 -9611 7478 866 -10792 3393 4822
3231 4822 -9602 -13 6491 -7483 -3124 8898 -3450 -7322 8002 273 -8425 5954 4754
3244 4754 -8136 2676 8582 -6680 -1773 10400 -3108 -4690 9952 1138 -7433 6700 5224
3257 5224 -7106 3823 8180 -6806 -26 9928 -4338 -5097 9347 -610 -7043 7244 3804 -9486
3271 -9486 3368 5244 -9228 -1668 7759 -6679 -5184 7955 -3464 -7991 5889 23 -9524
3284 -9524 3267 3722 -9705 17 6804 -7713 -2893 8470 -3768 -6762 7668 531 -8844 5914
3298 5914 3829 -8179 2120 8599 -5902 -1664 9550 -3465 -4516 9482 939 -6756 7623
3311 7623 4890 -6500 2988 6373 -6247 -876 10046 -4653 -3714 9062 -995 -7074 7617
3324 7617 3382 -9568 4104 5894 -9213 -923 7741 -6558 -4775 7619 -3907 -8493 5659
3337 5659 567 -9685 4579 4387 -9577 -170 6857 -7533 -3520 7892 -3694 -6097 7758
3350 7758 371 -8445 4872 3882 -8019 2323 7171 -6465 -1353 10352 -3473 -4533 9919
3363 9919 579 -6996 7190 4366 -7251 3813 6697 -6013 -573 9802 -4482 -4115 8636
3376 8636 -651 -6919 6943 1880 -8234 2964 5084 -8164 -456 6651 -5738 -3990 7808
3389 7808 -3383 -7180 5476 -63 -9300 2851 3668 -8889 -87 5951 -7552 -4182 7639 -4025
3403 -4025 -6353 7181 -263 -7973 4760 4380 -7508 1387 6562 -6137 -1053 8647 -3189 -3271
3417 -3271 9107 686 -5799 7244 4563 -7310 3029 7071 -4744 -194 8985 -3576 -3095 7989
3431 7989 -1934 -5859 7236 2708 -7649 3942 4489 -7666 745 7439 -4881 -3889 7350 -3495
3445 -3495 -6893 4865 -511 -8837 3808 3686 -7778 204 5631 -6952 -3277 6893 -3640 -5358
3459 -5358 6533 -132 -7659 4124 3132 -8156 1430 6075 -6418 -936 7714 -2947 -4317 8094
3473 8094 611 -5719 6419 4233 -5913 3541 6743 -5720 931 9535 -3167 -2874 9411 193
3487 193 -6048 6145 1929 -7524 3368 4948 -7051 10 6903 -5070 -3426 6850 -2414 -6185
3501 -6185 4225 164 -8420 2298 2690 -8836 -359 5122 -5888 -4371 5938 -3563 -5809 5631
3515 5631 -537 -7337 3868 2791 -6812 2004 5842 -6030 -1343 7481 -3133 -4118 7387 254
3529 254 -5574 6212 3487 -5923 3850 6945 -5146 924 7418 -3198 -2338 8431 -545 -5976
3543 -5976 5849 1876 -6613 3413 5542 -6736 -101 6144 -4863 -3029 6706 -3181 -6363 5032
3557 5032 764 -8304 2704 2911 -7695 62 4131 -6230 -3389 6721 -4301 -6267 5608 -1439
3571 -1439 -6632 4148 2944 -6858 984 5381 -5549 -1149 6889 -3384 -4016 6880 517 -5301
3585 -5301 6532 2696 -5301 3777 5690 -5961 549 8290 -3088 -3365 7832 -1181 -5092 5647
3599 5647 3327 -6061 3541 4794 -4968 200 7113 -5446 -3531 5827 -1664 -5368 5034 -299
3613 -299 -8000 3718 2439 -6656 -70 4546 -6125 -3468 5480 -4090 -5275 4950 -754 -6959
3627 -6959 3962 2295 -7687 1599 4891 -6073 -1187 6523 -2326 -3171 6856 -69 -5288 5253
3641 5253 3247 -6077 2931 5180 -4381 320 7700 -2038 -2913 7285 -300 -4494 5350 1821 -5372
3656 -5372 3321 5962 -5104 1161 5508 -4126 -2669 6339 -1904 -4821 4963 363 -6728 2854 3804
3671 3804 -6462 -358 5397 -5325 -3179 5836 -1770 -5588 4634 29 -6583 2575 2828 -6222
3685 -6222 768 4703 -6013 -1735 6349 -3309 -4537 6234 142 -4964 4432 3570 -6284 2305 5707
3700 5707 -4137 -117 6353 -2474 -1943 7831 79 -5393 5954 2775 -5072 3357 4570 -4643 534
3715 534 6193 -3583 -2734 5898 -1757 -4635 5453 527 -5484 2638 2798 -6409 -534 4180 -4821
3730 -4821 -2329 4859 -2633 -4661 3820 -526 -5766 1986 1938 -6531 1449 4880 -5372 -1935 5187
3745 5187 -2624 -3697 5724 417 -5547 3776 2415 -4401 2404 4884 -4585 -113 6324 -2726 -3449
3760 -3449 6940 -582 -3537 5001 2282 -5254 4000 3751 -4316 1058 5177 -2977 -1956 5867 -1272
3775 -1272 -4245 4017 673 -5988 2863 2972 -6806 -35 4366 -4977 -2508 5379 -2688 -4774 4431
3790 4431 -520 -6958 3208 2172 -5639 854 4456 -4728 -876 5826 -2603 -4151 5109 136 -5134
3805 -5134 5221 3771 -6089 3127 4209 -5357 -193 6426 -2550 -2140 5132 -861 -3463 4771 2075
3820 2075 -4627 3252 4963 -4125 613 5318 -3333 -1868 5293 -1966 -4264 4785 520 -6145 3596
3835 3596 1316 -6052 -112 4365 -4271 -2663 4174 -2672 -4177 3490 -13 -6086 2749 1689 -6024
3850 -6024 104 3820 -4898 -1305 4874 -2801 -3526 5534 -814 -4486 3826 1633 -4014 1955 4267
3865 4267 -4510 -494 6037 -1801 -1536 6356 -261 -3220 5643 2554 -3864 3072 4496 -3721 591
3880 591 5703 -2933 -2358 5455 -1320 -3980 4512 -24 -4854 2393 2516 -5636 578 3858 -4647 -2833
3896 -2833 4169 -2557 -4313 4190 111 -5370 2767 1560 -5671 -213 4223 -5217 -1685 4019 -2136
3911 -2136 -3002 4532 -390 -4638 2791 1709 -4926 2489 4614 -3712 52 5184 -2637 -2065 6634
3926 6634 -117 -3768 5089 2085 -4614 2886 4379 -2870 189 5292 -2840 -1918 5046 -1071 -3757
3941 -3757 3678 676 -5219 2522 3067 -5693 390 3642 -4364 -1980 5104 -2217 -4489 4105 -1159
3956 -1159 -4657 2517 1330 -5307 778 3621 -4448 -1701 4649 -2834 -3001 3726 -138 -5058 3824
3971 3824 2290 -4434 1685 3106 -4026 -172 5018 -2142 -1974 4648 53 -3202 4230 1535 -4406
3986 -4406 2245 4491 -3415 119 6089 -3375 -1572 4970 -545 -3420 4493 1623 -4687 2564 2837
4001 2837 -5591 348 3394 -4305 -1978 3757 -2105 -3079 3692 -126 -6218 2550 1331 -4859 980
4016 980 3610 -4257 -2332 3949 -2213 -2545 4389 -350 -4796 1907 2188 -4377 1279 3862 -3846 -634
4032 -634 5320 -2028 -1499 5500 364 -3762 4096 2044 -3685 3024 3941 -4233 790 5732 -2243 -2384
4048 -2384 5139 -839 -4083 4168 975 -4755 2116 2730 -4657 569 3620 -2931 -1426 3837 -2063
4063 -2063 -3805 4223 -758 -5272 1278 886 -5072 -1129 3062 -3756 -1968 4190 -2893 -3945 3433
4078 3433 -395 -4014 2149 1228 -4442 1318 4183 -3351 -201 4573 -2308 -2256 4373 -409 -3881 4713
4094 4713 1926 -3979 2376 3396 -3003 648 5561 -2240 -1168 5387 -868 -2677 5133 2007 -3610
4109 -3610 3408 3358 -4296 322 3469 -3484 -1088 3752 -1915 -3496 3404 -102 -4858 3090 1635
4124 1635 -4730 204 2739 -3894 -1992 4445 -2640 -3686 4692 -601 -4409 2046 845 -4255 812
4139 812 3365 -4441 -562 4137 -2528 -1939 3221 -740 -3787 3941 1350 -3167 2102 3409 -2475
4154 -2475 397 5026 -2092 -2001 5328 -1255 -2747 4654 847 -4498 3338 3662 -3799 323 3937 -2389
4170 -2389 -387 4232 -1073 -3732 2911 465 -4478 1920 1337 -4426 518 3653 -3910 -2430 3174
4185 3174 -2213 -3218 2954 -575 -4439 2220 2204 -3738 959 3445 -3810 -1571 3388 -1862 -2807 4136
4201 4136 -1006 -3965 3566 768 -3707 2473 4368 -3271 308 3968 -1647 -1844 4094 -1095 -3548
4216 -3548 4069 1763 -3272 2255 2856 -4200 -87 4197 -2664 -850 3972 -1418 -3046 2983 -142
4231 -142 -3770 1604 1299 -4575 -75 3264 -4268 -1515 2903 -1526 -3379 2575 -1004 -4916 2334
4246 2334 1236 -4896 983 3664 -3707 -1651 4648 -1876 -2122 4236 -1158 -2514 2839 1011 -4096
4261 -4096 1787 3042 -2919 311 4315 -2222 -1435 4895 -612 -3459 4860 1342 -3215 2176 1917
4276 1917 -4992 195 3551 -3023 -814 4592 -1252 -2674 4131 -454 -3951 1783 1932 -4251 1024
4291 1024 2964 -3311 -1714 3206 -1863 -2968 2992 -1058 -3831 1752 1500 -4256 2005 2877 -3960
4306 -3960 -429 2469 -1711 -1765 4614 -873 -2747 2608 1306 -4142 1127 3050 -3082 1177 4251
4321 4251 -1977 -1460 4127 39 -3047 3353 1473 -4196 2937 2518 -3494 311 3840 -3680 -1086
4336 -1086 4385 -1572 -2870 3322 83 -3299 2010 1583 -4312 351 3001 -3210 -1255 2791 -2268
4351 -2268 -3074 3054 -331 -4686 2397 1847 -4449 -75 2394 -3594 -1115 3684 -1924 -3072 3174
4366 3174 -111 -3195 2786 2155 -3805 1452 3238 -3186 -38 3844 -1745 50 4148 -1976 -3314
4381 -3314 2883 1992 -3025 2742 2703 -3553 742 3783 -2407 -948 4194 -790 -2190 3491 3 -3442
4397 -3442 1652 2292 -3599 -96 2461 -2564 -1110 3960 -2099 -4191 2682 -919 -3613 2401 707
4412 707 -4444 571 1679 -3335 -1282 3642 -1736 -2273 3734 -650 -2736 3293 2131 -4028 1232
4427 1232 2919 -3990 632 3862 -981 -1468 3593 -518 -2495 3334 2049 -3223 2869 2921 -2104 448
4443 448 3276 -1998 -1361 3468 -591 -2386 3019 -73 -3435 1592 1583 -3203 993 2232 -3427 -850
4459 -850 3187 -1833 -2171 2618 88 -3675 2331 1703 -4407 259 2484 -3422 -586 3277 -1775 -2053
4475 -2053 3592 253 -2974 2750 747 -3709 1240 3257 -3397 -768 3790 -2130 -1371 3640 -176
4490 -176 -2551 2929 1545 -3359 2030 2754 -3323 1058 2994 -2173 -1578 3784 -990 -3221 2778 638
4506 638 -3180 1946 1917 -2826 940 3104 -3428 -1141 3198 -1700 -2734 2596 -360 -3291 1554 670
4522 670 -3360 381 2013 -3337 -469 2888 -2037 -3047 3068 218 -3067 1724 1097 -3019 1761
4537 1761 2489 -3078 -190 3927 -897 -2055 2482 -410 -2092 3174 1416 -3640 2301 2328 -3483 33
4553 33 3616 -1466 -624 4156 -250 -2662 4138 1492 -2716 1806 2041 -3020 359 3741 -2401 -1571
4569 -1571 2874 -1217 -1668 2865 -838 -3525 2753 1644 -3879 -308 1581 -3753 -1235 2948 -1834
4584 -1834 -2661 2349 205 -3273 3092 877 -3236 704 2808 -2870 -21 4020 -1617 -1314 3896
4599 3896 -595 -1822 3613 1754 -2637 2440 2552 -2325 -13 3699 -1514 -1384 3825 -929 -2580
4614 -2580 3425 1122 -3580 2021 2587 -3485 616 2594 -2975 -711 3100 -1804 -2907 3824 668
4629 668 -3959 1524 882 -3219 553 1980 -3010 -1161 2304 -1091 -2828 2551 148 -3480 1844
4644 1844 1566 -3821 157 1933 -3019 539 2342 -2004 -1698 3719 -1609 -2963 2558 1498 -1871
4659 -1871 1679 2489 -2465 264 3390 -1667 -1205 3982 -481 -2420 2237 464 -2864 2033 1966 -3433
4675 -3433 98 2754 -1894 -1973 2551 -1363 -2369 2164 -711 -2856 2361 1709 -3570 686 2259 -3350
4691 -3350 -1393 2479 -936 -1392 2423 -919 -2567 1802 658 -2590 455 1278 -2854 21 3046
4706 3046 -1267 -1926 2674 -712 -3007 3476 979 -1860 1626 2997 -1893 -543 3890 -1353 -651
4721 -651 3468 -122 -2074 3075 1418 -2951 1260 1949 -2233 604 3062 -2516 -1363 3022 -1740
4736 -1740 -2167 2534 661 -3789 802 1937 -3142 376 2127 -1888 -1385 1897 -1816 -2027 1351 -548
4752 -548 -3290 1542 615 -2550 595 1991 -2786 -181 2242 -2141 -1589 2972 523 -2340 2200 281
4768 281 -2595 1944 3200 -2675 1104 3274 -1579 -1041 3044 -673 -1533 2017 1056 -2344 1867 1769
4784 1769 -3313 -586 2708 -1337 -1475 1605 -1337 -1652 2169 629 -3490 1316 390 -2900 456 1354
4800 1354 -2230 -1432 2162 -1007 -3196 2088 -927 -3002 1476 498 -3057 897 2143 -2501 -593
4815 -593 3377 -1247 -1882 2656 -612 -1518 2195 963 -3213 713 2661 -1567 616 3051 -2331 -1020
4831 -1020 1373 -340 -1414 2687 518 -2046 1120 2348 -2070 307 2236 -1291 516 3487 -1139
4846 -1139 -2470 2134 -389 -3159 810 1556 -1925 364 1844 -2708 -176 1735 -1126 -2016 1370
4861 1370 310 -2908 1792 210 -2790 673 2465 -1852 -763 1757 -1586 -1714 2028 -629 -2666
4876 -2666 1191 322 -2764 1345 2247 -1381 -65 2117 -749 -1152 3258 330 -2409 3179 1075 -2481
4892 -2481 1060 2809 -1464 896 2045 -1314 -1344 3060 189 -2293 2533 678 -3911 1257 1265 -2558
4908 -2558 163 2997 -1877 -1548 1962 -502 -2491 1318 -21 -2514 1741 266 -2785 332 1539
4923 1539 -2004 -1062 1969 -916 -1183 1908 627 -2632 1608 641 -2726 1625 1975 -2252 80 2154
4939 2154 -1201 -1711 3436 109 -1498 1481 431 -1959 1509 1831 -1226 704 2837 -1216 -1250 3122
4955 3122 -554 -2051 2390 595 -2424 1112 954 -2443 -240 1801 -1996 80 2888 -653 -2201
4970 -2201 2480 -211 -2591 814 -198 -2429 270 1227 -1945 -1048 2780 -840 -1004 2675 -367 -2508
4986 -2508 1650 1222 -3277 911 2796 -2178 -95 1964 -1662 -1387 2464 817 -1904 2178 1334 -1655
5002 -1655 1877 1325 -2878 729 2826 -1683 -1260 2678 -368 -1835 2822 1350 -2372 1013 1088 -1565
5018 -1565 626 1737 -1713 -1171 1731 -1144 -2973 2490 -138 -1733 1616 1101 -2608 -168 1576
5033 1576 -2691 -112 1727 -1645 -2224 1129 -390 -3150 2165 147 -1767 -237 1466 -1670 -508
5048 -508 2658 -380 482 3054 -583 -2092 2630 602 -2221 232 1583 -1076 243 2663 -424
5063 -424 530 2749 -702 -698 2244 1510 -2451 918 1558 -2651 274 1707 -1867 -962 2205 -1134 -1618
5080 -1618 1228 671 -3267 741 -220 -2008 -309 1836 -1975 -1383 2119 -1125 -2073 1976 -5 -2861
5096 -2861 886 682 -1062 297 813 -2207 -137 1916 -1389 -698 1871 -136 -1338 2515 1791 -2058
5112 -2058 778 1796 -1503 -918 2295 -430 -944 1902 -846 -1665 1800 1208 -1757 1061 1843 -2056
5128 -2056 -205 2031 -971 -879 1842 -413 -1750 1082 -242 -2054 611 795 -2454 -264 1777 -2216
5144 -2216 -604 2033 -601 -1615 1949 55 -2483 1587 390 -1057 264 1794 -1433 -1264 2091
5159 2091 -735 -1453 1856 286 -1887 1486 1433 -1556 591 1698 -1443 -458 2586 -1596 -526 3189
5175 3189 -169 -1041 1868 651 -2447 461 719 -1813 86 2450 -1525 -1291 1836 -9 -1405 1362
5191 1362 -146 -2077 658 770 -1882 -330 1595 -2041 -451 1411 -1711 -948 1763 178 -1770
5206 -1770 720 130 -2242 182 1899 -2135 -785 1026 -924 -1081 1887 -1010 -1576 1362 1315 -1594
5222 -1594 210 1787 -1694 866 1712 -1047 -967 2287 -292 -1231 1013 909 -1133 1991 1404 -1247
5238 -1247 17 2239 -780 -1054 1824 -619 -1503 844 380 -2278 951 694 -1699 413 1182 -1508
5254 -1508 -418 1405 -736 -2173 1308 154 -2354 1524 368 -2057 -209 1669 -37 -484 1474
5269 1474 -1204 -961 2050 -102 -689 1445 991 -2521 1210 1716 -2400 -546 1625 -942 -207 2896
5285 2896 231 -1194 2446 528 -1856 238 2085 -1839 -32 2177 -800 -384 2197 -906 -1424
5300 -1424 1456 326 -1512 617 840 -2113 239 2411 -877 -1103 1698 -238 -1462 1035 322 -2449
5316 -2449 730 1000 -2780 527 642 -2251 -99 1169 -919 -1107 1046 -388 -1579 1433 1869 -1702
5332 -1702 784 1242 -1518 603 1335 -964 -1088 1830 -258 -599 1891 440 -1109 506 1761 -1732
5348 -1732 746 1930 -199 -791 2167 -483 -1579 1369 -30 -1467 1394 1016 -2515 294 2485
5363 2485 -1370 -1028 1482 -1399 -1154 1671 369 -1561 808 13 -1892 12 1588 -1538 -554 1591
5379 1591 -426 -1404 950 -416 -808 1884 533 -1934 1243 2151 -1713 -536 2380 -590 -600 1555
5395 1555 8 -817 961 278 -903 1078 2165 -875 433 3109 -388 -208 1768 -1162 -1173 1560
5411 1560 413 -1935 919 2208 -2120 -152 976 -1264 -1692 1187 -587 -2127 1105 77 -1800
5426 -1800 535 380 -1371 435 1233 -1773 -474 1729 -541 -875 1966 -554 -2528 926 1621 -1896
5442 -1896 720 1837 -1271 -464 1712 -566 -1713 1750 -383 -835 1761 758 -908 1234 887 -1145
5458 -1145 8 922 -1017 -444 1920 -1035 -994 845 920 -1304 1013 1097 -2160 -83 1310 -492 -1705
5475 -1705 1326 -678 -2286 1147 57 -1643 680 828 -2495 598 970 -1191 -749 1822 -451 -1181
5491 -1181 1641 -60 -2233 1438 566 -2543 -329 2188 -878 353 2010 -515 -598 2293 455 -1349
5507 -1349 1327 217 -1169 744 1177 -904 354 2156 -305 -618 1197 635 -1603 1475 1178 -1850
5523 -1850 865 1401 -780 645 1427 -1510 -955 2310 -966 -2058 1188 576 -2085 -111 633 -1942
5539 -1942 553 1528 -702 -1023 1998 -1622 -1697 852 260 -1739 1304 1236 -2182 257 953 -420 -860
5556 -860 1871 -1106 -846 1666 844 -1340 2143 879 -2442 293 1358 -1200 -20 1206 -1535 -524
5572 -524 1632 -750 -1475 1660 187 -2299 1351 868 -1219 271 1528 -768 -1027 2093 -352 -2085
5588 -2085 960 -723 -2206 1034 776 -1891 -1282 1689 -976 -657 1249 -763 -1713 1457 -902 -1541
5604 -1541 1094 832 -631 -514 212 -1264 6 1918 -510 -1201 1866 189 -678 1072 671 -1158
5620 -1158 1708 2155 -1375 -209 2280 -483 599 1687 -716 -1341 1131 157 -1853 1333 964 -1975
5636 -1975 126 1517 -1104 -397 1667 -1573 -2003 1120 -970 -2003 498 479 -2084 -419 794 -1632
5652 -1632 -1718 2070 -1042 -1984 1220 113 -746 868 1276 -1833 623 1585 -2580 -1207 1140 -470
5668 -470 -1509 1535 316 -1102 771 1406 -822 1446 1897 -1514 87 2109 -991 -669 1398 -18
5684 -18 -802 1767 1025 -1627 1313 1098 -1457 518 1004 -883 -458 1083 18 -790 1340 -124 -1871
5701 -1871 1249 929 -2020 222 1283 -1815 -349 2093 -1653 -1950 1486 199 -1253 1038 621 -2347
5717 -2347 401 1148 -2247 -40 2247 -541 -1046 1373 -164 -1638 1839 877 -730 726 2265 -884
5733 -884 -204 1672 -996 -391 2034 -355 -1218 2197 611 -1991 1464 340 -968 -160 2179 -753
5749 -753 -498 2394 -851 -1447 2484 515 -968 731 1234 -1224 -295 1836 -706 -764 1181 -657 -420
5766 -420 1094 34 -1850 1035 150 -2171 735 1647 -1680 -593 1534 -848 -1540 1247 112 -713
5782 -713 382 591 -2039 71 803 -425 -568 916 -558 -1151 2285 -849 -1056 1722 935 -1544 1025
5799 1025 1096 -438 -121 1959 -1556 -106 2527 -731 -1186 2245 361 -1247 961 956 -2628 1338 2210
5816 2210 -1353 -63 1044 287 -861 1250 -992 -1358 327 193 -1376 550 1111 -1657 156 1744
5832 1744 -800 -1400 737 254 -2147 1699 -81 -1067 797 2186 -1203 387 2501 -1987 -887 1981
5848 1981 295 -1741 1424 654 -1783 853 1316 -1962 93 1253 -1913 -1075 2712 -450 -946 1841
5864 1841 3 -985 983 289 -1678 292 1059 -1177 -512 1095 -1352 -1270 1805 -673 -1650 869 833
5881 833 -2587 340 1828 -1723 -699 633 -1507 -1417 851 -831 -2378 831 818 -1188 969 1642
5897 1642 -1075 -552 1567 -1046 -382 954 92 -1341 2283 821 -1518 1783 1138 -597 -116 1692
5913 1692 -1338 -4 2285 -1223 -1090 1587 316 -899 1505 1594 -1757 907 1927 -1309 -192 447
5929 447 -1189 -1829 788 94 -2210 1461 495 -2027 583 594 -966 347 1314 -841 -1354 1825 336
5946 336 -879 1471 1412 -1120 78 1242 -36 234 1822 -618 -228 2111 466 -437 1328 621 -1350
5963 -1350 1059 1001 -2115 -96 1532 -854 -1431 1716 -834 -1101 2059 70 -1558 1033 720 -1639
5979 -1639 72 1000 -707 -979 1862 -1161 -1281 951 456 -2260 420 673 -2295 175 716 -1362
5995 -1362 -161 938 -1612 -872 1607 -576 -678 979 726 -1197 841 909 -1204 -320 1679 -1268
6011 -1268 -599 1879 -774 -1199 2006 1045 -1518 1262 1122 -1195 523 2246 -855 -800 864 -1082
6027 -1082 -1368 1409 -794 -2056 1052 443 -677 63 1561 -1653 -467 903 -131 -638 622 310
6043 310 -1520 1378 539 -926 984 889 -963 130 1566 -305 -1670 1019 -156 -749 1418 110
6059 110 -707 385 1496 -1030 605 1632 -1551 -574 1422 -134 -733 1811 958 -2003 888 2275
6075 2275 -1157 699 1761 -449 369 1585 -448 -909 1418 754 -1883 632 954 -1294 920 1289
6091 1289 -2433 -806 604 -110 -1312 1095 -1086 -583 856 -126 -1539 208 789 -1053 134 1364
6107 1364 -920 -1289 1393 502 -1833 901 1183 -2782 956 624 -1812 470 1568 -133 763 1976
6123 1976 -543 -1110 803 -320 -273 858 1191 -996 816 1472 -1593 -1121 1833 -238 -690 1695 907
6140 907 -1278 1079 1419 -1878 706 1288 -1167 -1055 1804 -724 -1059 1370 -478 -1689 882 233
6156 233 -557 -25 1157 -1597 5 2184 -2013 -1272 1598 -1098 -1943 1252 501 -1682 744 1375 -1742
6173 -1742 -278 1803 -830 -1282 1828 124 -461 1536 314 -1416 1196 1247 -1207 -195 1401 -664
6189 -664 -298 2207 -113 -212 1126 995 -1247 332 636 -1308 -457 1225 -1563 -184 1738 174 -762
6206 -762 626 0 -1231 815 643 -1892 108 974 -1012 -487 1439 -686 -1114 370 -1678 -1673 1082
6223 1082 -67 -761 766 603 -1749 -630 1479 -1237 -241 1195 -483 -659 751 -82 -1204 1438
6239 1438 682 -1761 380 1971 -879 -1007 2197 -694 -1112 1256 221 -450 828 475 -1375 -862
6255 -862 1859 -983 39 2324 -713 -1730 1441 -6 -1699 487 518 -2029 375 275 -1178 -583
6271 -583 1913 -1008 -296 1910 -261 -290 931 -298 -1288 -86 -114 -1119 399 1405 -1218 -485 1497
6288 1497 -614 -795 1196 -883 -994 1205 -189 -830 233 1152 -1792 501 1478 269 209 1090 -252
6305 -252 -1282 692 974 -1001 967 823 -1121 282 1311 203 -1501 2071 342 -1690 1017 607
6321 607 -1096 370 291 -1286 -388 962 -1110 -974 924 528 -932 1587 449 -1404 301 1047 -1782
6338 -1782 122 1434 -418 19 1431 -301 -585 1328 -207 -1485 797 537 -1099 636 737 -632
6354 -632 -737 1546 -641 -750 1688 598 -1348 1637 400 -759 659 230 -1459 75 1507 -373
6370 -373 -213 1709 -247 -2067 1536 1002 -1404 62 1434 -1128 -368 487 -815 -1157 1138 -210
6386 -210 -983 561 52 -1975 -304 607 -744 82 1406 -233 -320 1186 -182 -1372 567 582 -1266
6403 -1266 463 133 -1337 1371 -248 -1630 -823 1241 -8 -268 1830 -124 -659 1561 385 -1327
6419 -1327 401 1058 -929 12 1461 -416 -761 1669 -914 -1153 399 1374 -1066 -321 848 -1071
6435 -1071 -766 1184 -697 -1448 625 -777 -1325 796 503 -1965 387 908 -826 296 581 -1754
6451 -1754 -921 876 -505 -1188 768 -71 -1673 1241 572 -601 63 151 -1206 -665 -70 -508 -442 123
6469 123 14 -309 194 1348 -801 429 997 -304 735 927 -304 201 487 126 -689 918 74 -582
6487 -582 662 592 -651 -382 542 -1212 -572 590 -615 -1494 673 -370 -1913 672 760 -624 334
6504 334 888 -1331 -661 1136 -655 -734 435 -126 -1470 644 958 -1421 866 978 -38 179 1569
6521 1569 -628 -4 941 486 -1862 1053 -415 -1463 1544 611 -1418 107 1315 119 -581 1154
6537 1154 198 -1332 831 -311 -1655 1206 -415 -1623 256 1019 -442 -787 1489 -1452 -719 1491
6553 1491 -549 -1585 529 782 -1063 -1322 736 -899 117 1314 -456 -1399 950 -230 -1123 762
6569 762 1269 -762 266 1068 -481 -1065 2138 -702 -245 1401 204 -462 1683 515 -1075 1399
6585 1399 630 156 -238 875 -427 -1430 2020 52 -592 1212 745 -958 173 411 -665 891
6601 891 605 -499 -312 1146 -969 -1638 520 178 -1118 670 745 -1282 697 828 134 -824 812
6618 812 -1389 -243 1655 562 -623 634 54 -1342 -393 276 -511 -857 1521 -7 350 881 307
6635 307 -1823 -93 1144 -1429 106 937 -1223 -251 1328 -781 -86 270 1079 -1162 1369 713 -1000
6652 -1000 917 874 -1193 -790 712 -927 456 1362 -336 -1675 926 240 -1400 52 182 -1495
6668 -1495 -181 811 -824 -849 1443 -85 -1755 926 -214 -1108 -190 963 -1952 1319 603 -667
6684 -667 -341 871 -1103 -1088 1940 -14 -494 1162 574 -482 8 174 -972 -1168 1193 654 -100 1399
6702 1399 244 -583 953 1029 -87 555 232 -83 14 1410 -483 -661 1986 -347 -616 107 -450 -1134
6720 -1134 658 289 -1306 344 786 -754 -946 667 161 -772 -329 602 -727 87 731 -514 -275
6737 -275 1237 -1362 -302 977 106 66 1420 245 -873 565 527 -714 643 433 -1591 740 801
6754 801 288 -1501 350 -204 -481 1808 854 -645 646 320 -1832 740 1254 -112 -608 553 -623
6771 -623 -561 971 52 -848 11 -332 -2481 188 828 -999 -509 -102 -106 -289 253 252 -603 1290 389 -959
6791 -959 278 230 -615 626 734 -332 -221 955 1319 -1024 1255 414 -1017 334 457 -1101 519
$$ [...]
8191a05
##END NTUPLES=NMR FID
##END=
