##TITLE=1H_ANY-157c-12
 D2O, 8 sc, 
 7.6.2019
##JCAMPDX= 6.0         $$ Bruker NMR JCAMP-DX V2.0
##DATA TYPE= NMR FID
##DATA CLASS= NTUPLES
##ORIGIN= UXNMR, Bruker Analytische Messtechnik GmbH
##OWNER= root
$$ XWIN-NMR		Version 3.5
$$ Fri Jun  7 15:47:19 2019 Russian Standard Time (UT+4h)  she@DPX200
##.OBSERVE FREQUENCY= 200.13155
##.OBSERVE NUCLEUS= ^1H
##.DELAY= (6, 6)
##.ACQUISITION MODE= SIMULTANEOUS
##.ACQUISITION SCHEME= undefined
##.AVERAGES= 8
##.DIGITISER RES= 18
##SPECTROMETER/DATA SYSTEM= spect
##.PULSE SEQUENCE= zg30
##.SOLVENT NAME= D2O
##.SHIFT REFERENCE= (INTERNAL, D2O, 0, 15.7039)
##AUDIT TRAIL= $$ (NUMBER, WHEN, WHO, WHERE, WHAT)
$$ ##TITLE= Audit trail, XWIN-NMR		Version 3.5
$$ ##JCAMPDX= 5.01
$$ ##ORIGIN= Bruker BioSpin GmbH
$$ ##OWNER= she
$$ F:/spectra/data/she/nmr/H-F/1/audita.txt
$$ ##AUDIT TRAIL=  $$ (NUMBER, WHEN, WHO, WHERE, WHAT)
(   1,<2019-06-07 15:45:21.12 +0400>,<she>,<DPX200>,
      <created by zg, POWCHK disabled, PULCHK disabled
       configuration hash MD5:
       00 E9 B6 7A A2 85 ED C7 34 08 36 98 17 FE 4E 26
       data hash MD5: 16K
       EB A2 E3 73 DC 42 80 45 8E DC 0F 14 03 E0 7F C0>)
$$ ##END=
$$ 
$$ hash MD5
$$ 16 5A 2F 9D 8A 9C D1 E6 85 86 AE D3 75 1E 38 82
##$RELAX= 
##$RELAX= 
##$RELAX= 
##$RELAX= 
##$RELAX= 
##$RELAX= 
$$ Bruker specific parameters
$$ --------------------------
##$DU= <F:/spectra>
##$EXPNO= 1
##$NAME= <H-F>
##$PROCNO= 1
##$TYPE= <nmr>
##$USER= <she>
##$AMP= (0..31)
100 100 100 100 100 100 100 100 100 100 100 100 100 100 100 100 100 100 
100 100 100 100 100 100 100 100 100 100 100 100 100 100 
##$AQSEQ= 0
##$AQ_mod= 1
##$AUNM= <au_zg>
##$AUTOPOS= <>
##$BF1= 200.13
##$BF2= 200.13
##$BF3= 200.13
##$BF4= 200.13
##$BF5= 200.13
##$BF6= 200.13
##$BF7= 200.13
##$BF8= 200.13
##$BYTORDA= 1
##$CFDGTYP= 0
##$CFRGTYP= 5
##$CHEMSTR= <none>
##$CNST= (0..31)
1 1 145 1 1 1 1 1 1 1 1 1 1 1 1 1 1 1 1 1 1 1 1 1 1 1 1 1 1 1 1 1 
##$CPDPRG= <>
##$CPDPRG1= <>
##$CPDPRG2= <>
##$CPDPRG3= <>
##$CPDPRG4= <mlev>
##$CPDPRG5= <mlev>
##$CPDPRG6= <mlev>
##$CPDPRG7= <mlev>
##$CPDPRG8= <mlev>
##$CPDPRGB= <>
##$CPDPRGT= <>
##$D= (0..31)
0 1.2 0 0 0 0 0 0 0 0 0 0.03 0 0 0 0 0 0 0 0 0 0 0 0 0 0 0 0 0 0 0 0 
##$DATE= 1559907920
##$DBL= (0..7)
120 120 120 120 120 120 120 120 
##$DBP= (0..7)
150 150 150 150 150 150 150 150 
##$DBP07= 0
##$DBPNAM0= <>
##$DBPNAM1= <>
##$DBPNAM2= <>
##$DBPNAM3= <>
##$DBPNAM4= <>
##$DBPNAM5= <>
##$DBPNAM6= <>
##$DBPNAM7= <>
##$DBPOAL= (0..7)
0.5 0.5 0.5 0.5 0.5 0.5 0.5 0.5 
##$DBPOFFS= (0..7)
0 0 0 0 0 0 0 0 
##$DE= 6
##$DECBNUC= <off>
##$DECIM= 24
##$DECNUC= <off>
##$DECSTAT= 4
##$DIGMOD= 1
##$DIGTYP= 9
##$DL= (0..7)
0 120 120 120 120 120 120 120 
##$DP= (0..7)
150 150 150 150 150 150 150 150 
##$DP07= 0
##$DPNAME0= <>
##$DPNAME1= <>
##$DPNAME2= <>
##$DPNAME3= <>
##$DPNAME4= <>
##$DPNAME5= <>
##$DPNAME6= <>
##$DPNAME7= <>
##$DPOAL= (0..7)
0.5 0.5 0.5 0.5 0.5 0.5 0.5 0.5 
##$DPOFFS= (0..7)
0 0 0 0 0 0 0 0 
##$DQDMODE= 0
##$DR= 18
##$DS= 0
##$DSLIST= <SSSSSSSSSSSSSSS>
##$DSPFIRM= 0
$$ [...]
##$SUBNAM2= <"">
##$SUBNAM3= <"">
##$SUBNAM4= <"">
##$SUBNAM5= <"">
##$SUBNAM6= <"">
##$SUBNAM7= <"">
##$SUBNAM8= <"">
##$SUBNAM9= <"">
##$SW= 24.9336996594482
##$SWIBOX= (0..15)
0 0 2 0 0 0 0 0 0 0 0 0 0 0 0 0 
##$SW_h= 4990.01996007984
##$TD= 16384
##$TD0= 1
##$TE= 0
##$TE2= 300
##$TE3= 300
##$TEG= 300
##$TL= (0..7)
0 120 120 120 120 120 120 120 
##$TP= (0..7)
150 150 150 150 150 150 150 150 
##$TP07= 0
##$TPNAME0= <>
##$TPNAME1= <>
##$TPNAME2= <>
##$TPNAME3= <>
##$TPNAME4= <>
##$TPNAME5= <>
##$TPNAME6= <>
##$TPNAME7= <>
##$TPOAL= (0..7)
0.5 0.5 0.5 0.5 0.5 0.5 0.5 0.5 
##$TPOFFS= (0..7)
0 0 0 0 0 0 0 0 
##$TUNHIN= 0
##$TUNHOUT= 0
##$TUNXOUT= 0
##$USERA1= <user>
##$USERA2= <user>
##$USERA3= <user>
##$USERA4= <user>
##$USERA5= <user>
##$V9= 5
##$VALIST= <valist>
##$VCLIST= <CCCCCCCCCCCCCCC>
##$VD= 0
##$VDLIST= <DDDDDDDDDDDDDDD>
##$VPLIST= <PPPPPPPPPPPPPPP>
##$VTLIST= <TTTTTTTTTTTTTTT>
##$WBST= 1024
##$WBSW= 4
##$XGAIN= (0..3)
0 0 0 0 
##$XL= 0
##$YL= 0
##$YMAX_a= 62937
##$YMIN_a= -82189
##$ZGOPTNS= <>
##$ZL1= 120
##$ZL2= 120
##$ZL3= 120
##$ZL4= 120
##$ABSF1= 10
##$ABSF2= 0
##$ABSG= 5
##$ABSL= 3
##$ALPHA= 0
##$AQORDER= 0
##$ASSFAC= 0
##$ASSFACI= 0
##$ASSFACX= 0
##$ASSWID= 0
##$AUNMP= <proc_1d>
##$AZFE= 0.1
##$AZFW= 0.1
##$BCFW= 1
##$BC_mod= 2
##$BYTORDP= 1
##$COROFFS= 0
##$CY= 11.3945322036743
##$DATMOD= 1
##$DC= 2
##$DFILT= <>
##$DTYPP= 0
##$F1P= 18.9103706918063
##$F2P= -1.10871071338519
##$FCOR= 0.5
##$FTSIZE= 0
##$FT_mod= 4
##$GAMMA= 1
##$GB= 0.15
##$INTBC= 1
##$INTSCL= 1
##$ISEN= 128
##$LB= 0.24
##$LEV0= 0
##$LPBIN= 0
##$MAXI= 10000
##$MC2= 0
##$MEAN= 0
##$ME_mod= 0
##$MI= 1.114404
##$NCOEF= 0
##$NC_proc= 0
##$NLEV= 6
##$NOISF1= 3.799351
##$NOISF2= 2.8
##$NSP= 1
##$NTH_PI= 0
##$NZP= 0
##$OFFSET= 15.70392
##$PC= 1
##$PHC0= -8581.828
##$PHC1= 11.20019
##$PH_mod= 1
##$PKNL= yes
##$PPARMOD= 0
##$PSCAL= 0
##$PSIGN= 0
##$REVERSE= no
##$SF= 200.130013532006
##$SI= 16384
##$SIGF1= 3
##$SIGF2= 2
##$SINO= 400
##$SIOLD= 16384
##$SREGLST= <1H.CDCl3>
##$SSB= 0
##$STSI= 0
##$STSR= 0
##$SW_p= 3612.71676300578
##$SYMM= 0
##$S_DEV= 0
##$TDeff= 0
##$TDoff= 0
##$TI= <>
##$TILT= no
##$TM1= 0
##$TM2= 0
##$TOPLEV= 0
##$USERP1= <user>
##$USERP2= <user>
##$USERP3= <user>
##$USERP4= <user>
##$USERP5= <user>
##$WDW= 1
##$XDIM= 8192
##$YMAX_p= 0
##$YMIN_p= 0
$$ End of Bruker specific parameters
$$ ---------------------------------
##NTUPLES= NMR FID
##VAR_NAME=  TIME,          FID/REAL,        FID/IMAG
##SYMBOL=    X,             R,               I
##VAR_TYPE=  INDEPENDENT,   DEPENDENT,       DEPENDENT
##VAR_FORM=  AFFN,          ASDF,            ASDF
##VAR_DIM=   8192,          8192,            8192
##UNITS=     SECONDS,       ARBITRARY UNITS, ARBITRARY UNITS
##FACTOR=    0.0002004,     1,               1
##FIRST=     0,             0,               0
##LAST=      1.6414764,     0,               0
##MIN=       0,             -82189,          0
##MAX=       1.6414764,     62937,           0
$$ Real data points
##PAGE= N=1
##DATA TABLE= (X++(R..R)), XYDATA
0@%%%%%%%%%%%%%%jQj5J6j6J6j6J7k5L2l2L9m7M8n6O4p2Q0q8J03j13J23j38J54
38H1j71J89k10K33k58K88l20L53l91M35m86N47o17P02q06R35j106J340j685K242
58A295l283N914k4764o1351J8680N3117M6570J2852k506j4273k9845m3130k2768
71f3492J8941M7936L7699R254j4126k5384l3557k7967L85L7697M8493K3874j2580
84D7173l2766l6333k9751r175K7587N4549M1653n234m1326l7818j2590K069N980
97b5982J9261L7603K9462j3353n2080m6451n639K7940L3022K4739J6934J463k6301
110B0618m4739k9942Q407L5356L3202J5714p79j7159l3897l4519o365L1720M5032
123B2649K5236l697k0184k6786k9836j9388J1638M1928L9937N835k5541k8635
$$ plain form
0 0 0 0 0 0 0 0 0 0 0 0 0 0 0 0 -1 7 -8 8 -8 8 -8 9 -16 16 -16 23 -24 24 -32 32 -40 40 -48 55 -58 65 -73 81
38 81 -90 99 -111 122 -136 152 -168 185 -206 229 -257 290 -327 375 -431 504 -602 738 -947 1295
58 1295 -1988 3926 -20838 -82189 -63509 -10392 36178 49030 46524 32251 2406 -40724 -63492
71 -63492 -44551 3385 41084 50338 36212 10828 -22729 -50696 -50311 -12614 35879 59753 47173
84 47173 14407 -21926 -51677 -60852 -33265 21284 62937 57703 16377 -21441 -34031 -31962 -25982
97 -25982 -6721 30882 60344 46991 -5089 -51540 -57179 -29239 3783 28522 45456 46919 20618
110 20618 -24121 -54063 -45656 -10300 22902 38616 37837 20678 -13219 -47738 -54103 -22383 22649
123 22649 47885 44188 24004 -2782 -32618 -52006 -40368 1560 41497 47332 21791 -6844
135f844j5477p886k657J5527L7303L3061l534l9320m1716j6295Q824K1402K8255
148A0643K8658J0111k3679m3257k7489P581K8115K4028J2863N756n761k5342l4551
161c2324j6328J6625L4479K7078R585m987j8814l1585k7961O56L3535L9203J4010
174D3172j4791k4646k0577j5192n090J6290L5296K9282p32k6575k7904j4638m365
187c0470L773J9060L2116K1486j2347l8111l0859k190J8620K1302J7922J4078
199C4380O46k2641l5366k1156Q334K6552K4293J3305K350j1677k6657k7075m553
212c9265K3571L1483J6279k919j3100j8860k3256j5475R761L3348L0970N125j7567
225B0095k0582j4086j0890m737J3626L1585K5444n362l1748l0096q673R398J6296
$$ plain form
135 -6844 -22321 -30207 -32864 -17337 19966 53027 49493 10173 -31543 -47838 -39014 -17612 10643
148 10643 39301 49412 25733 -17524 -45013 -37432 -9317 14711 27574 33330 27569 2227 -32324
161 -32324 -48652 -32027 2452 29530 39115 34128 15314 -16271 -44232 -43576 -10041 29162 43172
174 43172 28381 3735 -16842 -32034 -37124 -20834 14462 43744 43012 16437 -11467 -26105 -30470
187 -30470 -26697 -7637 24479 45965 33618 -4493 -35352 -37542 -18922 2380 20302 34380
199 34380 35026 12385 -22981 -44137 -35803 -9251 15042 28347 30697 19020 -7637 -34712 -39265
212 -39265 -15694 15789 32068 29149 16049 -2811 -26067 -41542 -31781 1567 32537 37662 20095
225 20095 -487 -14573 -25463 -30200 -16574 15011 40455 35093 3345 -26751 -35424 -26026 -9730
238i730J9517J9557P073j6032l0198k1520L20J5651J8520J6230J0348m596k3522
251A618k8202r956J5514K5919J8532O650l254j5474k6928k2460K768K8165K9338
264B2230Q538j0526j4377j2029j2901r084Q288K7108K5622K080k0957k4814j4348
277b5170k960O905J8355K4482J3655j0133k5891k0872m310Q130J3449J6716J4910
290B7266M12k0212k7502j3076Q614J8663J6137J1465N825p461k3682k5201m940
303c3692J9359K5064J1974k386q396j1889j6422j2669N228K3798K4233O453j1642
316A9013j7425j5000j0835j844J3719K4406J6869m504j9968j8202p238J626Q284
329a1099J6102J8542O308j4588k4849j5781J222J1140J3020J3765J1304j398j8885
$$ plain form
238 -9730 9787 29344 36417 20385 -9813 -31333 -31013 -15362 3158 19388 29736 25140 1618
251 1618 -26584 -36540 -21026 4893 23425 30075 26821 11347 -15581 -38041 -35273 -7108 22230
264 22230 30768 20242 5865 -6164 -19065 -28149 -19861 7247 32869 34949 13992 -10822 -25170
277 -25170 -28130 -21225 -2870 21612 35267 25134 -757 -21629 -25939 -17809 -4360 12356 27266
290 27266 27678 7466 -20036 -33112 -24498 -5835 10302 21767 27592 20131 -3551 -28752 -33692
303 -33692 -14333 10731 22705 20319 11923 34 -16388 -29057 -23829 -31 24202 30655 19013
316 19013 1588 -13412 -24247 -26091 -12372 12034 28903 24399 4431 -13771 -21009 -19383 -11099
329 -11099 5003 23545 29853 15265 -9584 -25365 -24143 -13003 17 13782 25086 23688 4803
342D803k3744q827J1692J9198J2811M145k020j0132j8656j6347J037J9309K1536
355A4805Q903m074r603j2243j4181q202Q141K1738J7942J05j4228j5272r490m167
369a9826L076J4255K0217J0720q799k0296j5522l696M176Q552J3333J3786K403
382B2379j4782k1064j0146O128J3516J1855Q625M043o500j8330j8483l235J3853
395a2141J7786R805J150l980r573j4783j0799M621J8421J7120L429q585j1781
408F90j0833q958j768J1466J9873J3154l686j4879j3383o321q35M874J2617J5253
422A7264N151j1451j8803j1237J445Q426J0192J1319Q937k125j5810j8550o536
435b1778Q382J3458R656M904L84p531j5249j2869J548J5304J6006O247l047p437
$$ plain form
342 4803 -18941 -27768 -16076 3122 15933 20078 18058 7926 -10730 -27077 -26040 -6731 14805
355 14805 23708 19634 10031 -2212 -16393 -24595 -16454 5284 23226 23331 9103 -6169 -15659 -19826
369 -19826 -16750 -2495 17722 28442 19643 -653 -16175 -19871 -15695 -7143 6190 19976 22379
382 22379 7597 -13467 -23613 -17485 -3969 7886 16511 20554 14054 -4276 -22759 -25994 -12141
395 -12141 5645 15450 16600 12620 3047 -11736 -22535 -17914 507 17627 21056 12471 690
408 690 -10143 -19101 -20869 -9403 10470 23624 19938 5059 -8324 -14645 -15480 -10606 2011 17264
422 17264 22415 10964 -7839 -19076 -17631 -9205 987 12306 21243 19118 3308 -15242 -21778
435 -21778 -13396 62 9718 14622 15006 7475 -7774 -20643 -19095 -3791 12215 18462 15415 7978
449G978j0560j2374o505P512J7819J3947K89r859j0739p834m859J392J1429J6219
463A3855Q003p516j5916j1964l228K916P389J2124J2018J846j2105j6662q257
476a7497L639R118Q951P781M210n121j4901j4471k021J1074J3923Q322K148k649
490A2506q804j3608r555L713J4654J3318L172n331q048q644q149j934R518J6257
504I065J0418l067j1721j0955o363k145L697J1262J3528M849q617j4300q818Q4
518a3083N214P651R737P765j974j3212j4968n280O195J0374Q551N825J765o105
532H455j3137j1069N36J1192J1892N254j124n002q726j0690n360O429J4555J1337
546A4542Q87o865q436p588n745J43R205J3303O731n144j1424q894l200J236N648
$$ plain form
449 7978 -2582 -14956 -21461 -13949 3870 17817 18106 8247 -2492 -10326 -15185 -13793 -2364 13855
463 13855 21858 14342 -1574 -13538 -16766 -13850 -6461 5663 17681 19527 7422 -9240 -17497
476 -17497 -13858 -4740 4211 11992 16202 11081 -3820 -18291 -20312 -9238 4685 13007 15155 12506
490 12506 3702 -9906 -19461 -15748 -1094 12224 15396 10065 2017 -6627 -14776 -16710 -7192 9065
504 9065 19483 16416 4695 -6260 -12623 -14768 -11071 191 13719 18568 9951 -4349 -13167 -13083
518 -13083 -7869 -218 9519 17284 15310 2098 -12870 -18150 -11955 -1581 6970 12795 14560 8455
532 8455 -4682 -15751 -15215 -4023 7869 13123 11999 6997 -1729 -12419 -17779 -11350 3205 14542
546 14542 15429 8564 128 -7460 -13205 -13062 -3857 9446 16177 11033 -391 -9285 -12485 -11249 -5601
561e601J0382J0293J473j0026j3608p117J809O315P301P477M695l400j1607j1305
575a2919j916P727R985O601K637j565p535j1754p939L129J1776J0752L363k812
589I530n571p402p601k204P420J2514P685k348q413p965n346k533K727R677J1663
604A1833M364o688j1465p613j092L163N939Q130O362j523j0051j1076l874M410
618i181P755P118N471J566n578j1254r067K69Q355R022M772N32l090p203r105
633i618m226N596J1589Q442K81n362o603o503n354j79P842J1464O154l608r014
648I01p439l163P00M664Q342P659N31p935j0246n571Q28M706O666P449M451l239
664I304j0083r401j802N508P401N633L138q09o722j0237o144L621J0232Q580K371
$$ plain form
561 -5601 4781 15074 16547 6521 -7087 -14204 -12395 -6080 1221 8698 13393 9993 -1614 -12919
575 -12919 -14835 -7108 2877 9478 12115 10550 3015 -8739 -16678 -13549 -1773 8979 12342 9530
589 9530 3959 -3443 -11044 -13248 -5828 6686 14371 12023 3610 -4355 -9701 -12234 -9507 170 11833
604 11833 16197 9509 -1956 -9569 -10661 -7498 -1559 6571 12933 11410 1359 -9717 -13591 -9181
618 -9181 -1426 5692 11163 12729 7151 -4103 -13170 -12901 -4546 4476 9248 9780 6690 -513 -9618
633 -9618 -13844 -8248 3341 11783 12064 6702 99 -6404 -11758 -11937 -4095 7369 13523 9915 901
648 901 -6538 -9701 -9001 -4337 4005 11664 12195 4260 -5986 -11557 -10729 -6023 643 8092 12543 9304
664 9304 -779 -10180 -11982 -6474 927 6560 9698 8889 2167 -8070 -14214 -10593 -361 8219 10590
679A0590k344m325o172o850k749N279J0230P247m75o129p122n474k312L109Q687
694A190R352K891n701r311o647j905K096N546P842N842j256q065q543l159K551
709g277N112N786N564K183m878j0389q340K10P538Q275M640Q08k496o113p862
724g239m114L702Q864P154J286l589n739o292m760M64P192R585N015k535o875
739B119o476l967p23L724P600O940P54o096p852m517j06L129N733P178M409k979
755H870r301q670j897M588O426N107L003l65n142p892m931K135P121O544K745
770H341p25l370n991o729k647M681R094O847M18m771o401n359k233K811P165O982
786H113J681m338o477m810k074P08M282P177N811m44o648p585l558J082L768N244
$$ plain form
679 10590 8246 3921 -2251 -9101 -11850 -6571 3659 10906 10431 4302 -2820 -8294 -10606 -7497 1190
694 1190 10542 13433 7732 -1579 -8226 -10131 -8035 -2489 5353 11195 9939 1874 -6669 -9828 -7277
709 -7277 -2165 3621 9185 11368 6490 -3899 -12239 -12029 -4491 3784 8424 9232 6736 623 -7239
724 -7239 -11353 -7651 1213 8367 9653 6064 325 -5967 -10727 -10263 -3071 6514 11529 8994 2119
739 2119 -4357 -8324 -9047 -5323 2277 9217 9971 3875 -3977 -8494 -8600 -5471 262 7440 11849 8870
755 8870 -431 -9101 -10998 -6410 16 5123 8126 7761 2619 -5273 -10204 -8069 -948 5596 8341
770 8341 7616 4246 -1745 -8474 -11121 -6440 2654 9501 9919 5148 -1253 -6612 -8845 -6034 1131 8113
786 8113 9794 5456 -1021 -5831 -7905 -7197 -2915 4262 10073 9629 2981 -4604 -8162 -7080 -3312 1932
802A932N400K212m220q710o590O03O285O578L526O11j846m781o480m019K015O720
818g64O456K475j971m921n931m045R42O054P140L357j843m779n182m179j567L159
834e599P245O502P29n124o313l545m21J812M247N992L956k344p888p359j498M213
850e395N759M256K138k93l564n869m535J41M625N868L971L72l681o427n600o66
866h900N150P161M413j03l255m706m906k889J801O319O296J554l512m981l543
881d101j779l6L087O220N609K4o239p721l807J530M669N150L806P44l372n832
897b048m459l06L391M763M047J888j739n433o299k751K756N957N140K072j045
912E934l798n520m332L51N440O475K761j925m170m046l023j193K317N857N901
$$ plain form
802 1932 7332 9544 5324 -3386 -9976 -9373 -3088 3490 7016 7627 5781 1000 -5480 -9499 -7484 -764
818 -764 5692 8167 6196 1275 -4656 -8701 -7759 -1705 5435 8792 6949 2170 -3012 -7191 -8758 -5599
834 -5599 1646 8148 8877 3753 -2560 -6105 -6526 -4714 -467 5525 9481 7137 -751 -8110 -9608 -5395
850 -5395 364 4620 6758 6465 2901 -2968 -7503 -7362 -2737 3131 7102 7474 3793 -2634 -8234 -8900
866 -8900 -3750 3411 7824 7721 4466 -240 -5146 -8035 -6234 85 6381 7935 4423 -558 -4101
881 -4101 -5880 -5916 -2829 3391 9000 9024 2785 -4936 -8743 -7213 -2544 2606 6412 7156 3784 -2048
897 -2048 -6507 -6813 -3422 1341 5388 7276 5537 104 -6195 -8946 -6190 -233 4907 6979 5934
912 5934 2136 -3384 -7716 -7365 -1925 4550 7311 5386 1216 -2830 -5853 -7046 -4729 1128 7029
927G029J539l924o194m469r94K276M619N065K469k240n654n063j373K240M070
942f04M280L066M7l985o077m140M72M225N110L579P36k747n492n052p87M217N990
959B838L616j58k667l873m111k656J102N057N747K447j962m337m200k599j9L365
975b410N599M193n90n046n740k786Q96L368M346L699J189k566m999m295j121K169
991d094M047M169K286j301m893n490k149K537M957M175J724p99l149m751l863
1006f594m3M142N314K797p36k868l482l086j423J872N040N024J262l327n357l971
1022e436q78K095M050M163J997j422l915l953j880P14K930M169L299M9l880n403
1038c301l113Q64L545M041K936R41j931m582m570j137L138M869L115J32j941l015
$$ plain form
927 7029 8568 4644 -1550 -6019 -7013 -4737 -118 4947 7416 5176 -478 -5541 -6914 -4674 -604
942 -604 3676 6742 6789 2804 -3273 -7413 -6941 -2716 2394 5973 6709 3962 -1530 -6582 -7369 -3152 2838
959 2838 6454 6296 3629 -244 -4355 -7011 -5909 -852 4895 7342 5380 1043 -3157 -5756 -5775 -2410
975 -2410 3189 7382 6792 1746 -3994 -6780 -5884 -2516 1830 5529 6718 4152 -847 -5142 -6263 -4094
991 -4094 -47 4122 6408 5107 214 -5276 -7425 -4888 69 4244 5968 5169 2020 -2731 -6594
1006 -6594 -6637 -2495 2819 5616 4880 2012 -1470 -4556 -5979 -4107 933 5957 7219 3892 -1465 -5436
1022 -5436 -6314 -4219 -169 3994 5991 4569 654 -3299 -5179 -4465 -1535 2634 5933 5982 2102 -3301
1038 -3301 -6414 -5550 -2005 2036 4972 5913 3982 -600 -5170 -6307 -3169 1700 4815 4947 3006 -9
1054il349k224O82M000M959K546j358m053m338k532M38L316M479K827n16l240
1070A628l821k450k69K047L980L940J220k715m897l718o02K085L402L448K094
1085E372p23l841m685k116J811M096L606J394q26k698l750k974k43L035M502L137
1101E097K20k493l905l443j009K290M425L587M37k476l672k979j181J161L471
1116d70M184K176j320l854l795j769O22K527L603K940K87l022m557k888M97L120
1132a719L768K639M94k053l927l621j023K175L802L179J095j165l036l635k085
1147e112R80L733M000J750j187l149l587k366J4K777M197K948r6k766l599k541
1163d004n03J702L445L424J115k118m021l306p80J662L184L331J887p64l324l965
$$ plain form
1054 -9 -3358 -5582 -4900 -900 4059 6605 5247 1194 -3144 -5676 -5238 -1922 2557 5384 4868 1628
1070 1628 -2193 -4643 -4912 -2865 1115 5055 6275 3560 -1337 -5055 -5657 -3572 -170 3278 5372
1085 5372 4649 808 -3877 -5993 -4182 -86 3520 4914 4088 1390 -2360 -5334 -5577 -2542 1960 5097
1101 5097 5317 2824 -1081 -4524 -5533 -3243 1182 4769 5206 2730 -942 -3921 -5102 -3941 -470
1116 -470 3714 5890 4570 716 -3079 -4848 -4226 -1699 1904 4844 5131 2109 -2448 -5336 -4839 -1719
1132 -1719 2049 4688 5182 3129 -798 -4419 -5442 -3267 535 3714 4809 3644 608 -3027 -5112
1147 -5112 -4132 -399 3601 5351 4164 1015 -2572 -4938 -4924 -2147 2050 4998 4902 2136 -1463 -4004
1163 -4004 -4507 -2805 640 4064 5179 3061 -960 -4266 -5046 -3384 -200 3131 5018 4254 930 -3035
1179c035k030R66K996L258J958r0k289l645k863j12K770L909K685K10k078l438
1195h28l135j082J760L667L233Q74j536k900k866j490O94K928L719K004r40l224
1211H78l440j873L33K304L426K758L10k434l748k558j5K110L064K512P46j547
1227B826l330l191j010J623L208L009J350q29k759l411j977P01K934L311J646
1242D101n96k331l039k237j49K311L629K589M4k229l152k475o84J360L006L037
1258C185J107j498l135k816r64J128K654K981J675o74k854l389j761O14K427K969
1274A649K087J28k003l239k451j09K162L055K224L35j560k871k772j015J442L149
1290B11K932J012j159k575k766j533N69K523L130J696o92k517k884j733J96K067
$$ plain form
1179 -3035 -5065 -4099 -1103 2155 4113 4023 1734 -1911 -4774 -4886 -2116 1793 4478 4688 2610 -828
1195 -828 -3963 -5045 -3285 382 3615 4489 2953 53 -2813 -4303 -3609 -681 3038 5042 4102 878
1211 878 -2562 -4435 -4102 -1798 1628 4386 4696 2262 -1486 -4044 -4059 -1949 1115 3627 4373 2826
1227 2826 -504 -3695 -4705 -3082 126 3135 4485 3656 897 -2514 -4491 -3790 -856 2455 4101
1242 4101 3505 1174 -1865 -4102 -4251 -1940 1689 4278 4322 2093 -1059 -3534 -4218 -2858 148 3185
1258 3185 4292 2794 -341 -3157 -4121 -2993 -339 2642 4317 3643 789 -2600 -4361 -3747 -1320 1649
1274 1649 3736 3864 1861 -1378 -3829 -3938 -1776 1279 3503 3838 2278 -593 -3365 -4380 -2938 211
1290 211 3143 4155 2996 421 -2345 -3878 -3309 -786 2344 4040 3348 831 -2053 -3786 -3590 -1523
1306a523L077K357K04k081l143k317l35J585K688K505R16j286k898k785r15J346
1322b605K714K626J260p28k517l055j767N75K471K936J728k25j977k786k138j99
1338c687J969L033K228J65j795k786k365p67J287K836K807J043j235k682k594
1353b543j149P37K321K739J622n50k466k918j630M39K096K744K043K29j851k940
1369a077k328l04J721K687K202O45j255k612k539r56J239K722K597J050q85k317
1385E90k679j581M30K273K844J688l41k024k586j784j07J752K768K165K49j772
1401A885k735k172n44J279K515K457J021j053k549k512j026Q60K235K424J341
1416C426m72k192k713j660L96K109K606J735L9j638k581k113l94J571K613K065
$$ plain form
1306 -1523 1554 3911 4115 2034 -1109 -3426 -3761 -2176 512 3017 3933 2647 -251 -3036 -3951 -2605
1322 -2605 109 2735 3995 3267 750 -2305 -4072 -3497 -1026 1910 3638 3413 1436 -1350 -3488 -3687
1338 -3687 -1718 1315 3543 3708 1913 -873 -3238 -4005 -2718 118 2925 3968 2733 51 -2543
1353 -2543 -3692 -2955 -634 2105 3727 3177 711 -2207 -3837 -3398 -1302 1442 3485 3714 1863 -1077
1369 -1077 -3405 -3709 -1988 699 2901 3546 2291 -321 -2860 -3816 -2577 145 2742 3792 2907 590
1385 590 -2089 -3670 -3240 -967 1877 3565 3224 1200 -1386 -3170 -3277 -1525 1243 3408 3657 1885
1401 1885 -850 -3022 -3566 -2287 228 2685 3706 2653 104 -2408 -3434 -2574 -339 2085 3426
1416 3426 2954 762 -1951 -3611 -3215 -1106 1500 3235 3274 1636 -945 -3058 -3452 -1881 732 2797
1432B797M55j307k381k211q66J061K493K462J027r42k246k374j291L95J992K553
1448A617J616k98j973k482j542R7J649K419J917L03j582k595k074m04J354K320
1464C42K073Q03r31k219k287r89Q54K179K245J110n62j998k410j463L39J998K463
1481A547J531j41j616k252j770k80J408K354J937L33j361k225j911o19R75K181
1497I1K240J003q81k229k264j039O27J901K189J286l24j805k263j420J87J637
1513a064K224J613J87j432k352j929l81J350K248J871N69r87k037k054q62Q53
1529b183K120K101R07p16j875k091j241K86J737K307J545j42j669k222j519p8
1545b733J379K146J727L10j303k167j804m39J056K031J955Q48p65k047k102j003
$$ plain form
1432 2797 3252 1945 -436 -2647 -3513 -2452 41 2503 3530 2588 342 -2032 -3323 -2928 -936 1617
1448 1617 3233 2935 962 -1520 -3062 -2965 -1316 1103 3020 3323 1741 -854 -2928 -3332 -1978 342
1464 342 2415 3218 2287 68 -2219 -3208 -2354 -175 2070 3180 2618 620 -1790 -3253 -2914 -916 1547
1481 1547 3078 2937 1321 -931 -2701 -2981 -1573 781 2718 3051 1690 -535 -2446 -3065 -2090 91
1497 91 2331 3334 2453 224 -2040 -3079 -2452 -551 1638 2924 2600 795 -1468 -2888 -2701 -1064
1513 -1064 1160 2773 2960 1528 -824 -2753 -3134 -1784 464 2335 2904 1917 -120 -2174 -3036 -2183
1529 -2183 -63 2038 2945 2229 354 -1737 -2978 -2692 -955 1352 2897 2755 1086 -1136 -2655 -2733
1545 -2733 -1354 792 2519 2829 1526 -641 -2445 -2884 -1828 203 2158 3006 2241 194 -1908 -2911
1561b911O39J851K043J166l41j715k177j352K61J728K139J354k2j353k021j703
1577b414m11J172K154J846M78j055j988j831p13Q21J958K009Q76p35j921k022
1593a776j025M38J682K033J303j76j536k047j392j6J285J989J595L36j242k152
1609g01j795l42J212J985J705N96p64j797j905r47N98J816J932R78m64j591j900
1626a384j211J72J519K063J419k7j412k006j516k09J182J952J618L75j020j797
1642b82j592n82O99J685J884R38o16j863j976r39N49J602J804J097j35j360j905
1659i92j339K0J350J868J311J37j105j790j549m42R59J856J678N99p86j724j759
1676a708q21O37J700J779P94n29j508j640r84J55J295J863J335jj362j894j328
$$ plain form
1561 -2911 -2272 -421 1622 2788 2447 732 -1445 -2797 -2536 -808 1331 2685 2663 1310 -711 -2414
1577 -2414 -2825 -1653 501 2347 2825 1770 -218 -2049 -2762 -1941 17 2026 2902 2167 246 -1776
1593 -1776 -2801 -2363 -681 1352 2655 2479 943 -1104 -2496 -2512 -1227 762 2357 2693 1451 -701
1609 -701 -2496 -2838 -1626 359 2064 2660 1896 99 -1806 -2753 -2155 -339 1593 2571 2107 516 -1384
1626 -1384 -2595 -2423 -904 1159 2578 2551 1139 -867 -2383 -2592 -1410 542 2160 2535 1515 -282
1642 -282 -1874 -2456 -1757 -72 1812 2750 2134 271 -1705 -2644 -2095 -493 1311 2408 2273 913 -992
1659 -992 -2331 -2311 -961 907 2218 2355 1250 -540 -2089 -2531 -1572 284 1962 2561 1775 51 -1708
1676 -1708 -2529 -1892 -192 1587 2381 1852 344 -1296 -2280 -2125 -830 1033 2368 2367 1005 -889 -2217
1693b217r8J095J700J447M03r18j784j566m50Q77J672J553O06n91j543j707q78
1710b399M28J496J701J022j95j327j769j206Q1J354J790J184m6j141j606j311
1726a944l21Q86J700J537M89q28j635j476o18N64J464J645Q55m58j572j709q62
1743b283M16J387J632J016j05j209j685j204m7J087J594J255K93q64j619j471
1759a807m42Q52J656J479N11o59j511j560p83M68J500J620Q32l83j284j514r64
1776a989O6J123J650J208M1j184j679j217j40R44J540J353M29p63j572j449n10
1793b149O44J447J446O89m48j391j573q61L70J336J579R56j32j153j611j153j2
1810b016J113J604J136Q8q99j406j217m37O85J523J482N60p05j487j463o35M70
$$ plain form
1693 -2217 -2315 -1220 480 1927 2330 1412 -372 -1938 -2388 -1511 161 1714 2320 1729 186 -1521 -2399
1710 -2399 -1971 -475 1226 2248 2053 726 -1043 -2249 -2168 -814 976 2160 2114 973 -633 -1944
1726 -1944 -2265 -1379 321 1858 2347 1519 -116 -1592 -2210 -1646 -182 1463 2318 1860 288 -1421 -2283
1743 -2283 -1867 -480 1152 2168 2063 854 -831 -2035 -2082 -995 599 1854 2147 1283 -336 -1807
1759 -1807 -2249 -1397 259 1738 2249 1590 79 -1481 -2264 -1796 -296 1324 2156 1773 489 -1025 -1989
1776 -1989 -1923 -800 850 2058 2099 915 -764 -1981 -2121 -1177 363 1716 2145 1382 -190 -1639 -2149
1793 -2149 -1505 -58 1388 2077 1629 238 -1335 -2196 -1826 -490 1089 2045 1913 760 -851 -2004 -2016
1810 -2016 -903 701 1837 1925 1026 -380 -1597 -2034 -1349 174 1656 2216 1511 24 -1439 -2074 -1604
1827a604J345J515Q19l15j307j515q67K15J132J455J017K6j035j527j146j62Q73
1844a081J443J245M20o64j485j460n11P12J475J337N00n11j243j385p79K75J242
1861d70J507Q95j99j142j402r76n0R45J431J155J83q95j444j177k86P24J405J318
1879A522M67o32j413j330n33M75J208J324P63k23j166j473q67K32J141J378Q71
1896A744l8r09j380j107j67Q48J418J166K70p12j319j191m64N46J321J319N40
1913A885n17j253j287o50K94J155J356Q36k01j083j344q34L5Q73J267J031J89
1930A752p95j391j135k35P67J307J146L93n65j273j273n48N19J238J221N76l12
1947A392j070j244p87J64J037J338Q48q5r26j285r68j44P96J330J107K32p51j280
$$ plain form
1827 -1604 -259 1256 2075 1760 453 -1062 -1929 -1714 -582 873 1890 1916 881 -646 -1792 -1954 -1081
1844 -1081 362 1607 2027 1363 -122 -1582 -2093 -1381 94 1431 1931 1420 177 -1208 -1987 -1712 -470
1861 -470 1037 1932 1733 591 -811 -1787 -1837 -892 539 1694 1877 982 -462 -1639 -1925 -1201 204 1522
1879 1522 1989 1357 -56 -1386 -1919 -1444 -236 1088 1851 1628 462 -1011 -1878 -1646 -505 873 1744
1896 1744 1706 797 -583 -1690 -1857 -1009 409 1575 1845 1133 -186 -1377 -1841 -1295 26 1345 1885
1913 1885 1368 115 -1172 -1822 -1528 -373 983 1819 1618 535 -809 -1643 -1608 -735 532 1563 1752
1930 1752 957 -434 -1569 -1804 -1037 270 1416 1809 1244 -29 -1302 -1850 -1331 -93 1128 1704 1392
1947 1392 322 -922 -1709 -1545 -508 830 1678 1593 667 -618 -1586 -1730 -934 396 1503 1735 984 -296
1965b96j088l20N58J193J177N32m99j221j214n56L68J058J201P71j47j007j316
1982h06q63R4R54J252Q71P4p62j235j070k20P45J302J076K92n72j193j131m96
2000a688M24J178J226N61l94j054j167o56J73R63J233Q57j03r39j247q62m5P44
2018g96J192J008K63o91j259j071k75O00J151J047M30m15j103j197n81L68J077
2035b52J168O22j83r10j174q17K1Q95J243Q42K0p67j146r47k10O42J217J056K94
2054A614o14j128j020m01L80J033J135N89l09j047j154o01K24R16J118P50k8q30
2072F27j213q52m5P80J144Q65K05o15j106j015l17N62J129J009L69m39j000j054
2090i66n65K75J007J142O21k40r03j068o95M3P63J136Q35L8p66j116q33j27N83
$$ plain form
1965 -296 -1384 -1704 -1146 47 1224 1756 1257 36 -1178 -1734 -1366 -308 893 1664 1517 510 -806
1982 -806 -1669 -1575 -621 631 1502 1576 814 -421 -1491 -1711 -966 336 1412 1704 1132 -61 -1192 -1688
2000 -1688 -1264 -86 1140 1701 1307 253 -914 -1570 -1397 -434 799 1656 1553 614 -633 -1495 -1540 -796
2018 -796 396 1404 1667 976 -283 -1354 -1629 -1029 122 1169 1599 1184 81 -1116 -1697 -1329 -252
2035 -252 916 1538 1355 445 -729 -1546 -1525 -630 613 1455 1475 708 -438 -1385 -1595 -953 264 1320 1614
2054 1614 1000 -128 -1148 -1549 -1169 -136 999 1588 1279 232 -922 -1523 -1299 -383 735 1485 1457 627
2072 627 -586 -1438 -1483 -703 441 1306 1511 896 -210 -1225 -1542 -980 149 1158 1527 1088 88 -966
2090 -966 -1531 -1256 -249 893 1514 1274 371 -697 -1392 -1349 -586 550 1385 1423 657 -459 -1292 -1419 -836
2109h36J052R70L28n19j095j006l62M31R67R98M97k55r33j101n94K21R03J061
2127G27O27p7p43j075q08p2P50J098Q19J00n98j002q79k90M90J032R86L47m66
2146I66r58r66m40K69Q85J050N96k04q78j040o10J03P48R98P40O2o86j085p95
2165a245j12O54R81Q29K55m62r86r50l71M44R61R40M02k94q48r68n71J67Q60J055
2185G41N98j34p48r71o81n7O25J012Q15J24o25r79q02k02M65R26Q94L63m04r53
2205Gr35m09L19Q41R20N24j43q08j003o18J11P80R58O21Qo21r52p70j39N90R98
2226B79P86J93m87q73q33l75L72R01R31M06l47q44q67m80J68P49R58O19q8p43
2246D25r64o07jO04R09P28J54n51r57p85j63M81Q54Q06L15l36q66q93m13L12Q13
$$ plain form
2109 -836 216 1186 1514 995 -100 -1106 -1468 -1037 -70 928 1425 1170 237 -864 -1458 -1237 -334 727
2127 727 1354 1277 534 -541 -1349 -1421 -671 427 1246 1346 748 -254 -1133 -1423 -933 99 1085 1432 966
2146 966 8 -958 -1398 -1129 -244 806 1402 1198 320 -720 -1330 -1227 -479 519 1259 1321 635 -450 -1245
2165 -1245 -1357 -703 278 1107 1362 900 -86 -1036 -1407 -963 -2 938 1340 1046 198 -770 -1341 -1174 -314 741
2185 741 1339 1205 457 -514 -1195 -1252 -627 385 1200 1324 699 -280 -1082 -1284 -819 107 1001 1364 960 7
2205 7 -928 -1337 -1018 -177 743 1267 1124 316 -687 -1305 -1194 -414 544 1165 1173 552 -400 -1170 -1309 -719 279
2226 279 1065 1258 771 -102 -935 -1310 -938 -37 894 1300 953 109 -758 -1238 -1070 -321 637 1256 1168 425
2246 425 -539 -1146 -1147 -543 366 1094 1248 697 -260 -1045 -1208 -727 127 933 1248 912 46 -847 -1260 -948 -135
2267a35Q86M34j71p01q89n93M7P28R31O05l5o00q71o73j57N10R06P94K01m91q68
2288a42p48k84L17P90Q48M12k62q25q52m40K27O81Q31N54m3o48r07o23QO26Q40
2309C60O31J15m73q47p36k22M68Q50P38K40l35p62p76l95K36P61Q55M22j90o96
2329B44q02m93M8O12Q48O09jo12q49n92o8M80P81O86K25m15q31p24k47L66P46
2350A1P17L53k23p35q03m28J92P15P88M32p8n76p94n76k0N79Q26N71N8m87p44
2371b22o37j92L92P88P24K27l64p52o91l09K41O75P69M01j73o95p59m20R9N81
2391c17P30N45J7n31q14o04m7N05P43O04J53l81p13o96k44L57P23O76K87k55o40
2412I8p07m11J48O52P68M46j25n84p15m93j0M99P57O02N5n05p35n60j30L70O71
$$ plain form
2267 -135 751 1185 1014 313 -576 -1169 -1122 -394 537 1142 1107 507 -364 -1037 -1194 -684 222 1016 1217 726 -142
2288 -142 -890 -1174 -857 -67 781 1193 931 106 -746 -1186 -959 -278 553 1107 1064 416 -491 -1114 -1106 -480 360
2309 360 991 1106 633 -214 -950 -1172 -704 146 884 1124 789 27 -749 -1144 -908 -147 708 1130 940 244
2329 244 -558 -1051 -1003 -391 457 1066 1065 453 -396 -988 -1056 -576 205 891 1116 701 -130 -854 -1101 -735 11
2350 11 728 1081 858 123 -680 -1108 -916 -201 587 1019 941 365 -429 -1005 -1025 -446 380 951 1009 522 -222
2371 -222 -859 -1051 -659 129 853 1080 716 -36 -727 -1036 -795 -120 649 1050 877 182 -577 -997 -898 -317
2391 -317 413 958 975 444 -370 -974 -1021 -516 227 831 984 603 -110 -806 -1050 -693 30 706 993 738 98
2412 98 -609 -1020 -872 -220 548 994 869 285 -430 -923 -933 -434 323 925 980 475 -260 -820 -950 -580 91
2433I1O64K64l01p31p03k52K52O48O51L83j44o07p39m32J20N83O92M59j4m83p02
2454c01n67r5M63P29N61J25l63o57o29k59L00P03O79K68k90o35o27l39J43N56
2474b35P00M54j00n57p01m41K0M66O69N32J14m43p12n81j16L95O59N71K30k74
2494F50o48o61k70K46O15O21L24j25n38o68m41O8N51P00M52m8m67o47m81r5L92
2515d70O72N68J29l75o61n31j91K53N82O25L10k31o22o28l18J72N26O18M14p3
2535G69m95o64m43L5M52O14M56R3l67o16n83j44L63O54N52J82k95n65n70k87J95
2556f64N94O05K95j76n09n70l53L7M41O33M55Pm47o25m67m4L50O03N21J48l36
2577D98o27n45j40K81N68N02K47j60n37o04l05J40N16N88L33o0m23o08m50j2M61
$$ plain form
2433 91 755 1019 718 -13 -716 -968 -716 -68 583 966 822 215 -524 -956 -836 -253 439 898 884 401 -301
2454 -301 -868 -963 -500 229 790 915 552 -105 -734 -993 -693 10 689 957 667 32 -595 -934 -791 -235
2474 -235 465 919 819 262 -439 -880 -860 -394 275 807 921 478 -234 -815 -931 -536 123 694 924 650
2494 650 2 -659 -929 -683 -68 553 877 752 214 -454 -895 -827 -276 424 876 828 361 -286 -767 -862 -470
2515 -470 202 770 899 524 -137 -668 -859 -606 -24 601 911 680 58 -570 -888 -716 -190 428 842 769
2535 769 274 -390 -833 -798 -346 268 724 817 450 -166 -749 -893 -530 124 676 858 563 -2 -572 -859 -664
2556 -664 -70 535 830 654 145 -425 -778 -741 -300 333 788 795 348 -277 -744 -788 -438 165 686 834 498
2577 498 -129 -674 -814 -533 35 537 784 624 87 -517 -822 -682 -166 422 755 695 272 -336 -786 -798 -337
2598c37O40M27J2l67n69m57j44L07N93N34J78k77n57n10k41J67N25N76L13j46
2618F67n24n78l18Q8M37N54M02K4m14o14m44k5L76N53M41J22k66n83n11k19L05
2639e27N68N16J83j98m92n16l15J40M78N64L35r2m35n39l77l2L81N96M57M9m01
2660C43n65m40q7L00N35N01J91k70n57m90j91J93M84M82K97q1m66n76l49R2M64
2681a90N47L46ll77n50m38n8L77N58M38O8l00m96m67j92K22N28N16K19k09m88
2702E1m86k75J07M37N55L29p4m57n36l20J8L66N05L94Q3l40n51m36p9L10N01M29
2724E31J67k34m76n03k10J99N02M68K33j21m30m89l33O6M20N35L33k1l65m94l79
2745f01p1L12N35M23R3l19m89m01j54K19M60M67K20j62m79m89k26J17M13M69L12
$$ plain form
2598 -337 303 730 742 375 -194 -651 -795 -488 105 639 817 540 -17 -527 -768 -601 -76 500 813 667
2618 667 143 -435 -753 -665 -228 326 728 752 338 -276 -720 -745 -369 184 625 747 481 -102 -613 -832 -527
2639 -527 41 557 740 542 50 -466 -781 -641 -163 401 736 644 209 -330 -707 -739 -358 238 695 744 343
2660 343 -222 -662 -749 -449 86 587 778 508 -49 -539 -730 -537 -53 429 726 645 179 -397 -746 -654 -190
2681 -190 357 703 700 323 -227 -665 -723 -346 212 650 718 418 -78 -545 -737 -515 13 529 748 539 51
2702 51 -435 -710 -603 -166 389 718 644 187 -349 -669 -651 -285 220 614 697 357 -194 -630 -709 -399 102 531
2724 531 698 464 -12 -515 -725 -526 -24 444 677 556 126 -363 -696 -630 -210 325 658 637 272 -222 -601
2745 -601 -672 -360 175 598 691 372 -117 -518 -672 -453 7 474 694 532 53 -436 -662 -545 -132 337 649
2766F49l4m03n31l57L4M03M79L44M2k91m85m22r7K81M98M14J36k35m35m35k29
2787f74J74M75M79K22j40m26m57k65L1L78N13L17j6l60n01l16k7K79M61L97J13
2808F57k87m77m18j22K32M48M09K02j59m30m82k35J47M18M42K52n5l72m62l29
2828f21K2L56M89L31mk96m55l62j12K79M79M01J26k47m40m04j53J56M14M48K27
2849F34j24m28m56k37R0L66M31L11ml40m87l23jL15M44L35P9k53m46m10j21K57
2871c68M35M10J36j62m12m23k34J21M15M56K38j04l63m26k81J4L22M57L45Ml18
2892B62m49l40p4K56M23L86J50k30m52l99j41J81M04M01K12j25l74m56k42J13
2912d94L59M24K56ol24m38l36j3K98M57L38M5k50m15l66j34K16M31L91J54j92
$$ plain form
2766 649 615 212 -319 -676 -642 -239 240 584 626 335 -150 -572 -669 -388 110 524 660 425 -10 -445 -674
2787 -674 -500 -25 454 676 536 110 -347 -612 -581 -203 310 627 611 251 -250 -566 -593 -314 147 544 657
2808 657 370 -107 -525 -647 -415 33 442 644 485 55 -427 -662 -515 -97 345 597 542 170 -292 -621
2828 -621 -599 -243 246 577 573 277 -178 -540 -652 -373 106 507 633 386 -54 -458 -611 -455 -41 407 634
2849 634 510 82 -374 -611 -521 -155 276 587 583 243 -244 -567 -568 -253 191 526 605 352 -94 -504 -625 -368
2871 -368 67 477 613 451 39 -384 -618 -497 -82 374 612 508 145 -281 -562 -548 -226 231 576 580 262
2892 262 -187 -527 -601 -345 78 464 614 384 -68 -467 -608 -427 -23 378 590 465 91 -365 -607 -494
2912 -494 -135 289 545 539 215 -223 -559 -572 -274 183 521 566 316 -99 -465 -599 -383 48 439 593 401
2933D01l83l92j92J00L70M34K39p8l72m14k54K9L05M05L34K9k93m42l26n8K57
2954c01L94L47J22k09l95m03j32J78L85L79J78j14l50m03k40O4L66M25K41m8l03
2975A81l88l08l1K93M25L40K4k45m02l30r8J79L98L78J60j95l79l73j76J36L28
2996h3L82K36o3l57l96k62O9K98L91K71K9k74m06l29l1K58L73L25P7j85l70l54
3018d01j48J67L83L73J53j28l49l71k09P1L40L89K39m3l02m06k46JK66L91L04
3039D74N6k65l98l21n4J98L66L50J32j65l67l80j48J41L50L59J79q8l05l89k48
3060e23O5L08L94K43k5k54l74k93n1K43L89L09O6k17l74l08j14J43L67L62J48
3081E04j33l54l51j71Q9L18L66K22n5k99l82k45K8K71L70K72L0k29l88l03o3K26
$$ plain form
2933 401 18 -374 -566 -466 -96 338 577 499 127 -287 -541 -512 -207 198 532 561 268 -174 -500 -558 -301
2954 -301 93 440 562 353 -42 -445 -577 -399 -14 365 543 429 79 -324 -564 -500 -134 291 532 484 181
2975 181 -207 -515 -546 -253 172 512 536 291 -111 -441 -539 -360 38 416 576 381 2 -371 -547 -411 -83
2996 -83 299 535 472 115 -281 -543 -474 -176 215 486 515 241 -165 -494 -525 -267 106 431 508 323 -47 -401
3018 -401 -549 -382 1 374 527 399 50 -321 -530 -459 -119 270 509 466 164 -242 -488 -487 -221 170 474
3039 474 530 265 -133 -454 -508 -310 56 406 538 373 6 -374 -522 -381 -31 328 507 419 114 -275 -523
3060 -523 -458 -150 244 487 462 208 -166 -459 -510 -267 122 431 497 280 -94 -402 -516 -373 -6 356 504
3081 504 371 17 -334 -505 -416 -98 268 490 435 136 -246 -491 -463 -192 178 450 480 251 -137 -440 -503 -277
3103b77L66L16R5j52l58l49j46J36L61L36J75j12l01l61k10M3K99L91K39k5k77
3124A89l65k70k2K17L79K96O3k22l60l19r0J91L40L24J49j37l56l32j84J08L17
3145h4L54K03n8k85l73k33K7K84L50K52J9k40l60k79p8K22L65K93R1j85l19l18
3167c52j42J43L28L39J82j20l19l35j96P8K72L41K48k9k73l51k49j3K42L40K67
3188D01N7k05l53l05q4J88L38L14J13j44l15l29j63J15L08L36J80p2k77l39k17
3209d53K6K65L66K23J5k43l46k62m7K06L45K93P9j94l20l09j08J56L14L26J41
3230D73j32l05l16j80R2K66L39K04l2k64l37k35RK42L47K32L1k11l29k91o7J97
3252b67L25K79J06j44l17k92j57J22K90L30J69r3k91l16j85M3K55L34K30qk47
$$ plain form
3103 -277 89 405 500 348 -10 -359 -505 -369 -8 328 503 391 90 -271 -481 -438 -139 252 491 466 189
3124 189 -176 -446 -468 -251 128 424 487 265 -95 -414 -504 -313 27 351 500 363 7 -325 -509 -401 -84
3145 -84 270 473 415 130 -243 -476 -449 -165 185 437 456 216 -144 -423 -501 -279 86 379 470 285 -34 -352
3167 -352 -494 -351 -23 316 498 378 59 -276 -472 -394 -122 219 467 438 165 -186 -435 -448 -206 134 401
3188 401 458 253 -100 -405 -489 -301 37 351 464 320 5 -324 -487 -372 -64 272 452 380 103 -236 -453
3209 -453 -427 -162 204 427 442 199 -147 -409 -456 -250 95 388 467 273 -47 -356 -464 -308 6 332 473
3230 473 341 36 -280 -460 -368 -102 237 441 409 145 -192 -427 -418 -176 171 403 434 223 -106 -397 -464 -267
3252 -267 58 337 443 299 -18 -310 -467 -345 -55 275 444 351 60 -256 -441 -398 -143 191 421 413 166
3273A66l25k55j1K04L27K64O1j75l23k92q7J60L12K97J23j12l02l26j56R7K85
3294f8L23J62m7k50l19k27K9K50L31K25mk05l14k58n6J85L25K78P5j57l15k75
3316c12j10J11K84L06J52r8k84l22j60N9K52L24J99j3k43l20k33OK08L11K37N4
3338D08j92l08k74p7J81K97K90J06j27k88l03j45R8K77L23J55q3k48k99j90K5
3359c74K31L14K24Jk08l21k46k5J69L16K67Q0j72k92k77j08J30K90K87J30r0k75
3381E1l01j67P1K45L00J98k6k37l01k24nK18L13K30K0j86k83k58n6J60K82K88
3403C32Q1j32k76k82j29R0K63K98J59o6k60k98j64M9K23K79K13ok15k95k30j6
3425c82J75K84K50N6j46l00k61q1J26K88K62J22j08k57k85j48P5K47K87J78n7
$$ plain form
3273 166 -159 -414 -425 -221 106 370 431 256 -67 -359 -446 -286 26 323 446 334 32 -294 -450 -353 -68
3294 -68 255 417 370 120 -199 -426 -397 -147 184 409 405 200 -114 -372 -428 -243 82 360 435 278 -37 -312
3316 -312 -422 -311 -27 279 431 333 49 -273 -433 -374 -122 202 401 388 145 -175 -408 -402 -194 117 354 408
3338 408 216 -92 -366 -443 -262 35 325 431 304 16 -287 -432 -334 -57 266 421 338 90 -209 -399 -374
3359 -374 -143 171 395 396 188 -133 -379 -404 -235 81 348 428 256 -36 -313 -421 -291 -1 286 416 326 51
3381 51 -250 -417 -346 -101 199 397 371 134 -167 -391 -396 -178 135 365 385 199 -84 -342 -398 -238 44 332
3403 332 413 281 5 -277 -406 -316 -53 245 404 338 78 -220 -384 -335 -112 167 380 374 159 -136 -366 -382
3425 -382 -207 77 327 383 237 -63 -324 -405 -279 9 271 393 285 28 -257 -405 -330 -83 204 382 325
3446C25k13k85k05OK09K96K09J6j79k84k39m8J64K94K43Q0j39k73k53j16J31K32
3468b9K62J49o5k35k90j57N7K24K66J81rj90k95k24J2J79K78K08N0j55k71k31
3490b85q6J28K68K48J00j08k64k49j37Q3K43K70J63q3k06k69j69J6K10K65J91
3511C29nj59k79j99m8J51K61K33Q2j39k81k32r2J21K40K57J09r0k18k51j42M6
3533c06K19K76J56j6j92k68j95pJ72K73K16K3j58k53k25o0J35K46K30P8q9k48
3555Gk43j25Q6K19K61J42n3k26k41j65K8J95K51J91Mj89k66j83l1J67K50K06N1
3578C36j29k29k25r9J05K52K19J21r1k28k40j28M9K26K45J46l4j88k48j60j0J72
3600a38K41K00K9j48k62j88l9J14K30K22Q8j18k25k38j04J04K03K28J29o2k08
$$ plain form
3446 325 112 -173 -378 -372 -163 133 342 358 179 -105 -344 -392 -228 66 309 389 250 -23 -276 -392 -261 -29
3468 -29 233 382 317 82 -208 -365 -308 -84 182 363 354 164 -131 -355 -343 -164 114 322 372 217 -54 -285
3490 -285 -371 -243 25 273 373 265 1 -248 -385 -302 -59 211 374 291 85 -184 -353 -337 -127 138 329
3511 329 324 165 -114 -313 -361 -210 51 284 366 227 -54 -286 -378 -257 -17 240 349 259 41 -210 -352 -306
3533 -306 -87 189 345 329 137 -131 -326 -333 -161 112 328 351 193 -60 -285 -345 -210 36 266 344 255 7
3555 7 -236 -361 -275 -56 205 347 294 68 -173 -338 -310 -115 136 327 331 142 -124 -307 -338 -171 79 285 336
3578 336 207 -22 -247 -346 -241 11 230 351 260 32 -208 -336 -287 -61 184 330 296 108 -140 -300 -310 -138
3600 -138 103 303 332 184 -78 -266 -305 -191 39 261 349 231 6 -232 -336 -232 -29 199 328 266 58
3621E8k26j54L2J95K34J56Nj73k47j81l2J55K43K06K9j21k19k05o7Q3K23K27J02
3644C23q4k11k25j24M8K16K22J43m1j76k19j53mJ64K20J70J8j36k30j83k9J21
3666a70K13K19O1j14k18k18p8O5K28K07J03n9j83k19j32L5J86K08J45j4j67k17
3688a19j71oJ53K13J77M0j31k20j81o5J18J95K04R4r8j95k14r8P0J95J97J33l7
3711B54j81k14j47K3J59K20J59Kj47k13j63m3J37K17J70N6j07k03k01p1R5J96
3733bJ93J06p7j77k13j07L6J78K13J33l5j65k15j29j0J43K10J60J5j09k03j86
3755b41m0J07J93J86P3q8j99j94q9P4J85K10R7m8j68j99j13RJ58J95J62j8j34
3778A18k02j71j1J23K03J85N0j32j88j76p1P9J94J90R0q4j92j82r3M9J62K10J11
$$ plain form
3621 58 -168 -322 -290 -95 139 295 300 127 -120 -301 -333 -178 65 271 300 179 -40 -245 -312 -229 -6 221 323
3644 323 239 28 -197 -321 -273 -57 165 308 267 91 -128 -281 -285 -121 99 269 287 151 -79 -262 -291 -170
3666 -170 43 262 323 209 -9 -227 -305 -240 -12 195 298 239 56 -163 -295 -260 -74 134 279 265 98 -119
3688 -119 -290 -296 -143 70 247 287 156 -64 -245 -310 -192 3 207 301 203 8 -206 -304 -234 -39 158 291 254
3711 254 73 -141 -288 -265 -106 114 273 275 128 -85 -248 -291 -154 63 233 289 182 -21 -222 -293 -198 -2
3733 -2 191 297 220 43 -170 -277 -241 -63 150 283 248 83 -132 -261 -271 -128 82 242 257 148 -55 -241
3755 -241 -281 -174 19 205 278 190 -9 -203 -292 -218 -33 177 274 226 58 -141 -254 -245 -87 108 270 252 118
3778 118 -84 -255 -266 -143 60 245 295 163 -25 -201 -272 -193 1 191 281 197 5 -177 -270 -221 -59 151 262
3801B62k8j44k02j51J2J45J95J48K3j19j98j65m0J06J90J80M4q3j84j85q4O9J79
3824c0K00R6n5j61j86j11PJ42K19J31lj39j91j58j7J22K09J52K8q6j91j73n7Q5
3848a67J84J68Q1o3j77j95r7P5J51J88J16l9j57j82j30JJ41J96J39qj05j90j52
3871b22k8J04J77J63M8q7j84j66o0O1J70J84R0m8j71j78j08L1J57J76J20%j42
3894H7j86j40jJ26J76J49M6j13j87j50m3P9J74J73O8p0j63j78q8O4J57J65J10
3917B55m3j45j80j05PJ24J96J23kj36j68j31l8J16J69J45L8q4j72j75m5P0J79
3940bJ58R6o2j68j71q9L5J53J71J02j7j42j71j32J9J16J86J30L1j10j90j46m5
3963b48J02J76J60N4o8j81j59p0O2J65J59Q4m6j43j67j05K3J18J72J27Mj26j60
$$ plain form
3801 262 234 90 -112 -263 -251 -106 89 237 260 141 -57 -222 -262 -156 34 214 258 175 -9 -194 -278 -209 -30
3824 -30 170 266 211 50 -136 -247 -240 -98 121 252 249 110 -81 -239 -256 -134 75 227 255 169 -22 -195 -252 -167
3848 -167 17 185 266 203 26 -169 -266 -191 -40 148 264 225 68 -114 -244 -243 -102 94 233 225 120 -70 -222
3871 -222 -250 -146 31 194 242 155 -29 -195 -255 -194 -24 160 250 202 31 -147 -255 -224 -67 109 229 229 87
3894 87 -99 -239 -240 -114 62 211 257 144 -43 -193 -236 -157 17 190 258 188 25 -153 -241 -177 -20 145 255
3917 255 212 67 -113 -218 -211 -87 109 232 230 94 -74 -205 -243 -127 42 187 225 141 -31 -206 -251 -181 -2
3940 -2 156 252 190 22 -149 -238 -203 -50 121 223 206 64 -107 -239 -220 -104 82 212 243 133 -57 -203 -248
3963 -248 -146 30 190 244 176 -5 -164 -234 -172 -7 152 236 190 47 -120 -225 -202 -84 88 215 219 93 -67
3986f7j50rJ16J62J46M5j09j67j48p2Q6J75J51O7o1j50j59q3M5J47J75J01m1j38
4010F2j60j27J3J21J67J34J5j05j69j49l7J01J76J46M9q6j55j54q4P0J59J66Q3
4033B36n1j52j64p3QJ33J73J10j3j33j54j26lR9J92J23J8r9j57j59l6P3J62J50
4057A57N4o9j49j36q1M6J34J66Q7j9j38j69r5J2J27J57J23Jj11j57j33j9R5J55
4081C8J41L3p0j54j58n4P9J49J46Q2n8j35j60r0K1J33J75R2k0j21j51j14KJ01
4105i3J75J16J9j07j45j42l9P9J55J49L9o2j45j50n7N1J25J42Q6k4j42j45j02
4128b17J2J26J52J14Lj14j64j10pR2J52J20L9o7j58j38l9N2J59J44N8n4j31j45
4152a21q6L6J38J46R9l4j23j56j01J8J08J49J11J0q5j54j24k2P3J46J36L9p2j46
$$ plain form
3986 -67 -217 -226 -110 52 198 243 134 -33 -181 -253 -167 8 159 226 165 15 -144 -227 -182 -35 140 241 200 62
4010 62 -98 -225 -212 -91 76 210 225 120 -49 -198 -235 -134 42 188 237 151 -4 -158 -242 -172 -13 153 236
4033 236 185 33 -131 -204 -196 -63 110 220 207 74 -80 -206 -209 -110 82 205 223 124 -33 -192 -228 -155 7 157
4057 157 211 142 -7 -143 -224 -178 -44 122 209 190 52 -117 -212 -200 -73 84 207 208 97 -60 -193 -212 -117 38
4081 38 179 212 142 -12 -170 -224 -145 4 150 232 174 39 -121 -211 -190 -57 118 210 190 69 -82 -196 -194 -93
4105 -93 82 198 217 110 -35 -177 -216 -137 18 167 206 144 -1 -151 -208 -157 -32 110 196 172 30 -115 -217
4128 -217 -205 -79 73 187 190 76 -88 -198 -205 -113 39 159 198 131 -27 -165 -204 -152 7 151 209 155 24 -121
4152 -121 -207 -171 -33 113 212 178 55 -101 -202 -184 -76 73 184 194 109 -45 -169 -191 -118 28 164 203 131 -15
4176a5j46m2N3J34J48P7l7j44j36q6J4J22J47R6j3r7j57r9k1R8J51J33J1q8j46
4201d3j29l0Q0J30J31O6o1j35j50m5L2J15J45Q7k0j31j49q6J4J00J60R9Mr9j58
4226g3r5j8P7J43J08L9o2j47j26m7O6J23J42O8n6j20j48p0K8J24J28R3k0j03j40
4251h6r1j4J01J40J05K1q9j38j22k4P5J56J21M0p3j23j21o6N6J22J28N5k9j05
4275C9j39r0L1J05J34J06pr8j36j16nR6J29J01L2q0j26j26l4N9J13J33O1o4j07
4300A1j30p4L2J10J40P3k2j01j37q1LJ11J32R4j6q8j13j09j4O6J28J11N3o8j29
4325a8j09o1N3J14J39M6k6j23j16p3K5J09J21R3k9p6j22j01pQ2J31J02J1p1j24
4350c0j25j6O3J40J00M1o4j01j30m6K6J07J37N4k7r6j29p5J5Q9J34R0mr6j12j09
$$ plain form
4176 -15 -161 -203 -150 -16 132 209 172 28 -108 -194 -180 -58 89 185 172 75 -82 -181 -202 -104 47 180 191 103 -43
4201 -43 -172 -202 -122 8 139 205 144 9 -141 -186 -154 -39 106 193 173 42 -107 -193 -179 -79 81 180 184 85 -73
4226 -73 -168 -186 -109 34 142 181 119 -28 -154 -201 -135 -12 130 198 142 22 -126 -196 -168 -44 84 177 157 54 -86
4251 -86 -177 -191 -90 50 155 176 87 -51 -173 -197 -122 34 155 195 122 -1 -122 -188 -132 -10 118 173 144 39
4275 39 -100 -190 -159 -54 80 186 179 81 -55 -171 -176 -80 49 150 182 102 -24 -150 -184 -125 -12 121 182 118 11
4300 11 -119 -193 -161 -51 89 162 140 39 -98 -179 -176 -65 67 161 145 57 -56 -165 -179 -113 15 126 179 111 -18
4325 -18 -127 -188 -135 -21 118 164 138 15 -101 -174 -149 -40 81 174 145 69 -53 -154 -161 -79 52 154 165 94 -30
4350 -30 -155 -171 -108 32 132 173 109 8 -122 -168 -142 -35 102 156 129 33 -96 -171 -156 -67 67 157 153 57 -55 -164
4376a64NP9J12J10K3p7j02j23l2O9J04J11N0l7j17j21o7M2J02J25P2k0j04j16
4400g6q2K3O6J27R2J3q6j13r8l0P4J13J01M5n5j28j09m7M8J13J11M6k8j06j12
4425i8o7K5R9J06Q1lq6j24r5kQ2J11J06J4p4j09j02k5O5J12J00L8n5j09j07m9
4451a66M1J01J15N7pj05j17q6J8R8J16P9mr6r8q4j4P0J21R6K2n8j22r5l7L9R7
4478a9J19M9l6j06j31l5J7J22J00P6l5r3r7q7qQ3J12Q8J6p4r4r0k4N4J17R5Rl8
4506I0r7r6n7M1J03J10M7k9r7j02n7J0Q8R4R2np8j15q2KO6J14Q6K9p1j01j01l4
4534a50N5J00R9L2l8q6j09m7M1Q0J07O7l4r3q2r3J4P6J13P5qn9j21p6j4O3J04
4561A6R7K7n7j00r0m5N0R0J03M5k7q8j01n8J3R9R7O0j4o6j11p7%P1Q8J02Pn9r3
$$ plain form
4376 -164 -159 -80 32 142 165 88 -14 -137 -169 -100 4 115 165 128 11 -110 -177 -135 -33 92 164 144 40 -76
4400 -76 -158 -135 -69 58 150 163 77 -36 -134 -164 -90 23 124 169 114 -14 -123 -170 -122 -9 102 148 120 14 -98
4425 -98 -165 -140 -41 65 146 143 57 -67 -162 -164 -82 29 135 149 75 -34 -136 -161 -96 16 116 154 99 -10 -117 -166
4451 -166 -125 -24 91 148 141 36 -81 -167 -149 -51 65 144 140 44 -54 -138 -152 -82 39 135 157 99 -23 -118 -155 -116 -19
4478 -19 100 149 113 7 -124 -159 -142 -20 80 156 121 28 -69 -156 -164 -81 31 119 135 61 -33 -123 -147 -93 24 119 128 90
4506 90 -7 -103 -160 -119 -16 94 141 112 15 -87 -144 -134 -46 48 140 135 57 -58 -140 -138 -72 42 128 157 86 -15 -116 -150
4534 -150 -95 5 104 136 98 12 -97 -144 -103 -23 84 151 117 24 -58 -151 -137 -61 52 127 119 60 -61 -137 -151 -88 16
4561 16 113 140 83 -17 -107 -152 -102 -12 91 136 109 21 -80 -138 -125 -26 71 131 117 51 -60 -137 -137 -66 22 124 131 72 -21
4590b1q7l3M9R8R7L0l6j03q7n1L8Q8R9O1l1q1j08n5J4P4J00O8oo4j08o2k5Q4Q6
4619B8Q4L4o6j00j00j2M2R4R6K8k4r7q7m9QR6J01M7oq1r4p7%J03P7P8Rp6q4p9
4649a07k0M3J04Q6K6n4r7o5m6K9R7R6N3l1j05r7m6L2P4R6M8j0p0q7o6j6P1J02
4677D0Q3Qn4j10q6j5M5R6Q8K9m2p7r9l9K8R0Q9M6j9q3q2o5K6P1Q3O9J4q7q3p9
4707a15nO8Q5Q6J2n8r2p6k1L2Q7P8M2k7r0q5n1K9O3J01N6j0p7j02n6QO6R3O4Q
4737A13o3q4q6LM2P8R5J4m5p8q4l2M0P0Q1N4l1q5q6l7K4N8P9O2Ko0q0o4%M9P9
4768B8P0K8o2q4q0j6M3Q2P9L5l4q6p5m0J4P4Q1N0k0o5p8n5KO3Q5O0jo6p7o5pO3
4800e4P1P2K2m9p3q6j1L7Q2O4L1k7o8q1m3J2P8P6N0k5n6o4o1%O3P8O3Nn1q3o7
$$ plain form
4590 -21 -108 -141 -92 6 103 133 97 -6 -93 -144 -106 -18 81 142 111 30 -78 -133 -119 -45 55 123 117 53 -55 -117 -142 -58 28
4619 28 112 146 80 -20 -120 -132 -90 4 100 128 104 7 -80 -129 -121 -25 76 123 117 36 -58 -135 -135 -32 45 123 132 56 -28 -107
4649 -107 -127 -84 20 106 132 78 -19 -84 -130 -101 -4 92 145 114 9 -88 -134 -102 -28 68 116 106 36 -51 -117 -133 -62 40
4677 40 123 131 77 -33 -119 -134 -89 7 95 124 82 5 -94 -133 -105 -15 74 120 101 18 -64 -129 -103 -32 51 120 134 47 -36 -115
4707 -115 -120 -52 33 119 131 73 -19 -95 -116 -84 3 81 123 96 6 -79 -130 -101 -38 63 119 109 32 -70 -126 -118 -52 41 105 113
4737 113 50 -34 -120 -117 -75 3 98 112 67 -11 -95 -127 -87 -17 64 118 87 2 -84 -121 -97 -39 40 102 104 44 -36 -100 -100 -51 28
4768 28 98 126 64 -20 -100 -116 -73 9 88 123 89 3 -72 -112 -98 -24 57 107 87 22 -56 -111 -109 -46 39 99 98 32 -45 -110 -117 -54
4800 -54 17 89 111 62 -11 -97 -108 -71 11 75 106 79 11 -70 -113 -101 -23 53 103 78 22 -42 -103 -103 -40 38 101 106 55 -28 -95
4831i5j2L9R0O7K5l5p9r0j4K6P4P5L5l0o9n8n1lO8Q5N2jm7r4o0oN1P7O1J0l6p8
4863b3p4j3M7O2P3K3k2o5q1l1J9O7P6M8qp8o3m9QM6P5N9ln0q2m3j5M4P4N7K9m0
4895F7p3o1m2M3O5Q2K3k5o4p3n2K5P0N8N3j1n5p4n3JM4Q1N6J1n5p4n5j1L9O8O0
4926F8K4k7q0o5j8K1O1O6L2kp0o1n7J7O3O7N1om1p6n5j7O4P1M1J1k9o5o3kJ3O9
4958EN9L0k4o6n9m5K6N7P2L2on3o7l4LL2O6N7Kn6o2o1jL6P9M4K1l2o2p0j8K2O0
4991a3O2L8l9m1o6l0J3M6P3L3ln7o3l2nL9P7L9Ll4n9m4j4K7O2M5J9k8m7n4l6J9
5023g0N8N3N0j5o6o1m1K4L8N1N4j4m2n8l0j9M9N1M4J5k5n1o4j7K5N4N7K0j9n7
5053fn5k1J8N3M3N6j9n8n7k5PL8O2L2Ll2n0n8pL2O0N0K0k5o8m4j8K1N8M6K7k2
$$ plain form
4831 -95 -107 -68 22 89 114 79 0 -90 -104 -78 -4 71 106 76 7 -51 -102 -105 -37 48 100 99 52 -42 -102 -108 -57 20 81 91 55 -23
4863 -23 -97 -110 -63 -1 72 95 73 8 -73 -104 -85 -18 58 106 98 20 -43 -92 -84 -38 37 96 93 43 -39 -82 -97 -53 21 78 107 67
4895 67 -6 -67 -109 -66 -1 81 104 79 15 -58 -110 -85 -15 43 96 85 30 -44 -97 -96 -52 29 85 96 41 -33 -88 -99 -60 8 68
4926 68 92 65 -15 -80 -98 -77 -16 50 82 80 10 -51 -108 -91 -28 39 90 84 43 -33 -88 -105 -41 30 71 82 53 -12 -75 -77 -64 5
4958 5 64 94 70 4 -55 -100 -74 -17 55 87 81 28 -39 -73 -70 -38 28 85 87 31 -31 -92 -93 -57 22 66 87 55 -7 -77 -95 -73 -13
4991 -13 49 87 48 7 -59 -89 -76 -30 43 76 73 16 -47 -79 -84 -45 32 71 74 40 -19 -63 -77 -50 12 57 76 48 1 -53 -89 -70
5023 -70 -12 41 91 76 10 -51 -92 -68 -30 21 75 61 19 -39 -69 -88 -39 12 56 71 46 -5 -69 -86 -61 -7 50 70 51 -6
5053 -6 -61 -82 -64 -11 32 88 69 11 -46 -71 -64 -26 36 68 71 39 -11 -69 -76 -44 16 66 86 61 -7 -51 -69 -48 10 56 83 61
5085F1n0m6m2J2M6N9L3pn5n4l7MM6N2M4J1m2n6k4m1L5N6N1L1m2m1o1k5K1N0N8
5116D7K2k5m5m0k0jL5N4M1j1l0n0l9pL7N1M9nk0m8n6j0K3O7L6J2j6l4n4k0kN3
5148fN1J2kl5m4l9lL5N5L9Kl0o4m0lL2N8L6J1l2m5k8j6PM3M5K7qm7m2l9J8L7M7
5182C2K6Jl1n7l2NL7M4L7oj5n1m2j6J7N6M6J8k8k5o4j0J7L2N3J6j7l3n2k2J2L1
5214b1L7L9Nk6o1m1J2K4N4J4K9l1m7m5j1K5M3L1K4j4m6l6j8lM1M1L2Jl0m1k7r
5246e5L0L8M3km1l7k4j8L1K8M1K2j4m2n1j1J5L3N2J1ll5n2k0kM8L3K1nk1m8j0
5278d5j6K5N4K5J1l0l5l9qJ0N3L1J7k3l3l2k3QL4M2K9j2l2l2k6jK7L8K9J7l5l7
5310im1qK9K9L8J8k6l5l5j2J7L7L3K2j7l3m5k9RL4M8K6k0k1l7l2QK8L1L9Lj5m9
$$ plain form
5085 61 11 -35 -77 -65 -19 40 73 66 11 -43 -80 -76 -30 22 66 77 35 -21 -45 -86 -51 5 56 87 45 4 -57 -82 -61 -11 47
5116 47 69 44 -1 -41 -61 -62 -27 27 68 57 27 -23 -62 -69 -32 19 68 63 43 -5 -61 -71 -48 19 55 67 51 17 -37 -57 -59 -6
5148 -6 45 57 55 20 -24 -63 -66 -31 24 63 65 35 -29 -69 -72 -40 18 54 65 33 -12 -40 -56 -49 -6 39 66 58 11 -31 -70 -52 -15 32
5182 32 58 59 28 -29 -61 -56 -19 25 62 56 41 -10 -52 -68 -51 5 51 69 41 16 -48 -58 -41 -9 44 60 43 10 -42 -64 -52 -21
5214 -21 16 55 60 34 -27 -68 -56 -32 22 36 65 34 -13 -58 -69 -44 -1 30 54 40 -6 -42 -60 -63 -22 19 51 52 22 -19 -46 -55
5246 -55 -25 13 56 54 13 -24 -48 -66 -35 -7 34 56 42 0 -51 -62 -47 -14 38 49 46 11 -41 -61 -63 -15 18 39 34 13 -35 -45
5278 -45 -61 -36 18 43 54 24 -11 -50 -58 -48 5 36 53 30 -3 -35 -58 -50 -16 26 55 43 11 -21 -47 -48 -21 17 46 63 28 -9
5310 -9 -50 -58 -29 0 38 56 30 -5 -40 -52 -35 2 35 57 40 7 -38 -67 -58 -24 24 50 30 9 -28 -60 -52 -24 7 46 49 34 -15
5343a5k5pJ4L3K9K2k1l7l5pj1N5K0K9Ol2n9j4J0K1M5J8lln6k9MK0M4K1Rj3m0l0
5377c7j8K0L0L7J9k1j8l5k6kL0M0J4J3k6m5j9QJ2L4L7Jk2m0m0mK9L1L5J3k0k5
5409Em0k2J2K8K6L7rk7m2k5nL3M0J8J3k3l2l3j7L0K8K8K2k8l6j8j5J4L2K8K1j1
5441C2k8l7j8J7K1L4K5j0l4m0j3NJ6L9J8Pj3l6l3qJ2N6J9J8j8k4m5j7RK2M7Pm
5474B6j9l0k3J4NM3J7Nl3l0mk3K6J9L8J0j9l2j1k8J4L4K7K7j8k3l7j9K0ML4J5
5506B9J2k2l2k9oK6L7L6j7j1l8j7j2NM6L2mj7k5k4k2K2J5K8K4pl9k0k2OL2K7J9
5539C2Rk6l1l1RRK9L6J2j8l0l3k2L0K5K5J9j5k1k7l1J1L0L3J3ok7j2k3mJ6M1J8
5572D0nk4k3j5qJ5L0L1kj0k9l1kOK6J3J8Mk4m6j4J4RL2L0Lk1l2m2JL4K4K2%j0
$$ plain form
5343 -15 -40 -47 -33 0 29 51 30 -7 -42 -49 -60 -5 15 44 50 18 -41 -55 -45 -24 21 39 36 33 -23 -52 -48 -28 16 37 46 33 -7 -37
5377 -37 -55 -35 -5 32 51 30 12 -23 -49 -51 -21 19 33 46 20 -25 -44 -36 -24 10 47 48 26 -14 -54 -58 -29 2 37 50 30 5
5409 5 -35 -57 -45 -17 9 46 37 10 -32 -57 -62 -29 11 29 42 19 -13 -46 -63 -33 -5 23 45 17 -19 -37 -52 -38 -6 22 43 32
5441 32 4 -33 -51 -34 -13 21 46 36 2 -38 -51 -46 -30 9 27 34 21 -15 -48 -56 -44 12 31 49 31 7 -38 -55 -46 -24 23 30 26
5474 26 7 -23 -46 -32 -27 16 33 38 5 -25 -29 -52 -26 -7 31 41 22 -10 -21 -49 -35 -1 26 53 35 12 -25 -44 -24 -20 14 29
5506 29 41 19 -13 -42 -48 -22 15 51 34 23 -15 -32 -44 -39 7 39 35 18 -7 -31 -53 -31 -16 12 36 29 -10 -30 -52 -46 -14 13 32
5539 32 41 15 -16 -47 -38 -29 0 36 48 30 0 -33 -55 -25 0 25 44 29 8 -19 -50 -39 -9 24 37 31 4 -8 -31 -35 -19 22 40
5572 40 35 11 -12 -27 -35 -20 10 41 39 29 0 -31 -33 -27 -1 12 30 34 10 -36 -50 -36 -27 5 35 38 17 -15 -57 -56 -22 2 24 24 14
5607A4j4k4k2J3K7K2K0j8k1m0pJ2J5L2K4ok8k5j7MJ7K7L0mj4l3k2pK3RL8K0j2
5640C3k8k6k4PL4J7L0k4j1k3l6J5K0J9L3mk1l1j8mJ6L2J5K2k3m1mj6K0K1K0J5
5672C5pl0k1noK5L0J5j4j1l6j1%K7J5K4Qk1l7j7J1KK1L0Jnk1ql3J4K0K0J6lk3
5707Ek4j9J1J5K4K1Mk1l5oj5J3J9J4L0j1l5j7j4PK2K5J1j0j1l5qJ2K1J7RKqk3
5741a0k3qK8K8LLj2j1m4RK0K9J9jj1j9k6rJ3J2J6K4j4rk2k5QK1K8OPj3l4j9KK3
5777a1RK2J2j5l5j2JkL3K2Qk4j2j9klJ3K0K2Jj2l1j6J0PK3K2lk1k3oj8K3J7K7
5812B7m%l2k3pK7QJ6L0j8l2oj4KJ4J1J3J5k4k1j3JLL2J5j2jk3ok3J5L3J6J6k3
5847A2rk1j4KK1K1J4j2k3j5j0J3KJ9J5J5j4l0k0LJ0K3J8J0j6j8j7j3J6K3OJ2m
$$ plain form
5607 14 0 -24 -46 -33 -6 16 36 18 -3 -43 -50 -38 -23 9 33 27 -1 -26 -43 -39 -22 5 35 31 17 -16 -38 -45 -22 -13 25 45 33
5640 33 5 -21 -45 -38 -4 13 43 19 8 -15 -51 -36 -16 3 36 32 11 -20 -38 -42 -26 6 21 43 20 -21 -25 -41 -21 0 20 35
5672 35 28 -2 -23 -28 -34 -9 21 36 22 11 -25 -36 -36 -9 6 30 38 17 -20 -37 -26 -24 -3 27 28 23 2 -6 -39 -25 -5 15 31 28 5
5707 5 -19 -38 -27 -12 12 33 37 16 -19 -25 -40 -27 -8 6 36 25 -10 -27 -41 -34 -12 13 24 14 3 -32 -40 -28 -7 10 19 21 13 -10
5741 -10 -33 -41 -13 15 18 21 9 -2 -46 -37 -17 12 31 30 19 0 -26 -35 -22 -10 6 30 16 7 -15 -40 -32 -11 17 23 30 17 -17 -36 -34 -11
5777 -11 -2 20 32 17 -18 -30 -29 -31 2 24 32 8 -4 -23 -25 -28 -15 5 27 28 16 -15 -31 -21 -14 9 31 28 7 -16 -22 -40 -17 0 27
5812 27 23 23 -9 -32 -39 -12 -4 12 42 24 -8 -14 -28 -26 -12 -1 12 27 3 -18 -31 -30 -27 5 20 8 7 -16 -22 -45 -30 3 19 35 12
5847 12 3 -18 -32 -30 -9 12 26 14 -9 -24 -34 -21 -19 0 15 30 16 -14 -34 -31 -21 2 20 30 14 -4 -21 -34 -18 5 11 23 19
5880A9qk8rlK2J5J8rJl3rk4K8K5J3Oj2j5k7%J0J2K7J0j0k3k0QOPK2jJ0k8k6Jk
5917b7J1K2J9oqk2k2OJ2K4J3Jk0%k0pOJ1K7Lmj4nl2K3RK5Rk7mqj4j0J7K3LJ9j7
5955A6k5k6MJ0RM1Mj7k7k1lJ3J0K3J0kk3j0rpK9J9pNj6j0j7PJL1J3Jj1k7ok0J5
5992b3J8J7Mj2pk0LPKJ7L9j6j3k8k2J1PK2J2jj2j3qj3K6QOJ2nj1l2nPJ6J6QLj7
6030Cj9j7LL5J0J0kk0j3j8lJ6K5%K3k5k7okjJ6L6Rj6k3k7MK1kJ9QJ0j5k9k8K1
6066b4LK4K7lqk6k4j0K0K8K2jk4mk5%kK1K0J3lj9k7p%J0K6J4Ok3k4j3QMK6J2N
6103B2mk0k5qJ7K0J2KJj5k9KrK3L4Lnqk8pj0K6J9J8j4j4j1j8kkL0J3K9j9l5j7
6139b9NJ2J2K0Rjl2j7koK6J6%MLk3l2OK0J9J1lJl0k8KJ0L0K5%k4j0rlqK3J5J8
$$ plain form
5880 19 11 -17 -26 -29 -7 8 26 17 18 -15 -24 -48 -20 5 18 24 12 -3 -30 -30 -20 -8 19 29 19 -4 -24 -16 -10 -3 19 18 28 0 -26 -25 -27
5917 -27 -16 6 25 19 11 -11 -33 -27 -15 9 22 23 3 3 -17 -24 -18 -7 20 23 19 5 0 -32 -9 0 25 34 7 3 -5 -19 -29 -12 11 14 33 16
5955 16 -9 -35 -31 -21 -12 29 33 16 -11 -32 -35 -22 -12 11 21 19 -4 -14 -23 -30 -1 18 11 16 0 -10 -27 -20 -19 12 25 26 15 -12 -18 -38 -23
5992 -23 -5 12 16 4 -3 -23 -20 -13 -11 6 45 29 16 -12 -34 -23 -16 6 18 17 5 -8 -16 -29 -3 5 11 23 18 7 -25 -30 -23 -7 9 17 20 3
6030 3 -16 -33 -30 5 15 25 23 3 -10 -28 -31 -15 10 10 33 8 -19 -25 -27 -28 -12 24 33 17 -6 -33 -29 -8 -10 9 17 27 12 -17 -45 -24
6066 -24 -21 3 30 27 19 -7 -31 -41 -21 7 29 28 4 0 -25 -25 -27 -6 14 27 24 5 -22 -29 -29 -19 7 21 27 4 -20 -33 -25 -21 5 17 22
6103 22 18 -2 -27 -35 -18 2 14 16 17 2 -27 -25 -34 -11 23 26 21 13 -15 -22 -32 -6 13 31 17 3 -8 -26 -28 -30 0 13 42 23 -12 -29
6139 -29 -24 -12 0 20 29 28 -4 -21 -23 -29 -3 13 13 17 20 -3 -35 -29 -9 10 21 18 19 -11 -39 -37 -27 3 28 28 4 -6 -15 -18 -26 -3 12 30
6177C0mj9k4ljJ7J5J9j3j7mj3j9K5J8J4Jkl4Jj2J2K3jJ1Pk4k4pRJ1J6K3j6j1j9
6213a5j2KJ5J7K%Jk2j8nJ9J1J4J7k3k3j8%LK6K3%j2j1qk6QK6J4J3npk5j7MJ6J7
6250ARQLl0j8oJ3K4nK2rj7k4%oK6K1Nnj0rk4JJ2L0J0J0l6j7j3QKK7OJ2j1j1k5
6288b6j5RJ5L0N%k3j8lLJ2J8J2%j1l1%LLL2J0kok9j8lJ3K2J9Rj8k2j2lRJ4J9M
6326B1nj4k8kKJ7PK1mqm1J1oJ5J6J9kqj7k1nPK8NlJ4k7pk1pK5MK8oqj8j7J3RL1
6366A8Lnkk9mj0J5J4J2J6j0k4k2J1NJ2K2Jok0j6kQOOJ5mKl5nkJ2K9J0llk5j1J
6405b0QJ9MOj7qj6j3J7J7MK2k2Jj2pj4J9K2J1kk3j8oPmL2LLpj9j2j7K2K3J2kM
6443A7k4j8KlK8PkJ0j8j2j0j3J9K2QLj0l6K4j6KJ3K2%j5mk3j0K2QK1J1j5lk1j6
$$ plain form
6177 30 26 7 -17 -20 -21 -4 11 30 17 0 -4 -17 -36 -11 7 21 22 20 -14 -13 -25 -13 10 9 20 27 3 -21 -28 -19 -8 8 31 15 4 -15
6213 -15 -27 -25 -10 7 9 9 10 -12 -30 -35 -16 -5 9 26 3 -20 -38 -38 -35 -9 14 14 2 -9 -17 -43 -35 -9 5 18 13 6 -19 -36 -32 -16 1
6250 1 10 18 21 -9 -27 -33 -20 4 -1 21 12 -5 -29 -29 -35 -9 12 17 12 2 -7 -31 -30 -18 12 22 32 -4 -21 -34 -26 -24 3 9 21 10 -1 -26
6288 -26 -41 -32 -17 13 18 18 -5 -23 -26 -23 -11 7 19 19 8 -23 -23 -20 -17 15 25 23 17 -12 -30 -33 -20 2 21 30 12 -10 -22 -25 -16 -2 17 21
6326 21 16 2 -26 -28 -26 -9 -2 19 15 7 -34 -23 -29 -14 2 21 19 11 -6 -27 -32 -25 3 8 5 19 -8 -15 -36 -43 -18 -14 14 8 0 -18 -35 -22 -13 18
6366 18 21 16 14 -15 -19 -29 -14 0 12 28 18 -6 -28 -17 -12 0 22 23 17 -3 -19 -21 -13 -7 -1 14 10 12 -23 -28 -30 -18 11 21 18 15 -10 -21 -20
6405 -20 -12 7 11 17 0 -8 -24 -37 -20 -3 1 23 1 2 -10 -17 -31 -12 10 21 19 -4 -22 -28 -21 -25 7 10 13 6 -13 -25 -42 -20 3 15 13 17
6443 17 -7 -25 -23 -26 2 9 7 17 -1 -13 -23 -36 -17 5 13 16 6 -30 -6 -22 -20 -7 15 15 0 -4 -27 -37 -15 -7 14 25 10 7 -14 -30
6479c0J1J5nK9Kk3j2j5mJ5J5K3mj7k3lqJ4J6K1J5k1j2j1j2RJ3K0J2qk4j9j5J9
6513a7RJ6Qlj2j1l0J8J6RJJ4j2jm3OPJ5K2lLk2j3lKJ9J3L0rk9j3j2kOL4LJ7k0
6551A3k6k1J6LJ6K0Mj2j8j3jRJ9NJ0j2Rl3k9J4J4K0RNqk8j0pK9RJ0Kpj6k0kOK2
6589ALRqj3j3nj2K7J7J6lj6j7j2QJ4J9MJj0k0rPjJ0K1kKl9j0kJ4L0qJ4pqk6j1
6628c5J8J5K6mlqk8lKQK0J6nj4j7j0qNK2RJ0pj2j8j1MJ6J5PJ7m5qjrK4K0MJ3k6
6667aj8j2ONK2J4Qok9%j7J7QK0J7j8j1j5j7lL1K5okj9k1j0QJ8K1J8j3nk0k4J1
6703a8MK6J4%k0j3j7j4K5J1J0J6j9j5j3qJ9J1J7Kkk0j7j7J3J2K0J7Lk3k7JjNL1
6738A3J4kkk4k0Qj0K4K4%%k6k0jKK1OJ4J0l0j2j5MJ7J2J6qoqk3rJ3K0J5jNj7j7
$$ plain form
6479 -30 -19 -4 -9 20 22 -1 -13 -28 -32 -17 -2 21 17 0 -23 -26 -34 -20 -4 17 32 11 -1 -12 -24 -15 -2 18 30 22 -2 -21 -36 -17
6513 -17 -8 8 16 13 1 -10 -40 -22 -6 3 4 18 6 5 -38 -32 -25 -10 12 9 12 -10 -23 -26 -24 -5 8 38 29 0 -13 -25 -27 -21 13 16 33 13
6551 13 -13 -34 -18 -15 1 21 25 13 -5 -18 -19 -10 9 14 24 12 21 -12 -41 -27 -13 7 16 21 13 -15 -25 -32 -3 6 16 18 11 -5 -25 -27 -21 1
6589 1 4 13 5 -8 -21 -26 -38 -11 6 22 19 3 -14 -26 -18 -4 15 19 20 10 -10 -19 -12 -13 -3 18 16 18 -21 -31 -33 -19 11 3 17 10 2 -24 -35
6628 -35 -17 -2 24 20 17 9 -19 -22 -20 -12 8 24 19 5 -12 -22 -30 -25 -3 6 16 9 -3 -21 -32 -28 -12 3 10 27 -18 -26 -27 -36 -12 8 12 25 -1
6667 -1 -19 -31 -25 -20 2 16 24 18 -11 -11 -28 -11 -3 17 34 16 5 -10 -27 -30 1 26 20 18 -1 -22 -32 -24 -6 15 33 20 15 -5 -29 -18
6703 -18 -14 12 26 26 6 -7 -24 -38 -13 -2 8 24 5 -10 -23 -31 -12 -1 16 18 16 -4 -21 -38 -25 -13 7 24 27 4 -23 -22 -23 -18 13
6738 13 27 25 23 -1 -21 -13 -23 1 25 25 25 -1 -21 -22 -20 1 7 21 31 1 -11 -26 -22 -5 7 23 15 9 1 -22 -31 -18 2 17 16 21 4 -13
6776a3j7NJ5J7K7rj1k5j4rK7J1J4Kj6j1k5pJ8L0PJ2j9j4j2Oj4K9ROJ7k4l6mJ0
6811a8OJ8J6kj9j9kj3L0J6LJj7Jk5lJ6JK6J2j1l0kj6lK3K6K4j2j1l4koJ9J1J2
6847A6Oj7k0k5K0J0J8K5pnj5k0KNJ7K0Jk3mj5k1J6K9J0QQk8k8MRNPJ9J1l3%k1
6884a6qJ8PJ7Jj2j7j1jLL2QQrj2k4j4lK1J2J3Nj8rj7lJ3J3K1J0k7nl4J7RK2J3
6921B3Rk1j7o%oJ5K2NLj3k6j3kK8J0J7Nk3rj3J2oK3J0lok7j4pRK2J5nomk8%oJ7
6961a6K7PLj0j8j6nJ9J0J4Rk5lj6%J8PK8oj3j1j6%JJ8J7Qj2kl9MPNK5QOk6lj2
7000hj5K8RONqk5qkkK4K3Jj3j9j6oPJ4J2K1j1j2k9j8J1QK2O%j1jj8OQJ4K8j0j1
7039A0j5j5rJ5J5J0Nkrj5j4NJ4J9OKj7roqJ1J9PJk0mqj6J8J6J5j0Knk3pMJ1K3
$$ plain form
6776 -13 -30 -25 -10 7 34 25 14 -11 -25 -34 -7 4 18 20 4 -7 -32 -39 -21 9 16 28 9 -5 -17 -11 -25 4 13 19 36 12 -24 -28 -18
6811 -18 -12 6 22 20 1 -18 -20 -33 -3 13 16 17 0 1 -24 -27 -11 -10 16 28 17 -13 -15 -31 -34 -11 15 39 27 16 -18 -20 -26 -7 4 16
6847 16 22 5 -15 -40 -20 -10 8 33 26 21 6 -14 -12 -7 10 30 31 8 4 -11 -32 -16 13 23 31 39 11 -17 -13 -4 1 8 27 38 5 5 -16
6884 -16 -24 -6 1 18 19 7 -10 -21 -22 -19 13 21 29 20 8 -16 -30 -33 -12 0 13 18 0 -9 -26 -29 -16 -3 18 28 1 -4 -38 -21 -12 10 23
6921 23 32 11 -6 -12 -12 -18 -3 19 24 27 14 -12 -25 -27 1 11 28 33 10 1 -12 0 -6 17 27 24 18 -9 -23 -30 -21 1 16 11 5 1 -27 -27 -33 -16
6961 -16 11 18 21 11 -7 -23 -28 -9 1 15 24 -1 -4 -20 -20 -2 5 33 27 14 3 -13 -13 -12 6 23 31 19 17 -22 -18 -11 -6 19 27 33 7 4 -8
7000 -8 -23 5 14 20 25 17 -8 -16 -18 -20 4 27 28 15 -4 -20 -26 -19 -5 7 28 17 5 -24 -42 -31 -23 -1 5 5 -6 -7 -25 -19 -11 3 31 21 10
7039 10 -5 -20 -29 -14 1 11 16 14 5 -10 -24 -19 -5 14 20 22 5 -4 -10 -18 -7 12 19 20 0 -4 -12 -28 -10 6 21 11 13 8 -15 -22 -18 -7 16
7078A6J3pj5k6llJ7K2K2k3pk7J0j6PK2RJ1j7j5k1MJ6K0J5J0k9Mk7nQJ1J7OOj8
7114Gj5j4NK1MJ3J6k9j3k0JJ3J9J2Pj2k0j2mJK1LJ6jk3k5JK1j0K2QNj2k6j2jJ7
7151a6K0J2Ljk7j3LOJ8J3Nrk4ljPQK3Lj7qk2lK2kJ5J4kpj9j5%J6J3LJ4oj8l2j
7191b8J1K7RRj4ok0jpJ4LL1j9k1j5Nk%K4J2Mj9jj3oRRJK5j5j7o%kJ3K2J1j0j5
7230Bj7j5J1J3L3j1Lj8ppMRJ2J0lj0nj3j8K1QJ2ljj1qk4J5K5NJ4pk2j4j1KJ3J2
7268aJ6oqj3j3lK3%J8Lprj4j2J1J1J2K0rj7j0j3J4JK1J7j2mj9j1mQJ9J5Lj3nk6
7306a7j5J9J1J1Lj3mj5NMOJ4J2j3Kk1j7KkL9LOj8j2k4LJ7RK2Qk4lk1kQK2J4mJ
7345A6k2Kj7%J6J5J1pj0j3j0LKJ8K4%j8j2k3J6lK4J5njk2j4NMJ4J6J%j0j7j3N
$$ plain form
7078 16 29 22 7 -19 -22 -25 -8 14 36 13 6 -21 -11 -27 -20 2 11 22 5 -10 -31 -27 -11 9 24 34 5 9 -18 -23 -15 -4 13 19 25 7
7114 7 -8 -22 -17 4 8 21 37 8 -5 -25 -24 -11 8 20 27 15 -5 -17 -21 -20 1 4 20 19 -4 -29 -28 -7 -17 5 13 18 6 -20 -32 -33 -16
7151 -16 4 16 19 18 -9 -22 -19 -13 5 18 23 14 -10 -13 -14 -7 1 24 27 10 2 -20 -23 -1 -3 12 26 24 17 -2 -17 -17 -1 12 15 29 23 5 -27 -28
7191 -28 -17 10 19 28 14 8 -12 -13 -20 -6 -3 28 9 -12 -27 -22 -24 -24 0 12 16 -3 -4 -17 -23 -14 -5 -4 21 6 -11 -17 -17 -19 -6 16 27 17 2
7230 2 -15 -30 -19 -6 27 16 19 1 -6 -13 -9 0 12 22 19 9 4 -9 -27 -6 2 14 11 10 -1 -9 -33 -18 7 12 26 19 -3 -17 -28 -26 -13 -1
7268 -1 15 9 1 -12 -25 -28 -5 -5 13 16 9 0 -14 -26 -15 -4 8 28 19 2 -8 -21 -7 -6 15 32 20 16 -3 -14 -18 -10 9 24 27 14 9 -17
7306 -17 -32 -13 -2 9 12 -1 -5 -20 -15 -11 -5 9 21 8 10 -11 -28 -26 -28 11 14 20 2 -10 -34 -31 -14 -5 17 25 1 -2 -23 -25 -17 5 19 15 16
7345 16 -6 -4 -21 -21 -5 10 21 14 4 -9 -19 -16 -14 4 28 28 10 -2 -25 -9 -12 12 27 22 21 -1 -15 -10 -6 8 24 25 25 15 -2 -15 -10
7382a0J5NJ2Mk6j7j7RJ2J5J0kkl1%KNJ2J6Nnok3NMmJ8J4Lj0l0j0J6J2J0J8Mk8
7420Ej0j4jPJ2MJ2lj7j6mJ3J6MK2j4nl7J5pRK9Qj0k9pj6JK3lK0J0j9j5rlJ6LK8
7459A8ojj1j3j9J8J3J8J1kj4k7%lJ9J0J8j4Ok4mpOJ2J9kj7pj5nJ0J5J1J3j2oj1
7496ck7K1jK9Omj9ok4MQJ9L3j6k4plj2MJ7J2P%k5nj3QNK7J7j9jj6j2rJ7J9K2o
7535B3k0Ok1JMJ7J9pmk9j2JJ6J7J7Oj2j4l1j3K2K4KJ1%j2j8j2pJ2J9J3nk1Qk4
7571b4pK3J0J4mj1j0j8mJ3PK0J8j9j1j4kqJ2J8J6Kj1j3k4J0KK7LJ3j0j2qk3K1
7606dJ0J7Ook1j5MmRK1J0ll0j0lJ0mJ0J6kqj3j6O%K6J6j3%ok7mJ7J1J9Lj5j1r
7645a3j9QK1J9J1nk6j3pJ2J0nK6j1%j5j2lJ1J8J6Nkl0oj1J1K5kQqj9j3pKJ7K4
$$ plain form
7382 -10 5 10 22 26 0 -17 -34 -25 -13 2 12 10 8 -23 -23 -21 -16 -4 12 17 12 6 -17 -12 -8 -12 6 20 23 13 -17 -27 -11 1 11 29 33 5
7420 5 -5 -19 -20 -13 -1 3 15 12 -5 -21 -25 -12 4 8 30 16 11 -26 -11 -18 -9 20 28 18 -11 -18 -34 -33 -10 -13 7 17 -2 -17 -26 -29 -13 -10 18
7459 18 12 11 0 -13 -32 -14 -1 17 28 26 12 -15 -15 -18 1 11 29 15 21 -3 -7 -14 -8 4 23 21 4 -3 -18 -23 -13 2 13 26 14 8 -3
7496 -3 -30 -9 -10 19 25 21 2 -4 -28 -24 -16 3 36 20 -4 -11 -14 -26 -22 -5 7 14 14 -11 -16 -29 -21 -16 11 28 9 8 -8 -20 -29 -12 7 29 23
7535 23 3 9 -12 -11 -7 10 29 22 18 -11 -23 -22 -6 11 28 34 22 8 -23 -36 -14 10 12 23 23 11 -7 -19 -26 -14 5 18 13 -8 0 -24
7571 -24 -31 -8 2 16 12 1 -9 -27 -31 -18 -11 9 27 8 -3 -17 -19 -27 -15 3 19 21 10 -3 -27 -17 -15 12 15 28 18 6 -2 -25 -4
7606 -4 6 23 29 23 2 -13 -9 -13 -4 17 27 24 -6 -16 -19 -9 -13 -3 13 11 3 -10 -26 -20 -20 6 22 9 9 3 -24 -28 -11 0 19 22 7 -4 -13
7645 -13 -32 -24 -3 16 27 22 -4 -17 -24 -12 -2 -7 19 8 8 -7 -19 -22 -11 7 23 28 26 -4 -10 -21 -10 15 13 21 13 -6 -19 -26 -24 -7 17
7682A7MJ0k1k1j3NQJ3J0pNqk1mJ7RQJ1Jk2j7j2j1M2LJ3mk1kk0NJ6J7K1j3pj3k3
7720b5J1J8NkJ9j7j4j2rJ0K2RQnj4j0pJ0MK3jKj7j4j1qK4J0LMqpl1jJ5J4J7J1
7758B6j6j8j2j0KK7J6j0Pj7j6oJ4OJ6Qlrj0k0PJL0NMqj3rmPJ1J4Rj8oj0Pj8RK0
7798A3J6Jk2j4k1LK4J3lkOl6j4J2JK3J1Jj3j3Lk9J1K4J3J3rj6k3lmK4J4J6j0j4
7834dmj8RJ1J8J3p%j9j1j3LL3NkJ1j7l2lJ1K5%J1onj3j5LQJ7QLj9k0nKJ5J1J3
7873A7Oj0l1kMJ0JNJ0Jqj9oNOJ7J8j9lk2nRJ3J6Nlnj6j4NOJ8J1kk6J8%l4J9QJ1
7914A4J4mj8j9rJ5%K7Jj6Kj8k2J3NK5J0lqk0pj1J5J3J3Rj3j9j1j0JK8Pj%qk4j0
7952c9NJ8J3J6mpj0j6j4J3K7J0J1j4j1k3KRK4J0J1pk2j8j0POJ9K2j4j8j0j3lO
$$ plain form
7682 17 21 31 10 -11 -24 -19 -11 2 12 5 10 2 -19 -23 -6 3 11 22 23 1 -16 -28 -39 3 6 19 15 -6 -8 -28 -23 -7 10 31 18 11 -2 -25
7720 -25 -14 4 9 7 26 9 -5 -17 -26 -16 6 15 23 18 4 -6 -13 -3 1 24 23 25 8 -6 -17 -25 -1 9 12 16 8 1 -30 -31 -16 -2 15 26
7758 26 10 -8 -20 -30 -28 -1 15 5 12 -5 -21 -27 -13 -7 9 17 14 5 -5 -25 -18 -17 13 18 22 14 1 -8 -12 -5 6 20 29 11 5 -5 2 -16 -7 13
7798 13 29 30 8 -6 -27 -24 0 13 10 8 14 -22 -36 -24 -23 0 11 12 -1 -14 -11 -40 -29 -5 8 21 12 -4 -27 -30 -34 -10 4 20 10 -4
7834 -4 -8 -26 -17 -6 12 25 18 18 -1 -12 -25 -22 11 16 14 25 8 -24 -27 -16 9 9 20 14 9 -4 -19 -16 -8 9 17 20 1 -19 -24 -22 -7 4 17
7873 17 23 13 -18 -20 -16 -6 -5 0 10 11 3 -16 -22 -17 -11 6 24 5 2 -20 -25 -16 -3 13 18 15 10 -6 -20 -15 -9 9 20 18 -8 10 10 -24 -5 3 14
7914 14 28 24 6 -13 -22 -7 -7 20 21 5 7 -11 -33 -20 -15 10 20 17 9 -11 -18 -29 -14 -1 12 21 8 -11 -22 -32 -31 -3 4 3 3 -5 -29 -39
7952 -39 -34 -16 -3 13 9 2 -8 -24 -38 -25 2 12 23 9 -2 -25 -23 -14 10 20 31 24 2 -16 -26 -19 -13 6 28 14 -4 -14 -27 -30 -24
7987b4K3J7pj5qj0JQK0PJ4j3k7omMK1kJ5j5Ml0nJ7j1L3Qprk0j4J4RJ1J4kJrl7
8026c4J2RK5MKnj2k2J9j9K2J6J2pJk9rj1J7K6oKrmm0J3J4PJ5JNk3nj7NK0J2J4
8064B1j4k2jj2RJ6J4kKKk2j6kJ4J4J4Jj8j1j6J4oK3J2J7l0nrpJK2K4j4Rk0nj7
8101b0JQK1Rknj8j5jK1RJO%k7j1LJ6KJ3J4k0qj3o%OK3Jqkk1j1J1J6K0mJ3k1j6
8141a5rKPK1J9j9Nj2j1JoJ0J4J4qk2j1jMNJ4K1prk3j9J1OM0%%pk1j4QlRJ8J3j9
8181Fk2nrJ8NJ1R%j4l0
$$ plain form
7987 -24 -1 16 9 -6 -14 -24 -23 -15 5 12 26 13 -14 -20 -24 -20 1 -1 14 -1 3 -27 -32 -15 -26 7 15 8 -1 -21 -35 -21 -12 -1 13 11 12 3 -34
8026 -34 -22 -13 12 16 18 13 1 -21 -2 -21 1 17 29 22 23 -6 -15 -26 -9 17 11 13 4 0 -40 -27 -13 -6 9 10 15 -8 -13 -30 -25 -5 7 21
8064 21 7 -15 -16 -28 -19 -3 11 9 11 13 -9 -25 -27 -13 1 15 16 -2 -13 -29 -15 -21 2 14 31 1 -4 -13 -20 -19 3 27 13 22 2 -3 -20
8101 -20 -19 -11 10 19 17 12 -6 -21 -22 -1 8 9 15 15 -12 -23 -20 -4 -2 11 25 5 -3 -16 -22 -22 -16 7 8 0 -2 -23 -34 -23 -7 13 9 22 1 -15
8141 -15 -24 -22 -15 6 25 6 11 -1 -12 -11 -17 -7 7 21 13 -9 -20 -21 -17 -12 2 23 16 7 -16 -35 -24 -18 22 22 22 15 -6 -20 -12 -15 -6 12 25 6
8181 6 -16 -21 -30 -12 -7 4 13 13 -1 -31
8191c1
$$ Imaginary data points
##PAGE= N=2
##DATA TABLE= (X++(I..I)), XYDATA
0@%%%%%%%%%%%Qj6J6j6J6k4L2l2M0m8N2o0P2q1R0j05J20j37J54j77K01k23K50
34A32k77L08l46L84m26M74n25N82o42P11p90Q74r70J080j206J352j520J719j964
53a050K268k658L183l925N068p088J1699m0597p599Q0345J9748j2777l5231k1608
67a0222k5153j4110P982M4019M3922J3533k7268l7947l1178j5003J998L0152M6996
80B7721L4456p456l9318m1685k0982K83K1678L9744L9852N678l9490n4296k4368
93e8183J5044K9370K2408K0039K0043J01l7636n3519k3190K6329M7096K9814L363
106D1079j1051k0407l0980k7607J860L7085M4581J9354j1904k7257k9803k6612
118d1662j0522K0784M4660L5378o10k9626l2038j9330o330R637L0893L9232J5880
$$ plain form
0 0 0 0 0 0 0 0 0 0 0 0 0 8 -8 8 -8 8 -16 16 -16 24 -24 28 -32 40 -41 49 -56 64 -73 81 -96 105 -118 132
34 132 -145 163 -183 201 -225 249 -276 306 -336 375 -415 459 -511 569 -637 715 -805 914 -1050
53 -1050 1218 -1440 1743 -2182 2886 -4202 7497 -33100 -40699 39646 59394 46617 11386 -10222
67 -10222 -35375 -49485 -41503 2516 46438 59971 32703 -5244 -36422 -51425 -49427 -19275 27721
80 27721 62177 54721 15403 -26282 -47264 -46981 -25303 14441 54293 59971 20481 -33815 -58183
93 -58183 -43139 -13769 8639 28678 48721 48822 11186 -42333 -65523 -39194 7902 37716 41079
106 41079 30028 9621 -21359 -48966 -47106 -10021 34560 53914 42010 14753 -15050 -41662
118 -41662 -52184 -31400 13260 48638 48028 18402 -13636 -32966 -39296 -29659 1234 40466 56346
131E6346k4747m4327k7797P01J4074J6106K2876K7508Q838k7714m6463k6274J1698
144c9175L2227K7955J5345J975j7595l7036l3923j186L4005L9600J7376n357j4182
157B0029j8659k4542j8729O919L3009L3357Q995j5275k3706k2327j7038j033K5701
170a3299M1443K5200j2107l6215l0431j0405M199J3724K4606K7170P879k2712
182A9052l5390j9249N648J7183J7581J8801J5987l988l2245l9466j3371K1699
194b7758L3846K1283M908m778j4947k5986k2715J757K7892L1119J2040q655j8352
207I654k1521k0631p446J7860L5209K5943j624k1777k2898j5512q115M524K3219
220c115L0837J2777j7778l1463j9467n28Q436J2624K0858K3258M478k6036l8215
$$ plain form
131 56346 31599 -12728 -40525 -39824 -25750 -9644 13232 40740 49578 21864 -24599 -50873 -39175
144 -39175 -6948 21007 36352 38327 20732 -16304 -50227 -51413 -17408 22192 39568 34211 20029
157 20029 1370 -23172 -41901 -34982 -1973 31384 40379 25104 1398 -20929 -37967 -39000 -13299
170 -13299 28144 53344 41237 5022 -25409 -35814 -31615 -17891 6715 33885 41764 19052
182 19052 -16338 -35587 -29939 -12756 4825 23626 39613 35625 3380 -36086 -49457 -27758
194 -27758 6088 27371 32279 27501 12554 -13432 -36147 -34390 -6498 24621 36661 28006 9654
207 9654 -11867 -32498 -39944 -22084 13125 39068 37444 15667 -7231 -22743 -30858 -26334 -3115
220 -3115 27722 40499 22721 -8742 -28209 -28737 -20301 -7677 13181 36439 40917 14881 -23334
233b3334j8951J1334K5229J9930J0309J910j0788k4295k3329k585K0584K6248
245A2262J5082J283q955j8843k4837j5263R661K9303K5905N904j0803j6408j7499
258a3208j5474j895K0848L2092J6621j2208k6804j9156n510J191O968J8530K4792
271B6787J0755j6123l0224j9755J168J3888J6438J5902J0262n823k3863k5787
283b6375p322J4376K1796J6314Q297p32j4224k5042j9094L373K2380K1839P963
296B3549l553r196j5172j8906q737J4295K9408K0399l091j8320j7409j1197o684
309b4614J887J6663K4493J2907r939k2705j7144m228N060J1661J7846J6030k49
322B7668k0430k5422j1312O765J4763J4486J2607O545p988k2112k0442k022J5756
$$ plain form
233 -23334 -42285 -30951 -5722 14208 24517 26427 15639 -8656 -31985 -34570 -13986 12262
245 12262 27344 28627 19672 829 -24008 -39271 -29610 -307 25598 31502 20699 4291 -13208
258 -13208 -28682 -30577 -9729 22363 38984 26776 -28 -19184 -24694 -23503 -16535 1995 26787
271 26787 37542 21419 -8805 -28560 -27392 -13504 2934 18836 29098 23275 -588 -26375
283 -26375 -33697 -19321 2475 18789 27086 26354 12130 -12912 -32006 -28633 -6253 15586 23549
296 23549 19996 10800 -4372 -23278 -32015 -17720 11688 32087 28996 10676 -6733 -17930 -24614
309 -24614 -22727 -6064 18429 31336 21397 -1308 -18452 -22680 -17620 -5959 11887 27917 27668
322 27668 7238 -18184 -29496 -22731 -7968 6518 19125 25670 17682 -4430 -24872 -26894 -11138
335a1138J8269J0061K265l952j3218k0325j3035P994K4089K0543L998q829j2348
348D374j3031j2303l177J3519K2770J3597n573j6579j4055p274j820O243J7116
361C807J9673N734j4530k2227j3178K16P598J1067J4107J1074l071j8553j9674
374a7957n098J0286J4386J0759O825J000j0482k0180j5617K551J7699J7416P130
387A8718j594o578j2004j4918o888J0118K0456J3897j755j1557j1896r684o804
400b0489J897J4936J9999R096q687j7074j2432m093J751P728J4182J3288J01j5419
414D784j8400p457N150J0287J0769J0583N760o893j8546j6563j550J2073J3883
427C880Q233L087k095j0277j5828r480O753J7835J4264K478o024r049j1188j1049
$$ plain form
335 -11138 7131 17192 19457 15505 2287 -18038 -31073 -23079 1010 21553 25551 16722 4374
348 4374 -8657 -20960 -24137 -10618 12152 25749 20176 3597 -10458 -17732 -19552 -13309 3807
361 3807 23480 29214 14684 -7543 -20721 -20505 -12907 -1840 12267 23341 20270 1717 -17957
374 -17957 -23055 -12769 1617 12376 19201 20201 9719 -10461 -26078 -23527 -5828 11588 18718
387 18718 17124 10546 -1458 -16376 -23264 -13146 7310 21207 19452 7895 -4001 -13685 -20489
400 -20489 -18592 -3656 16343 25439 16752 -322 -12754 -16847 -15096 -7368 6814 20102 20203 4784
414 4784 -13616 -21073 -15923 -5636 5133 15716 21476 14583 -3963 -20526 -22076 -10003 3880
427 3880 12113 15200 13105 2828 -13000 -22480 -15727 2108 16372 18850 12826 3777 -7411 -18460
441a8460k435J1956J8860J0802m062j2040j0539o617k794M555J3800J5150L395
454B1571j1858j6553r408p0N249R170J2702R823k710j5503j6059m570P011J0358
468h47Q654O449J410q510j6023j1658K738J3860J3341O043k59n089j0855j3447
482a4193o114Q129J6296J1238k97p538q751q446o457J546J2588J5984O534p318
496A3201j3346j0029m408J63O301J2819J2055Q10j1999j4392o329K741O893Q471
510B951R292N043n976j5313j3164j132R288J1000P713M254p79q868j3892q428
524a8011M699J3326J0851K705l311o474r453r570j851J0134J5354Q795k558q881
538E755q807o983l986L149J1557J2719L313q464j2094p311j080L159P346J0875
$$ plain form
441 -18460 -20895 -8939 9921 20723 16661 4621 -5918 -12535 -15329 -10774 3026 18176 21571
454 21571 9713 -6840 -16248 -16318 -11069 -1899 10803 20626 17916 2413 -13646 -18216 -11205 -847
468 -847 7807 14256 15666 7156 -8867 -20525 -17787 -3927 9414 15457 15198 10109 -746 -14193
482 -14193 -20307 -12178 4118 15356 15059 7521 -1230 -9676 -16133 -14587 -1999 13985 20519 13201
496 13201 -145 -10174 -14582 -14419 -8118 4701 16756 17566 5567 -8825 -15154 -12413 -5520 2951
510 2951 12243 17286 11310 -4003 -17167 -18299 -9011 1989 9702 13956 13177 4309 -9583 -18011
524 -18011 -13312 14 10865 13570 10259 3785 -5668 -15238 -17089 -6955 8399 17194 14636 5755
538 5755 -3052 -10035 -14021 -10872 685 13404 16717 8253 -3841 -11152 -12232 -9073 -1727 9148
552I148Q182k476j2696j2985m308M343P542P689O940K541o458j3001r562J666
566a3435J0058R835M958N82l727r112j1280m994O549J2907R268J032m529o624
580A488p854o596M77R873J2488N020n360r669p591m098m05N412J1093J0022N16
595A4816r486j1165n394Q25M104O543Q312N087m205j1941j0265r41P029Q611O546
610H476L790q87p800j1520o805L390R964Q555L184j240m641p929q012j392Q024
625d843J1626O382j911o510p167o565l854L012J0337J0749K691o569r180n722
639g524j562J508N379Q884O837j949j0315j0500l547L610O634P051O042J714n732
654F530j0488p596P31O912P366M695J617k691p909r399l541N867J0425P339J213
$$ plain form
552 9148 17330 14854 2158 -10827 -15135 -10792 -3250 4439 11379 13920 7462 -5539 -15101 -13435
566 -13435 -3377 6458 11416 11998 8271 -841 -12121 -17115 -10566 2341 11609 12641 8112 1488
580 1488 -6366 -12962 -12485 -2612 9876 14896 9536 -133 -7724 -11822 -12227 -6815 4278 14300 14816
595 14816 5330 -5835 -11229 -10404 -6300 243 8555 13642 9437 -2504 -12769 -13710 -6681 1930 8476
610 8476 12266 11379 3579 -7941 -14746 -11356 -1392 7163 10347 9107 4466 -3463 -11475 -12867 -4843
625 -4843 6783 13165 11254 4744 -2423 -8988 -12842 -9830 507 11256 13947 7378 -1802 -7524
639 -7524 -9086 -7578 -2199 6685 13522 11573 1258 -9242 -12789 -9179 -2545 4506 10548 12262 6530
654 6530 -3958 -11554 -10823 -3911 3455 8150 9767 7076 -833 -10232 -13773 -7906 2519 9858 11071
669A1071l226n898p846o447O37Q991J0632L920m369p312n469l160p92L784Q716
684C232Q367R68p411r697n817l80L830O934Q012M198l830r679q164j215M798O570
700G16N814L676r57p098r611n129L053P819O923L641M90l347p623q249k111O716
716e277J0169N720j392n382n939n363l053K569Q484R025K824m752p748o042k827
731h984Q00N135Q064N830j496p892q047l133J963M900O298N820J555n330r179
746c696o494J67N075O041N013K936j458o985q712l502M803Q766O129R44k830n069
762A128o473n085N80P042Q474L900k113n003n045m188j963K874P654P395J180
777A0357n879q122n258n67L613O587O978K972l646p685o166j325K579M270M943
$$ plain form
669 11071 7845 1947 -5899 -12346 -11709 -2718 7914 11834 7465 153 -5316 -8476 -9268 -5484 3232
684 3232 11599 12567 5156 -4541 -10358 -10738 -6908 26 8038 12236 8406 -1273 -9437 -10652 -5854 716
700 716 6530 10206 9249 2151 -7460 -12589 -9536 -1717 5206 8847 9337 5990 -1633 -9882 -11993 -5277
716 -5277 4892 10612 9220 3838 -2101 -7464 -10517 -7948 536 9561 12385 7633 -115 -6157 -8984
731 -8984 -8184 -3049 5015 10845 9349 1457 -6590 -9723 -7760 -2860 3438 9258 10813 5483 -3696
746 -3696 -10190 -10023 -4948 1093 6106 9042 7584 599 -8113 -11615 -6812 1954 8083 9027 6197 1128
762 1128 -5345 -10430 -9850 -2808 5666 9566 7453 2450 -2595 -6783 -8746 -5872 1782 9177 10357
777 10357 4478 -3644 -8902 -9469 -5856 731 7709 10681 7035 -650 -6816 -8141 -5562 -1292 3651
792C651M205L91n399q101m643K053O207N955L628Q42l174p260p451j690N852Q490
808C556M722q87l856m292m104k719J308O068P122K933l060o327n937l210Q67N234
824b582P222M549j374n807n854k906K72K985N372N611J599m738p874n110N79M218
840c838M821M292K926q39o019p846l500L738P341N168O18k461l814m447l566J3
856g413M679O606M250l61m242n954n120j361M004P204N407j7m574n426l544j008
872f870J991N201O191K727l351o853n156r31K011L247M298M400J313m333p617
887c732n029J377O003N942K838p30l713n523m659o66L990N888M235R77k124m470
903F04n292l064J827N944N795J772k584m664m567l004K83M633O856M254j546n666
$$ plain form
792 3651 7856 8247 2848 -5253 -9896 -7843 -1636 4319 7947 8789 5615 -1645 -9096 -10786 -4934 3556
808 3556 8278 7391 3535 -757 -4861 -7580 -6272 -204 6918 9851 6791 464 -5473 -8683 -7816 -2582
824 -2582 4640 9189 7815 2008 -3846 -6752 -6480 -3495 1877 7488 9087 4349 -3525 -8635 -8056 -3838
840 -3838 983 5275 8201 7362 1343 -6503 -10003 -6265 1076 6244 6862 4401 587 -3860 -7426 -7413
856 -7413 -2734 3872 8122 7761 3519 -2435 -7555 -8916 -4912 2292 7699 7682 3108 -2318 -5862 -6870
872 -6870 -4879 322 6513 9240 5889 -964 -6120 -7051 -5040 -1793 2505 6905 8218 3885 -3732
887 -3732 -8761 -7384 -1381 4561 7399 6669 2956 -2567 -7226 -7892 -3902 1986 6221 7198 5074 604
903 604 -4688 -7752 -5925 19 5814 7586 5002 338 -4229 -7233 -6950 -2317 4539 8793 7247 1581
919A581n354k397L38K302M201M786K084l018o448n134m41L689N173M311J830j982
935E521n502n872k257K614N121M355J979o36l226m963l941J11M478N727L306n01
951F314l545n037m500j288L532O495M975J77l794m595l208j223J130L891N122
966D446K819j923n294m887j816J382L602M805L963L18m375o391l832J008M268
981a907M525K726K45k450m487m125r58K875M834L978J433j608m353n284k909J772
997e693N356N051J629j857l559l753k662q3L480N402L508r35m270m487k520k58
1013e651J915M041M615K076k497n527m575p32K840M301L577J308j686m151m279
1028d425j799J514L656L964K684J03l107n088l776K74L979M636K465l09k381l722
$$ plain form
919 1581 -3773 -6170 -5832 -3530 671 5457 7541 4523 -1925 -7059 -7500 -3811 1362 5673 7503 5521
935 5521 19 -5853 -8110 -5496 -375 3980 5959 5323 2097 -2866 -6807 -6696 -2218 3509 6815 6314
951 6314 2769 -2268 -6768 -8056 -4524 1971 6946 7123 3329 -1266 -4474 -5697 -4567 -676 4446
966 4446 7265 5342 48 -4839 -6655 -5273 -1671 3134 7097 7415 3040 -3351 -7183 -6175 -1907
981 -1907 2618 5344 5589 3139 -1348 -5473 -6431 -3556 1278 5256 6689 5081 728 -4556 -7465 -5693
997 -5693 -337 4714 6343 4486 927 -2826 -5488 -5571 -2091 3311 6819 5884 1614 -2873 -5393 -5651
1013 -5651 -3736 305 4920 6996 4499 -1028 -5603 -6335 -3495 806 4383 5691 4005 -146 -4425
1028 -4425 -6224 -4710 -1054 2910 5594 5697 2590 -2498 -6274 -6000 -2021 2615 5080 4771 2390 -1332
1044a332l713j349K685N389M258K77l107l959k927j271P13L128M418K817r45m156
1060I26m492k085J102L536M274K742n39l673m533k672L17K616L652L275J264j946
1076C764m514m107p75K706M084L013R09j299l382m261k493J356M561M564J649
1091E775j551l214l342k259j64K503M160L123j0k973m068k951m66K359M298L874
1107E094Q83k699m373l291p11J614L130L449J994r66l704m084j671J428L275L397
1123B765K134k7k707m428l405L2L373M344K632m6k231l453l110r27K082M005L357
1140D390O68j977l384l252j671R13L498M253K206j163l532l635j887M49K580L681
1156B137K736m8k993m033k539J53K350L447L051J088j747l995l726j042J989L486
$$ plain form
1044 -1332 -5045 -6394 -3709 1680 5938 6215 3108 -851 -3778 -5049 -4336 -1208 3210 6027 5082 926
1060 926 -3566 -5651 -4549 -1013 3261 6003 5464 1791 -2742 -5414 -5097 -2481 1171 4446 5710 3764
1076 3764 -750 -4857 -5632 -2926 1158 4171 5080 3781 399 -3862 -6355 -4999 -438 4126 5775
1091 5775 4224 1010 -2332 -4591 -4755 -2252 1908 5031 5021 2048 -2020 -4971 -5437 -3078 1220 5094
1107 5094 5977 3278 -1095 -4386 -5097 -3483 -353 3096 5090 4124 420 -3664 -5335 -3907 -632 2765
1123 2765 4899 4872 2165 -2263 -5668 -5636 -2263 2081 4713 4667 2436 -1017 -4127 -5054 -2972 1033 4390
1140 4390 5058 3081 -303 -3555 -5226 -4313 -815 3438 5644 4481 949 -2686 -4573 -4124 -1544 2137
1156 2137 4873 4825 1832 -2201 -4740 -4587 -2237 1210 4261 5349 3602 -393 -4119 -5161 -3172 314
1172C14L023J208r86k966l628k023J027L484L687J735p46k639l428k633l44K454
1188b461M007K913J14k412l431k636o38J731L527L244Q88j963l548k973j043J067
1204c614K799L427K118n93l142l688j851P77K612L120K133N7k314l737k751KK615
1221b030L565K476L87j660l085l051j148J492L304L040J004j261k801l008j607
1236d383P49L018L562J826q45k830l171j957N9K072L343K626K12k316l356k317
1252c708j64J801K908K667R30j488l330l138j006J456K925K834J422o61k578l249
1268b379j820O76K694L033J681l78k184l059k347j57K250L417K431J48j860k850
1284g04k460q78J294K934K903R84j462k899k669j068R19K549L043J757o16k700
$$ plain form
1172 314 3337 4545 3559 593 -3035 -5058 -4031 -547 3140 4875 4129 1490 -1938 -4571 -4915 -2461
1188 -2461 1546 4459 4573 2161 -1270 -3906 -4544 -2813 714 3958 4846 2883 -665 -3638 -4681 -3614
1204 -3614 -815 2612 4730 4137 995 -2693 -4544 -3767 -1155 1965 4098 4155 1841 -1896 -4647 -4645 -2030
1221 -2030 1535 4011 4398 2738 -347 -3398 -4546 -3054 250 3290 4294 3033 232 -2776 -4383
1236 -4383 -3634 -616 2946 4772 3927 1097 -2074 -4031 -3972 -1900 1443 4069 4281 1965 -1391 -3708
1252 -3708 -3872 -2071 837 3504 4434 2946 -384 -3522 -4528 -3072 -147 2687 4109 3448 870 -2379
1268 -2379 -4199 -3523 -829 2204 3885 3507 1323 -1736 -4083 -4240 -1990 1427 3858 4006 2146 -704
1284 -704 -3164 -4042 -2748 186 3089 4073 2611 -288 -2957 -4025 -3106 -557 2486 4243 3627 927
1300I27l175j741M31K168K819K089K03j985l110k306r8J989K903K258N60j428
1316B504k853k848j019J355K931K765J056r53k398k722j585N68K508L023J625
1331C957o00k335k803j884k1J959L064K372K56j920k922k232m97J394K627K538
1347B953R28j311k843k682r48J155K513K665J448n66k392l022j759M90K262K711
1363A602J734k8j847k777k165k18J921K896K216L27j550k656k439r27J147K719
1379d5K685J030j061k421k460j263N98K236K756J638n08k289k779j689J64J887
1395a521K684K122L17j688k786k178l62J498K491K183P64j141k546k551j004J114
1411b604K527K490J193o27k160k627j633L20K149K639J630k32j828k463j849k25
$$ plain form
1300 927 -2248 -3989 -3558 -1390 1429 3518 3721 1736 -1374 -3680 -3778 -1789 1114 3372 3932 2504
1316 2504 -349 -3197 -4216 -2861 70 2835 3891 2938 540 -2182 -3767 -3199 -691 2332 3957
1331 3957 3357 1022 -1781 -3665 -3686 -1727 1337 3709 3965 2045 -877 -3109 -3606 -2212 415 2953
1347 2953 3881 2570 -273 -2955 -3903 -2748 -235 2430 3878 3312 920 -2102 -3861 -3371 -1109 1602
1363 1602 3336 3308 1461 -1316 -3481 -3699 -1778 1118 3334 3661 2111 -545 -2984 -3911 -2764 -45
1379 -45 2640 3670 2609 188 -2272 -3535 -2937 -701 2055 3693 3185 896 -1883 -3572 -3408 -1521
1395 -1521 1163 3285 3602 1914 -872 -3050 -3412 -1914 577 2760 3524 2383 -163 -2714 -3718 -2604
1411 -2604 -77 2413 3606 2979 819 -1808 -3441 -3121 -972 1667 3297 3065 1237 -1226 -3075 -3300
1427c300J658K702K130L72j567k542k165p33J079K393K411J018r76k363k344j031
1443c258P08K051K393J462l84k095k634j617K45J849K440J764K11j479k482k034
1459b860l85J479K424J971M71j149k252k180r17R34K323K350J059o91k050k313
1475a786j354L38J922K450J479l07j816k290j539k2J526K359J913L38j449k402
1491f40j937m96J101K139K049Q94q44k173k254r37Q37K109K141J114n04j873k310
1508a584j444K48J765K286J524N6j456k212j771l36J376K326J842L69j261k145
1524d17j929p44R11K147K194R46p89k031k075j043M42J673K118J416k04j755k290
1541a430j459J10J588K192J662K30j358k223j841m03J162K052J839O48q43j959
$$ plain form
1427 -3300 -1642 1060 3190 3562 1995 -547 -2712 -3445 -2366 27 2438 3456 2480 117 -2227 -3258
1443 -3258 -2550 -499 1894 3356 2972 877 -1757 -3374 -3129 -1280 1160 2924 3135 1656 -826 -2860
1459 -2860 -3245 -1766 658 2629 3100 1951 -301 -2481 -3398 -2464 -141 2209 3268 2577 527 -1786
1475 -1786 -3140 -2802 -880 1570 3049 2742 926 -1364 -2903 -2925 -1399 960 2873 3211 1762 -640
1491 -640 -2577 -3073 -1972 167 2216 3110 2266 93 -2161 -3098 -2261 -152 1989 3103 2599 726 -1584
1508 -1584 -3028 -2780 -1015 1271 2795 2851 1395 -817 -2588 -2924 -1548 778 2620 2989 1728 -417
1524 -417 -2346 -3090 -2179 -32 2162 3108 2319 288 -1787 -2830 -2388 -715 1403 2819 2615 860 -1430
1541 -1430 -2889 -2779 -1191 1001 2663 2893 1535 -688 -2529 -2932 -1770 282 2121 2769 1926 -33
1557c3k030q99P76K000K084R99n34j786k140j341K31J750K233J393j51j517j982
1574i47j448k07J205K054J793M23j213k149j822n62R55J959K005Q81p25j953k036
1591a787r41N85J742J945J116k95j624k057j325J43J486K035J487K31j233k094
1607e86j799m24J220K098J714L88r74j795j742p67O60J853J997R43n99j776j944
1624a533j093K65J508J985J360m3j452k011j408p6J285J953J549K92j161j958
1640e38j617m59Q83J742J723Q57n56j755j983r75O20J749J828R18l64j454j832
1657a213j248Q4J429J979J353L9j235j818j429l47R85J785J611N09q75j779j658
1674a828o62P20J747J819Q19o32j687j736q78L31J334J695J209Qj307j894j323
$$ plain form
1557 -33 -2063 -2962 -2186 -186 1898 2897 2363 577 -1563 -2904 -2673 -923 1310 2703 2552 1035 -947
1574 -947 -2395 -2602 -1397 657 2450 2873 1660 -489 -2311 -2873 -1918 41 2046 2927 2202 249 -1787
1591 -1787 -2728 -2143 -401 1544 2660 2365 741 -1316 -2641 -2498 -1012 1023 2510 2741 1508 -586
1607 -586 -2385 -2809 -1589 509 2223 2611 1637 -158 -1900 -2667 -2007 -154 1843 2786 2187 411 -1533
1624 -1533 -2626 -2361 -853 1132 2492 2449 997 -1014 -2422 -2498 -1213 740 2289 2581 1420 -538
1640 -538 -2155 -2614 -1731 11 1734 2591 2035 280 -1703 -2678 -2058 -309 1519 2437 2073 619 -1213
1657 -1213 -2461 -2377 -948 1031 2384 2423 1188 -630 -2059 -2406 -1421 364 1975 2484 1609 -170 -1828
1674 -1828 -2490 -1770 -23 1796 2615 1983 296 -1440 -2318 -1987 -653 1042 2251 2259 952 -942 -2265
1691b265J9J277J763J312K21j004j761j583m71R28J785J582N26p04j560j586p93
1708b314M78J512J707Q98l65j407j735j101J23J353J872J241m9j275j728j197
1724a987j38R23J594J434M22q59j691j520m71P58J540J553P62m71j551j751q98
1741b351M39J481J638R29k35j242j615j110M1J174J670J184J17r97j603j358m27
1758b265Q44J680J499N00p57j549j463o41N34J460J594Q03m65j455j579q42K46
1775a856J203J560J150N4j143j695j252q9J062J568J229K84q33j554j407m70P66
1792a423J555J443N95n58j408j544q16L55J381J586Q82k65j224j534j033L6J143
1809h29J653J154J9j083j513j162k65P41J424J429N52o75j524j479n44O04J396
$$ plain form
1691 -2265 -2246 -969 794 2106 2327 1323 -438 -2021 -2492 -1564 221 1803 2329 1625 65 -1521 -2314
1708 -2314 -1836 -324 1383 2281 1916 509 -1226 -2327 -2204 -851 1021 2262 2213 938 -790 -1987
1724 -1987 -2125 -1202 392 1826 2248 1389 -302 -1822 -2293 -1535 5 1558 2320 1849 298 -1453 -2351
1741 -2351 -1912 -431 1207 2136 1901 659 -956 -2066 -2025 -851 819 2003 2120 1123 -480 -1838 -2265
1758 -2265 -1421 259 1758 2258 1501 -48 -1511 -2152 -1618 -158 1436 2239 1774 319 -1260 -2102 -1856
1775 -1856 -653 907 2057 2111 968 -727 -1979 -2068 -1006 562 1791 2075 1242 -312 -1719 -2189 -1423
1792 -1423 132 1575 2170 1612 204 -1340 -2156 -1801 -420 1166 2048 1783 559 -975 -2008 -1972 -829
1809 -829 824 1978 1997 914 -599 -1761 -2026 -1285 139 1568 2120 1445 -79 -1558 -2102 -1498 -102
1826a02J433P16l85j332j553q53K86J261J507R34o3j034j488j106j09R46J472
1843E30J146K64p49j430j354m99P07J555J445M91o48j370j342o43L33J191J464
1860A091Q61k31j220j453q80J20J011J414J069J18r25j508j179k24P96J396J249
1877A505M09o41j399j331m85N83J312J273O06l45j174j413q61K19J216J467Q79
1894A820j59r99j348r67j21Q46J412J141K08q26j374j135l49O31J314J294N41
1911A929n39j314j325n87M02J149J308P58k22j119j362q15J64J002J286R19R0
1928A724q28j355j128k37Q12J352J136L10o54j237j215m90N37J286J265N20m54
1945A344j157j232o72K16J045J316Q43q7j018j292q93k5Q20J290J044K00q04j343
$$ plain form
1826 -102 1331 2047 1662 330 -1223 -2076 -1790 -529 978 1912 1849 815 -673 -1779 -1888 -942 530
1843 530 1676 1940 1191 -239 -1593 -2092 -1385 170 1615 2106 1458 88 -1254 -1897 -1564 -373 1091
1860 1091 1952 1721 501 -952 -1832 -1712 -701 713 1782 1900 975 -533 -1712 -1936 -1140 256 1505
1877 1505 1914 1273 -126 -1457 -1942 -1359 -47 1226 1832 1487 313 -1100 -1961 -1742 -526 941 1820
1894 1820 1661 662 -686 -1653 -1774 -928 484 1625 1833 1007 -367 -1502 -1851 -1220 94 1388 1929
1911 1929 1390 76 -1249 -1836 -1434 -285 1023 1781 1559 440 -922 -1737 -1573 -571 715 1634 1724
1928 1724 896 -459 -1587 -1824 -1012 340 1476 1786 1132 -105 -1320 -1810 -1273 13 1278 1798 1344
1945 1344 187 -1045 -1717 -1501 -456 860 1703 1616 598 -694 -1587 -1612 -792 498 1542 1742 938 -405
1963d05j100k40O94J232J123M59n12j207j257n41M42J138J187O17k35r99j253
1980h57q53J36J018J326Q47m9q46j241r71j99P20J292J086K78o87j215j076l73
1998a664M88J169J181N47m31j155j194n97K85R93J214P64p2r58j285q33M2Q51
2016f55J194Q96J74p03j236j073k86P04J239J047L46n12j089j124n48L65J113
2033a48J172N82k96r84j140p22R5R08J234Q53j8q63j196q87j24O66J174J021K73
2052A600o34j198j022l26N27J067J053N00l43j039j191o23K99J010J114O56r8
2069A352q36j162q30j8Q43J185Q42R1p05j100r48k71N72J169J043L22n17j055
2087b3j006m61L14R96J106O01k71r87j075o31J45Q25J083Q01L9p90j151q54p3
$$ plain form
1963 -405 -1505 -1745 -1051 181 1304 1763 1251 44 -1213 -1754 -1312 -174 1013 1630 1395 396 -857
1980 -857 -1710 -1574 -556 770 1617 1568 722 -519 -1490 -1689 -969 323 1409 1687 1000 -215 -1291 -1664
1998 -1664 -1176 -7 1174 1721 1290 135 -1059 -1656 -1371 -378 836 1600 1528 570 -715 -1548 -1506 -655
2016 -655 539 1435 1609 906 -330 -1403 -1689 -985 254 1301 1647 1135 46 -1078 -1626 -1261 -148
2033 -148 1024 1606 1310 326 -814 -1536 -1441 -533 701 1554 1536 673 -523 -1410 -1534 -868 306 1327 1600
2052 1600 966 -232 -1254 -1580 -1053 14 1067 1567 1224 185 -1006 -1629 -1330 -320 794 1450 1352
2069 1352 516 -646 -1476 -1494 -651 534 1376 1467 762 -338 -1286 -1557 -985 184 1227 1549 1032 -23
2087 -23 -1029 -1490 -1176 -180 926 1527 1256 269 -806 -1437 -1292 -467 616 1417 1456 666 -485 -1339 -1412
2106a412O82J065Q78K41n23j091r90l27M96J049R72M17l46r37j038o00K24R47
2124b93J094O03j53q26j026p18j7P21J111Q18P2p01j056q21j93N12J021R58L49
2143A455m85j027r61l87L81Q92R71N38k37q70j070o05J91Q22J020O63j4o98j034
2162d55q11r3O82J046P95J39n07r55q98l24M45R87R73L62m00q90r29m95K03Q48
2182b77J007O15j53q24r96o19N8O70R81P54J15o42j049q03j34N53R36Q31L15m16
2202I22r40r42l83L88R10Q98M40k34p99r66o03J35Q19R86O20p3o79r33p15r4N94
2223f49R80P96J49n49r42p85k71M04Q88R05M01l64r03r05m23K43P82R07N52r1
2243A125p55r89o01O2P04R11O39R3n74r21p97j78N54R24P88K30m08q28q34m03
$$ plain form
2106 -1412 -730 335 1213 1454 931 -160 -1150 -1477 -981 68 1040 1457 1111 174 -864 -1464 -1240 -293
2124 -293 801 1404 1251 425 -601 -1319 -1336 -615 496 1314 1386 685 -371 -1192 -1385 -873 148 1106 1455
2143 1455 970 -57 -1018 -1405 -1024 -132 839 1377 1140 270 -800 -1405 -1214 -392 628 1291 1277 579 -455
2162 -455 -1266 -1359 -677 369 1164 1303 796 -159 -1057 -1381 -936 51 1024 1386 986 96 -833 -1328 -1125 -277
2182 -277 730 1345 1192 368 -628 -1247 -1189 -519 462 1216 1331 689 -360 -1163 -1297 -744 192 1023 1338 922
2202 922 -18 -960 -1343 -955 -45 853 1293 1059 260 -706 -1309 -1174 -355 631 1251 1178 499 -434 -1149 -1243 -649
2223 -649 331 1127 1276 727 -215 -1000 -1271 -867 21 926 1327 963 60 -845 -1268 -1025 -243 664 1216 1125
2243 1125 370 -619 -1220 -1158 -454 457 1096 1189 615 -306 -1103 -1281 -727 197 985 1215 807 -21 -855 -1258
2263a258L08Q72R06M10k74p62q66n04Q4P17R43O22n0o86q92o22p4N37Q79P44J88
2284A222m94r19p65k23M16Q13P86L74k77q20q64m43K43P81Q22M76j12o53q76o00
2304a113K2O61Q82N98L2n39q28o95j89M46Q84P71K07m18q13p04l25K73P31Q43
2324G26M14k24p63q13m50J47O31Q20N81j6o17q62o09kN47P89O30J41m26q00p32
2345h88k37M29P80P26K76k71p17p75m22K06P34Q08M26j64o29p64n13K3N67Q36
2365D31N72K3n47p79o07j12M15P53P04K28l87p92o96k44L22O72P19L70j89o99
2385A57p75m30J64O29P49M63k0n37p77n72m7N31P88N79Q6m31p17o60k11L67P53
2406H9O79K61l26o80o68l44J75O30P64M37j48o35p42m29M2N20P43N56N9n15p79
$$ plain form
2263 -1258 -950 -78 828 1238 964 202 -664 -1168 -1084 -367 576 1198 1148 462 -430 -1052 -1126 -589 290 1034 1222
2284 1222 728 -191 -956 -1179 -763 50 836 1210 933 113 -751 -1194 -951 -170 652 1128 1016 363 -513 -1113
2304 -1113 -1091 -430 452 1050 1082 543 -285 -980 -1169 -723 161 932 1139 721 -92 -796 -1121 -848 -117 726
2324 726 1140 916 153 -660 -1110 -963 -332 488 1069 1053 436 -426 -1035 -1037 -490 299 929 1070 644 -156 -888
2345 -888 -1125 -696 84 810 1086 815 98 -677 -1099 -893 -159 649 1075 911 282 -482 -995 -972 -405 431
2365 431 1003 1026 479 -300 -907 -1019 -604 149 853 1081 694 -98 -794 -1038 -716 -44 675 1045 856 157
2385 157 -618 -1048 -884 -255 494 957 937 400 -377 -949 -996 -465 323 902 988 557 -160 -820 -1031 -664 89
2406 89 768 1029 703 23 -645 -989 -814 -184 580 1017 869 234 -508 -937 -895 -375 368 924 983 468 -311
2427c11n77p1M37O80N99K10l22p05o76k88L30O93O64L11j99o20p15m24J19O24
2447b41P40M33o3n32o73n17o6M67P33N80R7m38o84n83j89L04O85O78K79l01o99
2468A0o59k70K13N66O52M02q9n66p28m40O8N34O60M84O1m42p09n91j05M28P07
2489A86N43J67l40o19o08k72K59O57O49K70j99n61o28l70N1N40P04M59n9n36o65
2510c72m38j5M13O41N47J28m02o69n51j52L23O02N70K71k23n93o58k98K12N75
2530h9O05L30r6n09o38m31L5N07O40M37J5l95o01n18j50L46O66N62J56l45o05
2551g8n33k31K25N67O07L05k02n63n87l14J09M64N69M33Lm54o40m62%M02N93M89
2573G02J16l57o14n49j45L38O01N03K02k21n22n65l02J57N45N96L10j25m71n54
$$ plain form
2427 -311 -888 -959 -522 158 757 967 645 -60 -736 -1024 -694 -1 663 974 775 155 -560 -984 -865 -241
2447 -241 499 932 869 337 -336 -853 -919 -452 281 861 958 520 -164 -747 -936 -632 53 731 1010 709 10
2468 10 -649 -919 -706 -140 512 914 825 259 -469 -909 -841 -307 353 837 898 456 -253 -844 -949 -521 186
2489 186 729 896 556 -63 -671 -943 -684 -27 622 892 693 132 -496 -866 -815 -275 429 888 829 293 -372
2510 -372 -810 -825 -412 229 776 904 502 -167 -718 -870 -547 55 625 896 673 80 -578 -876 -664 -89
2530 -89 516 846 750 241 -397 -828 -793 -286 354 791 806 411 -190 -708 -858 -512 154 716 872 527 -78
2551 -78 -611 -842 -617 -50 557 862 660 97 -490 -804 -695 -231 338 771 774 320 -320 -782 -782 -380 213 702
2573 702 818 461 -153 -702 -847 -509 92 595 797 576 54 -511 -813 -656 -111 485 795 670 199 -355
2593c55m00kM55O33M45Nm44n87m20q2L28N56N05J79l08n91n14j97K40N30N34K84
2615G94j42n33n99l19J41M91N47L45l1l99n92m41k1M24N90M22O8l33n24m97j79
2636g88K77N94N29J80k47n43m85k46J39M74N66L17j14m79n53l31K9M10N50M27
2656G06O2m07o03m38o0L46N27M68J50k66n59n24j82K55N23M70K36j38m42n24l53
2677g53P6M81N64L42n3m13n29l94m5L69N77M45N8l40n36m31j29K42N22M95K01
2698G49k17n26m96k18J68M38N22L13p6m66n62l23O9M12N03L56M4l34n21m64q1
2719g10L45N32M31J04k58m79m72k17K01N19N03K12j68m62m75k72N4M22N28L50
2739F88o3m07n07l44j4L22N13M16R4l35n30m26r6K57M79M42J87j66m81m95k34
$$ plain form
2593 -355 -755 -757 -302 331 776 781 337 -250 -670 -752 -424 132 637 816 508 -83 -597 -794 -554 -24 510 794
2615 794 652 119 -480 -799 -658 -167 380 725 694 295 -297 -738 -759 -335 255 677 745 412 -112 -609 -788
2636 -788 -511 83 612 792 545 2 -483 -729 -590 -116 450 767 653 174 -379 -710 -681 -271 279 706
2656 706 768 361 -242 -680 -740 -394 133 601 751 485 -74 -598 -780 -525 -2 468 704 566 124 -400 -753
2677 -753 -677 -196 368 710 657 244 -285 -679 -724 -355 222 667 725 385 -151 -582 -711 -469 53 548 749
2698 749 532 6 -490 -708 -540 -102 420 733 657 191 -371 -694 -625 -213 290 646 690 356 -165 -629 -710
2719 -710 -365 167 598 702 444 -35 -507 -724 -523 -4 499 711 543 81 -394 -666 -612 -190 338 688
2739 688 625 218 -289 -633 -647 -325 188 604 698 363 -167 -593 -689 -432 47 489 676 510 29 -466 -700
2760g00J80M40M71K55o3l91n13l52M4M01N22L40k8l15m75l81q1K82N17M12J04
2781F69k68m54m12j86J71M54M75K41j62m55m62k39R0L84M69L26k3l98n05l26K6
2802e85L31M56L51Q0k78m78m16j19K64M75M13J48j96m23m61k01J27M58M62K25
2822F33j13l73m56k90K6L47M99L38k1l42m60l23o6K79M49M08J12k67m76m08j15
2843f19K12M02M18K19j34m40m51k45J26L86M53K56m1l44m67l23j0L72M61L14L6
2864E81k60m54l65j30K37M67M15J13k01m13m09j93J54L92M65K36j29l92m27k56
2884e69N3L37M35L25Nl26m63l40j0K62M47L49J04k08m67m04j33K22M11L88J82
2905F00j35l93m24k46J05L93M35K33n9l42m11l09j4L15M53L43J9k85m29l36q6
$$ plain form
2760 -700 -520 -80 391 646 583 192 -321 -673 -629 -228 294 634 606 291 -184 -565 -646 -364 153 565 669
2781 669 401 -53 -465 -651 -480 -26 449 690 528 73 -389 -628 -538 -154 315 641 618 220 -285 -611 -585
2802 -585 -254 202 553 633 355 -123 -539 -658 -394 81 494 642 446 23 -438 -639 -512 -54 408 633
2822 633 520 147 -309 -599 -573 -226 273 611 590 248 -212 -535 -601 -322 127 535 647 380 -96 -504 -619
2843 -619 -407 -5 413 632 498 58 -393 -638 -512 -126 327 583 542 198 -269 -592 -602 -230 231 545 581
2864 581 321 -133 -498 -628 -391 76 491 604 403 -10 -419 -612 -458 -66 399 635 506 114 -313 -569
2884 -569 -516 -179 256 581 586 260 -203 -543 -553 -291 156 505 609 401 -66 -470 -603 -381 30 418 600
2905 600 465 72 -352 -598 -493 -100 335 568 509 167 -244 -553 -567 -252 201 544 563 278 -151 -487 -573
2926e73K17M19L85J40k08m17l91j59J48L77M05K38r5l78m35k52P6L34M08K85K
2947E26k85m31l37k3K75M23L39O7k07l96l85j39K00M00L95J59j63l55l87k23R0
2968d57L43M23K55o8l46m04k53QK77M14L14M5k80m21l17o8K18L92L44J25j65m03
2990b4l84j50J54L71L80J82r2l26m12k39O2L41L98K55l7k68l97l05k9K55M22L21
3012D78M9k30l72l50r9J73L75L79J53j48l83l56j82R3L40L82K35o9l30l99k37
3033d98K7K81L89K80M1k66m00l09n8K36L72L24R7j92l50l55j51J58L79L51J62
3054E18j15l30l60k23O3L18L88K50m9k94l71k57j5K41L86L11O0k50l66l24q9J91
3076c17L73L35J39j55l61l58j68J43L09L69J94o8k98m04k32M4K94L71K54Pk45
$$ plain form
2926 -573 -356 63 448 588 380 -37 -428 -587 -439 -62 343 581 486 108 -327 -579 -503 -169 239 524 526
2947 526 241 -190 -527 -550 -275 148 487 554 347 -49 -434 -573 -373 27 422 581 418 63 -324 -547 -457
2968 -457 -114 309 564 496 150 -254 -507 -499 -222 192 506 551 271 -150 -467 -535 -317 75 419 544 379 -24
2990 -24 -408 -558 -404 -33 347 529 437 111 -301 -540 -478 -137 261 516 479 211 -186 -491 -520 -265 157 478
3012 478 527 297 -75 -425 -524 -351 24 403 556 408 25 -331 -513 -420 -80 302 537 468 138 -261 -498
3033 -498 -471 -190 199 479 520 254 -146 -455 -513 -277 95 419 516 324 -26 -381 -532 -374 5 356 518
3054 518 403 73 -287 -510 -447 -129 259 509 460 166 -205 -462 -477 -236 150 461 521 271 -95 -419 -508 -317
3076 -317 56 391 530 375 14 -344 -512 -369 -60 309 503 435 137 -267 -499 -455 -161 210 464 471 226
3097B26l64l02o1K31L81L15P6j99l65l11j41J53L55L56J65j32l41l55j75O8K97
3118a23L70K51m2l01l75k44MK59L69K82M5k25l62l20p6K01L52L21J21j47l40l53
3140c33j63J37L27L42J87p6k97l67k10L4K69L63K56j8k47l50k72l6J96L81K94
3161D17O5k07l51l04j12J58L24L39J54j23l25l58j66R8K92L34K17k9k79l76k36
3182d68J9K60L51K50M1k11l51l00p7K03L66K88R4j60l18l15j47J23L28L42J50
3203D68q6k99l39j89M7K50L61K38j3k48l59k45j5J98L51K86N9j89l49k92r2J66
3225b91L18L04J19j21l09l17j71J22K75L26J84n7k61l50k07J8K61L37K33Mk17
3246B00l33k61m6J96L33K81Q3j70l28k74j11J30K87L29J41r6l03l21j71N4K84
$$ plain form
3097 226 -138 -440 -501 -270 111 426 502 303 -62 -373 -514 -361 -6 350 515 383 42 -313 -488 -420 -123
3118 -123 247 498 456 155 -220 -464 -460 -201 168 450 495 270 -92 -412 -488 -287 65 386 507 360 20 -333
3140 -333 -496 -359 -32 310 497 421 124 -243 -453 -419 -150 213 469 451 204 -146 -418 -454 -258 123 417
3161 417 482 275 -76 -380 -492 -334 -10 329 483 360 35 -323 -489 -391 -99 235 452 423 144 -232 -468
3182 -468 -449 -189 162 412 453 242 -109 -409 -486 -283 83 371 465 305 -13 -328 -475 -352 -24 318 468
3203 468 382 83 -256 -445 -398 -148 213 451 438 190 -169 -414 -429 -231 120 406 465 276 -73 -365 -457 -291
3225 -291 27 331 450 329 20 -297 -468 -346 -71 255 439 382 121 -229 -436 -418 -157 180 413 417 200
3246 200 -133 -394 -440 -244 89 370 453 283 -45 -319 -430 -300 -13 316 457 361 58 -263 -434 -380 -96
3267i6L06K11rk56l30k41J0K26L15K55M3k03l15k88p2J76L16K87J00j36l00k99
3289c00j45J02K98L03J57o2k72l12j95J5K60L32K45j4k37l26k42k2J87L20K76
3310C68P0j80l06k84r5J46K84L03J43r7k91l15j65P9K68L13J97m3k55l23k09J5
3332c77K25L25K21K5k02l10k62p3J79L06K86R0j52k95l02j08R5K80L17J50q1k70
3354F7l08j81M6K41L17K16qk31l22k31j5J98L03K60N5j81k99k82q6J59L05K80
$$ plain form
3267 -96 210 421 412 156 -174 -415 -405 -179 136 391 434 231 -84 -372 -444 -268 48 335 435 299 -1 -300
3289 -300 -445 -343 -45 258 415 353 81 -231 -426 -411 -151 181 426 412 175 -151 -393 -415 -228 92 368
3310 368 438 258 -48 -332 -427 -281 3 306 449 352 61 -254 -419 -340 -72 241 438 395 140 -183 -392 -377
3332 -377 -152 173 394 419 217 -93 -355 -428 -249 57 343 433 281 -14 -316 -424 -329 -49 268 418 337 67
3354 67 -241 -422 -376 -135 182 398 390 159 -163 -394 -409 -211 92 352 407 226 -73 -355 -441 -282 23 303
$$ [...]
8191i
##END NTUPLES=NMR FID
##END=
