##TITLE=1H_ANY-157c-11
 CDCl3, 8 sc, 
 7.6.2019
##JCAMPDX= 6.0         $$ Bruker NMR JCAMP-DX V2.0
##DATA TYPE= NMR FID
##DATA CLASS= NTUPLES
##ORIGIN= UXNMR, Bruker Analytische Messtechnik GmbH
##OWNER= root
$$ XWIN-NMR		Version 3.5
$$ Fri Jun  7 15:55:50 2019 Russian Standard Time (UT+4h)  she@DPX200
##.OBSERVE FREQUENCY= 200.13155
##.OBSERVE NUCLEUS= ^1H
##.DELAY= (6, 6)
##.ACQUISITION MODE= SIMULTANEOUS
##.ACQUISITION SCHEME= undefined
##.AVERAGES= 8
##.DIGITISER RES= 18
##SPECTROMETER/DATA SYSTEM= spect
##.PULSE SEQUENCE= zg30
##.SOLVENT NAME= CDCl3
##.SHIFT REFERENCE= (INTERNAL, CDCl3, 0, 15.7039)
##AUDIT TRAIL= $$ (NUMBER, WHEN, WHO, WHERE, WHAT)
$$ ##TITLE= Audit trail, XWIN-NMR		Version 3.5
$$ ##JCAMPDX= 5.01
$$ ##ORIGIN= Bruker BioSpin GmbH
$$ ##OWNER= she
$$ F:/spectra/data/she/nmr/H-F/1/audita.txt
$$ ##AUDIT TRAIL=  $$ (NUMBER, WHEN, WHO, WHERE, WHAT)
(   1,<2019-06-07 15:54:09.71 +0400>,<she>,<DPX200>,
      <created by zg, POWCHK disabled, PULCHK disabled
       configuration hash MD5:
       00 E9 B6 7A A2 85 ED C7 34 08 36 98 17 FE 4E 26
       data hash MD5: 16K
       3E 54 40 AD E3 9A 58 DC 4B B8 0F A6 48 0F 83 8D>)
$$ ##END=
$$ 
$$ hash MD5
$$ A4 25 70 EC 6E 9E 6B CE 7F 7A 9F 9E 3C 54 A5 27
##$RELAX= 
##$RELAX= 
##$RELAX= 
##$RELAX= 
##$RELAX= 
##$RELAX= 
$$ Bruker specific parameters
$$ --------------------------
##$DU= <F:/spectra>
##$EXPNO= 1
##$NAME= <H-F>
##$PROCNO= 1
##$TYPE= <nmr>
##$USER= <she>
##$AMP= (0..31)
100 100 100 100 100 100 100 100 100 100 100 100 100 100 100 100 100 100 
100 100 100 100 100 100 100 100 100 100 100 100 100 100 
##$AQSEQ= 0
##$AQ_mod= 1
##$AUNM= <au_zg>
##$AUTOPOS= <>
##$BF1= 200.13
##$BF2= 200.13
##$BF3= 200.13
##$BF4= 200.13
##$BF5= 200.13
##$BF6= 200.13
##$BF7= 200.13
##$BF8= 200.13
##$BYTORDA= 1
##$CFDGTYP= 0
##$CFRGTYP= 5
##$CHEMSTR= <none>
##$CNST= (0..31)
1 1 145 1 1 1 1 1 1 1 1 1 1 1 1 1 1 1 1 1 1 1 1 1 1 1 1 1 1 1 1 1 
##$CPDPRG= <>
##$CPDPRG1= <>
##$CPDPRG2= <>
##$CPDPRG3= <>
##$CPDPRG4= <mlev>
##$CPDPRG5= <mlev>
##$CPDPRG6= <mlev>
##$CPDPRG7= <mlev>
##$CPDPRG8= <mlev>
##$CPDPRGB= <>
##$CPDPRGT= <>
##$D= (0..31)
0 1.2 0 0 0 0 0 0 0 0 0 0.03 0 0 0 0 0 0 0 0 0 0 0 0 0 0 0 0 0 0 0 0 
##$DATE= 1559908449
##$DBL= (0..7)
120 120 120 120 120 120 120 120 
##$DBP= (0..7)
150 150 150 150 150 150 150 150 
##$DBP07= 0
##$DBPNAM0= <>
##$DBPNAM1= <>
##$DBPNAM2= <>
##$DBPNAM3= <>
##$DBPNAM4= <>
##$DBPNAM5= <>
##$DBPNAM6= <>
##$DBPNAM7= <>
##$DBPOAL= (0..7)
0.5 0.5 0.5 0.5 0.5 0.5 0.5 0.5 
##$DBPOFFS= (0..7)
0 0 0 0 0 0 0 0 
##$DE= 6
##$DECBNUC= <off>
##$DECIM= 24
##$DECNUC= <off>
##$DECSTAT= 4
##$DIGMOD= 1
##$DIGTYP= 9
##$DL= (0..7)
0 120 120 120 120 120 120 120 
##$DP= (0..7)
150 150 150 150 150 150 150 150 
##$DP07= 0
##$DPNAME0= <>
##$DPNAME1= <>
##$DPNAME2= <>
##$DPNAME3= <>
##$DPNAME4= <>
##$DPNAME5= <>
##$DPNAME6= <>
##$DPNAME7= <>
##$DPOAL= (0..7)
0.5 0.5 0.5 0.5 0.5 0.5 0.5 0.5 
##$DPOFFS= (0..7)
0 0 0 0 0 0 0 0 
##$DQDMODE= 0
##$DR= 18
##$DS= 0
##$DSLIST= <SSSSSSSSSSSSSSS>
##$DSPFIRM= 0
$$ [...]
##$SUBNAM2= <"">
##$SUBNAM3= <"">
##$SUBNAM4= <"">
##$SUBNAM5= <"">
##$SUBNAM6= <"">
##$SUBNAM7= <"">
##$SUBNAM8= <"">
##$SUBNAM9= <"">
##$SW= 24.9336996594482
##$SWIBOX= (0..15)
0 0 2 0 0 0 0 0 0 0 0 0 0 0 0 0 
##$SW_h= 4990.01996007984
##$TD= 16384
##$TD0= 1
##$TE= 0
##$TE2= 300
##$TE3= 300
##$TEG= 300
##$TL= (0..7)
0 120 120 120 120 120 120 120 
##$TP= (0..7)
150 150 150 150 150 150 150 150 
##$TP07= 0
##$TPNAME0= <>
##$TPNAME1= <>
##$TPNAME2= <>
##$TPNAME3= <>
##$TPNAME4= <>
##$TPNAME5= <>
##$TPNAME6= <>
##$TPNAME7= <>
##$TPOAL= (0..7)
0.5 0.5 0.5 0.5 0.5 0.5 0.5 0.5 
##$TPOFFS= (0..7)
0 0 0 0 0 0 0 0 
##$TUNHIN= 0
##$TUNHOUT= 0
##$TUNXOUT= 0
##$USERA1= <user>
##$USERA2= <user>
##$USERA3= <user>
##$USERA4= <user>
##$USERA5= <user>
##$V9= 5
##$VALIST= <valist>
##$VCLIST= <CCCCCCCCCCCCCCC>
##$VD= 0
##$VDLIST= <DDDDDDDDDDDDDDD>
##$VPLIST= <PPPPPPPPPPPPPPP>
##$VTLIST= <TTTTTTTTTTTTTTT>
##$WBST= 1024
##$WBSW= 4
##$XGAIN= (0..3)
0 0 0 0 
##$XL= 0
##$YL= 0
##$YMAX_a= 14521
##$YMIN_a= -20146
##$ZGOPTNS= <>
##$ZL1= 120
##$ZL2= 120
##$ZL3= 120
##$ZL4= 120
##$ABSF1= 10
##$ABSF2= 0
##$ABSG= 5
##$ABSL= 3
##$ALPHA= 0
##$AQORDER= 0
##$ASSFAC= 0
##$ASSFACI= 0
##$ASSFACX= 0
##$ASSWID= 0
##$AUNMP= <proc_1d>
##$AZFE= 0.1
##$AZFW= 0.1
##$BCFW= 1
##$BC_mod= 2
##$BYTORDP= 1
##$COROFFS= 0
##$CY= 11.3945322036743
##$DATMOD= 1
##$DC= 2
##$DFILT= <>
##$DTYPP= 0
##$F1P= 18.9103706918063
##$F2P= -1.10871071338519
##$FCOR= 0.5
##$FTSIZE= 0
##$FT_mod= 4
##$GAMMA= 1
##$GB= 0.15
##$INTBC= 1
##$INTSCL= 1
##$ISEN= 128
##$LB= 0.24
##$LEV0= 0
##$LPBIN= 0
##$MAXI= 10000
##$MC2= 0
##$MEAN= 0
##$ME_mod= 0
##$MI= 1.114404
##$NCOEF= 0
##$NC_proc= 0
##$NLEV= 6
##$NOISF1= 3.799351
##$NOISF2= 2.8
##$NSP= 1
##$NTH_PI= 0
##$NZP= 0
##$OFFSET= 15.70392
##$PC= 1
##$PHC0= -8574.688
##$PHC1= 8.400189
##$PH_mod= 1
##$PKNL= yes
##$PPARMOD= 0
##$PSCAL= 0
##$PSIGN= 0
##$REVERSE= no
##$SF= 200.130013532006
##$SI= 16384
##$SIGF1= 3
##$SIGF2= 2
##$SINO= 400
##$SIOLD= 16384
##$SREGLST= <1H.CDCl3>
##$SSB= 0
##$STSI= 0
##$STSR= 0
##$SW_p= 3612.71676300578
##$SYMM= 0
##$S_DEV= 0
##$TDeff= 0
##$TDoff= 0
##$TI= <>
##$TILT= no
##$TM1= 0
##$TM2= 0
##$TOPLEV= 0
##$USERP1= <user>
##$USERP2= <user>
##$USERP3= <user>
##$USERP4= <user>
##$USERP5= <user>
##$WDW= 1
##$XDIM= 8192
##$YMAX_p= 0
##$YMIN_p= 0
$$ End of Bruker specific parameters
$$ ---------------------------------
##NTUPLES= NMR FID
##VAR_NAME=  TIME,          FID/REAL,        FID/IMAG
##SYMBOL=    X,             R,               I
##VAR_TYPE=  INDEPENDENT,   DEPENDENT,       DEPENDENT
##VAR_FORM=  AFFN,          ASDF,            ASDF
##VAR_DIM=   8192,          8192,            8192
##UNITS=     SECONDS,       ARBITRARY UNITS, ARBITRARY UNITS
##FACTOR=    0.0002004,     1,               1
##FIRST=     0,             0,               0
##LAST=      1.6414764,     0,               0
##MIN=       0,             -20146,          0
##MAX=       1.6414764,     14521,           0
$$ Real data points
##PAGE= N=1
##DATA TABLE= (X++(R..R)), XYDATA
0@%%%%%%%%%%%%%%%%%%%%%%%%kRj5J6j6J6j6J6j6J6k0K8l2L2l4L8m4M8n2O0o6
$$ 0 0 0 0 0 0 0 0 0 0 0 0 0 0 0 0 0 0 0 0 0 0 0 0 0 -2 7 -8 8 -8 8 -8 8 -8 8 -12 16 -16 16 -18 20 -24 24 -28 32 -34
45c4P3q2R0r9J12j28J45j68J98k34K84l59M86p27J343n785j5261J1057J8976M634
$$ -34 39 -43 47 -52 60 -68 77 -91 107 -127 157 -202 284 -443 900 -4885 -20146 -9089 9887 14521
65A4521j1405q980L186Q043m71n787M93O401N86o766n181K673N707N6n575j320
$$ 14521 3116 -5864 -2678 5365 4894 -893 -400 6001 6587 -179 -5360 -2687 3020 3076 -2499 -3819
81c819L878j149p133m15R631O938o124j2268j849J2362R709n736r909K255J0246
$$ -3819 59 -1090 -8223 -8638 993 7931 1807 -10461 -12310 52 9761 4025 -5884 -3629 6617
96F617K469r207p577O744J3798J180j3660r300N742J0050J282o451m617J107P42
$$ 6617 9086 -121 -7698 -954 12844 14024 364 -8936 -3194 6856 8138 1687 -2930 -1823 -1081
111a081l009K03O229K361p290p713K064R099M571n638o578L923Q185j942r371
$$ -1081 -4090 -3887 2342 4703 -2587 -10300 -8236 863 5434 -204 -6782 -2859 5326 3384 -5987
126e987r89J0896Q748n581j3027k569J1125P963n589q541L70N677R95n342l243
$$ -5987 -6976 3920 12668 7087 -5940 -8509 2616 10579 4990 -3551 -3181 2496 3491 -1851 -5094
141e094M680N047m202p711N82P049K803m002l400K750M127k810n957K949J0367
$$ -5094 -414 4633 431 -7280 -6698 351 3154 -848 -4248 -1498 2629 -181 -6138 -3189 7178
156G178K758r161q161L782J0624L108q530p068M838P828j956q260k438N935N013
$$ 7178 9936 775 -7386 -3604 7020 10128 1598 -5470 -632 7196 5240 -3020 -5458 477 5490
171E490l829p524J01O580J621m995k173L498K470l115l983K741P797J448p998
$$ 5490 1661 -5863 -5762 818 2439 -2556 -4729 -1231 1239 -1876 -5859 -3118 4679 6127 -1871
186a871n299N327P622m67o437k170N813M456n431p745K665R234J754q282o975
$$ -1871 -7170 -1843 5779 5312 -1125 -3295 2518 6974 1543 -6202 -3537 5697 7451 -831 -7806
201g806L286Q492J283p563m425M493M660k033l603J288M291N11m742k309N148
$$ -7806 -4520 3972 5255 -2308 -6733 -2240 2420 387 -3216 -1928 2363 2874 -1868 -4177 971
216I71M928l172n468J622O126J135o317n206M269Q169q09r069l712N946N534l031
$$ 971 5899 2727 -2741 -1119 5007 6142 -175 -5381 -1112 7057 6248 -2821 -6533 -587 4947 1916
232A916p121r26O684L671n545n682L166O529K54n472k925L984N334j072m623M72
$$ 1916 -5205 -6131 553 4224 -1321 -7003 -3837 2692 2946 -2526 -5451 -1467 3867 2795 -1828 -1356
248a356M462O3m367j258M508M093k800o690n61O536K753n712n209K825O115K65
$$ -1356 3106 3169 -1198 -2456 2052 6145 3345 -3345 -3906 2630 5383 -329 -5538 -2713 3402 3667
264C667o526m093M911O511k163o951o92O187M054l062n070R32N546J048m719j681
$$ 3667 -2859 -6952 -2041 4470 2307 -4644 -5336 851 4905 1843 -3227 -2295 3251 4299 -420 -2101
280b101M438L101k909m618K29M651J510m894l735L623M581k424o049j122N096
$$ -2101 2337 5438 2529 -2089 -1860 2791 4301 -593 -4328 -705 3876 1452 -4597 -5719 -623
295f23L840l676n856J533O803J281n609l227L797N358l74n120j380N365L662l580
$$ -623 3217 -459 -6315 -4782 2021 3302 -2307 -5534 -1737 3621 3247 -1873 -3253 2112 5774 2194
311B194m599J431M548Q14l879k716L026L506k879n383O77N180J334m523l877K287
$$ 2194 -2405 -974 3574 4388 509 -2207 819 4325 1446 -3937 -3260 1920 3254 -1269 -5146 -2859
327b859N271r5n703k056M877M172k211m258L58M792K201l975l747L186N086r55
$$ -2859 2412 2317 -3386 -5442 -565 3607 1396 -2862 -2504 2288 4489 514 -3233 -47 5039 4084
343D084m840j260L688K644k878m703P66M910N58m903k622K931L339j587m573n73
$$ 4084 -756 -2016 1672 4316 1438 -3265 -2499 2411 2969 -1934 -4556 -1625 1714 127 -4446 -5019
359e019N031L028l919m104K349N030M13m167k123L815M615j566m929l6M559J555
$$ -5019 12 3040 -879 -4983 -2634 2396 2809 -1358 -3481 334 4949 3383 -1546 -1582 2977 4532
375D532l355l106J808M027k64m995k087L885K782l081m056Q56M260J336m056l437
$$ 4532 1177 -1929 -121 3906 3642 -1353 -3440 445 3227 146 -3910 -3054 1206 2542 -1514 -4951
391d951K751M540r76m184l10M063K681k399l922R27M815R51m209k193L247L278
$$ -4951 -2200 2340 1364 -2820 -3130 933 3614 1215 -2707 -1780 3035 3986 -223 -2416 831 4109
407D109j593m340j056L810K399l325l718J786L760m22l939j791K845L498j483
$$ 4109 2516 -1824 -2880 930 3329 4 -3714 -1928 1832 1410 -2529 -4320 -1475 2023 540
422E40m084M76M543J385l528k644K248M206K47l960j533L810K775k680l669P97
$$ 540 -3544 -3068 1475 2860 -668 -3312 -1064 3142 3389 -571 -2104 1706 4481 1801 -1868 -1071
438a071L657J069l334k970K156L606j464m505n79L686K226k392l533P64M104P00
$$ -1071 2586 3655 321 -2649 -493 3113 1649 -2856 -3435 251 2477 85 -3448 -2684 1420 2120
454B120l972j889L290L271j225l351l47L468K039l003l269K023M012k81l757j751
$$ 2120 -1852 -3741 -451 2820 1595 -1756 -2103 1365 3404 401 -2868 -845 3167 2886 -871 -2622
470b622K507K831j626m017N7M010J250l268k445J729L029k13l359j071L593K824
$$ -2622 -115 2716 1090 -2927 -2870 1140 2390 -878 -3323 -1594 1435 1222 -2137 -3208 385 3209
486C209k313l281R57L449Q97k796k205K288L570j028m011n99L187J586k329k855
$$ 3209 896 -2385 -1428 2021 2918 122 -2083 205 3775 2747 -1264 -1863 1324 2910 581 -2274
502b274Q04L447M45l810k111K721K744j435l116j17L256J988k547l076J526L509
$$ -2274 -1470 1977 2422 -1388 -3499 -778 1966 531 -2585 -2702 554 2542 -5 -3081 -1555 1954
518A954j21k910p44K636K235j670l490J92L742J088l213k232J914K788o04l499
$$ 1954 1833 -1077 -1821 815 3050 1380 -2110 -1918 1824 2912 -301 -2533 -619 2169 1565 -1934
534a934j377L027K573k174l143R73L264O89k591k073J766L219l56l003j27L107
$$ -1934 -3311 -284 2289 115 -3028 -2055 1209 1898 -693 -2766 -1000 2219 1863 -1140 -1267 1840
550A840J289k314k485R42L222O94l089j821K231J987j830k772L03K746J078k756
$$ 1840 3129 815 -1670 -728 2494 3188 99 -1722 509 2496 666 -2106 -1803 943 2021 -735
566g35k792J677L564l54l555j324K516K791o43k859k88L041J279k497j793J811
$$ -735 -3527 -1850 1714 1360 -2195 -3519 -1003 1788 1145 -1714 -2002 1039 2318 -179 -1972 -161
582a61K551j40k317j052J848J466j906k246J337K631l27k960j610J955K756j022
$$ -161 2390 2250 -67 -1119 729 2195 289 -1957 -620 2011 1684 -1276 -2886 -931 1825 803
598H03l501k10L395J499k390k207J354L221M33l244j940K823L511n49l020j214
$$ 803 -2698 -2908 487 1986 -404 -2611 -1257 1964 2397 -847 -2787 36 3547 2998 -22 -1236
614a236J573J727o74j696N87J757q76k643k70K194J035j824k289N93K768L01k971
$$ -1236 337 2064 1390 -306 281 2038 1162 -1481 -1751 443 1478 -346 -2635 -2042 726 1027 -1944
631a944j347K508K392j179k936m21L371K884j831l661J67L310J380j835j774R74
$$ -1944 -3291 -783 1609 430 -2506 -2927 444 3328 1497 -2164 -1997 1313 2693 858 -916 58
647E8K250k41k766r87K028J350j126j352J38Q05k22j424j77K169J087k416k337
$$ 58 2308 2067 -699 -1686 342 1692 566 -786 -648 157 -65 -1489 -1666 503 1590 -826 -3163
664c163J515L511Q63k881k704J542L674K42k953r57K422J841j427k889m38K790
$$ -3163 -1648 1863 2726 -155 -2859 -1317 2357 2599 -354 -1311 1111 2952 1525 -1364 -1802 988
680I88J991j750k586P3J411J14j062l74J044N98j605j562J565K520n81k637o41
$$ 988 2979 1229 -1357 -1284 127 241 -821 -1195 -151 447 -1158 -2720 -1155 1365 784 -1853 -2494
697b494K180K050q29k355K06K969J009k710k331J436L309J012k686k777R77K599
$$ -2494 -314 1736 907 -1448 -1242 1727 2736 26 -2305 -869 2440 3452 766 -2011 -1034 1565
713A565n7k011m56J223N38j015j136O04J457l91j729J36J919N36j568j201J157
$$ 1565 1508 -503 -959 264 802 -213 -1349 -745 712 321 -1408 -1272 647 1183 -385 -1586 -429
730d29K389R0l016j679K646L158o82l179j386J792K113q14k356J36K235L61k133
$$ -429 1960 2050 -966 -2645 1 3159 2477 -702 -2088 -296 1817 1003 -1353 -1217 1018 1379 -754
747g54j509Q45J888M83j547j052R68Q93o96l09J153P39j127j624M54K832J571
$$ -754 -2263 -1418 470 953 -594 -1646 -678 215 -481 -790 363 1102 -25 -1649 -1195 1637 3208
764C208k431l030Q68L148Q65k257k103R92K711J55k967j687J868K238l67j969
$$ 3208 777 -2253 -1385 1763 2628 371 -1732 -740 1971 2126 -841 -2528 -660 1578 1211 -758
780g58q27J266J277q86j297P66J391l71j118J08J081M85q97r44Q55J356q65j953
$$ -758 -1585 -319 958 72 -1225 -459 932 561 -557 -449 632 1117 220 -724 131 1487 622 -1331
798a331L35K368R48k157k993R1L454K013k314l049L36K453R39j494j498R17K009
$$ -1331 -996 1372 2320 163 -2830 -2739 715 2728 414 -2635 -2299 154 1093 -401 -1899 -982 1027
815A027j23j800k43J535Q78n93q86O8R83K86q99p8J200j9j798r37J336J834k70
$$ 1027 904 -896 -1139 396 1274 681 -205 -137 846 1132 233 155 1355 1336 -462 -1399 -63 1771 1501
834A501k409j313J899J986j330k517J27K502J527j490k620OK730J414j541j598
$$ 1501 -908 -2221 -322 1664 334 -2183 -2056 446 1973 483 -2137 -2131 599 2013 472 -1126
850a126N42J453L87r55o12Q41O35j137r66J024J138o15j388l31R70O11j200j338
$$ -1126 -584 869 1256 301 -311 530 1165 28 -938 86 1224 609 -779 -1110 -140 471 -729 -2067
868b067J095K165k38k425j290J520K564L27k300j289J809J953o32j550j4J321
$$ -2067 -972 1193 955 -1470 -2760 -1240 1324 1651 -649 -1938 -129 1824 1192 -358 -372 949
884I49P56r27j157O85J384l71j475l33P29L11o04o66N12J070p06k109k44K203
$$ 949 1705 778 -379 306 1690 1319 -156 -489 240 551 -53 -719 -207 863 157 -1952 -2196 7
902GJ359j271k021L4K255J367j613j948Q31K197M68j349j043N94J406j7j468m19
$$ 7 1366 95 -1926 -1892 363 1730 117 -1831 -1000 1197 1665 316 -727 -133 1273 1256 -212 -631
920f31J119L90r43n00O03N07o74j410K5J763P40j612j252R97J555p5j560p68J641
$$ -631 488 878 -65 -565 38 545 -129 -1539 -1514 249 989 -623 -1875 -878 677 602 -958 -1726 -85
939h5K096o51k311l20K061J494q30j948l83J763J177j050j265J94M20l27m15J92
$$ -85 2011 1360 -951 -1271 790 2284 1454 -494 -877 886 2063 1013 -252 -58 362 35 -380 -188
957a88N87m0j209p70J080J180p98j462J51J578R95j066j697M97K239M54j919j102
$$ -188 399 359 -850 -1620 -540 640 -158 -1620 -1469 109 1104 38 -1659 -1162 1077 1531 -388 -1490
975a490J351J905J6j949j302J213J704m37j500k36Q71M51n84q45J80Q23k52r20
$$ -1490 -139 1766 1782 -167 -1469 -256 1448 1011 -489 -725 146 597 13 -832 -652 171 -81 -1001
993a001M02J224p7j258n42J026J427j79j717l82J889J279j196j720M4J634J014
$$ -1001 -599 625 548 -710 -1252 -226 1201 1022 -695 -1077 812 2091 895 -825 -781 853 1867
1010A867j174j658N24J657q7j683q11Q51J113j34j238l79R76L92r24m06Q16O50
$$ 1867 693 -965 -441 1216 1129 -554 -1365 -514 599 465 -773 -1152 -176 216 -708 -1114 -298 352
1028C52l52q07Q2J298O60j328j231R44J634J0j344p81Q82J268n21j777j67J654
$$ 352 0 -807 -725 573 1233 -95 -1326 -382 1252 1262 -82 -863 19 1287 766 -1011 -1178 476
1046D76P63j066j252J33J211M74j143q36R56J116m82q87J97Q80K95q18p49Q98
$$ 476 1239 173 -1079 -946 265 739 -404 -1240 -284 832 350 -537 -340 540 835 17 -732 166
1064A66J391m41j485j58J162N88q31j275J69J559L84j627j084Q58J113l22j189
$$ 166 1557 1116 -369 -527 635 1223 392 -883 -714 845 1229 -398 -1482 -624 489 167 -1022
1081a022l61J106J042q00j309M15J280J35q55l53P65J016k53j276m7J300L50j112
$$ -1022 -1383 -277 765 -35 -1344 -929 351 486 -369 -722 43 1059 806 -470 -517 783 1133 21
1099B1o36P35J034j59j490p81J173J104p99j274J77J152M26r10j048M93J410L1
$$ 21 -615 120 1154 995 -495 -1276 -103 1001 202 -1072 -895 257 683 -227 -1275 -782 628 659
1117F59j201j73J156O96o10r56P3J186M89j070o55R01P54o86j131j80R73P11r37
$$ 659 -542 -715 441 1137 527 -429 -356 830 1319 249 -406 495 1249 563 -568 -748 225 936 -1
1136aj299M78J299k24j370n16Q92J097k31j241j23J407O11j043p44P06J149K11
$$ -1 -1300 -822 477 253 -1117 -1633 -741 356 125 -1116 -1239 168 779 -264 -1008 -302 847 1058
1154A058r17n59R34R32p90j188L33J148K30r47r03M10J054l48j450j66J244N89
$$ 1058 141 -418 516 1448 658 -530 -197 951 1181 234 -669 -259 795 447 -1003 -1169 75 664
1172F64q06r58J56J149M14j137p13J089J205l66j019r7R21O97o95j049N22J309
$$ 664 -142 -1100 -944 205 619 -518 -1231 -142 1063 697 -322 -419 502 1199 504 -545 -23 1286
1190A286q7j299m94O62O61m26j160j43J182M66j201r05N79R30p0r31l77J081J049
$$ 1286 1199 -100 -594 68 729 303 -857 -1000 182 648 -553 -1458 -879 51 -19 -950 -1327 -246 803
1209H03o77j180M20J257K66q01n30O47J196j34j371l62J141N78p83q77K17R64
$$ 803 126 -1054 -634 623 889 88 -442 205 1401 1267 -104 -466 675 1253 470 -407 -190 774
1227G74J67j236r10Q59R83n85j032Q7R62M80p86j020M76J380O2j114k27R77P33
$$ 774 941 -295 -1205 -346 637 52 -980 -893 69 549 -237 -1257 -781 599 661 -453 -680 297 1030
1246A030m40j080q6J256N94j084q70P04R02l26j128n14Q07R12n89j151K20J036
$$ 1030 590 -490 -576 680 1274 190 -680 24 926 600 -528 -1042 -235 677 88 -1063 -843 193
1264A93Qr07m83O35J049q0j107j34J276N70r44q02N46J172L10j041q04Q36R99
$$ 193 201 -706 -1189 -554 495 415 -692 -826 450 1020 76 -726 -180 992 1302 261 -543 293 1292
1283A292n80j164L4R17M31o85r91K14J050r8j249k86J010P03m89r41j6J063M36
$$ 1292 712 -452 -418 499 930 245 -746 -532 518 420 -829 -1115 -105 598 109 -832 -848 215 651
1302F51j026o16R95R90m02j012k02R40P72p42j250L63J384J31j152p97M55R58
$$ 651 -375 -991 4 994 592 -420 -622 318 1090 348 -902 -539 845 976 -176 -973 -518 440
1320D40k3j087l60J061N80q35o76M43P77L1p60l32J008R40o87j141K58J100L30
$$ 440 417 -670 -1030 31 611 -224 -900 -457 320 351 -409 -741 267 1207 520 -621 -363 737 1067
1339A067p51p62M52J146j46j451m24J119O90p02j082pJ094N53j052j006N69J004
$$ 1067 316 -446 6 1152 1006 -445 -869 250 940 238 -844 -851 243 796 -256 -1262 -693 311
1357C11r6o78j67O15N55m42q51L74J115k0r81k10Q53O70n72j218o8J343N70j172
$$ 311 215 -463 -630 -15 540 98 -753 -379 736 716 -265 -475 378 1048 476 -742 -810 533 1103 -69
1377f9r65N58R84n6j031o63Q09J106m15j145J12J096L74p04p38M06J175J98j017
$$ -69 -1034 -476 508 452 -579 -1242 -433 673 258 -887 -775 321 695 -9 -747 -341 834 1032 15
1396A5l01Q89M00o94o05L40Q38J12j038p26P73Q57o63j142k6R77O27p63j168K63
$$ 15 -286 603 1003 309 -296 44 882 994 -44 -770 3 860 197 -945 -971 6 633 -130 -1298 -1035
1416a035J360J58j213m78Q91R82j10r19l18R00O39o92n98N94P84j62q44m32O32
$$ -1035 325 483 -730 -1208 -317 665 555 -364 -682 218 857 165 -433 161 945 783 -61 -493 139
1435A39P84n78j145K14J106Q0j003o35N20R12j67j165j33J318O93q93r48K83J131
$$ 139 923 345 -800 -586 520 600 -403 -1038 -518 394 227 -938 -1071 247 940 47 -901 -618 513
1454E13N81p81q91O02J134j75r82j98O14L86n01o70L20Q74l31j323k34J017N45
$$ 513 1094 313 -578 24 1158 983 1 -197 417 803 302 -368 -48 826 495 -828 -1062 -45 500
1473E00o40r71RJ121N58j059r67P00J194L2r12l75Q53J001m55j232J23J298M16
$$ 500 -140 -1111 -1102 19 577 -482 -1449 -749 445 477 -435 -810 43 1044 589 -643 -520 778 1194
1492A194q13o59K42P00Q6q10l98O06K90o28l88N35N40l64j096l64J247J245p50
$$ 1194 381 -278 -36 664 750 -60 -458 148 438 -190 -578 -43 497 133 -963 -1327 -80 1165 415
1511D15j515O1J380O99p24j035K46J313L30j089o13P41P77l06r10l78P20P18n40
$$ 415 -1100 -1039 341 1040 316 -719 -473 840 1170 81 -532 209 986 680 -230 -608 112 830 290
1530B90q75J89N17l24n85J46O79K77p50q01O35J211k19j261k36J187J101l71j455
$$ 290 -585 -396 121 -203 -788 -642 37 314 -436 -1237 -602 609 390 -871 -1107 80 1181 810 -645
1549f45m33J457J151q02j340J04J124N60p09r64K16Q21j45q01OO48J45n06m75
$$ -645 -1078 379 1530 728 -612 -508 616 1176 467 -497 -281 540 395 -406 -400 248 393 -113 -588
1568e88J94N74l5p49O5J060L18j012q22N49J296L62j292j031R11J428k59j357
$$ -588 -394 180 145 -604 -539 521 839 -173 -995 -446 850 1212 -80 -1111 -200 1228 969 -388
1586c88n20P95R09l07j142j79J044M04q56o86L06O44J26m93k02O26L12p63m55
$$ -388 -908 -113 796 489 -653 -832 212 616 -240 -926 -620 24 150 -343 -545 81 393 -370 -825
1605h25Q04Q41l16r07j58R97Q58p66j353K09J393M89r54j018K06J113K87j106
$$ -825 -21 820 504 -403 -561 436 1294 528 -825 -616 777 1266 312 -706 -500 613 900 -206
1623b06p59P53Q00l69p30J3O52L03o42o50N86R29k42p75M8O57K09o31o36N30J181
$$ -206 -965 -212 588 219 -511 -498 154 457 -185 -835 -249 680 438 -337 -289 368 577 -54 -690 -160 1021
1644A021j27j394n80J015R63m10j251m12J040R72p05j103J58R17J91n78m30M15
$$ 1021 894 -500 -1080 -65 898 488 -763 -1175 -135 837 132 -971 -813 104 295 -283 -713 -298
1662b98P73j15p28P3Q21O3p21k48O53P98j98j096l60R91O06q20q32M05R47N0j135
$$ -298 475 360 -368 -295 526 589 -132 -380 273 1071 873 -223 -583 408 1014 194 -638 -233 714 764 -371
1683c71q80P89J327k51j370m17R04Q85j70r07k31P56L70n87k00P03M52m98p25
$$ -371 -1251 -462 865 614 -756 -1173 -269 616 446 -461 -692 64 434 -153 -353 350 802 304 -421
1702d21RP89M29p31o78O21P50n06j036j45R50P31o45j267Q2J359M51j014q11M70
$$ -421 -412 377 806 75 -603 18 768 262 -774 -919 31 762 117 -1150 -1068 291 742 -272 -1083 -613
1722f13J031K44q68n19Q55Q81m53q51N5O93L70l64m25K75M76m77q67K18R52J79
$$ -613 418 662 -206 -725 130 1011 558 -293 -238 455 825 461 36 311 787 310 -557 -339 613 792
1742G92q61p69K66R53N2j109m50R86P30n90r20O6J083O67q36j080M05J225K72
$$ 792 -69 -838 -572 381 433 -676 -1126 -140 590 0 -920 -854 229 896 60 -1020 -615 610 882
1761H82p48m56L41N20k00o88P2Q95J50r35n40N19N88k12p72j89Q49N10q05q14
$$ 882 134 -322 19 539 339 -349 -277 618 768 -167 -707 -188 400 188 -584 -773 76 586 -219 -1033
1781a033N29J010M5q90n54P16J117j55j100j79R45M77n83o57K23Q78K30r40o54
$$ -1033 -504 506 551 -339 -893 -177 940 785 -315 -494 451 928 345 -312 -89 789 1019 79 -575
1800e75N64N92l73o08N1N81J55p63o90N76R78k39j003j74Q11O35l59q53N0J016
$$ -575 -11 581 208 -400 -349 232 387 -376 -1066 -490 488 249 -754 -928 -117 518 159 -694 -644 372
1820C72L20q61m77P01Q08j82r13m20O97P77m51q09K06O86p3p09l59N15P38k87
$$ 372 692 -169 -646 55 863 681 -232 -652 45 822 371 -438 -232 454 381 -328 -687 -172 566 279
1840B79r31k1R52K98p35n37L98Q41J29q85m22Q71P68n47r10O0Q06M34n62p61L06
$$ 279 -652 -673 279 577 -158 -695 -297 544 673 -212 -634 237 1005 458 -452 -392 414 848 286 -475 -169
1861a69Q07j91r65j92P43N08m17p68m2P86K65p89m27O83O57k98p21j08Q06O11
$$ -169 638 447 -518 -710 33 541 124 -644 -686 100 365 -424 -851 -168 489 191 -530 -638 168 779
1881G79o47q79L96R92P6p53m21M34O66k34q85p6R40L75p37o59K53O86J21o88m10
$$ 779 132 -747 -351 641 717 -36 -457 -23 643 409 -476 -552 388 763 26 -633 -380 306 427 -261 -671
1902f71O96O60m90p58J90P49K40n84n54M25Q86j47r56j85P61M16n01o83Q2Q46
$$ -671 25 685 195 -563 -373 376 616 32 -522 -97 789 642 -314 -499 262 678 177 -506 -424 422
1922D22K57r15o52N69P04k43o82j10O33M91n29p84L39R14L2p33k53N80O10k36
$$ 422 679 -236 -888 -319 385 142 -540 -650 -17 474 -55 -839 -500 414 446 -287 -540 40 650 414
1942D14q12o5Q79L64o99n28M07O49n2q10m40O50P08m42q24J53P31J42o05n33L64
$$ 414 -398 -463 416 780 81 -447 -40 609 557 -253 -693 -43 665 223 -601 -448 283 425 -180 -713 -349
1963c49Q61k8q21j62P20M13m54n69J35P54K56p34n25N89O37l86p96q9O59M55m88
$$ -349 512 484 -337 -499 221 634 180 -389 -254 500 756 22 -503 86 723 337 -459 -548 111 566 78
1984G8q10K05P89n2p66k34N42N80j91p13j03Q23L98o75m88N14P27Oo79l47O03
$$ 78 -732 -527 262 210 -556 -790 -248 332 141 -572 -675 148 546 -129 -617 -103 624 630 -49 -396 207
2005B07O31m49p79K23P62Q6o26n16K74O55j27q47j66P94M15n60o59J21P05K74
$$ 207 838 389 -390 -167 595 681 55 -461 -187 468 341 -506 -672 122 537 -23 -682 -561 144 418
2025D18o25m68N93O98l20o69M1O11L48m42n98K88Q03l9q18l62N10N08k46o80j31
$$ 418 -207 -675 -82 616 296 -373 -332 279 627 185 -413 -125 678 639 -179 -541 -31 477 231 -449 -580
2046e80P09L37p15o07M41O26q9n73j87N79N72l96p49K01Q32K21n35l71L01O54
$$ -580 129 466 -249 -856 -415 211 122 -451 -638 -59 513 117 -632 -431 401 622 87 -284 17 671
2066F71j5p55k30O91L98n35n35K16N65M2p31n03N27O78l06p04LN51K57m17n57
$$ 671 656 -99 -329 362 760 225 -310 -94 471 513 -218 -721 -194 484 178 -526 -523 28 285 -132 -689
2087f89K41Q16O8p42k42O29M93l34o30k1P54M16o49n86L77N63j25n86k40M22M68
$$ -689 -448 368 436 -306 -548 81 574 240 -390 -411 343 759 110 -476 -99 464 339 -247 -487 -65 403
2108D03k73o48J00O22L2o21k59M70O23r5p39j85P50M35n47m85L17O59J08n80m74
$$ 403 130 -518 -418 204 236 -385 -644 -174 449 354 -385 -570 180 615 68 -417 -100 559 667 87 -387
2129c87M25O50k41p01m4N59K90l89n86N8O19O1o83k28N56L98l45m93K6N12K45
$$ -387 38 688 447 -254 -298 261 551 162 -424 -366 253 314 -369 -597 -41 357 12 -481 -455 57 302
2150C02n09l66N43O02k91o81j16N80N59l38p62O3Q07J95o52m40K90N01j9n21j75
$$ 302 -207 -573 -30 572 281 -400 -516 64 623 285 -477 -414 393 588 -64 -504 -214 287 268 -253 -428
2171d28N38L12m90m49K88N02L9m31k64M23N77k80p13P5O52K23m40m13K31O10p2
$$ -428 110 422 -68 -517 -229 273 312 -119 -383 40 617 337 -376 -301 351 574 134 -279 -48 562 490
2192D90p89k63O57M79l60n92j11M98L57l81n55J94N39k6m05k6L12K46l12m58K44
$$ 490 -299 -562 95 574 214 -378 -489 9 366 -15 -570 -376 163 137 -268 -294 18 264 -48 -506 -262
2213b62P00M3o85k49N02M71k27o34j66O32M64m45n92J78M91K4m47l21L88O15j79
$$ -262 438 481 -204 -453 49 520 293 -341 -507 125 589 144 -448 -270 221 245 -202 -523 -135 480 301
2234C01o95p0N81K82l05l05J18L88O4l97q0M86J47n18l80K95N78J49o28o16L49
$$ 301 -394 -464 117 399 94 -211 -93 295 359 -38 -118 368 515 -3 -383 -88 490 639 11 -605 -256
2255b56O53j70o53r7N00L51l23o32lO76K67m77l22K92L64mk95j18L49L05l51l74
$$ -256 397 227 -426 -523 -23 328 5 -627 -630 46 313 -164 -486 -194 170 166 -129 -247 102 407 56 -318
2277c18L09M81o8m34k19K74L40k53m87J95O46l9o93m38L56O84J36o07m19M15M71
$$ -318 -9 472 404 -30 -249 25 365 112 -375 -180 466 427 -266 -704 -348 336 472 -135 -554 -139 332
2298C32j90l79P3M13K02l67m05K69O10k3n43j71K48J42j26j68J37L21k03p16j78
$$ 332 142 -237 -164 249 451 84 -321 -52 558 535 -8 -179 69 211 85 -83 54 375 172 -544 -722
2319g22O39M85k36n90k21M17L71k88m03L27N45j33n41j52M73N74p5o43j93M90
$$ -722 -83 402 166 -424 -645 -228 143 -145 -548 -221 324 191 -350 -502 -29 545 470 -173 -366 124
2339A24L01j96j64R3J59j07m14j26M95L90l73m89O5K95K5k93j59L86M71l09p25
$$ 124 425 229 65 158 317 210 -204 -330 165 555 182 -307 -242 53 78 -215 -374 12 483 174 -551
2360e51JO32M37k15m90j32M09K71k92j62L09K03l52m30J4N17M14l30o17n9L24
$$ -551 -550 82 519 304 -186 -318 91 362 70 -92 217 420 68 -362 -348 169 583 253 -364 -423 -99
2381i9Jj40R0K57K9l84m89K20P62K59n57m42K05M62J61l14j97L27L35l50m25K05
$$ -99 -98 -238 -148 109 138 -246 -735 -515 247 506 -51 -493 -288 174 335 21 -176 151 486 136 -289 -84
2403h4N00J55l35m24JL29N1k73N7L29o5m43k99J97N42J80m67l46K80K79k13k42
$$ -84 416 571 236 -188 -187 142 193 -80 -23 306 241 -202 -501 -304 238 418 -49 -395 -115 164 -49 -291
2425b91J73M09J21m88m99K82P28J11n18l94O8L19J31j78n2K46n3m97j86M01M28
$$ -291 -118 291 412 -76 -575 -293 435 546 28 -366 -298 21 152 -26 -78 168 115 -382 -568 -167 261
2446B61Rl54k87J69K73j49j66L10L47j89m80j51M18N70o6o47k24M28K91j69k42
$$ 261 270 -84 -371 -202 71 -78 -244 66 413 224 -256 -407 11 581 515 -132 -356 72 363 194 -48
2467d8M1K43K5m23k97L83M70j00l82j74J01J38k5j16K15K91k30m94nM50K88j49
$$ -48 -7 236 261 -162 -459 -76 394 294 -88 -262 -161 -23 -48 -164 51 342 112 -382 -387 63 351 202
2489B02l77r6L37J48l27j73L51K38k47m50j30M50N21j77n80j20L05J31l1j2J10
$$ 202 -175 -271 66 214 -113 -286 65 303 56 -394 -524 -74 447 270 -310 -430 -125 6 -25 -37 73
2510G3J72j65m06J7N22K60k74k74J8K13R1j95j34K81K04l59l78J51M20J50l02
$$ 73 245 80 -326 -309 213 473 199 -75 -57 156 247 52 -82 199 403 44 -334 -183 237 387 85
2531H5m51kM42Q5l07n7K53J11j89l16QM19K89k85l13J52J96p0j54K6K35J54k92
$$ 85 -366 -368 74 159 -148 -205 48 159 -30 -346 -338 81 370 85 -228 -76 120 50 -104 -78 157 311 19
2554A9l93J75M43J0l62k17J21K55L8k79o0L50Q1l70k33K51L74J50k58l35J57L23
$$ 19 -374 -199 244 254 -108 -325 -204 51 89 -190 -250 100 181 -189 -422 -171 203 353 95 -240 -83 240
2576B40o5k07J08K31j5k20j97J28L52k8m33j44K99J46j50k22m2K29Q6l24k34L06
$$ 240 175 -32 76 307 292 72 -125 3 355 327 -106 -250 49 195 45 -177 -219 10 96 -228 -462 -156
2598a56L57j20k85j17J74K54n4k41O8L66j8l02j02J80K24nk60j14K82J35k74j81
$$ -156 201 81 -204 -321 -147 107 53 -188 -120 246 228 -74 -176 4 228 223 -37 -151 131 266 -8 -189
2620a89J45J75m3k52j46K49L34j72l96K6K86J24j41j22Q5K79Ol51r5L32K13j68
$$ -189 -44 131 88 -164 -310 -61 273 101 -295 -269 17 141 0 -122 -37 242 248 -103 -198 134 347 179
2642A79j87k0J84J44k44k38J62K47j60k31jJ68J26j80l19N7L53L5k88n7J92J40
$$ 179 -8 -28 156 300 56 -182 -20 227 67 -164 -165 3 129 -51 -370 -313 40 75 -213 -270 -78 62
2664F2o5k15p0L31K37k25k15J39J91Nj46j50J44K66j01l23N2K44Rk08j31O0K51
$$ 62 -3 -218 -288 43 280 55 -160 -21 170 175 29 -121 23 289 188 -135 -83 161 170 -38 -169 -109 142
2687A42M9k95j19K64J27k11j48O3K14J50j85k47J62K61j01k44L8K11J11j19k61
$$ 142 191 -104 -223 41 168 -43 -191 -128 86 236 51 -196 -34 227 126 -118 -80 131 242 123 -138
2708a38rK86L0k92j00J96J22o1j81j11J88J62k12j82J99K37m6k07j02J36K55o4
$$ -138 -147 139 169 -123 -223 -27 95 34 -147 -258 -70 92 -120 -302 -103 134 88 -119 -221 -85 170 106
2730A06k61N1L01J5j94j04O6J60N8k19j07K48J57k06k22M6J65J05j41j97J27K66
$$ 106 -155 -104 197 212 18 -86 -20 140 198 -21 -128 120 277 71 -151 -105 60 165 24 -173 -46 220
2752B20j13k48QJ67Q3o9j44L1K17K9l03r3K16J54q1j69q4J59J84j86k74J35K23
$$ 220 107 -141 -133 34 117 48 -96 -65 152 181 -122 -215 1 155 74 -95 -179 -20 164 -22 -296 -161 62
2775F2l8j38l5R9J34p9k43L9K92P3j91q1P1J53M6j76j48K44J72j78j54R3J32n
$$ 62 24 -114 -149 -50 84 5 -238 -199 93 166 -25 -106 -35 118 164 -12 -160 84 256 78 -76 17 149 144
2799A44j55j59J27K69p5k80KJ76N0q3j26l1K23J05k28j03J69R7j11r9K2J55J19
$$ 144 -11 -170 -43 226 151 -129 -127 49 99 16 -110 -141 82 187 -41 -144 25 122 11 -88 -66 89 208
2822B08j80k14J25K24j02j88k6J01J26j8k23n6K14K5j92m6J46J51J3j85j60K19
$$ 208 28 -186 -61 163 61 -127 -153 -52 74 56 -167 -223 -9 16 -176 -222 -76 75 88 -97 -257 -38
2844c8K21j20j58J18J45%r4r7N5J80l4k13J3K10Oj47j12j8J80N2k51j25K39J59
$$ -38 183 63 -95 23 168 168 74 -23 32 212 178 -35 -22 188 194 47 -65 -83 97 149 -102 -227 12 171
2868A71j55j99l2J35J48l2j83Q7J73q9j67N3J31R1k8k04l7K39Q5k13j11J04P0
$$ 171 16 -183 -215 -80 68 36 -147 -60 113 24 -143 -90 41 132 104 -100 -137 102 187 -26 -137 -33 37
2891C7m4q3m9J42J05k07j96J40J98J0q3q8L7J80pk17J2K53J01j11j12j5J21R3
$$ 37 -7 -90 -139 3 108 -99 -295 -155 43 53 -30 -118 -81 99 92 -125 -113 140 241 130 18 3 124 217
2915B17j33r5J67Q3k07j01P5J27K8j47k41M3K50L2j77l6L4Ln9o5O1K58O2k96j42
$$ 217 84 -11 156 239 32 -69 6 133 161 14 -227 -184 66 98 -79 -115 -81 -78 -137 -202 -141 117 179 -117 -259
2940b59J81J53Qq5q6P0J44q5j41Q0J37o0j11n4M5J57J1k13l6J94nj65k6J48J49
$$ -259 -78 75 83 -2 -88 -18 126 41 -100 -20 117 57 -54 -108 -63 94 105 -108 -144 50 45 -120 -146 2 151
2965A51K1j91j72J31K18m6q0N6L4Pp1j28Q9K44l4k76p9J27R1Kr5q9N4K6j51j0
$$ 151 172 -19 -191 -60 158 112 32 88 122 129 58 -70 19 263 229 -47 -126 1 92 94 -1 -90 -36 -10 -161 -171
2991a71K29N9j61j63m5J11K16j8j85N3J32o7j56L7J40J57j2k56q6K07J27j00n8
$$ -171 58 117 -44 -207 -252 -141 75 57 -128 -75 57 -10 -166 -129 11 168 156 -100 -186 21 148 48 -10
3014a0J0PJ3m2m3J36J34j62j80M0J42O1%o7j6J01p9j89Q7K55M9j60j63m5J51J39
$$ -10 0 7 20 -22 -65 71 205 43 -137 -97 45 106 106 39 23 124 45 -144 -57 198 247 87 -76 -121 30 169
3040A69j33j36R2P6j03q4JR7J33q7k35k2K04N0k3oj5m2o0o0J17K47N3k88j37Q2
$$ 169 36 -100 -8 68 -35 -119 -118 -21 112 25 -210 -232 -28 22 -1 -7 -22 -64 -124 -184 -67 180 233 -55 -192 -110
3066a10J36Q3l9j04K3J04j17j51J54J96l8j50j43L0K49Q5j70q2P7Jn0L7O4P9K8
$$ -110 26 109 70 -34 -11 93 -24 -175 -21 175 137 -13 -156 -126 123 208 38 -44 33 34 -16 21 85 164 192
3091A92j56j56J20J40q3n4N8J9j2j23j45R5K59m4k38q5Q8Q9N8o3j00P5M6j21j3
$$ 192 36 -120 0 140 57 3 61 80 68 -55 -200 -105 154 110 -128 -213 -125 -36 22 -41 -141 -66 -20 -141 -154
3116a54J95R8m9j53j26P6K37L5j21K3K8j14p4Q1J12J07p2k52o8K23J23j04j05
$$ -154 41 139 90 -63 -189 -113 124 159 38 61 89 -25 -99 -18 94 201 129 -123 -191 32 155 51 -54
3139e4j2L2Q6n6o0J14J28j38j51L3J09J12K3j18n2Q4l3j33P8J33Mj02j20o1J29
$$ -54 -66 -34 52 -4 -64 50 178 40 -111 -78 31 143 166 48 -4 80 47 -86 -8 125 129 27 -93 -154 -25
3164b5R7j42j07J06Q1r1q1rJ01J38q1k18M1K19O1o0k4l7L8M8o6J7K00L2j98r6
$$ -25 72 -70 -177 -71 10 -81 -162 -171 -70 68 -13 -231 -190 29 90 30 6 -31 7 55 -11 6 206 238 40 -56
3190e6N5P4O7l4j12L5O5j19q2J17J04n1j13j19N7K22N8k08q9R7N1oj0J2P1N0j54
$$ -56 -1 73 140 106 -6 29 94 -25 -107 10 114 63 -50 -169 -112 110 168 -40 -129 -32 19 13 3 15 86 136 -18
3217a8j44J38J42m6p1l5NN6m4j17M9J42o1j33J3P1N6J1j24n5J64Q5j47m6J38R6
$$ -18 -162 -24 118 72 1 -34 -29 27 -17 -134 -85 57 -4 -137 -124 -53 3 14 -110 -165 -1 84 -63 -109 29 125
3243A25j7j16j06R6J96jj35KM3l5l1l0L7J08j6j83o4J61N3q0o7j7M8O2n7p3J19
$$ 125 108 -8 -114 -18 178 177 42 44 87 52 21 -9 28 136 120 -63 -127 34 87 7 -60 -77 -29 33 -24 -97 22
3270B2Q9j35j20N0J05J18k9j81k4J50J2j27L2N7M0j9j13o1J42P4j25p2R5O6l5
$$ 22 111 -24 -144 -94 11 129 100 -81 -105 45 57 -70 -38 19 59 40 -73 -134 8 82 -43 -115 -20 46 11
3295A1k7n6O0J02o8j35Q4J44J0q5m2mQ7K5j35k9J83M7j33j00J1O9Q7p2j18P4R5
$$ 11 -16 -72 -12 90 22 -113 -29 115 125 40 -2 -6 81 106 -29 -58 125 172 39 -61 -50 19 106 34 -84 -10 85
3322H5r4q7N8N3nl1r0L2J69J2j77m4J02K9j1l1j3P3N7j46r4J27J05n4o5l6K1J23
$$ 85 -9 -96 -38 15 10 -21 -111 -79 90 102 -75 -119 -17 12 1 -30 -43 30 87 -59 -153 -26 79 25 -40 -76 -55 68
3350F8k9j42K7J34rq0jM8O2Mj12l4J43P5j04m6O7K9mn8j14P5J45o0j44K4P6j2
$$ 68 39 -103 -76 58 49 -31 -32 16 78 82 -30 -64 79 154 50 4 71 100 96 38 -76 -1 144 84 -60 -36 40 28
3378B8m7q3%J37K6j54k9J22K4o2l7j4R0R8r1q9Q4Q1p3n4J2N4P9l5j56OJ53j2j23
$$ 28 -19 -102 -102 35 61 -93 -122 0 24 -38 -75 -89 1 99 8 -81 3 84 11 -43 -31 23 102 67 -89 -83 70 58 -65
3407f5PN3M5Mr7n1J29O5j16o3R5P0Rl3q6L2J31l3j34O9J09k5p1o1RR4J0j48n1
$$ -65 -58 -5 40 44 -53 -104 25 90 -26 -89 6 76 85 52 -34 -2 129 96 -38 31 140 115 44 -17 -8 86 96 -52 -103
3436a03J41J1q1o4nK8O9p1r8J11J22p0j12K0N9P6Jj03J3J57%j42k1J07J3Jl2n3
$$ -103 38 49 -32 -96 -101 -73 -4 -75 -173 -62 60 -10 -122 -102 -43 33 34 -69 -56 101 101 -41 -62 45 58 59 27 -26
3464b6J01N8j25j05R3P7k9m0o7M1J27n2j54L8J20j0m8OjP7Jj12l5J60O0j03o3
$$ -26 75 133 8 -97 -4 73 44 4 -63 -22 105 53 -101 -63 57 47 -1 5 4 81 82 -30 -65 95 155 52 -11
3491a1J1M2M1n6j21M8J30p8j05K7O1Mn0r1K9J31K4j30j5R3J4om6k3Q4J13p9r1
$$ -11 0 42 83 27 -94 -46 84 6 -99 -72 -11 -7 -57 -148 -119 12 36 -94 -109 -16 -2 -8 -54 -77 7 120 41 -50
3519e0P6O9l1n4MM9Q3l8j47J7J26k0r3j8J2O0L9r3q2Q8P8j05l7P4N0K0p6q5O2
$$ -50 26 95 64 10 14 63 146 108 -39 -22 104 84 -9 -27 -15 45 84 -9 -91 -3 75 -30 -67 7 57 77 1 -84 -22
3548b2J20n7j07M7P4Nl7q2rP9M3j39j2J07J0o0m8k3Q8P8q4j03R8J01m9p4J1L8
$$ -22 98 41 -66 -19 55 60 23 -59 -68 11 54 -85 -97 10 20 -40 -88 -111 -23 55 -29 -132 -34 67 18 -56 -45 -7
3576gO8Kq8OJ49l4r4k0N8M7K7q8o2J10O3j20r3O5O2Ml4o0K4R0n5j17N9R5k0m2
$$ -7 61 63 -25 -19 130 96 2 -18 40 87 114 26 -36 74 137 17 -76 -11 51 55 21 -39 -15 75 20 -97 -38 57 37 -5
3606em1lR4J3j27o0J33M2m4m7lJ9L9o8r2J00J10o5q0PM0N5lq3j7J37L4j04j3N6
$$ -5 -46 -49 45 58 -69 -129 4 46 2 -45 -48 -29 10 -58 -150 -50 60 -5 -85 -78 -38 17 14 -69 -86 51 85 -19 -32 24
3636B4M5pm8m2R5Q5j03p9P9M8m0n8l8M5J18l2j47j1P3Ml9OJ4M9J3j20m6J48N1
$$ 24 69 62 14 -28 67 152 49 -30 49 97 57 -1 -39 6 124 92 -55 -66 7 11 -28 -22 -8 41 54 -66 -112 36 87
3665H7j07n6L2N4N3m8j00L8Q4n6q7N8O8jm2r2qJ18M8j26qQ3M3l0m8k5P0J07o8
$$ 87 -20 -76 -44 10 63 15 -85 -47 37 -19 -106 -48 20 19 -23 -115 -123 -5 43 -83 -91 -8 35 5 -43 -68 2 109 41
3694D1o9Q2M6l1k5k0K5Q1k0j30K3J28pj12n6J6O7L4r6n3Q8L2j09m5O2M6K7l4q7
$$ 41 -28 54 100 69 44 24 49 130 110 -20 3 131 124 12 -44 -28 39 73 -23 -76 12 44 -65 -110 -48 -2 25 -9 -96
3723i6L1J11k7r2K6O1J7j9n9PR6Qj37l1J00M1l5m4j3J6N0n4q2Q5J11m7o2l3L9
$$ -96 -65 46 19 -73 -47 14 31 12 -47 -40 56 64 -73 -104 -4 37 2 -42 -55 -39 11 -43 -125 -40 71 24 -38 -71 -32
3752c2Q3Mq8j3J25J8p3K2K8kJ7p5l4J14O4j11r8M7L2Ml1p2J6R5l3j44L0R2rm1
$$ -32 51 55 -33 -46 79 97 24 46 74 72 89 14 -20 94 158 47 -51 -4 28 32 1 -71 -55 40 7 -137 -107 -15 -24 -65
3782f5k8J5Q4N4j13n7R3M4k9k6kL1O4l9q0L4Q1m1n4K6L7J4j9j06mJ44L1j11m1
$$ -65 -93 -78 6 60 -53 -110 -17 27 -2 -28 -30 1 65 26 -54 -20 61 20 -34 -8 29 43 24 -82 -86 58 89 -22 -63
3811f3O8K2J8m0m5O7O3o7o5R1O6k6p3n9L2R7K2j13rO5m1m5j2J9L2J9j04m5J10
$$ -63 5 27 45 5 -40 27 90 23 -42 49 115 89 16 -43 -11 86 108 -5 -14 51 10 -35 -47 -28 4 23 -81 -126 -16
3840a6N7r0n8K5K0N2lp9M6J06n9r0K7P5M6Nq7k4R0J7r5k0Q8M2k2n7n1N2Q1n3q3
$$ -16 41 -49 -107 -82 -62 -10 -13 -92 -46 60 1 -89 -62 13 59 64 -23 -47 43 60 -35 -55 33 75 53 -4 -55 -3 78 25 -58
3871e8P0O4m6l5rL0O2j3j23MJ12L0n4l0pJL3n4l8J05M7j12p4L4K5M7pp7j3R7k3
$$ -58 12 76 30 -5 -14 16 78 65 -58 -54 58 88 34 4 -3 -2 31 -23 -61 44 91 -21 -95 -61 -36 11 4 -73 -86 11 -12
3902a2p1K8P2k1j9m3LJ16M5j08o8Q1J6lj0rK3O4o6r2M6Q6k7l7J6KL9%r1qJ09K2
$$ -12 -83 -55 17 -4 -23 -66 -63 53 98 -10 -78 3 19 16 6 -3 20 84 18 -74 -28 58 31 -6 10 12 51 51 -40 -48 61 83
3934H3q9k0L5K2K4k8p0O6N5r1m4P2M4j1o0q7nJ34K1r0k2L4k0j8mJ6P0J7q8n9R8
$$ 83 -6 -26 9 31 55 27 -43 23 78 -13 -57 15 59 48 -12 -99 -104 30 51 -39 -61 -27 -47 -65 -69 -53 17 34 -54 -113 -15
3965a5P2l6l9pJ2P0j1n5L7Q1p6o1LN1N2Nq4m5P7K5p7j9M8L3km9n6M4P3m6o0N8
$$ -15 57 21 -18 -25 -13 57 46 -9 28 109 33 -28 -25 26 78 83 -1 -46 31 56 -21 -40 8 41 39 -10 -66 -22 51 5 -55 3
3997CN4k8k4k7KP7Oj21LQ2J7l4k1k7J4L6p4l4J03N4q8p0RL6O3Lq5L1P2rn5K6L6
$$ 3 57 29 5 -22 -20 57 63 -58 -55 27 44 10 -11 -38 -24 12 -62 -96 7 61 -27 -97 -88 -52 11 14 -71 -40 32 23 -32 -6 30
4030C0J1Pn4rR6M1r6n2N9K0j5j3l0L6N7p5p8L6N9l5k0mj2M9Kq8j5J04J5n0NJJ8
$$ 30 41 48 -6 -15 81 122 26 -26 33 53 38 25 -5 31 88 13 -65 -29 30 -5 -25 -29 -41 8 10 -78 -93 11 26 -24 -19 -18 0
4063@L8n3n2P4N6o6m1L1K5K0j4o8j5R8j3o7J9M0j6rl4k6R5O1q4l5M3L7k2j0j7
$$ 0 38 -15 -67 7 63 -3 -44 -13 12 32 18 -50 -65 33 20 -47 -28 12 -4 -13 -47 -73 22 83 -1 -36 7 44 22 12 -5
4094eK1P0k1q5L9P5l7m9Pj2L8K0q7k0O7J1q6j3L6PM1l0o9M0N1n7k8N0L7J1j3n9
$$ -5 16 86 65 -20 19 94 57 8 15 3 41 61 -26 -46 21 32 -54 -67 -31 -24 17 -13 -82 -42 9 -48 -76 -26 11 22 9 -50
4126e0j7R3K1q4RN0ok3Kk1N1K8p5m2O6M9l5j4j3nN0%o2L5P6l4p2QPM9K0n3l7O8
$$ -50 -67 26 47 -37 -28 22 16 -7 -5 -26 25 53 -22 -64 2 51 16 2 -11 -16 34 34 -28 7 83 49 -23 -15 -8 41 61 8 -29 39
4160C9K4q0rL5J2Lj8o0K2Q2n0p5M0L7k9qj2QO6j5p3j6Q4J1k5Kj4K1J7l2l3M6N9
$$ 39 63 -17 -26 9 21 24 6 -54 -32 50 0 -75 -35 2 -27 -35 -47 -39 27 12 -61 -77 7 18 -7 -5 -19 2 19 -13 -46 0 59
4193E9m8k6MQN1j7o4LQ1j2m4K1K1rJ5l6l4P6L0n8l2L5Oj4ql5K2O1k9q2K3L9l5
$$ 59 11 -15 -11 -3 48 31 -33 -30 51 39 -5 16 37 28 43 7 -27 49 79 21 -11 24 30 16 8 -27 -5 56 27 -55 -32 7 -28
4226b8nmj0M4J7p1l6Q4J2n2nmK8N3j8o3K7O3m9j4L4J8J8Lp8JP4%o6J7L0pJ4j8
$$ -28 -33 -37 -47 -3 14 -57 -93 -9 3 -49 -54 -58 -30 23 5 -58 -31 32 -17 -31 3 21 39 42 -36 -35 39 39 -27 -10 20 13 27 9
4260Il5K4O4n2k9M7J3j4ok4ON5j3o9K9O3l8l2Pk2J2L4l8m3N7J0o6kJ2NK5j7o0
$$ 9 -26 -2 62 10 -19 28 41 27 21 -3 3 58 45 -24 5 68 30 -2 5 -17 -5 29 -9 -52 5 15 -51 -53 -41 -36 -11 -28 -88
4293h8M2N4l3n1L1K9J4Pj8j0N4Mo9K1L9KRj1l2L2L4m5n2N5L1l2llj1L8j2o6K2
$$ -88 -46 8 -25 -76 -45 -16 -2 5 -13 -23 31 35 -34 -13 26 28 37 26 -6 26 60 15 -37 18 49 17 14 11 0 38 26 -40 -18
4326a8O7k1l3J3nLL2m0m3P3L1n6j5J5j2J8j3m2J1O0l8o0L8K6m6J6j9l1N6M6o7
$$ -18 49 28 -5 8 3 6 38 -2 -45 28 59 3 -12 3 -9 9 -4 -46 -35 25 -13 -73 -35 -9 -55 -39 -58 -89 -33 13 -54
4357e4j3N5qj0J5lJ8O3m9m5N0L5l4lK5jJ7Mn9rP0j2l7J1j3KJ4j3l5L2K5o8k1N5
$$ -54 -67 -12 -20 -30 -15 -18 0 63 14 -31 19 54 20 17 42 41 58 62 3 -6 64 52 15 26 13 15 29 16 -19 13 38 -30 -51 4
4391DJ9j4j2m0KN7Ln5K9K5l2j4%j5L7M0o1l7N1J1n7L0%JL4j4n0M6L6m0oJ4qJ3
$$ 4 23 9 -3 -43 -41 16 19 -36 -7 18 -14 -28 -28 -43 -6 34 -27 -64 -13 -2 -59 -29 -29 -28 6 -8 -58 -12 24 -16 -22 -8 -16 -3
4425cM4l6KM4po8J6L2J6K7j7n6K4M0m9j3M4Qm3Nk4j7O0jo5JL1j0qK2k7J3K4n1
$$ -3 41 5 7 51 44 -24 -8 24 40 67 50 -6 18 58 9 -4 40 48 5 10 -14 -31 29 28 -37 -36 -5 -15 -23 -1 -28 -15 9 -42
4459d2m2Q0K6l7plk2K8Ok8K4L6k6m5L0J9kJ3j6l1N8J2k6pL2j6lJ2j9J6L1j9m9
$$ -42 -84 -4 22 -15 -22 -25 -47 -19 -13 -41 -17 19 -7 -52 -22 -3 -5 8 -8 -39 19 31 5 -2 30 14 11 23 4 20 51 32 -17
4492a7L1K5k2J2Nk5K3J7o6j6N9k0k9L0nj0J4k8l0M5L0n7jJ8rK0Rl9j1M1j3l4N5
$$ -17 14 39 17 29 34 9 32 49 -17 -33 26 6 -23 7 2 -8 6 -22 -52 -7 23 -34 -35 -17 -26 -6 3 -36 -47 -6 -19 -53 2
4525Bjk3jj4k8M3M0m5nL4j1j0J9pj0M5Lm2L3K9m0j5K1mL0K2n8k1N7k3l0RMk0L2
$$ 2 1 -22 -23 -37 -65 -22 18 -27 -32 2 -9 -19 0 -7 -17 28 31 -11 22 51 11 -4 17 13 43 65 7 -14 43 20 -10 -1 3 -17 15
4560A5ml9K8K7o5j2L4JJ4J8m4k0M1kk9K4K4j9%Qk7QM0l4l6M4Pj3K2rk1K3j1l5
$$ 15 11 -28 0 27 -38 -50 -16 -15 -1 17 -27 -47 -6 -8 -37 -13 11 -8 -8 0 -27 -19 21 -13 -49 -5 2 -11 11 2 -19 4 -7 -42
4594d2J7N7l4k5K3%nL4j8rN1Mn3jK2j3RK4l1NL4m8l2L5J2k6J9m5qM1J7n8RK9m3
$$ -42 -25 32 -2 -27 -4 -4 -9 25 7 -2 49 53 0 -1 21 8 17 41 10 15 49 1 -31 4 16 -10 9 -36 -44 -3 14 -44 -35 -6 -49
4629d9KL6j0K6kk2n3N6L7k3OOk8RJ8j9J6L2k8m2M1MmL2k6n2L8K5l7%M2k9nJ5l6
$$ -49 -47 -11 -21 5 3 -19 -72 -16 21 -2 4 10 -18 -9 9 -10 6 38 10 -32 9 13 9 41 15 -37 1 26 -11 -11 31 2 -3 12 -24
4664b4J2M6j5k3J8Rl0JN%L5J0n4k8L5Nj9L1j4l3K2pl3N8J5m5k7J3lK9M7l5l1K3
$$ -24 -12 34 19 -4 14 23 -7 -6 -1 -1 34 44 -10 -38 -3 2 -17 14 0 -33 -11 -18 -51 7 22 -23 -50 -37 -40 -11 36 1 -30 -7
4698gj4k1N3K7j0j9ol0L4O2l8k2K3j5k6K0Jk4N8k2n7K0L8k7OQk3lNj3oL7J3l2
$$ -7 -21 -42 11 38 28 9 3 -27 7 69 31 9 32 17 -9 11 12 -12 46 24 -33 -13 25 -2 4 12 -11 -14 -9 -22 -28 9 22 -10
4732a0j0j1kL0J8l2J4J4n2j1M4J0m%l2k1L6M3m0J3Ml1jL6KJ8L1o9l1L9K2OK6j8
$$ -10 -20 -31 -33 -3 15 -17 -3 11 -41 -52 -8 2 -2 -2 -34 -55 -19 24 -16 -3 1 -30 -31 5 7 25 56 -13 -44 -5 17 23 49 31
4766C1m2J6Kk2L8K5l4j8j5MJ3M4k1l9K1J0m5K3L4k1lOn2K3M4k4j7K1j8l9K6J8
$$ 31 -11 5 7 -15 23 48 14 -4 -19 -15 -2 42 21 -18 3 13 -32 -9 25 4 1 7 -45 -22 22 -2 -19 2 -16 -55 -29 -11
4798a1k7L9J6n2j5K2LJ1L6j6k5K7k0k7N3L2l1k4%j0L2N5l6k4J1k3j3L2K8j1Ml2
$$ -11 -38 1 17 -35 -50 -28 -25 -14 22 6 -19 8 -12 -39 14 46 15 -9 -9 -19 13 68 32 8 19 -4 -17 15 43 32 36 4
4830Dm9M5J7j5J1Nk8j4J6j4QK5j3l6J9J2j0K0kk8RJ5k8kN6k0k1lj8LK8K3l8K3
$$ 4 -45 0 17 2 13 18 -10 -24 -8 -22 -14 11 -2 -38 -19 -7 -17 3 1 -27 -18 -3 -31 -33 23 3 -18 -21 -39 -36 -8 15 -23 0
4864@%m2jN0KJ5jm3j7M7K4j7K1Jl0J3Qj4L4K4n6l1L3j1kM1k0m0J1Pm1K7K6j9k6
$$ 0 0 -42 -43 7 9 24 23 -20 -37 10 34 17 38 39 9 22 30 16 50 74 18 -13 20 9 7 48 28 -12 -1 6 -35 -8 18 -1 -27
4899b7Lk1J4L3j9nJ4j2j7K1J7j8J0Ql5J7K3j1J0Qj4k5K6j3pM6%l4j1J8qJ7K6j1
$$ -27 -24 -45 -31 2 -17 -22 -8 -20 -37 -16 1 -17 -7 1 -34 -17 6 -5 5 13 -1 -26 0 -13 -20 26 26 -8 -19 -1 -9 8 34 23
4933B3k2K3j1j7M4Ql0Kk3%L0L0m3lJ3k5j4M8k3MPk9m1K9K3l5K6Pl4oK0k6J7K5
$$ 23 1 24 13 -4 40 48 18 20 -3 -3 27 57 14 11 24 -1 -15 33 10 14 21 -8 -49 -20 3 -32 -6 1 -33 -39 -19 -45 -28 -3
4967cj9k7L2mKK1Kl9J5K5k2J7L0j0k8J1rmM4pk0K5%k9NK1j6K5Jl8mL7qk2K3qj5
$$ -3 -22 -49 -17 -21 -19 2 4 -35 -20 5 -17 0 30 20 -8 3 -6 -10 34 27 7 32 32 3 8 29 13 38 39 1 -3 34 26 4 27 19 4
5004DJ5nj4K4J3n6LMP%J2j2j9Njk6K7J1l1QRj0J5J4j8k4L2Nk5K7Ok3K8%l8K7L2
$$ 4 19 14 0 24 37 -19 -16 -12 -5 -5 7 -5 -24 -19 -20 -46 -19 -8 -39 -31 -22 -32 -17 -3 -21 -45 -13 -8 -33 -6 0 -23 5 5 -33 -6 26
5041B6rj6J6j2pL6k9nL8rl0K1J1k2RK1l4J3J7k2k3L1k0pJ1jk4L7Pm5kPj9J1J2
$$ 26 17 1 17 5 -2 34 5 0 38 29 -1 20 31 9 18 39 5 18 35 13 -10 21 1 -6 5 4 -20 17 24 -21 -23 -16 -35 -24 -12
5076a2p%K3l9j8M2K3l3JK0l1J8J1l2K0K9k9QlJ8k1K4oj8L1Rj3nJ8j6j0J9j3pM4
$$ -12 -19 -19 4 -35 -53 -11 12 -21 -20 0 -31 -13 -2 -34 -14 15 -14 -6 -9 9 -12 12 6 -12 19 28 15 10 28 12 2 21 8 1 45
5111D5k2k1K3Oj3j0RrJ1J9m0qL8k3k2J5j1kJ5Lm2K3J7l7mK8k0JK0l5J0K6jl1L2
$$ 45 23 2 25 31 18 8 17 8 19 38 -2 -10 28 5 -17 -2 -13 -15 0 3 -39 -16 1 -36 -40 -12 -32 -31 -11 -46 -36 -10 -11 -42 -10
5146a0Oj0K1Mk7RL6m3J1K3Mj9NQj8L0j5k8L7J0l2LJ2k2K0Kk0jK9j1k6K4Jk6J9
$$ -10 -4 -14 7 11 -16 -7 29 -14 -3 20 24 5 10 18 0 30 15 -13 24 34 2 5 17 -5 15 17 -3 -4 25 14 -12 12 13 -13 6
5181FOk6K0J3k1oj%oJ4Jk3J9j4k6J7J8k1J4Ml5L0K3l7qL0JoK7j6rL2j2j8J2K8
$$ 6 12 -14 6 19 -2 -8 -9 -9 -15 -1 0 -23 -4 -18 -44 -27 -9 -30 -16 -12 -47 -17 6 -31 -39 -9 -8 -14 13 -3 -12 20 8 -10 2 30
5217C0k6rL8j4KJ1k6j5K5J0k4RJj6nNljL7m4j4K8mkQlk1K2Nj5lK1j5j8J4njL2
$$ 30 4 -5 33 19 21 32 6 -9 16 26 2 11 12 -4 -9 -4 -7 -8 29 -15 -29 -1 -5 -7 1 -2 -23 -1 4 -11 -14 7 -8 -26 -12 -17 -18 14
5255A4j7k6L1%k4K3kj7J4Pl1PL4k3jJ6ooJ9Ql1L8Qn2J7J9j3J7J5m0mK3oj0K2%
$$ 14 -3 -29 2 2 -22 1 -1 -18 -4 3 -28 -21 13 -10 -11 5 -1 -7 12 20 -11 27 35 -17 0 19 6 23 38 -2 -6 17 11 1 23 23
5291B3l5Jkj3L5Pj8k2Roj2K9Jj7J8qk5K9J5k1%Rj6lK3MpJ4j8k2J9J4mK3Jl1JK4
$$ 23 -12 -11 -13 -26 9 16 -2 -24 -15 -21 -33 -4 -3 -20 -2 -10 -35 -6 9 -12 -12 -3 -19 -22 1 5 -2 12 -6 -28 -9 5 1 24 25 -6 -5 19
5329A9l2J3M0j5k9Pj1OL1j1m2K4Lj5J0K1k1J9j9k1mL7Ql0Rkj4RK0k4K3Ql2k3J2
$$ 19 -13 0 40 25 -4 3 -8 -2 29 18 -24 0 3 -12 -2 19 -2 17 -2 -23 -27 10 18 -12 -3 -5 -19 -10 10 -14 9 17 -15 -38 -26
5364b6K3KJ7j9k3RJ2rL5J3m1qjnL4K9j8m1J4nOK4J8l0J6j4k7K0L3j3j2J3m3jL1
$$ -26 -3 -1 16 -3 -26 -17 -5 -14 21 34 -7 -15 -16 -21 13 42 24 -17 -3 -8 -2 22 40 10 26 12 -15 5 38 25 13 26 -17 -18 13
5399A3j1j7L3j4l1nL4j4J7Qm7ML0k0lL3nk4j3pJM0J8k8J7Ol9J3K8Mj2J3k7l4N2
$$ 13 2 -15 18 4 -27 -32 2 -12 5 13 -34 -30 0 -20 -23 10 5 -19 -32 -39 -38 2 20 -8 9 15 -24 -11 17 21 9 22 -5 -39 13
5434A3J8k3J2j4m6J7K4J1oL0m2k7K0K0PK1k2l4QJ5oJ8J5k4k2J2j0RK5Km7J4j5
$$ 13 31 8 20 6 -40 -23 1 12 6 36 -6 -33 -13 7 14 35 13 -21 -13 2 -4 14 29 5 -17 -5 -15 -6 19 21 -26 -12 -27
5467b7j5L1J6k1%Nk6kL4%JOj4j4K5jrL4lk5jK2lKJ3k5rK3j4JJ9J0k9lqj4L8L4
$$ -27 -42 -11 5 -16 -16 -11 -37 -39 -5 -5 -4 2 -12 -26 -1 -2 -11 23 20 -5 -6 16 13 15 28 3 -6 17 3 4 23 33 4 1 -7 -21 17 51
5505E1l8k6J0j9MK7Nj9Qj2k8J2M2k3j1Lk7J2L6j9%Pj7l1J9K2J8Mj0m2QL1rOJ9
$$ 51 13 -13 -3 -22 -18 9 14 -5 3 -9 -37 -25 17 -6 -17 -14 -41 -29 7 -12 -12 -5 -22 -53 -34 -12 6 10 0 -42 -34 -3 -12 -6 13
5540A3j6j9J5kkL2Ol4J3Qj1LJ9k8J9J4l6pK5J8qkkm9K9J9k0J6Ol6j0PMlK5k4k8
$$ 13 -3 -22 -7 -9 -11 21 27 -7 6 14 3 6 25 -3 16 30 -6 -13 12 30 22 20 18 -31 -2 17 -3 13 19 -17 -27 -20 -16 -19 6 -18 -46
5577d6L3Lj2K2qk0oJ0JJ4K2l8j0J2OLJ7J2j8JRk4J4K2mj0J3l1PL1Jk6K5kk0MJ5
$$ -46 -13 -10 -22 0 -8 -28 -34 -24 -23 -9 13 -25 -35 -23 -17 -14 3 15 -3 -2 7 -17 -3 19 15 5 18 -13 -6 25 26 0 25 23 3 7 22
5614B2jJ3ok7j6L4j5NJ3j1j9J7k2j0L5Ol1k1K1j3oL4j4rJ6k4k0L8J5l2J8j0j9
$$ 22 21 34 28 1 -15 19 4 9 22 11 -8 9 -13 -23 12 18 -13 -34 -13 -26 -32 2 -12 -21 -5 -29 -49 -11 4 -28 -10 -20 -39
5647c9J9L4k5mQMj4J6Lj2L3om3L1J4m%J8j7JJ2k5J7QJ0l7J3Nj8K2Mm1J8MrnJ3
$$ -39 -20 14 -11 -15 -7 -3 -17 -1 2 -10 23 17 -26 5 19 15 15 33 16 17 29 4 21 29 39 2 15 20 2 24 28 -13 5 9 0 -5 8
5684HLk0J4j5j1J9J2k8KK3l6LJ0klK6k5j3L1j3j6K7krONjJK9k6j5J4J2j2L0j3
$$ 8 11 -9 5 -10 -21 -2 10 -18 -16 7 -29 -26 -16 -18 -21 5 -20 -33 -2 -15 -31 -4 -6 -15 -9 -4 -5 -4 25 -1 -16 -2 10 -2 28 15
5720A5k6K4Lj2QL0k6%qJ1j6K1j9j5J8J0j6Mj0oRJ5l0j1L0j6lJ3pj1J8j0l2L1J4
$$ 15 -11 13 16 4 12 42 16 16 8 19 3 24 5 -10 8 18 2 6 -4 -10 -1 14 -16 -27 3 -13 -16 -3 -10 -21 -3 -13 -45 -14 0
5755@l0QOj8OK3j3oL3k5j0J9J9k4J4lj5J9J2k1OOj7JK4nlJ7k2qJ4J6j7J0J0j7
$$ 0 -30 -22 -16 -34 -28 -5 -18 -24 9 -16 -26 -7 12 -12 2 -1 -16 3 15 -6 0 6 -11 -10 14 9 6 23 1 -7 7 23 6 16 26 9
5791IlK2l5NPNk4K4Lj2NMk1J7Ml4JK1j7KPj3j1K1kj4K1oj1%J4nLK6j8j3K1jj4
$$ 9 6 28 -7 -2 5 10 -14 10 13 1 6 10 -11 6 10 -24 -23 -2 -19 -17 -10 -23 -34 -13 -15 -29 -8 -14 -25 -25 -11 -16 -13 13 -5 -18 3 2 -12
5830a2J9ok2K5KnJ6Kk2OJ8j9J2kolJ3J3k9NPNmnk4K4Oj3pJ5nj9K7j3j1J5rj4%
$$ -12 7 1 -21 4 6 1 17 19 -3 3 21 2 14 12 6 3 16 29 0 5 12 17 13 8 -16 8 14 1 -6 9 4 -15 12 -1 -12 3 -6 -20 -20
5869b0K7k7J1%j7J3J3jKKjk7J3K1k0K4J0l5QK8k0rK8%k5L5k4j4K3Mk4J2J3j9O
$$ -20 7 -20 -9 -9 -26 -13 0 -1 1 3 2 -25 -12 9 -11 13 23 -12 -4 24 4 -5 23 23 -2 33 9 -5 18 22 -2 10 23 4 10
5904A0J3k0lJ5k5j0K1Mj7J6pj4J0J6k8pL3k4oK3qjJ8k4k3J9J7j2J0Jj1LJ0j8N
$$ 10 23 3 0 15 -10 -20 1 5 -12 4 -3 -17 -7 9 -19 -26 7 -17 -23 0 -8 -9 9 -15 -38 -19 -2 -14 -4 -3 -14 -11 -1 -19 -14
5939a4J8j0j1K1lj2J2OpPJ3l0OK8j6j0J5j4lK2Jk2J1Nj3mJ9k9K5J7l1oJ8j6mJ1
$$ -14 4 -6 -17 4 1 -11 1 7 0 7 20 -10 -4 24 8 -2 13 -1 -4 18 19 -3 8 13 0 -4 15 -14 11 28 -3 -9 9 -7 -11 0
5975@Rk7K0Mj9J5J6l2rK1qoK1lj4K8Kk6J4J7j7j2J1j8J3Qj1PK5j4j8J8rj2J4O
$$ 0 9 -18 2 6 -13 2 18 -14 -23 -2 -10 -16 5 2 -12 16 18 -8 6 23 6 -6 5 -13 0 8 -3 4 29 15 -3 15 6 -6 8 14
6011A4k1K2%k3oK0Lj1J0j6j8L8qpJJ7k4OJ0k2J1K3l6j6L1nrJ7Jj5J2Nj9J7Pj1
$$ 14 -7 15 15 -8 -14 6 9 -2 8 -8 -26 12 4 -3 -2 15 -9 -3 7 -15 -4 19 -17 -33 -2 -7 -16 1 2 -13 -1 4 -15 2 9 -2
6047bj1J0pJ0Rj6nJ5J0j4OJ6j6RLk2KK1mj8K9j6j6K0ok0K3J0k4kK0pj0K4l8JK5
$$ -2 -13 -3 -10 0 9 -7 -12 3 13 -1 5 21 5 14 17 -5 -3 18 14 -4 25 9 -7 13 7 -13 10 20 -4 -6 14 7 -3 21 -17 -16 9
6084Ink7K1J1j8%PpJ0Mk0OJ9j1k1K0J2oJ9j1qJ0J0k4J0jlkK3j5LKpk2K7Nj2J2
$$ 9 4 -23 -2 9 -9 -9 -2 -9 1 5 -15 -9 10 -1 -22 -2 10 4 23 12 4 14 24 0 10 9 6 4 27 12 15 17 10 -12 15 20 8 20
6122B0j3j4QK5j7nOJl0K3kj9J2lj7K6lj3LQj6RJ7k1JJ8Nl6J4J2l3L1Qj8J6J1j9
$$ 20 7 -7 1 26 9 4 10 11 -19 4 2 -17 -5 -8 -25 1 -2 -15 -12 -4 -20 -11 6 -15 -14 4 9 -27 -13 -1 -34 -3 5 -13 3 14 -5
6159eOLlONrpK8mj1kJ8j0oJ1plJ7j3j3J2Qj2Oj0j1J7mj6J4J0k6nK0rrJ2rj4LK5
$$ -5 1 4 1 7 12 3 -4 24 20 9 7 25 15 9 20 13 10 27 14 1 13 21 9 15 5 -6 11 7 -9 5 15 -11 -16 4 -5 -14 -2 -11 -25 -22 3
6200Ck1RJ0rLQj4QRlj2j%pK1J2j7oJ8rJ3Rj5QKj7qK0Pj8K0j1k1J1J4j7K2Ok9l
$$ 3 -18 -9 1 -8 -5 3 -11 -3 6 3 -9 -10 -10 -17 4 16 -1 -7 11 2 15 24 9 17 19 2 -6 14 21 3 23 12 -9 2 16 -1 21 27 -2 -5
6240eJ3Pk9K1nj9K0oj9J0K5k6LLj2mJ8nkMqk7L0J7j2J0rj5J1K0krJ3lj7J8Oj6
$$ -5 8 15 -14 7 2 -17 3 -3 -22 -12 13 -13 -10 -7 -19 -23 -5 -10 -12 -8 -16 -43 -13 4 -8 2 -7 -22 -11 9 7 -2 11 8 -9 9 15 -1
6278aROk3J9J7jj0J0j1lNj4MJ7j1j7J7oJmPj5J3Oj7j5K5rj7J7j1rJ0lj6J5Qj3
$$ -1 8 14 -9 10 27 26 16 26 15 12 17 3 7 24 13 -4 13 7 8 4 11 -4 9 15 -2 -17 8 -1 -18 -1 -12 -21 -11 -14 -30 -15 -7 -20
6316b0nJ4j7J3K2k1qK2j0qJ7Rj6lMqK1J6l0mK1j6J4J2J0k5J3Jk2J9Mj1M%j3kK3
$$ -20 -25 -11 -28 -15 7 -14 -22 0 -10 -18 -1 8 -8 -11 -7 -15 6 22 -8 -12 9 -7 7 19 29 4 17 18 -4 15 19 8 12 12 -1 -3 20
6353B0j5j9J8ooJ6j2JJ7j5j4j5K8rkJ2j3pJ3jj8J3K0k9LNMLJ0j1kL1k2j3K8mj4
$$ 20 5 -14 4 -2 -8 8 -4 -3 14 -1 -15 -30 -2 -11 -13 -1 -14 -21 -8 -9 -27 -14 6 -23 -20 -15 -11 -8 2 -9 -11 20 -2 -15 13 9 -5
6390eK1j6j1K2LpjJ4j0j4K4j7K3Npj4KRj9J3Mj2lKrlK0ol1J6omJ6oj5J0Jj0MJ3
$$ -5 16 0 -11 11 14 7 6 20 10 -4 20 3 26 31 24 10 12 21 2 15 19 7 4 6 -3 -6 14 8 -23 -7 -13 -17 -1 -7 -22 -12 -11 -21 -17 -4
6430dj9rK9j2qK0j1oK0j1JrK4j4POj5NJ7j3j3J9M%POl3J8J1ppjRkK0j9j5J9j0
$$ -4 -23 -32 -3 -15 -23 -3 -14 -20 0 -11 -10 -19 5 -9 -2 4 -11 -6 11 -2 -15 4 8 8 15 21 -12 6 17 10 3 2 11 9 29 10 -5 14 4
6469DJJMKrPk3RK3l0j3K3oJJ4j2j4J5J2l1J8Pk8OK2j7JPj1j1J9PJOopJ0jpJ7%
$$ 4 5 6 10 12 3 10 -13 -4 19 -11 -24 -1 -7 -6 8 -4 -18 -3 9 -22 -4 3 -25 -19 3 -14 -13 -6 -17 -28 -9 -2 -1 5 -1 -8 2 1 -6 11 11
6510A1j8OJ3jrJ7j8nK1Kk3J5nokOjJ3%j7lJ7qj1Qpj3K3Lj7KNlj5K0pj1K0j4lQ
$$ 11 -7 -1 12 11 2 19 1 -4 17 19 -4 11 6 0 -2 4 3 16 16 -1 -4 13 5 -6 2 -5 -18 5 8 -9 -7 -2 -5 -20 0 -7 -18 2 -12 -15 -7
6551glj3OJ3lJ5qrnJ9qJK0j0rJ1Lk2J7jmKJ4j0pNJkLjpOJ3nj6J2qkKj7JK6k4l
$$ -7 -10 -23 -17 -4 -7 8 0 -9 -14 5 -3 -2 18 8 -1 10 13 -9 8 7 3 5 19 9 2 7 8 6 9 8 1 7 20 15 -1 11 3 1 3 -14 -13 13 -11 -14
6595a4J1njMLj8K5J1k1RrKmK0jj1Rj6NqJ4j2J3Jj7QQj3OJ6ok2J3J3pmkj1OJ4j1
$$ -14 -3 -8 -9 -5 -2 -20 5 16 -5 4 -5 -3 -7 13 12 1 10 -6 -1 -9 5 -7 6 7 -10 -2 6 -7 -1 15 9 -13 0 13 6 2 0 -11 -5 9 -2
6636bkoKLK2k0nMjnJ7j3oRjnKJ7j5j1J4okMqKJ2jj2J3kjj3K1rMJ2rj6PRjkPj9
$$ -2 -4 -10 -8 -5 17 -3 -8 -4 -5 -10 7 -6 -12 -3 -4 -9 -7 10 -5 -16 -2 -8 -10 -6 -14 -12 0 -1 -13 0 -2 -3 -16 5 -4 0 12 3 -13 -6 3 2 0 7 -12
6681a2J1LJQmp%QqN%j6j0K0PpLJ3j7jJ6j9RRj5j0PJ1nJ2l4JJ8Pj7J9Rj7nLLJJ6
$$ -12 -1 2 3 11 7 0 0 8 0 5 5 -11 -21 -1 6 -1 2 15 -2 -3 13 -6 3 12 -3 -13 -6 5 0 12 -22 -21 -3 4 -13 6 15 -2 -7 -4 -1 0 16
6724A6kk1J9j0qOJNNnj4NJ1rj1J8oj0PRj2LK0l3J0rJ0RRk3QlMj9J6Nj9J5JoR%
$$ 16 14 -7 12 2 -6 0 1 6 11 6 -8 -3 8 -1 -12 6 0 -10 -3 6 -6 -3 17 -16 -6 -15 -5 4 13 -10 -2 -5 -1 -20 -4 1 -18 -3 -2 -8 1 1
6766Aj0qJ7rnJ2J7l5K3J2j7J0J8k0J5jrLllj2L1j5j0mJ3nPNj7oK3k0NQNk4J3%
$$ 1 -9 -17 0 -9 -14 -2 15 -20 3 15 -2 8 26 6 21 20 11 14 11 8 -4 27 12 2 -2 11 6 13 18 1 -5 18 -2 3 11 16 -8 5 5
6805Ek0K7j4j1KJ3j3KPonJ1j4j1J9Nn%Qj5QNj3MKLkJ8nj3J8Pj2J1kj3OK1j9kJ3
$$ 5 -15 12 -2 -13 -11 2 -11 -9 -2 -8 -13 -2 -16 -27 -8 -3 -8 -8 0 -15 -7 -2 -15 -11 -9 -6 -8 10 5 -8 10 17 5 16 14 1 7 28 9 7 20
6846B0j6KJ4%k3K2Ll3J6Oj9J7Oj1j4K4j7rJ2nKKkj1KK4l9K0pJ1pJ0j0ROj3mQJ4
$$ 20 4 6 20 20 -3 19 22 -11 5 11 -8 9 15 4 -10 14 -3 -12 0 -5 -3 -1 -3 -14 -12 12 -27 -7 -14 -3 -10 0 -10 -1 5 -8 -12 -4 10
6885A0j0Nj0OQNj4kL3k2j6K5kqK0k0MPJo%jj1J4%pPJ3j0k0lJ1j7MK2j3l%Kj0%
$$ 10 0 5 -5 1 9 14 0 -2 31 9 -7 18 16 8 28 8 12 19 20 14 14 13 2 16 16 9 16 29 19 -1 -4 7 -10 -6 16 3 0 0 2 -8 -8
6926hLkOj6JJ4j2j3J3J5j7LKj1MK5j8j4K0PrK0j5lJ9oqJ0LOj1J4pj5K0qNknj4
$$ -8 -5 -7 -1 -17 -16 -2 -14 -27 -14 1 -16 -13 -11 -22 -18 7 -11 -25 -5 2 -7 13 -2 -5 14 8 0 10 13 19 8 22 15 0 20 12 17 15 10 -4
6966dJ5Rj2KNk0JJ3mpJ5pj7PL%%J1j2nRj1JKnmJ8rj8J8J0k3RK3j4j4J5jJK0j4
$$ -4 11 20 8 10 15 -5 -4 9 5 -2 13 6 -11 -4 -1 -1 -1 10 -2 -7 2 -9 -8 -6 -11 -15 3 -6 -24 -6 4 -19 -10 13 -1 -15 0 -1 0 20 6
7007FpJ0rRQJ3l2J8J1l4K5J3k5%Lj2J2J8k2j4J7kpO%j3QMj0KLmnK1j5pQmj7L1
$$ 6 -1 9 0 9 17 30 -2 16 27 -7 18 31 6 6 9 -3 9 27 5 -9 8 6 -1 5 5 -8 0 4 -6 -4 -1 -5 -10 11 -4 -11 -3 -7 -24 7
7047Glk2KJ0j3mJ0MjJ6nj9PJ8j7NKpJ0J7rj8J1KLJ0j4lJ8NpNjj9J7lj2lK2j2q
$$ 7 4 -18 -16 -6 -19 -23 -13 -9 -10 6 1 -18 -11 7 -10 -5 -3 -10 0 17 8 -10 1 3 6 16 2 -1 17 22 15 20 19 0 17 14 2 -1 21 9 1
7088AMQj9LJ3k7OJ2j3Qkmj3K9j4j5K2rj3RJ6k0PJ1rKRj2KJ0k2J9OJ2k5J2Mj2J1
$$ 1 5 13 -6 -3 10 -17 -11 1 -12 -4 -6 -10 -23 6 -8 -23 -1 -10 -23 -14 2 -18 -11 0 -9 -7 2 -10 -8 2 -20 -1 5 17 -8 4 8 -4 7
7127GMk4J0J1nLNNk1J5MmkNj3J0Rk5J5Pj3nJ0%j3Njj1kMJPRk7%K4k0J4j2jlNR
$$ 7 11 -13 -3 8 3 6 11 16 -5 10 14 10 8 13 0 10 19 -6 9 16 3 -2 8 8 -5 0 -1 -12 -14 -10 -9 -2 7 -20 -20 4 -16 -2 -14 -15 -18 -13 -4
7170dmJ5k0OJ1Joj7J4JJJ8j3j2jJ1Rk%j4J9okLOlj2KkNJjj8J4Oj6ONj1mJ5Kj7
$$ -4 -8 7 -13 -7 4 5 -1 -18 -4 -3 -2 16 3 -9 -10 1 10 8 8 -6 13 7 5 8 14 11 -1 1 -1 4 5 4 -14 0 6 -10 -4 1 -10 -14 1 3 -14
7213a4K0oqQRk5J6j2NLJj2J2NrrKJ2pJ4j3mJ4oNlQj1LJ1pkJ6j1qJ3kk5J9Jj1J2
$$ -14 6 0 -8 0 9 -16 0 -12 -7 -4 -3 -15 -3 2 -7 -16 -14 -2 -9 5 -8 -12 2 -4 1 -2 6 -5 -2 9 2 0 16 5 -3 10 8 -17 2 3 -8 4
7255DLj3LOrML2k3k0K5j0q%jkMOj6J2KnMjOj3J2klJ0mk1MK9l1J1J4k0Pjp%J6J
$$ 4 7 -6 -3 3 -6 -2 30 7 -13 12 2 -6 -6 -7 -9 -5 1 -15 -3 -1 -6 -2 -3 3 -10 2 0 -3 7 3 -18 -14 15 -16 -5 9 -11 -4 -5 -12 -12 4 5
7298Ej0kNMOJ0k9J6Rk3QMqPMkj1RmloJ6k2J2Lj3KJ9j2mOrKRQoQJj5jJ1qoPklJ6
$$ 5 -5 -7 -2 2 8 18 -11 5 14 -9 -1 3 -5 2 6 4 -7 2 -2 -5 -11 5 -17 -5 -2 -15 -13 6 -6 -10 -4 -13 -11 -2 6 0 8 9 -6 -7 4 -4 -10 -3 -5 -8 8
7345Hj3%KjLLLlMjplJ1Jj2JRn%Mj7J0J2jnjqoMOOkj2mjJ9JMk3kJ5LpKJ7j3j6J7
$$ 8 -5 -5 -3 -4 -1 2 5 2 6 5 -2 -5 6 7 -5 -4 5 0 0 4 -13 -3 9 8 3 2 -6 -12 -8 -2 4 2 -10 -14 -15 4 5 9 -14 -16 -1 2 -5 -3 14 1 -15 2
7393BJk1K2Rj6oJ7kj5K0j6jJ4qJNmj4J2J1j4%%lJ6lk0nK0j2nJ4mj4K5rj5J0J1
$$ 2 3 -18 4 13 -3 -9 8 6 -9 11 -5 -6 8 0 1 6 2 -12 0 11 -3 -3 -3 -6 10 7 -13 -18 2 -10 -15 -1 -5 -19 6 -3 -18 -8 3
7432Ck1KJ3%j0J3jj7K1mj5J1J4qmOrRJ1k6jJ8JqjJ6k1L3rj4MPqkJ0nkKj0j9L1
$$ 3 -18 -16 -3 -3 -13 0 -1 -18 3 -1 -16 -5 9 1 -3 3 -6 3 14 -12 -13 5 6 -2 -3 13 -8 25 16 2 6 13 5 3 13 8 6 8 -2 -21 10
7473A0j0mR%j9QPj5J7oMrPkj0PJj4J1J4l1J3Oj6K7qr%J7k2LK9Jk4J8Lj6J6jj3
$$ 10 0 -4 5 5 -14 -6 1 -14 3 -3 1 -8 -1 -3 -13 -6 -5 -19 -8 6 -25 -12 -6 -22 5 -3 -12 -12 5 -17 -14 15 16 -8 10 13 -3 13 12 -1
7513a%J4KqkoROjj1JJ5j3mK1k5J5jj9LJJkJ3oj5OmKm%o%RMj5J1%oMJ0j8J7Lrp
$$ -1 -1 13 15 7 5 -1 8 14 13 2 3 18 5 1 22 -3 12 11 -8 -5 -4 -3 -5 8 2 -13 -7 -11 -9 -13 -13 -19 -19 -10 -6 -21 -10 -10 -16 -12 -2 -20 -3 0 -9 -16
7559a6J5j4K5kj4KK1o%nJ%POj4nJ0j0JJ2j1JjPKmj3LMRopllRRk4j0K1Kj5J2kl
$$ -16 -1 -15 10 8 -6 -4 17 11 11 6 7 7 14 20 6 1 11 1 2 14 3 4 3 10 12 8 -5 -2 2 11 5 -2 -5 -8 1 10 -14 -24 -3 -1 -16 -4 -6 -9
7603iqkoLJ8lpKkmK1j4rK1qj4J6KmKJ4poJ5j7qK6mj1J3Nj0KMj0NjqJ3Nj2oJ0l
$$ -9 -17 -19 -25 -22 -4 -7 -14 -12 -14 -18 3 -11 -20 1 -7 -21 -5 -3 -7 -5 9 2 -4 11 -6 -14 12 8 -3 10 15 5 7 11 1 6 5 -3 10 15 3 -3 7 4
7647DlNKrnJ9j5qK4k6KRqj3J2J0k1NJ1j4PQj0%RnmJ0j0lK2j1KQmjnJ3%Ljj7J5
$$ 4 1 6 8 -1 -6 13 -2 -10 14 -12 -10 -1 -9 -22 -10 0 -21 -16 -5 -19 -12 -4 -14 -14 -5 -10 -14 -4 -14 -17 5 -6 -4 4 0 -1 -6 7 7 10 9 -8 7
7690GJ4oj8J3ppK4okJ2j6j0K1Moj4Rnj5J5j0jKLrPj2j0J9%plJ1Mj1PolQj3mNK1
$$ 7 21 15 -3 10 3 -4 20 14 12 24 8 -2 19 23 17 3 12 7 -8 7 -3 -4 -2 1 -8 -1 -13 -23 -4 -4 -11 -14 -3 1 -10 -3 -9 -12 -4 -17 -21 -16 5
7733Eqj0J1JnRPj9J4%jJQln%j3J8Oj7OJ5j1j1PLpJ0rpJ6mKj9K1poMrmJ1Lmlj1
$$ 5 -3 -13 -2 -1 -6 3 10 -9 5 5 4 5 13 10 5 5 -8 10 16 -1 5 20 9 -2 5 8 1 11 2 -5 11 7 9 -10 11 4 -2 2 -7 -11 0 3 -1 -4 -15
7778a5j1J8LqJ5jnrJ5j1MmLj2J5QmmPk5J6J0j2J6pj1J3J1knLlLJ0rj2NK3j7j2
$$ -15 -26 -8 -5 -13 2 1 -4 -13 2 -9 -5 -9 -6 -18 -3 5 1 -3 4 -21 -5 5 -7 9 2 -9 4 15 13 8 11 8 11 21 12 0 5 28 11 -1
7818aPqlJ1jj3J6kk6J1Qj0PRk5mJ9MrJ5oqOj6J6RNl6KK0j2OJ7kj9KkPOJ1k5J1
$$ -1 6 -2 -5 6 5 -8 8 6 -20 -9 -1 -11 -4 5 -20 -24 -5 -1 -10 5 -1 -9 -3 -19 -3 6 11 -25 -23 -3 -15 -9 8 6 -13 -11 -13 -6 0 11 -14 -3
7860crK1pJ1knPj3qJ7lpPQj7%J8k3J1KKrj%lNOk1J1RrjJ1j1kjOqJ8k0pJ8mLOn
$$ -3 -12 9 2 13 11 6 13 0 -8 9 6 -1 6 14 -3 -3 15 -8 3 5 7 -2 -3 -3 -6 -1 5 -16 -5 4 -5 -6 5 -6 -8 -9 -3 -11 7 -13 -20 -2 -6 -3 3 -2
7906bj9LJ3rjK2j7RknmK2j3j1K1j3KoPpRJ8k3j5PLJ0JLj6MKpJ5J2j4Llj4LJ8j5
$$ -2 -21 -18 -5 -14 -15 7 -10 -1 -3 -8 -12 10 -3 -14 7 -6 -4 -10 -3 -10 -1 17 -6 -21 -14 -11 -1 0 3 -13 -9 -7 -14 1 13 -1 2 -1 -15 -12 6 -9
7948imRpjjK0j1k%pJ2J1Mk4J5k1NJ0J3qPNk3OOmj0J7j7nJ8j4J1OPj6LmnJ6jk1
$$ -9 -13 -4 -11 -12 -13 7 -4 -6 -6 -13 -1 10 14 -10 5 -16 -11 -1 12 4 11 16 -7 -1 5 1 -9 8 -9 -14 4 -10 1 7 14 -2 1 -3 -8 8 7 -14
7990a4J0JklPPmojjMJ4j8knJ2Rj1N%JpRj6J3lOLj2%Rj0lJ7j4Kj1lK3Nj8OMqjO
$$ -14 -4 -3 -5 -8 -1 6 2 -4 -5 -6 -2 12 -6 -8 -13 -1 8 -3 2 2 3 -4 5 -11 2 -1 5 8 -4 -4 5 -5 -8 9 -5 -3 -14 -17 6 11 -7 -1 3 -5 -6 0
8036@J1k2MJ2j5MJ0kJMj3MjjnPkRj4J4roK6j9PjjrNKRokmjPl%J7j6PmjR%rrQL
$$ 0 11 -11 -7 5 -10 -6 4 2 3 7 -6 -2 -3 -4 -9 -2 -4 5 -9 5 -4 -10 16 -3 4 3 2 -7 -2 0 9 3 1 -3 -4 3 0 0 17 1 8 4 3 12 12 3 -6 2 5
8085EOj1Rj4MJ5k1LLKppJ4pPKp%Mkj3J6Qj0%j8PKK0l2J5LmNl%QJ2k2J0Qk1mK3
$$ 5 11 0 9 -5 -1 14 -7 -4 -1 1 -6 -13 1 -6 1 3 -4 -4 0 -2 -15 1 9 -1 -1 -19 -12 -10 10 -22 -7 -4 -8 -3 -6 -6 2 14 -8 2 10 -11 -15 8
8129Hqj0POkpJ3kKj1J0Roj6J9Qj4j1KMj7J4QqKpNj8J3KKKlmmPnmJ3Mj3N%MOLj9
$$ 8 0 -10 -3 3 1 -6 7 5 7 -4 6 15 9 -7 12 20 6 -5 -3 1 -16 -2 6 -2 0 -7 -2 -20 -7 -5 -3 -1 -4 -8 -12 -5 -10 -14 -1 3 -10 -5 -5 -1 5 8 -11
8176a1J7Kj2oK1k2J3PqPQlj0J2K
$$ -11 6 8 -4 -10 11 -11 2 9 1 8 16 13 3 15 17
8191A7
$$ Imaginary data points
##PAGE= N=2
##DATA TABLE= (X++(I..I)), XYDATA
0@%%%%%%%%%%%%%%%%%Qj6J6j6J6j6J6k2L0l2L2m0M8m8N6o4P2q0Q8r9J08j21J36
$$ 0 0 0 0 0 0 0 0 0 0 0 0 0 0 0 0 0 0 8 -8 8 -8 8 -8 8 -14 16 -16 16 -24 24 -24 32 -32 40 -40 48 -51 57 -64 72
40G2j50J64j83K02k21K46k75L04l40L81m29M87n53O39p49Q97j106J425j989L264
$$ 72 -78 86 -97 105 -116 130 -145 159 -181 200 -229 258 -295 344 -405 492 -614 811 -1178 2086
60B086j1198N75K1876m525j4359q753Q232Q928K67o372J752O230O86o686k133
$$ 2086 -9112 -8537 13339 8814 -5545 -14298 -6066 2862 3129 -3243 -1491 4739 5425 -1261 -3394
75c394N151O346j184n720j565M195n10n547L50Q285K484r399j0892J957J2677
$$ -3394 1757 8103 6919 1199 -366 3829 3319 -2228 -1878 6407 8891 -508 -11400 -9443 3234
90C234O127r527j0504L680J0193J96r376m278R159J1645k629j4168n156J0791
$$ 3234 9361 -166 -10670 -6990 3203 3399 -5977 -10255 -1096 10549 7920 -6248 -11404 -613
104f13J1105j462q449l716L315K868j631j09M175l7q085n774M665Q504J045q044
$$ -613 10492 9030 581 -3135 180 3048 1417 1308 5483 5446 -2639 -8413 -3748 4756 5801 -2243
120b243o420M252P217k988q559J253J0983N083q508j1050K097J3463O482p992
$$ -2243 -8663 -4411 2806 -182 -8741 -7488 3495 8578 70 -10980 -8883 4580 11062 3070
134C070q325L021P408P50n177k085M877L808n045o983K187P287P98o125l881K555
$$ 3070 -5255 -2234 5174 5924 747 -1338 3539 7347 2302 -4681 -2494 4793 5591 -534 -4415 -1860
150a860L245k926m882L246Q313n01j0347n464P267J0403K71r463n092P086Q047
$$ -1860 1385 -1541 -6423 -3177 5136 4635 -5712 -11176 -3909 6494 6765 -2698 -7790 -704 7343
165G343l113p968m7P354L852n096o705J663P023O04o228k454L700J871l550l183
$$ 7343 4230 -3738 -3785 3569 7421 2325 -4380 -2717 4306 4910 -1318 -3772 -72 1799 -1751 -4934
181d934L008N813j037q373l431P283P178k496o821o47O377L645n333n709M699
$$ -4934 -1926 3887 2850 -5523 -8954 -1671 5507 3011 -3810 -4457 1920 5565 232 -5477 -778
196g78R040m73r184m562N905Q013j116q674l554N726M416l453m465J220L486p67
$$ -778 8262 7789 -1395 -5957 -52 7961 6845 -1829 -5383 343 4759 1306 -3159 -1939 1547 780
212G80m699j385N107L864m177n105K688O040j09o032k743N911P248k490q877j496
$$ 780 -3919 -5304 -197 3667 -510 -5615 -2927 3113 3004 -3028 -5771 140 7388 4898 -3979 -5475
228e475P809M827m622o598Q38O781K097o547n145M163N980j772o366j793M748
$$ -5475 2334 7161 2539 -4059 -3221 3560 5657 -890 -6035 -1872 4108 2336 -4030 -5823 -1075
243a075M392k409n047P60M690J02l991n6M957K921l567n340J386P062J885o258
$$ -1075 3317 908 -4139 -3379 1311 1413 -2578 -2634 2323 5244 1677 -3663 -2277 4785 6670 412
259D12m118M337N568j624o818k580N528N133m011p298M48O515K291m915m844J879
$$ 412 -3706 631 6199 4575 -2243 -4823 705 5838 1827 -5471 -5023 1492 3783 -1132 -5976 -4097
275d097N511L45m944j068M915K680l514l616J993N033R80m569k541M463M174l234
$$ -4097 1414 1759 -3185 -4253 662 3342 -172 -3788 -1795 3238 4218 -351 -2892 1571 5745 2511
291B511n585N35N544K275m781n313K320O155m69o656k508M692M406k084n274m03
$$ 2511 -3074 -2539 3005 5280 499 -4814 -2494 3661 3192 -3464 -5972 -1280 3126 1042 -4232 -4635
307d635N495K871m325l917K956N061J36l919j602L674L209k895m509J895N333
$$ -4635 860 3731 -594 -4511 -1555 3506 3642 -277 -1879 1795 5004 2109 -2400 -505 4828
322D828P9n223l012L127M279j609o015j379N170K989l884m449J151M495J033m317
$$ 4828 4907 -316 -3328 -201 4078 2469 -3546 -4925 245 3234 -650 -5099 -3948 547 1580 -2737
338b737k789L948M906j793m787J91M660K307k985l521K096N068o5n038j796L838
$$ -2737 -5526 -1578 3328 1535 -3252 -3061 1599 3906 921 -2600 -504 4564 4499 -539 -2335 1503
354A503K793k536m274K47M635J520m927l964K969M532j113m721j206M130L654
$$ 1503 4296 1760 -2514 -2267 2368 3888 -1039 -5003 -2034 2498 1385 -3336 -4542 -412 3242
369C242k614m716J016N139J176l703k042K939L802r06m545r13M563K389l626l641
$$ 3242 628 -4088 -3072 2067 3243 -460 -2502 437 4239 3333 -1212 -2125 2438 4827 1201 -2440
385b440J823L940r9m643k820L184L877k156m634K34M048J446l333l233J798M692
$$ -2440 -617 3323 3224 -1419 -4239 -1055 2822 666 -3968 -3734 314 1760 -1573 -4806 -3008 1684
401A684L51m343j295M101L059k227l674M87M390J933l505l134K576L657j325m087
$$ 1684 2035 -2308 -3603 498 3557 1330 -2344 -1857 2533 4466 961 -2173 403 4060 2735 -1352
417a352r30L281K537k439m139P74M210K54m310k067K959L578q69m082q35M134
$$ -1352 -2282 999 3536 1097 -3042 -2268 1942 2196 -2114 -4181 -1222 2356 1487 -2595 -3430 704
433G04K400l144l093K052L976L23l438k031K812L291j924m219L83M092J256l337
$$ 704 3104 -40 -3133 -1081 2895 3218 -220 -2251 561 3852 1928 -2291 -1908 2184 3440 103
449A03l189J344L664k01m286j400L682K619k333l343M78L535J372l101k480K848
$$ 103 -3086 -1742 1922 1721 -2565 -3965 -283 2336 3 -3340 -2862 673 2045 -1056 -3536 -688
465f88L951j004l848o18L311K421j982l461Q69M090M86l842k066K367K598j125
$$ -688 3263 2259 -1589 -2207 1104 3525 1543 -1918 -1049 3041 3527 -315 -2381 -14 2584 1459
481A459l369n60L437J893l181l217J645L458N2l035j460K718L107j591l829L29
$$ 1459 -1910 -2470 967 2860 -321 -3538 -1893 1565 1617 -1418 -2878 -160 2947 1356 -2473 -2144
497b144L821J230k704k193J598L170k82l850j430L228K366k252l110N47L101R37
$$ -2144 1677 2907 203 -1990 -392 2778 2496 -1354 -2784 444 2810 558 -2552 -2005 1096 2033
513B033l100k691K032L434p35l181j75K901J613k069k753J145L926O72l419j595
$$ 2033 -1067 -3758 -1726 1708 973 -2208 -2383 518 2131 62 -2691 -1546 2380 3052 -367 -1962
529a962K705K556j303l240m43L285J927k780l088J432L062l47l168j557K126K685
$$ -1962 743 3299 1996 -1244 -1687 1598 3525 745 -2343 -911 2151 1804 -1364 -2921 -795 1890
545A890j069l174R9L131P39k708j743J884L121O4l075j258K778K012k002k345
$$ 1890 821 -2353 -2254 877 1616 -1092 -2835 -951 2170 2234 -841 -2099 679 2691 689 -1656
561a656J157K754K91k934k125K121L101j240l878o52L019K056j678l001O0K982
$$ -1656 -499 2255 2546 -388 -2513 -392 2709 1469 -2409 -3061 -42 2014 336 -2665 -2605 377
577C77Q51k722j394K421K424q08k296l52K256J479j675j683J813K510r13k939
$$ 377 1228 -1494 -2888 -467 1957 1149 -1147 -1499 757 2236 561 -1122 691 3201 2288 -651
593f51p15K437K129j674l385J81L340O82l165k066J753K621n84l351j187L242
$$ -651 -1366 1071 3200 1526 -1859 -1678 1662 2344 -821 -2887 -1134 1487 903 -2448 -3635 -393
609c93K965j686l382l04K508J834p96j510P04J791o93k165M36K530O18k119j809
$$ -393 2572 886 -2496 -2800 -292 1542 746 -764 -60 1731 1038 -1127 -691 1839 2457 338 -1471
626a471J107K403l13l119j022K642J719k067k794L89L233J713k753l393J100L814
$$ -1471 -364 2039 1726 -1393 -2415 227 1946 -121 -2915 -2526 707 2420 -333 -3726 -2626 1188
642A188Q97k373j448J541K200m81k429k28K618J368j557j450M88R26k80j172o1
$$ 1188 2085 -288 -1736 -195 2005 1524 -905 -1133 1485 2853 1296 -154 334 1260 980 -192 -253
659b53J625L35k617j892J973K888n51l491j934K258L397n10l328n32K809J501
$$ -253 1372 1707 -910 -2802 -829 2059 1508 -1983 -3917 -1659 1738 1228 -2100 -2632 177 1678
675A678j840k224P48L177J481k278k406Q72K108J37j181k87Q74K93j477j177J551
$$ 1678 -162 -2386 -1638 1539 3020 742 -1664 -792 1316 1453 272 -15 859 1152 -325 -1502 49
692D9J949j316k805r2K432J392j496k257N24K753M41k838j510K380L141j19l078
$$ 49 1998 682 -2123 -2215 217 1609 113 -2144 -1620 1133 1574 -1264 -2774 -394 2747 2628 -450
709d50j966J926K930l52k297k58J506L96j188r42O73J163o31j752J51J750O1j890
$$ -450 -2416 -490 2440 2088 -209 -467 1039 1435 247 -695 -22 1141 510 -1242 -1091 659 720 -1170
727a170q87J381J787o03k748p45L117K663j679l285l37K671K019j116k196M82
$$ -1170 -2057 -676 1111 508 -2240 -2985 132 2795 1116 -2169 -2506 165 2184 1068 -1128 -646
743f46K327M1k287r72J533J742k15j872r88J129R73q34o16Q70L72j217j090R94
$$ -646 1681 1722 -565 -1537 -4 1738 1523 -349 -1337 -208 765 -69 -685 185 557 -660 -1750 -756
761g56K378N67k779k318J822L363J42k683j484J661K465m32k986r85K508K009
$$ -756 1622 2189 -590 -2908 -1086 2277 2419 -264 -1748 -87 2378 1946 -1040 -2025 483 2492
777B492j211k308m57J505J015j144j397P58J306o13j290K70J117K26r03o43R63
$$ 2492 1281 -1027 -1484 21 1036 -108 -1505 -747 559 -54 -1344 -1074 43 269 -634 -1277 -314
794c14J274p61j518P94K293K49k391j966J296L467J035l137k829J234K791L17
$$ -314 960 199 -1319 -525 1768 2017 -374 -2340 -1044 2423 3458 321 -2508 -1274 1517 1834
810A834k048j373J091J729n93k014p3J702O12j033q60L80J071K78q11j00J086
$$ 1834 -214 -1587 -496 1233 640 -1374 -1447 255 867 -166 -1026 -646 425 703 -108 -208 878
827H78L5j455l17J747J417q89k292o41K143J603j770k410O53K491N48k256k290
$$ 878 913 -542 -859 888 2305 1416 -876 -1517 626 2229 459 -1951 -1298 1193 1741 -515 -2805
844b805O99K783P86k212j598J084J649Q0j076m25J017P59q38o23J274J160p95
$$ -2805 -2106 677 1463 -749 -2347 -1263 386 466 -610 -1035 -18 741 -97 -720 554 1714 919
861I19j259J52J166M62j083j026J113J623r23k555o62K006J950p10k644r71K081
$$ 919 -340 -188 978 1440 357 -669 444 2067 1144 -1411 -2073 -67 1883 1173 -1471 -2442 -361
878c61J723j201j753L74J535N30r89q26R18J413m41j411Q4J168L95o10n04M68
$$ -361 1362 161 -1592 -1218 317 847 -142 -968 -50 1363 922 -489 -405 763 1158 548 44 512
896E12O95p96j745J85K159O69j971j908N53K120O26k042j727J295K222q6j736
$$ 512 1207 411 -1334 -1149 1010 1679 -292 -2200 -1647 473 1099 -943 -2670 -1375 847 761 -975
913i75o78J096J430j31j311q4J471N47r22l69P62M62o89r96L39J573K46j899j200
$$ -975 -1653 -557 873 742 -569 -653 818 1365 443 74 836 1298 609 -387 -48 1525 1771 -128 -1328
932a328J186J297o75j683m01J596J421j243k313J86K355J031j423j689L41K068
$$ -1328 -142 1155 480 -1203 -1604 -8 1413 170 -2143 -1957 398 1429 6 -1683 -1342 726
948G26R72j320j256O34R21j45l40K80M23k35j023m70J092Q93j094j454M20J462
$$ 726 1698 378 -878 -244 677 532 192 472 895 660 -363 -833 259 1152 58 -1396 -976 486
966D86L30j442j420P77K061K1k068o90J816J646n97j907o09J786J726p28j574
$$ 486 816 -626 -2046 -1269 792 813 -1255 -1945 -129 1517 920 -987 -1596 190 1916 1188 -386
983c86J19J201L60p18p18K97P72k61r63K42R54m24j397k89J130R63o84j635q5
$$ -386 -267 934 1294 576 -142 155 927 666 -297 -55 899 475 -922 -1211 -81 882 198 -1437 -1522
1002a522J887Q74j571j511P35J851O30j358j313R00J749l10j697l39J303R86n15
$$ -1522 365 1239 -332 -1843 -1108 743 1373 15 -1298 -398 1351 1041 -656 -995 308 1294 779
1019G79j290k77J048L36j042m42Q35M74o26p54K39J058K92j310q96J295J604l91
$$ 779 -511 -788 260 596 -446 -888 -53 421 -205 -959 -720 338 630 -680 -1576 -281 1323 932
1037I32j478l34J182J121o59j500K49J802M66j442j114N39J170J33j282p65R88
$$ 932 -546 -880 302 1423 764 -736 -487 1315 1781 339 -775 -236 934 1067 -215 -980 8
1054HR26q22j104K81Q19K0q30m70R47J144o68j422J91J450M66r49q72N94J486
$$ 8 934 112 -992 -711 108 128 -702 -1172 -225 919 251 -1171 -980 470 936 -13 -885 -291 1195
1073A195J17j668q13J256J090o36j205j08J093O44j058j302N51J301j35j061k24
$$ 1195 1312 -356 -1169 87 1177 541 -664 -772 321 965 -93 -1395 -844 457 322 -739 -963
1090i63Q49P35m78j096J86J418L16j111l80J025R00m47j277l26J396R97j051j315
$$ -963 -114 621 143 -953 -767 651 967 -144 -524 501 1401 954 -323 -649 747 1744 693 -622
1108f22M29J127j2j151q95O18J187l00j418j43J157L77q96q10L94J198L39j058
$$ -622 -193 934 922 -229 -1124 -506 681 381 -1037 -1180 -23 354 -542 -1352 -958 240 579 -479
1126d79m94J097P86p33q84L71J163N03r64j043O89J256m47j435k29J084P63o59
$$ -479 -973 124 910 177 -707 -336 827 1330 366 -677 12 1268 821 -614 -843 241 1004 345
1144C45j320o7J283L24j298o78R31J035j95r91l38J041Q62p67r59P33J288J0r99
$$ 345 -975 -1042 241 565 -733 -1411 -480 555 360 -631 -969 72 934 167 -792 -59 1229 1239 240
1163B40n58O80R71m13j308M5J301K63j176r33L42R28M0j251o49J090R55p76j151
$$ 240 -318 362 1333 920 -388 -343 958 1221 45 -888 -546 382 422 -829 -1478 -388 567 -209 -1360
1182a360J40J015N00p02p63P37J347k01j263r5J066O68m66q72J55J203K60j327
$$ -1360 -1220 -205 295 -407 -1170 -433 914 713 -550 -645 421 1089 623 -249 -94 1109 1369 42
1200D2p88Q19Q67m32j011k60R25O41r90j220N42J260m4r92l59Q14R76l41j236
$$ 42 -746 73 940 508 -503 -763 162 803 -187 -1407 -865 395 351 -641 -1000 -186 790 449 -787
1219g87k1J405N93q95o53N34R36j7j146o12J033R12q18j108K40Q83O3j001q71
$$ -787 -808 597 1190 295 -358 176 1112 1095 -51 -663 370 1282 464 -644 -404 479 542 -459 -1330
1238a330N77J195k40j296j35J053N06o92q30K85J320M76j100o58J017R65m77r78
$$ -1330 -753 442 202 -1094 -1229 -176 330 -362 -1192 -907 413 889 -211 -869 148 1113 636 -342
1256c42m8J013P56p27j106L44J034k07j065l17P24P11m11j165j06J186L18j138
$$ -342 -390 623 1379 652 -454 -110 924 717 -348 -665 59 770 359 -806 -912 274 592 -546
1274e46o54Q24J072o9j085n23J014R97o61j038L71J113K14q09p54M00R84k04j214
$$ -546 -1200 -376 696 627 -458 -981 33 1030 369 -669 -298 815 1029 220 -534 -134 850 646 -568
1293e68j51J099M18q54r26J67R56K23j067n13J052Q45p01r93J84J054N83p65r53
$$ -568 -719 380 798 -56 -982 -815 141 364 -703 -1216 -164 681 -20 -1013 -829 225 808 43 -910
1312i10O62J420p4j288m88Q39R05k31j045k24J041M01j029p20N91O64k72p82j97
$$ -910 -248 1172 1098 -190 -678 161 1066 835 -210 -434 607 1008 -21 -741 -150 514 242 -540 -737
1331g37Q73O18q86j072N19J213J06q79n08O57J019k76j309r6J359N71r44r14L30
$$ -737 136 754 -132 -1204 -685 528 634 -245 -753 -96 923 647 -662 -758 601 1172 228 -686 -356
1350c56J059K35j185q85P59J021l71r21r0O04L32n25p27M82J058j43j024oJ010
$$ -356 703 938 -247 -1132 -373 648 277 -644 -734 -130 202 -323 -1050 -568 490 347 -677 -683 327
1369C27M99o61q73L34J379L86j269p85Q89R58l54j071l68Q81Q55o90j264J98J058
$$ 327 826 165 -708 -374 1005 1391 122 -663 226 1184 830 -241 -609 272 1127 437 -827 -629 429
1388D29O4r75o00N65R98p1j120k41J000M22p33m09O22P94o3r09m09R51Q28p52
$$ 429 493 -482 -1082 -517 481 410 -710 -951 49 471 -262 -671 -49 745 682 -227 -636 315 1143 391
1408C91j033L15J043K63r46j014M10J239j21j391l80J071P24n34r89j01R55N52
$$ 391 -642 -327 716 979 33 -981 -571 668 547 -844 -1224 -153 571 37 -952 -1053 -98 454
1426D54p10n31P65P77l19p49m9Q23O98n55r49M09J147j14j140m38O95P03m32j129
$$ 454 -256 -787 -22 755 436 -313 -362 461 1159 604 -345 64 1211 1097 -43 -481 214 917 485 -644
1446f44q0J204K97j233r12N86J053J55r58p30P38J094l15j026O0R05L79m48m30
$$ -644 -724 480 777 -456 -1368 -782 271 426 -532 -1262 -524 570 255 -771 -711 194 573 125 -305
1465c05M34P96l31j111P1J189L74r03q43K57R74K07j207q63Q54J073l92j088k28
$$ -305 129 925 594 -517 -446 743 1117 214 -629 -372 602 809 -398 -1261 -407 666 274 -814 -1042
1484a042Q86P35o28j086L70J418K53j012m81O01P72Jp10k35P20L75o15l73N29
$$ -1042 -156 579 -49 -1135 -765 653 906 -106 -587 14 786 787 77 -158 562 937 322 -51 478
1503D78L51n54r28m9J170P49j146j539L41J447L11j086q94M98J242J16j187m39
$$ 478 829 275 -653 -702 468 1217 71 -1468 -1127 320 631 -455 -1349 -851 391 507 -680 -1119
1521a119J006P80m54p72L4R12O45o16q21L36P01k70n46K36N72k5q12o11O47R74
$$ -1119 -113 667 213 -559 -525 387 1032 416 -405 -69 632 362 -184 52 624 599 -213 -824 -177 797
1541G97m79j303RJ257O74q31j310K1J547R02j105j243N31J327L06q96p70M46R49
$$ 797 318 -985 -976 281 955 124 -1186 -1165 382 1284 179 -1064 -533 794 1100 204 -566 -120 829
1560H29j34q42N1P09lo74l89K77M89j42p25J5Q53L0j111n42Q31J131q3j299p02
$$ 829 695 -147 -96 613 610 -64 -453 -176 313 171 -554 -539 314 344 -767 -1309 -478 653 570 -729 -1431
1581a431J202J347n65j388r1J154Q11n07j029O2J100K93r93n95N67O53q5o07k32
$$ -1431 -229 1118 553 -835 -926 228 1039 532 -497 -435 665 958 -35 -630 -63 590 505 -102 -334
1600c34M69K16p12l93Q13O65n71q99J30J001N57q99j110N74J501J67j212p91O20
$$ -334 135 351 -361 -754 59 724 153 -746 -616 385 942 43 -1067 -493 1008 1175 -37 -828 -208
1619b08J087O2j182n64R20P83o26q40J44O12P2o83n05O21Q03m03q84J32P20J08
$$ -208 879 941 -241 -805 115 898 272 -568 -424 188 260 -423 -928 -307 496 93 -791 -659 61 169
1639A69n66l43O44R89k88j319j89J308Q36p33j121k3J211P08r27j153L94R98j2
$$ 169 -397 -740 -96 893 605 -714 -903 405 1241 508 -613 -636 575 1283 356 -797 -403 595 583
1658E83p87l54M66N81k89q12P9P96Lp28j02P50N79m36r33o3J140N51r02p01O46
$$ 583 -204 -558 -92 489 200 -612 -533 263 266 -462 -564 186 765 329 -604 -667 473 1024 122 -579 67
1679F7Q91k48j099n06R76J095o02j469j72J130O49n95r62j09Q08L30o16k44O81
$$ 67 958 710 -389 -895 81 1176 574 -895 -1067 63 712 117 -845 -954 -146 184 -432 -676 5
1698EL45o04n59L42Q71L18p09n03P14P47n65q79K40J022M18q48j095L37J301J24
$$ 5 350 -254 -813 -471 400 718 9 -494 220 967 402 -477 -237 785 1203 355 -740 -403 898 1022
1718A022j295p23O92R23j38j010m20Q65P13o69q60K94Q50K43m57l58L31M89l61
$$ 1022 -273 -996 -304 619 481 -529 -949 -84 629 -40 -900 -606 244 487 30 -328 3 492 131
1737A31o11M30R67l6r78n13N43Q44j59j087l28R95N51q83q99L18R83K69r98q99
$$ 131 -480 -50 917 881 -97 -610 -67 777 618 -469 -797 198 749 -134 -1033 -715 268 537 -461 -1360
1757a360O48J259Kr74l50N84N53j55n20K18Q73O9r25l29P54N75l64p03l6P62K99
$$ -1360 -712 547 549 -425 -775 -191 362 207 -313 -95 778 847 -78 -407 347 922 558 -145 -181 581 880
1778H80q98p66O36Q68l26j011l52Q17Q46m55j174j4J080L76p24n11M55Q48L9r08
$$ 880 -18 -784 -148 720 394 -617 -969 -152 694 239 -935 -949 131 507 -217 -728 -273 575 614 -294
1798b94m26P92O93m28n84J99N44K1p12m68O54Q17m74j071rQ86L89o14p78J85R68
$$ -294 -720 72 765 337 -247 -48 496 517 -195 -663 -9 808 334 -737 -746 140 529 -85 -863 -678 290
1819B90J53r11l60Q59P00m38q40q9R07O95n26p82L13P57j50p01j59O12N32m42
$$ 290 443 -468 -828 31 731 293 -547 -636 271 966 440 -342 -29 728 578 -123 -282 330 862 420
1839D20r23P7R20J07r07m91N57O90j66q74k91Q90O27p11q39L37R34K57o59n86
$$ 420 -503 -426 494 601 -306 -797 -240 450 284 -590 -881 9 636 -75 -914 -577 357 614 -45 -631
1859f31M41Q16k47q82M0Q86L44o00p05J47P82J25q09l86P55N01n14p29J20P73
$$ -631 -190 626 379 -503 -463 423 767 167 -538 -391 391 516 -293 -679 76 577 63 -666 -546 227
1879B27L59p19p28N63J003j19q68k38O20N83k91p78R7R59K40r00n71M72O57p6
$$ 227 586 -133 -861 -298 705 586 -282 -520 100 683 392 -386 -289 670 910 10 -561 -89 568 492
1899D92p21l12O67N13o54p75L36P60J1o69l93N31P46k75r32OR18L48o11n28L18
$$ 492 -229 -541 126 639 -15 -790 -454 306 317 -352 -745 -214 532 257 -675 -669 249 597 -14 -542 -224
1920b24Q03R1r21m77P74O76m16p17L0O26K87o15o96M41Q68j49q42j35O59M57l92
$$ -224 579 670 -251 -728 46 722 306 -411 -381 245 532 -83 -779 -338 530 381 -461 -596 63 520 128
1941A28p11J14R15K68p82m17O04O08k22p38k00P46N95n90q05K71P29n3p28m00
$$ 128 -583 -469 446 714 -68 -485 119 727 505 -233 -433 313 908 318 -487 -216 513 460 -268 -668
1961f68M69O89k28r01j01P85K78n83m87L32P06J19p26l77P18O27m69o91K04P64
$$ -668 -199 490 262 -639 -740 45 323 -260 -747 -415 291 410 -316 -693 25 652 183 -508 -304 460
1981D60L07n89o60L20Q06j48q09j42O62L77m24p01oP61K28p41m50O11O34k66o74
$$ 460 767 178 -482 -162 644 496 -313 -455 207 584 160 -541 -547 214 442 -299 -749 -138 496 230 -444
2002d44j50O75N47m74o73L79Q40m4p04k94M51N90k19p65m6P88K49p60o08K90O52
$$ -444 -594 81 628 154 -519 -140 700 656 -48 -342 109 699 480 -285 -331 457 706 -54 -662 -372 280
2023B80M9o99m37O01N75m70p09K13O78J96m88m16M18P69j15q35r9P40M69l37n89
$$ 280 329 -370 -807 -206 369 -101 -810 -597 81 277 -211 -627 -209 560 445 -390 -489 251 720 383 -206
2044b06O4O87K18p49n10N50N87l02o47r1N36L53n52p09L13Q15K4o84l02M36N62
$$ -206 -142 545 763 14 -496 54 641 339 -308 -399 137 490 -62 -771 -458 357 381 -303 -605 -169 393
2065C93j33o68q4P93L74o01m33L79N63q6o69k81O30N87m78p35J02N75P5n23m39
$$ 393 260 -408 -492 301 675 74 -359 20 583 497 -172 -453 177 764 286 -449 -347 228 303 -220 -659
2086f59L20O67j03q18j56P26L49m53n28K06P63K65o79m82N58O44k25n53j8N04
$$ -659 -339 328 225 -593 -749 -23 326 -127 -655 -449 314 579 -100 -582 -24 620 395 -158 -176 328
2106C28L64l51n93J66O10p4o56j68N23M15l29p35q8P43K89o40m65M78N72r8o09
$$ 328 692 341 -252 -86 524 450 -206 -374 149 564 235 -500 -588 155 444 -196 -661 -183 389 291 -318
2127c18k84N28O15k93o69J11O64J83m88m54K12O08Jo79j81O23K85n11m73J58N05
$$ -318 -602 -74 541 248 -421 -310 354 537 49 -405 -193 415 416 -263 -444 179 464 -47 -520 -362 143
2148A43Q9n01l00N37M81m27o34J17O84L80m17o59K22Q30R7p30l21M83M89j40n32
$$ 143 232 -269 -569 -32 449 22 -612 -495 189 569 152 -507 -285 545 642 -88 -409 74 563 423 -109
2169a09j01N14K29n60m07L71M56j39m82j67M08M04l88o43J84P11R5n46k92L40
$$ -109 -210 304 533 -27 -434 -63 393 254 -228 -395 13 417 29 -614 -430 281 376 -170 -462 -122
2189a22N22j37p04q6P78L90n30n64J29N46K12m54n09K83N58j24m67m4L54J17l28
$$ -122 400 263 -441 -527 251 641 111 -453 -324 222 434 -20 -529 -246 312 188 -279 -323 31 148 -180
2210a80l10L01O24q6p23r8O41L71l53n20M0O84L55n46n64L04N31r4m67j93M18
$$ -180 -490 -189 435 349 -374 -472 169 540 187 -333 -293 391 746 200 -364 -60 471 377 -90 -283 135
2231A35M28l10p22J1O51J51m62l05J80L51Nm01o3M50J33n09k11M50N38p0o44l74
$$ 135 563 253 -469 -458 193 344 -118 -423 -243 108 113 -288 -351 99 232 -277 -488 -38 500 430 -214 -588
2253e88M94O91k50o75J8N71K01m50n32J26O79J17o07l24L79L31j33l25n6L47K31
$$ -588 -94 597 347 -328 -310 261 462 12 -520 -394 285 402 -205 -529 -150 181 48 -277 -333 14 245
2274B45l26k95L84M81j86m53n8L85L16k31m05K34N65j66p42k17N37N54j29p30
$$ 245 -81 -376 8 489 303 -150 -208 177 493 262 -143 91 656 490 -252 -469 68 622 493 -237
2294b37l56M67M43l22m68J35L91M1l81l00L38N79j57n63l9M15K18j27j17J48K35
$$ -237 -593 -126 317 -5 -473 -338 53 94 -287 -587 -249 330 173 -390 -429 -14 204 77 -40 108 343
2315C43j90n40M8P39L18m61o04l6M56K96l48m13K93M31k63n59jN49L94k71o41
$$ 343 153 -387 -339 400 718 257 -347 -383 73 369 21 -392 -99 332 69 -490 -491 58 452 181 -460
2336d60m5O26L04k79k09J46J47q9k42J3N11K68m84m81J62L68k5l00j26L23K36
$$ -460 -505 121 425 146 -63 83 230 141 -101 -88 423 691 207 -274 -112 256 231 -69 -195 128 364
2357C64m13o53J40P17K07m52m99K5M88K58l09k07L06K16l36k73K56N37K28m37
$$ 364 -49 -702 -562 155 362 -90 -589 -564 -76 182 -127 -334 -28 188 -148 -421 -165 372 600 163
2377A63n55J36M86O7j99M3J54r2l85k54L04O62pp31l90L68M82ll60j95L13K77
$$ 163 -392 -256 230 297 98 141 295 203 -182 -436 -132 530 523 -208 -598 -230 252 249 -111 -306 7 284
2399B84l27l48L29N25l7m27l16J72M13P0l09JK70j32m26j15L31M19k2n64l23L45
$$ 284 -43 -391 -62 463 426 -1 -317 -145 268 338 29 30 300 168 -258 -373 -42 377 355 -209 -532 -187
2421a87L08k47k40K09L09m7m52l00M45O96q4o45k69L24M03J00k05j10J75k3l80
$$ -187 121 -126 -366 -157 152 105 -347 -647 -202 494 410 -235 -504 -180 223 323 118 8 183 160 -220
2442b20m0M73L37k23m35k00K25K90j39j99K24K18k79m24L4M76M09k50o46j00N75
$$ -220 -260 213 550 327 -108 -308 -83 207 68 -131 93 311 32 -392 -358 118 527 277 -369 -469 106
2463A06L01k75k58O7K22kl48j56M40L84k71m78q5K20J65l6j23J01J89k75m11J42
$$ 106 407 132 -126 -59 163 161 -187 -343 97 481 210 -268 -353 -133 32 -4 -127 -26 163 -112 -523 -381
2485c81N35J73k86l52J3L91J74l17j24L42J87k98l52P5M98L49l43o17j3M53J55
$$ -381 154 327 41 -311 -298 93 267 -50 -174 168 355 57 -295 -220 278 627 284 -333 -346 107 262
2506B62j52r4P1K7j78k95J17N15J36m23k91J48K51P2j78r8K39J51l13k88K74M29
$$ 262 110 16 87 114 -64 -359 -242 273 409 -14 -305 -157 94 166 -12 -110 129 280 -33 -321 -47 382
2528C82k4l93l61J47M52M7l82j05K60M2k55k11J16L87J58l52l26K20K74q9j32
$$ 382 358 -35 -396 -249 203 250 -132 -237 23 65 -190 -401 -285 102 260 -92 -418 -198 76 -13 -145
2549a45R9K09P1k48k47K58M62p9m34j18K36K50l8k78p8K77L2l96j59L14L07n7
$$ -145 -46 163 234 -14 -261 -3 459 380 -54 -172 64 314 276 -2 -80 197 229 -167 -326 -12 295 238
2571B38l72k71K03L22p4k45J09K17n6k15q8K18L07o7m07m7L89J32k13k15M8K05
$$ 238 -134 -405 -202 120 46 -199 -90 127 71 -144 -232 -14 293 226 -181 -228 161 293 80 -135 -87 118
2593A18M6k92j70L05K82k38l78rK15K03r1k59P9L18m2l18k8K67K02l9k35l4K94
$$ 118 164 -128 -298 7 289 51 -327 -336 -121 82 -9 -268 -189 129 87 -231 -259 8 210 171 -64 -98 196
2616A96J49k76j51K29J77j20k08o4K27K24k61m04P1L39K3k20j36Q3J90o1l39m3
$$ 196 345 69 -82 147 324 204 -4 -68 159 383 122 -282 -211 128 151 -69 -205 -122 68 7 -332 -375
2638c75L95J55k33j82P7K11R7j80j78K20K54j53k35Q5K09L9j80k49Q9L48j4l44
$$ -375 20 175 -58 -240 -163 48 145 -35 -213 7 261 108 -127 -42 167 206 26 -223 -134 214 200 -144
2660a44o5K11R8j50k02J3L03J66k73k40J91K41n7j65l3J87K15j03l04Q9K90l0
$$ -144 -209 2 100 -50 -252 -239 64 230 -43 -283 -92 149 92 -73 -106 81 296 193 -111 -22 268 238
2682B38k36o8J41J69k3k89j08K50Q1k32j46J25J71L7k38k00J60K70j23k50J17
$$ 238 2 -66 75 244 221 -68 -176 74 155 -77 -223 -98 73 110 -128 -328 -168 102 -21 -271 -154
2703a54K27M8j54j86O6K93L8k81n0K54J13j29j67k1J53J58j96j97K00K21j48k29
$$ -154 73 121 -33 -219 -153 140 178 -103 -153 101 214 85 -82 -103 50 208 12 -185 15 236 88 -141
2725a41l6J53J99q1k55O4K74qk54m9J34J58Nj93p3K42J30k62j82J21J79L5j59
$$ -141 -177 -24 175 94 -161 -97 177 169 -85 -134 0 158 163 -30 -103 139 269 7 -175 -54 125 160 1
2748Aj79J28K14j24k98O0K17M1j17j02L0J72K2k73n1K86J39j38j50PJ66J47j92
$$ 1 -178 -50 164 40 -258 -198 19 60 -57 -159 -129 43 65 -208 -259 27 166 28 -122 -115 51 198 6
2771Fk20J76K47q8k01J4J18O3p6k02M7K89L0k59p5J21J12rj35r7K27J71k00j80
$$ 6 -214 -38 209 121 -80 -66 52 115 39 -163 -116 173 203 -56 -131 -10 102 93 -42 -139 88 259 59 -121
2795a21J52J46o7j49p4J58K17j21k97J5K11J6j45r7J6J82N4k31j35J82J30j38
$$ -121 31 177 110 -39 -113 45 262 141 -156 -141 70 86 -59 -156 -140 42 96 -135 -270 -88 42 -96
2817i6q3P5J41P5j75j74J74K50q7j98M8J65P9n6j97j3K06M7k10m1J51Q1p4j99
$$ -96 -179 -104 37 112 -63 -237 -63 187 100 -98 -50 115 194 138 -59 -72 134 181 -29 -70 81 162 88 -111
2841a11q7J91K08j73j99J24J55o5r7m4Q0J55m1j81M6K18k3j64p4O8J28M3k12j03
$$ -111 -198 -7 201 28 -171 -47 108 43 -54 -98 -18 137 96 -85 -39 179 156 -8 -82 -14 114 157 -55 -158
2865a58K23J33k37k06O9J41Q4q0j70L7J70q7j59P2J76L4n9j36J7K41J00k18j03
$$ -158 65 198 -39 -245 -176 -35 49 -31 -201 -164 6 -81 -240 -168 8 42 -17 -153 -136 105 205 -13 -116
2888a16J92J08n6o7j0J11O0j88j78J79J87p3j49p2K8J18l6k02NK47M7j91j11M6
$$ -116 76 184 128 61 51 162 222 34 -144 35 222 149 0 -72 -44 74 38 -164 -159 88 135 -56 -167 -121
2912a21J23P8j02r5J62R9j78p9J54R6k7j30j51Q5K76l1k25o3P7J3n7k8N3J70k6
$$ -121 2 80 -22 -117 45 144 -34 -113 41 137 110 -20 -171 -86 190 159 -66 -129 -52 -39 -96 -124 -71 99 73
2937G3l04r1K37J79n5j03m9O8J50n5j17Q9J71p6j22K1Q8J24l0k01m7J89Qj87j3
$$ 73 -231 -322 -85 94 39 -64 -113 -45 105 50 -67 22 193 117 -5 16 104 228 198 -3 -50 139 147 -40 -53
2962e3J55O5q3k06j20J81K01j08j46L7N3m0l9m3J01J91n7k78j3K12J05o8q3p4
$$ -53 102 167 84 -122 -242 -61 140 32 -114 -77 -24 -64 -103 -146 -45 146 89 -189 -202 10 115 47 -36 -110
2986a10N8O8q0mJ78L0k24j36O8J49J49o9k15L8J27l2j31P3J65Q0q5k09m3K61J44
$$ -110 -52 16 -64 -68 110 140 -84 -220 -152 -3 146 77 -138 -100 27 -5 -136 -63 102 182 97 -112 -155 106 250
3011B50j61r3L6M6j0rk4O7Q2j86j72J17J73lp4p9m2P2l6j35J00K41k6k46j04N0
$$ 250 89 -4 32 78 68 59 35 102 184 -2 -174 -57 116 113 39 -40 -82 -10 -46 -181 -81 160 134 -112 -216 -166
3037a66J72J25j54j39J26J04j09r0P9Q9M5q7k01L1K51N4j46j5j2l4j2L3J00J69
$$ -166 6 131 -23 -162 -36 68 -41 -131 -52 37 82 -5 -206 -175 76 130 -16 -31 -43 -77 -89 -56 44 213
3061B13m1k75j14K03J72Qo4j00K7R4p3j17J40J53j07j77o2P5J94L8k34j23J06
$$ 213 172 -103 -217 -14 158 166 102 2 29 123 50 -67 73 226 119 -58 -120 -45 149 187 -47 -170 -64
3084f4M3n5L5N4J6l8j32r1J69J70r9p4N4L2k9p8m4J27K09q4k72k8J65R6qp7j02
$$ -64 -21 -76 -41 13 29 -9 -141 -232 -63 107 8 -66 -12 20 -9 -87 -131 -4 205 121 -151 -179 -14 82 74 -3 -105
3111a05O4O2r3k3J76M7j42j41j8J31K16Oj86qO4o5j5J27R7L1j08k21J1K42R4j83
$$ -105 -41 21 -72 -95 81 128 -14 -155 -173 -42 174 180 -6 -14 50 -15 -30 97 194 225 117 -104 -93 149 243 60
3137F0j20K0M1N7n6j08Q6Q8j58j62J03J44M5n5j11m7J16K5q9O8J73l1j37n8K4
$$ 60 -60 -40 1 58 2 -106 -20 68 -90 -252 -149 -5 40 -15 -126 -173 -57 -32 -121 -53 120 89 -48 -106 -82
3162h2J55R0j38r3J14R0j20p5L5Q1O1j11j89O4K27K5j52o6J5J5P2k3PJ45lk04
$$ -82 73 163 25 -68 46 136 16 -59 -24 57 118 7 -182 -118 109 134 -18 -84 -69 -54 18 -5 2 147 144 -60
3188f0o6J38J16K6n7r6K9Q5r2q8J26P8j03j37m5P7J87k0k51r0J34R0l7k2KM3K1
$$ -60 -126 12 128 154 97 1 30 115 23 -65 61 139 36 -101 -146 -69 118 98 -153 -243 -109 -19 -56 -78 -76 -33 -12
3215a2j18r0J79J56q1o8RL5M5pp5N0J43p4j43L9R4K3n7r9n0J58O0j37q7J43O2
$$ -12 -130 -220 -41 115 34 -34 -25 10 55 48 -27 23 166 92 -51 -12 82 105 48 -51 -101 57 117 -20 -107 36 98
3242I8r1j04m1J09J83l8j68nR6k8k8L7L4N4k7j66j5J70L7j29n3J2M5L7n6p9Q9
$$ 98 7 -97 -138 -29 154 116 -52 -57 39 11 -17 20 54 108 81 -85 -100 70 107 -22 -75 -63 -18 19 -37 -116 -27
3269b7O7j55r1J13J37K4o6j42rJ82L4j26J5J05J6m1m8k8J13Q5j36q0J17O6o9n7
$$ -27 40 -115 -206 -93 44 68 2 -140 -149 33 67 -59 -44 61 77 36 -12 -40 73 158 22 -58 59 125 56 -1
3295ak2L3Q1o6j28P1J60m3j37j2L5O6K9j09j4J44K1j63o7Q5P8M1p9j01N2J17q0
$$ -1 -23 10 91 25 -103 -32 128 85 -52 -64 -29 37 66 -43 -57 87 108 -55 -122 -37 41 82 3 -98 -46 71 -9
3322ij03O3O0l5m9l7M7J33k3j79j7J52M1l6j8j0O1K9j12o0J43J23q2r5%M5O6k2
$$ -9 -112 -49 11 -24 -73 -110 -63 70 47 -132 -149 3 44 8 -10 -20 41 70 -42 -102 41 164 82 -13 -13 32 98 76
3350G6j39K4J48l2j04MM1K3j3r5l6J40O7j33o3R8M2l4n5l6P2J29p9j30L7Q8j8
$$ 76 -63 -39 109 77 -27 -23 18 41 28 -67 -103 37 104 -29 -92 6 48 14 -41 -77 -5 124 45 -85 -48 40 22
3377B2n7l3OJ12Nj64k5J34J9r5k2K1O5P0r0r0J06Q0p8l6N2P3L7l9j14L1J50mj36
$$ 22 -35 -68 -62 50 55 -109 -134 0 19 -76 -98 -77 -12 58 -32 -122 -16 64 -14 -50 2 75 112 73 -41 -10 140 136 0
3406@J5O9J8l2q4m1R7O0j28q3J16M5m7o0o5M3J06l5j16N9J29m8r6KM2R0K4j26
$$ 0 15 84 102 70 -14 -55 42 102 -26 -109 7 52 5 -55 -120 -77 29 -6 -122 -63 66 18 -78 -76 -34 56 80 -46
3434d6l2J42N1j31m2L5K9L7n5q4P1J10j04j23L4J08K3j3r7J6J39mj54J0J34J7
$$ -46 -78 64 115 -16 -58 -23 6 43 -12 -96 -25 85 -19 -142 -108 0 23 10 -87 -71 68 64 -90 -80 54 71
3460G1j0l8k7R6N1j01p8J11P5n9q1j6K8P4o0j61L6J37k7r2j4K0K2kp8k3J49M6
$$ 71 61 23 -4 92 143 42 -36 75 150 91 10 -6 22 96 36 -125 -89 48 21 -71 -85 -65 -43 -45 -123 -146 3 49
3488D9j17l8O1N3K6n4o6O7J40o3j09N1O5j9m6n1L1J11Mj57k2J26kn3l7mO9Q4r4
$$ 49 -68 -106 -45 8 34 -20 -86 -19 121 58 -51 0 65 46 0 -51 -20 91 95 -62 -84 42 40 -13 -50 -54 15 99 5
3517Ej01Q9R4p6l2K5O2M2n2j12L7J46l1j22J3M7K5J4j04p2Q0P5j08n9P8M9k3p2
$$ 5 -96 -7 87 11 -21 4 66 108 56 -56 -19 127 96 -26 -13 34 59 73 -31 -103 -23 52 -56 -115 -37 12 -11 -83
3545h3p2P6J13m4j30P8R7k1o2j4MR0L8r1k6J23J9r7k9J5P9M8r2r3Q8J07r8p9L0
$$ -83 -155 -79 34 -10 -140 -62 35 14 -48 -62 -58 32 70 -21 -47 76 95 -2 -31 -16 63 111 19 -74 14 121 23 -56 -26
3574b6N1K5j2o7%J19k3j20J2Q5L6rp3n2R1P1j31p6R7P1l5p0m1K4P5m4j08N8J04
$$ -26 25 50 38 -29 -29 90 67 -53 -41 44 80 71 -2 -54 37 108 -23 -99 -2 69 34 -36 -77 -53 22 -22 -130 -72 32
3603C2l7p2qL4O1K2j16m8J50O8q0n1K6M0K4m2n7Q2J22r2j12M2N2L7m0n3j0J12
$$ 32 -5 -77 -85 -51 10 32 -84 -132 18 86 6 -45 -19 21 45 3 -54 28 150 58 -54 -12 40 77 37 -16 -26 86
3631H6J5j39j5R1J7k5l0k6P8N7j00p9J00M6o9l6KM8P5n0j48%J10Kn3j2OJ4Mq3
$$ 86 101 -38 -53 38 55 30 0 -26 52 109 9 -70 30 76 7 -29 -27 21 96 46 -102 -102 8 10 -43 -55 -49 -35 -31 -114
3661a14k6J37M5j08p3R2N0L1m4p4M7J12m0o9O7N8%o6m9j1J44K6j24n0J13Nn0n3
$$ -114 -140 -3 42 -66 -139 -47 3 34 -10 -84 -37 75 35 -34 33 91 91 25 -24 -35 109 135 11 -39 74 79 29 -24
3689b4j5O2P1p9r9P3P4n9m4J0L7N2j1j04K6J23qj26m2P9O3Lo4p2P0M9j21l4P7
$$ -24 -39 23 94 15 -84 -11 63 4 -40 -30 7 59 48 -56 -30 93 85 -41 -83 -4 59 62 -2 -74 -4 45 -76 -110 -33
3718c3L8j7m7p5L3J07l2q9K9R3ml2j7J9Q3J7j15j2J47L6p4l6K3K1M0m7q2Q3Q5
$$ -33 5 -12 -59 -134 -101 6 -26 -115 -86 7 3 -29 -46 -27 56 73 -42 -54 93 129 55 19 42 63 103 56 -26 57 142
3747A42r3r9J7M1M9j8j12j4J27nr4j1N5J8k4k5j6R3N2j04q2P3P8k5k8l3J6P8k3
$$ 142 49 -50 -33 8 57 39 -73 -87 40 35 -59 -70 -15 3 -21 -46 -62 31 83 -21 -103 -30 48 23 -5 -38 -22 56 33
3776C3j35K5R2j7o9kJ5O2J9j07n1J34M7o2k7K7K4M8l2o9L6J20l0o7M9M7j8m2o4
$$ 33 -102 -77 15 -2 -71 -73 -58 4 23 -84 -135 -1 46 -16 -43 -16 8 56 24 -45 -9 111 81 14 63 110 92 50 -14
3805a4J0J20J1j38l5Q2J1j8m0n0L5N8o6n8P5N7o4p0j7O3J07Oj40nQ9j0m1J7L6
$$ -14 -4 116 127 -11 -46 36 47 29 -11 -61 -26 32 -34 -92 -17 40 -24 -94 -111 -48 59 65 -75 -80 9 -1 -42 -25 11
3834A1K0Jp9l7J01N1r2o1M8M7K6j9p6K8Q3m3q9M3J00Rk8n9j5Q1M9r6l7J12J6m8
$$ 11 31 32 -47 -84 17 68 -24 -85 -37 10 36 17 -59 -31 52 9 -80 -37 63 72 44 -15 -30 51 100 4 -33 79 95 47
3864D7k8l4L7O6n8q4N9M2l8o6K4K2K8k7r7NJ28K1r4k7J2J7M0k9k8Q6N1j26o1O6
$$ 47 19 -15 22 88 30 -54 5 47 9 -57 -33 -11 17 -10 -107 -102 26 47 -47 -74 -62 -45 -5 -34 -62 24 75 -51 -112 -46
3894d6P3J4l1n9MR1k0q1K7Q2l8m6kRR8K4j26m6Q7O4m9pJK0L0m7q6N9J07m3q2Q
$$ -46 27 41 10 -49 -45 46 26 -55 -28 54 16 -30 -32 -23 75 99 -27 -73 14 78 29 22 23 43 73 26 -60 -1 106 63 -19 -11
3926a1J8LJ7q0j7J04J3j10k7N6K2j0j7m9N0P1q2l4P8N8o0m2m4M5J28%j16k4P0
$$ -11 7 10 27 -53 -70 34 47 -63 -90 -34 -12 -22 -39 -88 -38 33 -49 -83 -5 53 -7 -49 -93 -48 80 80 -36 -60 10
3955A0rj7J2J7K0Qr4l3J00P5q2m8J2L6L2jn3K5P6o3p8N5O9K1k7p2l1O6M2r2j1
$$ 10 1 -16 -4 13 33 41 -53 -86 14 89 7 -41 -29 7 39 38 -15 10 86 23 -55 0 69 90 63 -9 -40 26 68 -24 -35
3986c5N4K9n4l2m1L3P1n1p8N1N4m6k7JK3O5oq9LJ16J3m6j6mK1K7k6l2Q5M0j04
$$ -35 19 48 -6 -38 -79 -46 25 -26 -104 -53 1 -45 -72 -71 -48 17 11 -78 -75 41 54 8 -8 -12 9 36 10 -22 63 103 -1
4017an4M5M7K9k0q2KP7l2o4K9O4k5j6l2pQ4K9r3m5Q6K2j7rl0L5L3l1r5M5P4l5
$$ -1 -55 -10 37 66 46 -36 -34 43 11 -53 -24 40 15 -1 -33 -40 44 73 -20 -65 21 43 26 17 -13 22 55 24 -71 -26 48 13
4049A3m8RlQJ2q5pR0J7n9j7K4QL0l2l1O9O0n8m9M7M7J2l2m4J6Q2Pp6PL8j5l5k2
$$ 13 -35 -26 -29 -21 -9 -94 -101 -11 6 -53 -70 -46 -38 -8 -40 -71 -2 58 0 -49 -2 45 57 25 -19 -3 79 86 10 17 55 40 5 -17
4083a7lN8L9q9o6P5K2m8nRJ0M3j6r0L9P7m2m5K7K5J9mo2j6P5K9j01LN4J3jl8m0
$$ -17 -20 38 77 -12 -78 -3 19 -29 -34 -25 -15 28 12 -78 -39 38 -4 -49 -22 3 22 18 -44 -60 15 44 -57 -54 0 13 12 -26 -66
4116f6K7M9k8n1N7L9l1k2l3jR1K8q6oP5Ll8J2MRM5o4m2O7N2o7l9J0J1K8J0o8R
$$ -66 -39 10 -18 -69 -12 27 -4 -26 -59 -60 31 59 -27 -33 42 45 7 19 23 32 77 13 -29 38 90 23 -16 -6 5 33 43 -25 -16
4149a6N2l8p8L1L4J8%l9n1R1J8p6j7O3J1k1Ll4J5O3k6o3K5O0k3j4j8KN0jq4kR9
$$ -16 36 -2 -80 -49 -15 3 3 -36 -87 4 22 -54 -71 -8 3 -18 -15 -49 -34 29 3 -60 -35 25 2 -12 -30 -28 22 21 -63 -65 34
4182C4J2m7NjnL2j6l6N9M2m7m8L4J6K0j2o3MQ0j4p7J4L9j2k6j5j9N2K7o5l4M8
$$ 34 46 -1 4 3 -2 30 14 -22 37 79 32 -16 18 34 54 42 -21 -17 63 49 -28 -14 25 13 -13 -28 -47 5 32 -33 -67 -19
4214a9K9l6j5oMN7nq3L9N4l4l1J9jK3J0m9j8P4Qo4OL2J3K2j9o3N2N8l8m7N7K5
$$ -19 10 -26 -41 -47 -43 14 9 -74 -35 19 -15 -46 -27 -28 -5 5 -44 -62 12 20 -44 -38 -6 7 29 10 -53 -1 57 19 -28 29 54
4247E4kk7k1j3Q0Nr1J9N3j8j7j3l2K6M7n5m0M1K0m5k0JjM5qn3MP1l3m4J6K0J3
$$ 54 52 25 4 -9 71 76 -15 4 57 39 22 9 -23 3 50 -5 -45 -4 16 -29 -49 -48 -49 -4 -12 -65 -61 10 -23 -67 -51 -31 -18
4280a8L0l6l9P5J7o6OL8K2j4qm4J2P9n6n5M0M6k3J4j9k1N4J8q0QQ3k0mj4oJM5
$$ -18 12 -24 -63 12 29 -37 -31 7 29 15 7 -37 -25 54 -2 -57 -17 29 6 20 1 -20 34 52 -28 -20 63 43 39 25 19 20 65
4313F5l0n9O8L1m9l8J6mK3no2J1N1j9n8K7Mk0J8j5l7O3L1n2m8N2RPJ8j2%N6k3
$$ 65 35 -24 44 75 26 -12 4 0 23 18 -44 -33 18 -1 -59 -32 -28 -48 -30 -45 -82 -19 12 -40 -88 -36 -27 -20 -2 -14 -14 42 19
4346A9o0M8L9m3JJ7j3K8J8m5m7O4Kl0J3npM6l6m5M8L6l8j4L9j1OLm2j6N7J5p3
$$ 19 -41 7 46 3 4 21 8 36 54 9 -38 26 28 -2 11 6 -1 45 9 -36 12 48 10 -4 35 24 30 33 -9 -25 32 47 -26
4379b6J7K1j5Nj8k8K4M0o3l9N0L1m0j4jj2N4J0n0J8L8l5k1M5j6M5L5n6k8O1K3
$$ -26 -9 12 -3 2 -16 -44 -20 20 -43 -82 -32 -1 -41 -55 -56 -68 -14 -4 -54 -36 2 -33 -54 -9 -25 20 55 -1 -29 32 55
4410E5m6OK0kJ3j5k6J4M6k9m7L1J4j3J9l0k7L9Po5K0N1j2j2jl9J1M4l7l2L7K1
$$ 55 9 15 35 33 46 31 5 19 65 36 -11 20 34 21 40 10 -17 22 29 -36 -16 35 23 11 10 -29 -18 26 -11 -43 -6 15
4442A5l7j4Oj4M4J2p9QN0j2j3J7k8OL8l3k3O6K5l3k6K2j3L1J7l2J2M6l6l9L9L5
$$ 15 -22 -36 -30 -44 0 12 -67 -59 -9 -21 -34 -17 -45 -39 -1 -34 -57 9 34 1 -25 -3 -16 15 32 0 12 58 22 -17 22 57
4474E7k2mj6k4K8L8o6kN1k0k8K1l%K1k0o4L3M6l1QroMJ2o1LN7pl1J5Rk9K2j3j8
$$ 57 35 31 15 -9 19 57 -9 -11 40 20 -8 13 10 10 31 11 -53 -20 26 -5 3 -6 -12 -8 4 -57 -54 3 -4 -35 -20 -11 -40 -18 -31 -49
4510d9M0M0p4oL0J4qK1j8k9N6Ol5L9Nl0j0RMK5M5n5l9N9j2k5J5j2rL9k0o2M6L7
$$ -49 -9 31 -43 -49 -19 -5 -13 8 -10 -39 17 23 -12 27 32 2 -8 1 5 30 75 20 -19 40 28 3 18 6 -3 36 16 -46 0 37
4544C7l6j8J6PJPm0j5N4Rn6J6K2k5K2Qn9K8K8m9j4N5J0k6Lk1l5O3J7m6K2L5k5
$$ 37 1 -17 -1 6 7 14 -26 -41 13 22 -34 -18 4 -21 1 9 -50 -22 6 -43 -57 -2 8 -18 -15 -36 -71 -8 9 -37 -15 20 -5
4577ej9J7LJN4m1k6N3J2l2J3Nl0K2J7m3RL2j4m9K2NrJ7j6l3M5Mn3rN5k3J2J3j6
$$ -5 -24 -7 -4 -3 51 10 -16 37 49 17 30 35 5 27 44 1 10 42 28 -21 1 6 -3 14 -2 -35 10 14 -39 -48 7 -16 -4 9 -7
4612gk0M0k8k6M3K7m1%%j3L4J9n9mL7j0j5K3Oj4J5m0j3N5L6l7qMk9J2M0j9RL0
$$ -7 -27 13 -15 -41 2 29 -12 -12 -12 -25 9 28 -31 -35 2 -8 -23 0 6 -8 7 -33 -46 9 45 8 0 4 -25 -13 27 8 17 47
4646D7on9L1K4j5Nol6J7M1m2j6L6k7j8J0kj7L7Jm8K0K4m9QK1lK0J0l9l7N4J3j2
$$ 47 41 -18 13 37 22 27 21 -15 2 43 1 -15 21 -6 -24 -14 -16 -33 4 5 -43 -23 1 -48 -40 -19 -22 -2 8 -31 -68 -14 -1 -13
4680a3K1lk5K4Ok9N8J1o2l3M0J8K3J0m2k6K4Kj6N4J3m4k4%JK7L7l5k9L0qj8J7
$$ -13 8 5 -20 4 10 -19 39 50 -12 -45 -5 13 36 46 4 -22 2 4 -12 42 55 11 -13 -13 -12 15 52 17 -12 18 10 -8 9
4713IKkLmm1J7L9k6rJ0k0k7N0l3LL3J1o7lK9%L2K8n1rK8k8lM9Qj8%j9k4N8L8n9
$$ 9 11 9 12 8 -33 -16 23 -3 -12 -2 -22 -49 1 -32 -29 4 15 -52 -55 -26 -26 6 34 -17 -26 2 -26 -29 20 28 10 10 -9 -33 25 63 4
4750DkK1l9PM1qPNm2m9O0L0MNk4m2kL2j0J8K8l4n1J6NML2k2m6K2K3l6K5K5pk6
$$ 4 2 23 -16 -9 32 24 31 36 -6 -55 5 35 39 44 20 -22 -24 8 -2 16 44 10 -41 -25 -20 -16 16 -6 -52 -30 -7 -43 -18 7 0 -26
4786b6J0j3PM4Jm1J3Pl6K6K6oJ9Nm7k0N4nlK5k2k1K3ml0N2J7n7k7J7RK1L1l0m6
$$ -26 -16 -29 -22 22 23 -18 -5 2 -34 -8 18 12 31 36 -11 -31 23 18 15 40 18 -3 20 16 -14 38 55 -2 -29 -12 -3 18 49 19 -27
4821b7K6j3PL0J6k6k5ol0L8M0k6k8Pj3k4L1J2rQrm7K9N1k5lRk9J2K5kj2N5k3k1
$$ -27 -1 -14 -7 23 39 13 -12 -18 -48 -10 30 4 -24 -17 -30 -54 -23 -11 -20 -12 -21 -68 -39 12 -13 -16 -7 -36 -24 1 -1 -13 42 19 -2
4856bpJ9j1K7K6l1j4K1l6mM7Oj4jl6k4N1J4k8Mnm3J7M3j2JJ6m3l7O2OqJ6k8l7
$$ -2 -9 10 -1 26 52 21 7 28 -8 -12 35 41 27 26 -10 -34 17 31 3 7 2 -41 -24 19 7 8 24 -19 -56 6 12 4 20 -8 -45
4891d5J6J6j5K6L2m3l0K6j4PK6j9k5L2Kk1J1L4j7j0K1l6NN6kk0J7j7j9K9J0kL3
$$ -45 -29 -13 -28 -2 30 -13 -43 -17 -31 -24 2 -17 -42 -10 -8 -29 -18 16 -1 -11 10 -26 -21 35 33 13 30 13 -6 23 33 31 64
4924F4j7n2PL2j9NK9m3k3K9j7rJ1J0l1kJj7K8L5m4j6J3Nk6L3K4l9J0ml9N4J9k4
$$ 64 47 -5 2 34 15 20 49 6 -17 12 -5 -14 -3 7 -24 -26 -25 -42 -14 21 -23 -39 -26 -21 -47 -14 10 -29 -19 -23 -62 -8 11 -13
4958a3Nkk4oL7j3lL6k4l5K7K7j6J3qj5K1K2j7JL2j6m5L4kOK4%m6J1J4j6LJ6k8
$$ -13 -8 -10 -34 -40 -3 -16 -19 17 -7 -42 -15 12 -4 9 1 -14 7 29 12 13 45 29 -16 18 16 22 46 46 0 11 25 9 12 28 0
4993@pK1l4j5L8ok3pK0k2L4rk4J1Pk4j2L5NK%lk0OOj3K9J6j6j8K0mKL9l8j5L0
$$ 0 -7 14 -20 -35 3 -3 -26 -33 -13 -35 -1 -10 -34 -23 -16 -40 -52 -17 -12 -10 -10 -13 -33 -27 -21 -34 -5 11 -5 -23 -3 -7 -5 34 -4 -19 11
5030A1J5l0K8ok8J4K1l7K7K4k4j7K6rk0K6mk2J6Rm0j0L7l2mK4k7RK7j4k6K5Kk3
$$ 11 26 -4 24 18 -10 4 25 -12 15 39 15 -2 24 15 -5 21 17 -5 11 20 -20 -30 7 -25 -29 -5 -32 -23 4 -10 -36 -11 -9 -32
5064c2J2rj8K0K5m0J0K4pj4K0j3pJ5lk5L7L0m4J2J8j4OK4l6QL5j2k2L8j1j9J6
$$ -32 -20 -29 -47 -27 -2 -42 -32 -8 -15 -29 -9 -22 -29 -14 -17 -42 -5 25 -19 -7 11 -3 3 27 -9 -1 34 22 0 38 27 8 24
5097B4Jk2K8K3m9RNpjOk4rL4qk5lK3l3lKlJ8K0l7j5N0j7k1J9MoK2Kl4J5J7k7J1
$$ 24 25 3 31 54 5 14 19 12 11 17 -7 -16 18 10 -15 -18 5 -28 -31 -29 -32 -14 6 -31 -46 4 -13 -34 -15 -11 -17 5 7 -27 -12 5 -22 -11
5135a1K5j5j5K5k1oL0Jk2J2J1j1K0ok3PM1l5jK2Jk0LKk3L1Kl0J9J7k3j8J3j3j4
$$ -11 14 -1 -16 9 -12 -18 12 13 -9 3 14 3 23 17 -6 1 42 7 6 28 29 9 12 14 -9 22 24 -6 13 30 7 -11 2 -11 -25
5170b5L2k6j5J8Pk2KJ0j2PoqQK6k3k4M6%rJ4Mk9L1jk3K7J5k3LQj2J0J9j2l0K6
$$ -25 7 -19 -34 -16 -9 -31 -29 -19 -31 -24 -30 -38 -30 -4 -27 -51 -5 -5 -14 0 4 -25 6 5 -18 9 24 1 4 12 0 10 29 17 -13 13
5206A3Pk8J6J4j5PPk5OL4k3k2L2qj5J3k2j1K9J4l1J1Mk6J0J0j7MRj1l1K8J0j8
$$ 13 20 -8 8 22 7 14 21 -4 2 36 13 -9 23 15 0 13 -9 -20 9 23 -8 3 7 -19 -9 1 -16 -12 -3 -14 -45 -17 -7 -25
5240b5J2j0j1K0J7j8JRj1%OJ6qK0j4k7K3L3l5J3J2oj0K8k9j7K9mj2J0Lj8J6j6
$$ -25 -13 -23 -34 -14 3 -15 -14 -5 -16 -16 -10 6 -2 18 4 -23 0 33 -2 11 23 17 7 35 6 -11 18 14 2 12 15 -3 13 -3
5274coK1J1n6J2L3rj7K1k5j1K7J4l1QJ9m2NJ9pROj9j3K6Qk4K2Pk5LOj8K6L7l2
$$ -3 -9 12 23 -33 -21 12 3 -14 7 -18 -29 -2 12 -19 -11 8 -34 -29 -10 -17 -8 -2 -21 -34 -8 0 -24 -2 5 -20 -17 -11 -29 -3 34 2
5310Bj6J5l%K6Qk5K0k4k8L1J4Lrnj7ML5k6nJ6nj4kMkJ9ol6lK1jKK8l3mJ0j9j4
$$ 2 -14 1 -2 -2 24 32 7 27 3 -25 6 20 23 14 9 -8 -4 31 5 0 16 11 -3 -5 -1 -3 16 10 -26 -29 -8 -9 -7 21 -12 -16 -6 -25 -39
5349c9M4J0l2mJ6k1LK7j4J1J9l6k9N3kJ8j2j5k2J1L0mRJ4m3mJJ4J7K8l7l4J1J2
$$ -39 5 15 -17 -21 -5 -26 -23 4 -10 1 20 -16 -45 8 6 24 12 -3 -25 -14 16 12 21 35 -8 -12 -11 3 20 48 11 -23 -12 0
5383@mJ6J4l6J3j0k9K7K8ql9PqRL3oj8Rj5k2J7L4j2Qnl9J3K5jjK3lm6oJ6pL4K3
$$ 0 -4 12 26 -10 3 -7 -36 -9 19 11 -28 -21 -29 -20 13 7 -11 -2 -17 -39 -22 12 0 8 3 -36 -23 2 1 0 23 20 -26 -32 -16 -23 11 34
5421C4m2j9K7j9LM5lj6pj8rL9K6k4j2j7j4J3L9lj3j2j1l3L5K6kk0kl6K0J8j6J
$$ 34 -8 -27 0 -19 -16 29 26 10 3 -15 -24 15 41 17 5 -12 -26 -13 26 23 10 -2 -13 -46 -11 15 13 -7 -9 -45 -25 -7 -23 -22
5455b2J4j4k0J2K0qK8k0l4K3J0KJ4J5k8JJ3l2J3M0mk4Mk3lL7J2j3PPl9j1L6Rk
$$ -22 -8 -22 -42 -30 -10 -18 10 -10 -44 -21 -11 -9 5 20 -8 -7 6 -26 -13 27 23 -1 3 -20 -23 14 26 13 20 27 -12 -23 13 22 20
5490B0Kk9k8N2knkK2m2j5K1JJ8J5l8k8J7LjK0J0l2j4OrK8K8j9k2%lOL8qk1LMk1
$$ 20 22 -7 -35 17 15 10 8 30 -12 -27 -6 -5 13 28 -10 -38 -21 -18 -19 1 11 -21 -35 -29 -38 -10 18 -1 -23 -23 -26 -20 18 10 -11 -8 -4 -25
$$ [...]
8191@
##END NTUPLES=NMR FID
##END=
