##TITLE=1H_ANY-157C-2
 CDCl3, 8 sc, 
 5.6.2019
##JCAMPDX= 6.0         $$ Bruker NMR JCAMP-DX V2.0
##DATA TYPE= NMR FID
##DATA CLASS= NTUPLES
##ORIGIN= UXNMR, Bruker Analytische Messtechnik GmbH
##OWNER= root
$$ XWIN-NMR		Version 3.5
$$ Wed Jun  5 14:41:57 2019 Russian Standard Time (UT+4h)  she@DPX200
##.OBSERVE FREQUENCY= 200.13155
##.OBSERVE NUCLEUS= ^1H
##.DELAY= (6, 6)
##.ACQUISITION MODE= SIMULTANEOUS
##.ACQUISITION SCHEME= undefined
##.AVERAGES= 8
##.DIGITISER RES= 18
##SPECTROMETER/DATA SYSTEM= spect
##.PULSE SEQUENCE= zg30
##.SOLVENT NAME= CDCl3
##.SHIFT REFERENCE= (INTERNAL, CDCl3, 0, 15.7039)
##AUDIT TRAIL= $$ (NUMBER, WHEN, WHO, WHERE, WHAT)
$$ ##TITLE= Audit trail, XWIN-NMR		Version 3.5
$$ ##JCAMPDX= 5.01
$$ ##ORIGIN= Bruker BioSpin GmbH
$$ ##OWNER= she
$$ F:/spectra/data/she/nmr/H-F/1/audita.txt
$$ ##AUDIT TRAIL=  $$ (NUMBER, WHEN, WHO, WHERE, WHAT)
(   1,<2019-06-05 14:40:04.65 +0400>,<she>,<DPX200>,
      <created by zg, POWCHK disabled, PULCHK disabled
       configuration hash MD5:
       00 E9 B6 7A A2 85 ED C7 34 08 36 98 17 FE 4E 26
       data hash MD5: 16K
       07 A6 D4 7B A0 33 83 EC 27 2E 50 D4 07 31 4F 4D>)
$$ ##END=
$$ 
$$ hash MD5
$$ 16 6C 9A 0A FA FB E5 4E 87 C1 31 72 15 53 34 1D
##$RELAX= 
##$RELAX= 
##$RELAX= 
##$RELAX= 
##$RELAX= 
##$RELAX= 
$$ Bruker specific parameters
$$ --------------------------
##$DU= <F:/spectra>
##$EXPNO= 1
##$NAME= <H-F>
##$PROCNO= 1
##$TYPE= <nmr>
##$USER= <she>
##$AMP= (0..31)
100 100 100 100 100 100 100 100 100 100 100 100 100 100 100 100 100 100 
100 100 100 100 100 100 100 100 100 100 100 100 100 100 
##$AQSEQ= 0
##$AQ_mod= 1
##$AUNM= <au_zg>
##$AUTOPOS= <>
##$BF1= 200.13
##$BF2= 200.13
##$BF3= 200.13
##$BF4= 200.13
##$BF5= 200.13
##$BF6= 200.13
##$BF7= 200.13
##$BF8= 200.13
##$BYTORDA= 1
##$CFDGTYP= 0
##$CFRGTYP= 5
##$CHEMSTR= <none>
##$CNST= (0..31)
1 1 145 1 1 1 1 1 1 1 1 1 1 1 1 1 1 1 1 1 1 1 1 1 1 1 1 1 1 1 1 1 
##$CPDPRG= <>
##$CPDPRG1= <>
##$CPDPRG2= <>
##$CPDPRG3= <>
##$CPDPRG4= <mlev>
##$CPDPRG5= <mlev>
##$CPDPRG6= <mlev>
##$CPDPRG7= <mlev>
##$CPDPRG8= <mlev>
##$CPDPRGB= <>
##$CPDPRGT= <>
##$D= (0..31)
0 1.2 0 0 0 0 0 0 0 0 0 0.03 0 0 0 0 0 0 0 0 0 0 0 0 0 0 0 0 0 0 0 0 
##$DATE= 1559731203
##$DBL= (0..7)
120 120 120 120 120 120 120 120 
##$DBP= (0..7)
150 150 150 150 150 150 150 150 
##$DBP07= 0
##$DBPNAM0= <>
##$DBPNAM1= <>
##$DBPNAM2= <>
##$DBPNAM3= <>
##$DBPNAM4= <>
##$DBPNAM5= <>
##$DBPNAM6= <>
##$DBPNAM7= <>
##$DBPOAL= (0..7)
0.5 0.5 0.5 0.5 0.5 0.5 0.5 0.5 
##$DBPOFFS= (0..7)
0 0 0 0 0 0 0 0 
##$DE= 6
##$DECBNUC= <off>
##$DECIM= 24
##$DECNUC= <off>
##$DECSTAT= 4
##$DIGMOD= 1
##$DIGTYP= 9
##$DL= (0..7)
0 120 120 120 120 120 120 120 
##$DP= (0..7)
150 150 150 150 150 150 150 150 
##$DP07= 0
##$DPNAME0= <>
##$DPNAME1= <>
##$DPNAME2= <>
##$DPNAME3= <>
##$DPNAME4= <>
##$DPNAME5= <>
##$DPNAME6= <>
##$DPNAME7= <>
##$DPOAL= (0..7)
0.5 0.5 0.5 0.5 0.5 0.5 0.5 0.5 
##$DPOFFS= (0..7)
0 0 0 0 0 0 0 0 
##$DQDMODE= 0
##$DR= 18
##$DS= 0
##$DSLIST= <SSSSSSSSSSSSSSS>
##$DSPFIRM= 0
$$ [...]
##$SUBNAM2= <"">
##$SUBNAM3= <"">
##$SUBNAM4= <"">
##$SUBNAM5= <"">
##$SUBNAM6= <"">
##$SUBNAM7= <"">
##$SUBNAM8= <"">
##$SUBNAM9= <"">
##$SW= 24.9336996594482
##$SWIBOX= (0..15)
0 0 2 0 0 0 0 0 0 0 0 0 0 0 0 0 
##$SW_h= 4990.01996007984
##$TD= 16384
##$TD0= 1
##$TE= 0
##$TE2= 300
##$TE3= 300
##$TEG= 300
##$TL= (0..7)
0 120 120 120 120 120 120 120 
##$TP= (0..7)
150 150 150 150 150 150 150 150 
##$TP07= 0
##$TPNAME0= <>
##$TPNAME1= <>
##$TPNAME2= <>
##$TPNAME3= <>
##$TPNAME4= <>
##$TPNAME5= <>
##$TPNAME6= <>
##$TPNAME7= <>
##$TPOAL= (0..7)
0.5 0.5 0.5 0.5 0.5 0.5 0.5 0.5 
##$TPOFFS= (0..7)
0 0 0 0 0 0 0 0 
##$TUNHIN= 0
##$TUNHOUT= 0
##$TUNXOUT= 0
##$USERA1= <user>
##$USERA2= <user>
##$USERA3= <user>
##$USERA4= <user>
##$USERA5= <user>
##$V9= 5
##$VALIST= <valist>
##$VCLIST= <CCCCCCCCCCCCCCC>
##$VD= 0
##$VDLIST= <DDDDDDDDDDDDDDD>
##$VPLIST= <PPPPPPPPPPPPPPP>
##$VTLIST= <TTTTTTTTTTTTTTT>
##$WBST= 1024
##$WBSW= 4
##$XGAIN= (0..3)
0 0 0 0 
##$XL= 0
##$YL= 0
##$YMAX_a= 866488
##$YMIN_a= -555530
##$ZGOPTNS= <>
##$ZL1= 120
##$ZL2= 120
##$ZL3= 120
##$ZL4= 120
##$ABSF1= 10
##$ABSF2= 0
##$ABSG= 5
##$ABSL= 3
##$ALPHA= 0
##$AQORDER= 0
##$ASSFAC= 0
##$ASSFACI= 0
##$ASSFACX= 0
##$ASSWID= 0
##$AUNMP= <proc_1d>
##$AZFE= 0.1
##$AZFW= 0.1
##$BCFW= 1
##$BC_mod= 2
##$BYTORDP= 1
##$COROFFS= 0
##$CY= 11.3945322036743
##$DATMOD= 1
##$DC= 2
##$DFILT= <>
##$DTYPP= 0
##$F1P= 18.9103706918063
##$F2P= -1.10871071338519
##$FCOR= 0.5
##$FTSIZE= 0
##$FT_mod= 4
##$GAMMA= 1
##$GB= 0.15
##$INTBC= 1
##$INTSCL= 1
##$ISEN= 128
##$LB= 0.24
##$LEV0= 0
##$LPBIN= 0
##$MAXI= 10000
##$MC2= 0
##$MEAN= 0
##$ME_mod= 0
##$MI= 1.114404
##$NCOEF= 0
##$NC_proc= 0
##$NLEV= 6
##$NOISF1= 3.799351
##$NOISF2= 2.8
##$NSP= 1
##$NTH_PI= 0
##$NZP= 0
##$OFFSET= 15.70392
##$PC= 1
##$PHC0= -8500.488
##$PHC1= 16.80018
##$PH_mod= 1
##$PKNL= yes
##$PPARMOD= 0
##$PSCAL= 0
##$PSIGN= 0
##$REVERSE= no
##$SF= 200.130013532006
##$SI= 16384
##$SIGF1= 3
##$SIGF2= 2
##$SINO= 400
##$SIOLD= 16384
##$SREGLST= <1H.CDCl3>
##$SSB= 0
##$STSI= 0
##$STSR= 0
##$SW_p= 3612.71676300578
##$SYMM= 0
##$S_DEV= 0
##$TDeff= 0
##$TDoff= 0
##$TI= <>
##$TILT= no
##$TM1= 0
##$TM2= 0
##$TOPLEV= 0
##$USERP1= <user>
##$USERP2= <user>
##$USERP3= <user>
##$USERP4= <user>
##$USERP5= <user>
##$WDW= 1
##$XDIM= 8192
##$YMAX_p= 0
##$YMIN_p= 0
$$ End of Bruker specific parameters
$$ ---------------------------------
##NTUPLES= NMR FID
##VAR_NAME=  TIME,          FID/REAL,        FID/IMAG
##SYMBOL=    X,             R,               I
##VAR_TYPE=  INDEPENDENT,   DEPENDENT,       DEPENDENT
##VAR_FORM=  AFFN,          ASDF,            ASDF
##VAR_DIM=   8192,          8192,            8192
##UNITS=     SECONDS,       ARBITRARY UNITS, ARBITRARY UNITS
##FACTOR=    0.0002004,     1,               1
##FIRST=     0,             0,               0
##LAST=      1.6414764,     0,               0
##MIN=       0,             -555530,         0
##MAX=       1.6414764,     866488,          0
$$ Real data points
##PAGE= N=1
##DATA TABLE= (X++(R..R)), XYDATA
0 0 0 0 0 -8 8 -8 16 -16 24 -24 40 -48 57 -72 89 -105 129 -153 179 -212 249 -290 335 -388 446 -510 581
27 581 -660 748 -844 954 -1068 1199 -1341 1497 -1667 1855 -2061 2286 -2534 2807 -3110 3440
43 3440 -3810 4221 -4685 5205 -5799 6479 -7274 8213 -9340 10725 -12477 14772 -17925
56 -17925 22560 -30063 44306 -81237 384952 866488 456117 441851 550935 742160 590235
67 590235 288201 87028 190846 240577 131895 -79683 -165791 -102111 25040 -16652 -112964
78 -112964 -90023 52965 157424 209158 177784 153130 221065 312489 282240 196680 118628 66588
90 66588 52809 34108 -70040 -166933 -174692 -146342 -130564 -139635 -194211 -195299 -82199 8819
102 8819 -1319 -17087 6820 55085 105153 80430 -18122 -65785 -73267 -149254 -267942 -357795
114 -357795 -402551 -397291 -413781 -509302 -555530 -466770 -368043 -331806 -305616 -259492 -163452 -26114
126 -26114 42848 40843 90309 171873 191585 160346 108785 62075 53466 17132 -98761 -188036
138 -188036 -203021 -224283 -255509 -265596 -273065 -244702 -173306 -136078 -110176 -26822 54886 94896
150 94896 146294 202906 240745 269976 255051 208099 216002 238712 183532 105781 71788 66670
162 66670 89632 100844 57070 46064 121876 186624 202782 227081 263831 310589 359432 348635
174 348635 305176 314625 324293 265570 189500 124874 61467 23549 -24541 -113847 -165290 -157839
186 -157839 -169140 -184577 -158004 -119559 -78410 -31016 -10142 25937 109579 153429 131825 123569
198 123569 134193 131328 113325 48490 -45749 -81926 -90954 -158153 -235110 -266524 -277965 -274095
210 -274095 -270950 -290806 -270442 -190898 -145745 -137399 -97315 -41816 4636 40206 28131 662
222 662 25684 42712 -5600 -53723 -73421 -93421 -105290 -125548 -162806 -154997 -110853 -106922 -109535
235 -109535 -65180 -12531 32039 69913 74143 85838 141976 165857 131981 111165 101444 72778
247 72778 42088 -1762 -54462 -65344 -69283 -115739 -141345 -115571 -89796 -70468 -50964 -40948
259 -40948 5473 86766 119099 117103 151113 194529 209213 205509 174308 141835 146271 130205 60570
272 60570 12822 3593 -13759 -32636 -54461 -80260 -58939 -11315 -10311 -18538 17164 57250 82823
285 82823 104513 103272 105640 133453 127501 84541 69163 60448 22542 -16652 -54994 -88830 -84141
298 -84141 -79883 -117545 -132197 -98634 -76737 -68279 -54896 -45412 -14759 29943 29640 13861 37595
311 37595 57118 41272 18680 -12013 -36377 -30838 -50330 -109439 -131366 -114789 -115351 -120820 -117838
324 -117838 -111984 -75173 -29475 -24845 -18215 25865 56571 64634 74577 75494 82596 103821 87037
337 87037 42579 35634 38335 9513 -18596 -37517 -51342 -37989 -27274 -45661 -38762 -31 15545
350 15545 17332 30570 41358 62656 86413 68790 45987 64047 71826 43024 17859 -2239
362 -2239 -19003 -18845 -39163 -80839 -84900 -64573 -69924 -75834 -65178 -50998 -20743 4764 -6391
375 -6391 -5214 32135 45237 30774 27608 26068 26964 36189 16438 -17730 -14558 -8301 -32445 -47908
389 -47908 -48222 -46244 -27332 -17026 -29745 -13914 26868 35029 29497 41696 50616 60565 70828
402 70828 51944 32683 48230 48240 19619 5644 519 -6714 -5335 -20238 -47456 -37047 -14695
415 -14695 -25524 -33052 -17276 -4262 11828 23332 7900 5875 31207 30378 7883 4721 5905
428 5905 4603 7674 -10669 -31851 -17342 -8524 -31364 -39315 -28609 -22968 -11053 -5593 -16935
441 -16935 -3572 25920 22820 10571 20337 27218 29550 30527 11407 1423 20261 19335 -5184 -7185
455 -7185 1772 604 3911 -3283 -18527 -4066 14657 557 -6683 9043 17069 21957 23678 8294
469 8294 8686 26982 16144 -7315 -4072 -69 -6324 -7597 -20672 -34216 -19614 -14900 -38585 -43546
483 -43546 -30839 -30337 -29683 -31470 -42061 -30096 -9201 -20262 -29550 -11650 -2326 -1419 4010 -2994
497 -2994 -2562 21385 23867 6655 15428 31653 31533 31621 26486 15981 27437 33968 11354 2101 13984
512 13984 12293 5924 3489 -8955 -7166 8261 -2975 -20415 -9192 454 -5200 -5566 -10123 -13083
526 -13083 2755 4863 -15046 -13075 -28 -5133 -10435 -13595 -23168 -15759 -2892 -17746 -25526 -7585
540 -7585 -697 -6176 -4316 -8882 -8173 5823 -443 -18219 -10428 -873 -11117 -16106 -20694 -29600 -21575
555 -21575 -17967 -37475 -38659 -18514 -14813 -14691 -3571 3290 19374 43893 44946 44298 68694 82834
569 82834 78687 80857 79197 74640 83059 75905 49781 45457 48783 29322 12196 2881 -11145 -11811
583 -11811 -9473 -26409 -31247 -13316 -8995 -14552 -8022 -6206 -2652 9849 4043 -9533 1810 10089
597 10089 -3700 -9334 -11501 -18486 -14487 -15010 -32787 -32722 -17474 -20783 -25740 -17097 -13391 -5390 6618
612 6618 -770 -7696 6277 6205 -11361 -17815 -25219 -36915 -39334 -50425 -71686 -69333 -62478 -75801
626 -75801 -81422 -73310 -68150 -54676 -38158 -36948 -23367 9029 22495 25174 39259 47711 50474
639 50474 58468 48424 30239 31935 27087 3643 -9253 -16987 -31902 -37014 -41360 -56567 -53356
652 -53356 -38020 -40948 -40754 -22837 -11566 1211 19382 22931 27150 47377 51001 40611 45636
665 45636 49563 43823 44625 39950 29090 39033 50575 40983 38719 50698 56157 66126 76949 73330
679 73330 77877 95709 93194 83343 85253 78370 64098 55917 36969 12762 5777 -6419 -33586
692 -33586 -44130 -44430 -51908 -50453 -46234 -49521 -36413 -15378 -12743 -6101 12506 19942 23997 33932
706 33932 28317 20804 24180 9586 -17088 -28441 -39832 -62042 -75682 -90159 -108538 -108701 -105971
719 -105971 -116421 -113247 -98593 -93504 -83779 -67520 -60803 -47966 -27351 -26696 -29376 -15022 -8353
732 -8353 -13689 -13524 -20478 -30168 -23210 -22630 -35047 -32638 -22732 -20061 -7779 6076 9555 24785 44657
747 44657 45825 49238 64014 64492 60401 62853 53041 39830 37620 24301 4367 -1318 -8899 -24442
761 -24442 -25269 -23076 -25032 -12429 -343 1808 20820 48716 58863 68517 83873 89487 96653 107666
775 107666 98402 83923 83351 75416 58940 48408 31469 11402 6094 -4205 -20774 -19212 -12922
788 -12922 -16817 -10808 1007 4400 16614 33488 31820 30308 38373 34854 28679 29546 17521 1840
802 1840 -3865 -17144 -33378 -33946 -40736 -56100 -56488 -53170 -56366 -47566 -37160 -38852 -29474 -13225
816 -13225 -12899 -12591 -7246 -14030 -21764 -23764 -39115 -53689 -55952 -69561 -87192 -89076 -92063 -99542
830 -99542 -94220 -92514 -96265 -79678 -56503 -46014 -30239 -10576 75 17066 36678 39545 42167
843 42167 49322 42498 34560 34940 25208 13357 12206 2366 -10703 -7650 -4153 -8223 535 9751 9839
858 9839 22367 38696 46254 57967 70150 68290 70814 79060 71533 60899 56330 42078 29232
871 29232 29347 17835 1131 588 -1077 -6932 -2603 794 -2370 7433 19606 20320 29488 40611 39170
886 39170 40755 43716 32437 25463 26582 11755 -5943 -13763 -27049 -39333 -37387 -41779 -51754 -47480
900 -47480 -42295 -40211 -25792 -13985 -13145 -2174 11725 15404 23686 32417 25770 22831 25062 11911
914 11911 -1077 -4529 -17199 -30733 -33775 -42267 -50926 -44491 -42622 -47464 -39614 -31123 -27109 -13088
928 -13088 -2524 -4984 2325 13289 11906 12211 14060 2374 -6082 -5777 -15323 -26116 -28090 -36983
942 -36983 -45539 -39663 -36743 -37308 -26346 -17770 -14974 -803 11964 14849 26051 36791 33903 35788
956 35788 41701 36511 32917 32204 17981 6740 8181 1892 -6363 -5895 -9961 -12542 -1008 5164 3632
971 3632 14145 24028 24897 34129 42052 38721 40983 43404 32577 26367 26306 14946 3891 -1123 -14739
986 -14739 -24503 -22618 -28270 -35447 -31075 -30363 -31800 -19668 -10138 -10308 -2476 4289 2249 9852 16288
1001 16288 7715 3776 4760 -3514 -8350 -8791 -20537 -27839 -23072 -27162 -32470 -25710 -22267 -20614 -9235
1016 -9235 -4291 -2554 12456 24818 24596 28928 33968 30757 34439 36296 23764 16384 17535 9279
1030 9279 3040 4022 -4015 -10853 -6323 -7797 -9369 -703 1595 -788 8240 15502 15188 21762 24406
1045 24406 17855 19112 20968 9465 3212 3065 -8099 -16534 -18513 -27481 -31071 -24502 -29316 -35634
1059 -35634 -28788 -24589 -22668 -13532 -10818 -12585 -828 7182 3796 7118 10560 4549 3359 3436 -6374
1074 -6374 -9352 -6590 -14928 -20565 -15125 -15969 -16661 -10210 -11272 -11800 -502 4800 2710 9679 14510
1089 14510 11792 17067 20247 13533 13768 13695 2286 -2557 -545 -8624 -14238 -13479 -19126 -19331 -10513 -11604
1105 -11604 -14655 -6025 -1452 -3025 4309 7774 7622 15839 18830 11317 13742 18715 13233 9179 6884
1120 6884 -2314 -2243 2802 -4170 -8878 -2386 -1502 -1012 6613 7455 7071 16895 19555 16165 23111 27555
1136 27555 23179 25698 27560 21747 23334 23644 12783 8289 11377 3769 -542 2321 -1243 -2049 3696
1151 3696 -172 -3798 4123 4903 -1753 -489 -1103 -4554 710 -1231 -12845 -13094 -10460 -18568 -22707
1166 -22707 -23415 -31198 -31852 -28045 -34431 -35736 -26571 -25719 -26965 -19749 -17073 -15537 -6649 -6542 -10990 -3433
1182 -3433 1160 -3140 -1267 1351 -2678 -400 1827 -6560 -6434 -986 -5613 -7959 -2551 -2135 -239
1197 -239 6862 4656 3041 12707 15146 10531 14156 15863 13813 18077 18124 10977 14237 18116 10321 7120
1213 7120 9895 6396 6201 7650 291 -730 7830 6211 1169 4829 4689 2688 6997 3812 -3047
1228 -3047 1392 3333 -4602 -4500 -2046 -5689 -4014 -3139 -10312 -8525 -1441 -5556 -7868 -1000 -670 972
1244 972 7745 5294 4344 13513 13836 7788 11469 14103 10732 12487 10682 3809 7945 10696 1760 -1159
1260 -1159 2067 -1250 -2564 -1064 -8000 -8749 -1525 -5049 -10275 -5085 -3792 -5972 -3034 -5556 -9631
1275 -9631 -2969 -1895 -9488 -8522 -4410 -7723 -6295 -5816 -11662 -8996 -3093 -8959 -11882 -5636 -6419 -8084
1291 -8084 -4718 -7556 -8205 -286 -1361 -7560 -2858 853 -1943 420 716 -3463 2292 6983 72
1306 72 988 7988 7065 6373 9119 5992 6760 14515 10151 5322 11632 13362 9647 11505 9178 5112
1322 5112 11098 9932 362 625 3847 -1401 -3055 -3463 -9570 -7921 -4449 -12570 -16170 -9487 -11307
1337 -11307 -15228 -13004 -15259 -15374 -7708 -9204 -14464 -7636 -2803 -6565 -4788 -3044 -5879 -355 2946
1352 2946 -4174 -2718 5107 3125 1161 3882 1442 3041 8539 3557 112 7934 9958 6304 9260
1367 9260 9642 9006 15279 15184 7945 11499 16847 11860 10597 12464 9882 11891 14835 7794 5847 12399
1383 12399 9128 4247 5791 3769 2658 7285 2991 -3100 2831 5046 -1893 -2854 -2772 -6988 -4638
1398 -4638 -4762 -13174 -12562 -6865 -11284 -14755 -11828 -13849 -12799 -8658 -13791 -15867 -7076 -5458 -10017
1413 -10017 -6204 -3039 -3297 2455 1588 -3844 1066 5727 -329 -2108 712 -1116 706 2453 -4373
1428 -4373 -4443 2522 -1620 -7287 -3716 -3793 -4374 -245 -3585 -7385 279 2773 -3457 -3413 -1180 -3297 -1598
1445 -1598 -2167 -8725 -6195 -440 -5742 -8256 -4270 -5147 -4556 -1726 -6121 -7672 816 786 -4293 -229
1461 -229 3602 3144 6334 5644 861 6590 10175 3628 2896 6961 6026 7621 10023 4974 7113 15012
1477 15012 11765 7220 12663 14409 13694 16939 15085 12628 19883 20762 13621 14434 16828 12946 12375 10289
1493 10289 3493 5333 8728 786 -3895 656 -1187 -3970 -3383 -8019 -9647 -4092 -6586 -13474 -9806
1508 -9806 -7282 -10171 -8545 -10653 -15114 -10080 -8439 -17029 -17676 -12135 -14488 -14924 -12903 -16579 -14137
1523 -14137 -7411 -11114 -14619 -7670 -4921 -6139 -3572 -4437 -4790 3134 3704 -2842 675 5388 2228
1538 2228 2703 3274 -968 2349 6388 299 -1100 5812 5407 3539 5302 3629 4328 10517 7219 1440
1554 1440 7044 10006 6005 6413 5330 1659 5296 5606 -2982 -3444 1488 -2274 -4967 -4070 -6277 -4601
1570 -4601 -493 -5603 -8142 -1026 596 -2600 -215 -1146 -1372 4871 4484 -2043 2068 6927 3296 2603
1586 2603 3503 1426 4193 6339 98 185 6838 6187 3706 6317 4865 5267 10851 7269 2116 7626
1602 7626 9894 4543 4874 5277 2820 4382 3805 -3870 -2751 1977 -2719 -6551 -4812 -6320 -5400 -2331
1618 -2331 -7501 -9819 -2334 -2206 -7176 -5333 -4823 -6177 -2737 -4608 -10302 -5439 -2063 -7303 -8441
1633 -8441 -6737 -8612 -5798 -4119 -9942 -8949 -1253 -2443 -4779 -58 1170 1516 6205 4242 2046
1648 2046 9051 11019 5542 6712 9177 7708 10246 9350 2869 5483 10215 4811 1904 4878 3399
1663 3399 3266 4890 875 -262 6520 4484 -1827 318 933 -1150 287 -3296 -8542 -4606 -2088
1678 -2088 -8905 -10613 -8120 -10495 -10064 -9196 -14135 -12366 -5646 -8692 -11617 -6731 -4849 -4453 -1153 -3797
1694 -3797 -5761 1352 2509 -2837 -1237 1425 -667 1207 2089 -2114 1255 5288 29 -826 4686
1709 4686 4676 4900 7148 5047 6694 13668 12206 7497 11560 13107 10271 11323 9208 5470 9674 10274
1725 10274 2414 2285 5999 3302 1838 1086 -3338 -1446 3739 -907 -4913 -352 412 -1869 491
1740 491 -2237 -4313 211 -1072 -7339 -5021 -2693 -6190 -5928 -5797 -8434 -4578 -1257 -6816 -6934 -1135
1756 -1135 -1091 -1525 1502 27 1400 7229 4627 890 6425 7131 3181 3012 1926 -304 3134 2710
1772 2710 -4879 -4237 338 -2398 -3243 -2567 -5020 -3427 383 -4155 -5981 -148 -365 -3477 -1986 -3125
1788 -3125 -4034 -335 -2879 -10078 -7282 -4681 -8244 -9063 -8680 -10867 -7954 -4795 -9768 -8799 -3117 -4299
1804 -4299 -5630 -1630 -2112 -604 3872 864 -1835 4599 6265 2205 3434 3660 2437 5733 6282 1626
1820 1626 4724 10167 7141 7103 10865 10335 12458 14705 9931 9346 15849 15231 11041 11720 10184 8730
1836 8730 11299 7542 1109 3200 4125 -1529 -2206 -1808 -4443 -2594 -1521 -6889 -5753 -355 -3158 -5965
1852 -5965 -3608 -4819 -5340 -2277 -5984 -8622 -3810 -3991 -8706 -7485 -6402 -8417 -6426 -7371 -10610 -6619
1868 -6619 -1653 -5554 -5807 -1515 -1385 427 2592 -1504 -968 4760 3168 87 2600 2909 1390 3343
1884 3343 1179 -1712 2984 4324 -873 -734 2338 1784 4056 5005 843 3021 7267 3988 1331 4277
1900 4277 2620 577 1335 -2285 -4536 -338 -2289 -7789 -6178 -5160 -7703 -6214 -6728 -9931 -6165
1915 -6165 -2448 -5844 -5314 -686 -1159 -856 1321 -1342 -168 4287 1468 -1727 1973 3729 2279 3292
1931 3292 1948 10 4926 6593 1913 3251 6491 4741 5975 7020 4297 6244 9529 4790 2398
1946 2398 5817 4414 1986 2610 -969 -2678 1550 398 -4430 -1852 -244 -3202 -2224 -1759 -4046 -604
1962 -604 981 -3354 -3144 982 -1020 -2485 -1932 -5330 -4872 -1500 -5405 -9442 -5178 -4950 -7349 -5535
1978 -5535 -5588 -6523 -1968 -971 -4491 -1249 3204 1643 2084 3596 2693 5985 9540 5318 4093 8111
1994 8111 7415 5246 7264 5670 4449 8237 6934 3305 6722 8411 4816 5174 5272 2759 5002 5294
2010 5294 -845 -792 1860 -1418 -4241 -3294 -6366 -7152 -4885 -8653 -11456 -7316 -7011 -10075 -8227 -7755
2026 -7755 -7151 -3868 -3787 -7706 -4551 -932 -4057 -4389 -2961 -4834 -3991 -1540 -5926 -6491 -2072 -3438
2042 -3438 -5853 -3923 -3484 -3231 557 -681 -2298 2373 4970 2441 3838 5470 3911 6797 7695 3855
2058 3855 4513 8390 5113 3795 5847 4973 4285 6229 3760 2118 6280 6051 2575 4398 4634 3082
2074 3082 5077 4145 -213 1709 3209 -2046 -3084 -2004 -4257 -4470 -3544 -7303 -6891 -2350 -4042 -5611
2090 -5611 -2547 -1448 -1202 2247 1643 300 5304 6954 3612 5002 6677 4648 5414 5120 1244 2201
2106 2201 4484 734 -941 1792 818 567 2636 347 -103 4019 3169 -297 2273 2614 967 2037
2122 2037 989 -2232 -670 -37 -4713 -6094 -4894 -6878 -7362 -6396 -9437 -8808 -4759 -7161 -8684 -4907
2138 -4907 -4851 -5301 -3323 -4543 -6366 -2756 -2361 -6697 -5746 -4150 -6151 -6160 -5729 -8620 -6883 -3657 -6200
2155 -6200 -5596 -1072 -808 238 4042 3439 4519 9669 9559 6944 10249 11663 9341 10410 9686 6256
2171 6256 8385 8834 3809 3877 5579 3203 2465 4170 2037 2502 6043 3617 2216 6017 5661 3280
2187 3280 4410 2382 350 2094 641 -3952 -3069 -2233 -5937 -5799 -5956 -8655 -7024 -4722 -7644 -7100
2203 -7100 -2655 -2821 -2707 115 -119 -174 3618 1773 -802 1350 2220 -902 -281 -973 -3279 -1101 -541
2220 -541 -3991 -2644 3 -1367 -1210 1786 1417 2999 6773 5004 4635 8204 7776 5481 5699 4273
2236 4273 1571 2842 730 -3552 -2558 -2248 -5802 -5873 -5217 -7061 -5961 -3712 -5854 -5625 -1032 -1546 -2507
2253 -2507 76 -458 -1027 1019 -1297 -4378 -1628 -2419 -5967 -5266 -4993 -7173 -5123 -3821 -6503 -4098
2269 -4098 -258 -1455 -674 2905 3139 4617 7481 6058 6078 9150 8356 5232 6115 4714 2098 3508
2285 3508 1967 -1668 409 949 -1695 -1080 889 -497 1054 3095 1258 2334 5458 3675 2278
2300 2278 4250 2455 798 1750 -1076 -4449 -2743 -4141 -8375 -7933 -7264 -9513 -7486 -6384 -7737 -5687
2316 -5687 -2193 -3561 -2521 1049 487 1695 4434 2850 2337 5186 3859 784 2809 2149 -100 1350
2332 1350 888 -950 1183 3255 1418 2949 5878 5179 6936 9234 7685 8664 11088 8758 6837 8492
2348 8492 6315 3585 4191 1261 -1877 -586 -2426 -6066 -5590 -4767 -6429 -5413 -3804 -5457 -2948 -871
2364 -871 -3050 -2325 270 -1233 -2059 -525 -2933 -4383 -2656 -5131 -7956 -6798 -7390 -9405 -8332 -7958
2380 -7958 -9498 -6960 -5399 -6460 -3998 -646 -1304 492 2884 1699 2594 5443 3123 1841 4067
2395 4067 2463 1047 2443 1080 -659 1446 1309 -982 1259 2798 1339 3439 5168 3344 5528
2410 5528 7541 4573 4656 6682 4012 2062 2556 261 -2333 -1136 -3892 -6658 -4716 -5163 -7370 -5403
2426 -5403 -4652 -5507 -2311 -803 -2077 827 3333 2867 4168 7147 5498 5781 7654 4728 3630 5359
2442 5359 3834 1537 2973 1705 301 2279 1574 -296 2208 3339 1419 3215 4997 2510 4069
2457 4069 5664 3018 2924 4659 2013 573 1621 -899 -2511 -1112 -3181 -4656 -2549 -2951 -4798 -2600
2473 -2600 -1961 -3762 -1891 -1082 -3495 -2122 -1053 -3638 -3557 -2801 -5446 -6457 -5835 -9086 -10559 -8926
2489 -8926 -10508 -12315 -9532 -9887 -10256 -7323 -6409 -6589 -2627 -277 -911 1910 4875 4296 6596 8080
2505 8080 6987 7753 10037 7544 6757 8445 6226 4606 5856 4039 2673 4386 3629 1455 3193 3057
2521 3057 737 2477 2524 -95 1075 2129 -522 -385 1150 -1202 -1681 -99 -2244 -2657 -234 -1455
2537 -1455 -2549 264 164 -612 2102 1957 287 3027 3326 953 2116 2458 -142 -91 245 -2503 -2591
2554 -2591 -1496 -4327 -5293 -3525 -4967 -5946 -3307 -3969 -4663 -1089 -455 -885 2185 3643 2620 4910
2570 4910 6216 5040 6971 8205 5752 6208 7354 4859 3915 5107 2361 738 1730 -835 -3173 -2001
2586 -2001 -3222 -5555 -4306 -5067 -7359 -6204 -6062 -8887 -6991 -5907 -8373 -7243 -5241 -6866 -5627
2601 -5627 -2440 -3763 -2794 -216 -658 -527 2395 2703 2251 4951 5062 3518 6022 5993 3562 4875 5078
2618 5078 2394 2929 3362 544 364 1526 -888 -1240 667 -1108 -2169 443 -950 -1463 816 382
2634 382 -514 1892 2262 848 3236 3649 2009 3355 4373 2141 2690 3662 750 603 1984 -394 -1693
2651 -1693 -631 -3149 -4602 -3764 -5481 -7102 -6095 -7049 -9263 -7272 -6646 -8525 -6132 -4684 -5957 -3844
2667 -3844 -1478 -2354 -333 2735 1750 3205 6309 5504 5915 8157 7207 6373 8528 7511 6015 7448
2683 7448 6883 4681 5514 5355 2825 3331 3464 1036 1190 2539 -282 -444 690 -1576 -2147 -747 -2580
2700 -2580 -3895 -1645 -3162 -4599 -2492 -2754 -4130 -2029 -1616 -3109 -733 363 -1272 -238 1354
2715 1354 -932 -105 1396 -1142 -1517 -17 -2329 -3384 -2159 -3959 -5549 -4051 -5221 -6722 -4263
2730 -4263 -4164 -5448 -2926 -1557 -2312 108 2250 1260 3014 5404 3585 4504 6336 4825 4114 5264
2746 5264 3458 2256 3572 1856 -158 1058 291 -1983 -348 -585 -2534 -750 145 -2373 -958 486
2762 486 -2049 -2295 -742 -2757 -2891 -1610 -3683 -4839 -2961 -4225 -5088 -3255 -3860 -4058 -1419 -680 -1340
2779 -1340 1839 3336 2407 4254 6419 5041 6209 7829 5567 4996 6438 4302 2848 3948 1638
2794 1638 429 1766 594 -963 847 980 -235 1912 2572 1695 3772 5053 2898 4367 5426 3166
2810 3166 2399 2974 335 -869 -64 -3177 -5033 -3867 -5695 -7140 -5669 -6236 -7141 -4644 -4798 -5633 -2900
2827 -2900 -1744 -2855 -1421 131 -1756 -876 7 -2316 -3176 -1761 -3556 -5300 -3720 -5147 -5215 -3489
2843 -3489 -3475 -4123 -787 -258 -350 2835 4178 4003 6678 7931 6089 7250 8183 5736 5208 5613 2875
2860 2875 2034 2643 -480 -1315 286 -1212 -2378 -208 -665 -1076 1187 1680 492 2261 3381 1526
2876 1526 2058 2664 79 -107 -367 -3693 -4122 -3452 -6421 -7620 -5992 -7380 -7269 -4299 -4822 -4456 -1328
2893 -1328 332 -366 2646 4155 3813 5047 5942 3891 4701 5559 2155 1275 2091 -772 -1807 -751 -2765
2910 -2765 -3400 -936 -1490 -1998 1000 1574 1354 4001 4890 3681 6026 6451 3939 4787 4381 1910 1800
2927 1800 901 -2355 -3397 -2452 -5209 -6273 -4392 -5406 -5510 -2759 -3191 -2881 -13 926 274 2203 2854
2944 2854 1477 2299 1945 -391 181 10 -3231 -3406 -2588 -4593 -4730 -3055 -3992 -3754 -273 127 459 3812
2962 3812 5101 5480 7703 8026 7188 8998 8743 5121 5328 5319 2251 1019 657 -2730 -3545 -2543 -4773
2979 -4773 -5533 -3185 -3819 -3617 -1235 -1336 -1287 1741 1388 -329 1574 1618 -1067 -1070 -1841 -4678 -4906 -5360 -8548
2998 -8548 -9025 -7709 -9550 -9279 -7364 -7743 -6473 -3083 -2552 -1445 1815 2848 2613 5126 5333 4294
3014 4294 5367 4726 1941 2294 2748 210 -192 480 -1461 -726 836 204 745 3497 3933 4433 7301
3031 7301 7163 6889 9157 8711 6742 7750 7344 4145 3493 2578 -370 -783 -820 -3837 -3666 -2250 -3491
3048 -3491 -3207 -1017 -1411 -784 2338 2153 1693 4369 4266 2214 2925 2490 -346 99 -1327 -4909 -5120
3065 -5120 -4980 -7759 -7672 -6449 -7814 -6402 -4340 -4878 -3287 1002 934 1573 4280 4551 4788 6743 5799
3082 5799 3907 4895 4020 794 441 -418 -3262 -3190 -3318 -6183 -5190 -3662 -5287 -5036 -2744 -3279 -2852 -658
3100 -658 -1661 -2144 -78 -895 -3278 -2370 -2766 -4775 -4574 -5154 -7426 -6237 -5342 -6936 -5376 -3215 -3159
3117 -3159 -1276 1639 1622 3136 6695 6423 5993 8517 7916 6655 7623 5885 3408 3923 3186 -379 -289
3134 -289 -231 -2409 -1516 -346 -1771 33 2970 2566 3888 6833 7415 7591 9925 9362 8932 10664 9073
3151 9073 6634 7136 5708 2623 2401 1055 -1875 -1823 -1885 -4766 -4714 -3593 -4919 -4443 -3176 -4699 -4347
3168 -4347 -2645 -4369 -4762 -3475 -4734 -6273 -5454 -6571 -8106 -6355 -6549 -8389 -6628 -4929 -5766 -3855
3184 -3855 -1613 -1464 668 3346 2562 3641 6332 5570 4804 6357 4442 2808 3433 894 -1945 -1624
3200 -1624 -2981 -5472 -5350 -5454 -7541 -5986 -4789 -6186 -4512 -1730 -1748 -254 2156 2280 2895 5062
3216 5062 3873 3373 5430 4366 2687 3517 2194 172 1153 617 -1930 -923 -516 -2006 -1211 29
3232 29 -1498 -616 1366 -291 -10 2277 1015 381 1946 757 -153 1703 391 -757 1204 1493 771
3249 771 2482 3190 2979 5167 6550 5782 7107 8923 7518 7758 8974 7145 6572 6428 3821 1539 2013
3266 2013 -965 -3597 -3841 -5618 -7800 -7303 -7726 -9685 -8116 -7065 -8082 -6704 -4980 -5228 -3486 -2022
3282 -2022 -2680 -2023 365 -404 -1246 518 -487 -1265 -195 -1367 -2536 -774 -1219 -2716 -1225 -972 -1731
3299 -1731 -696 331 -1454 -350 1378 -246 -120 1452 307 93 1470 -90 -606 1327 477 -687
3315 -687 1056 1350 621 2280 3019 1751 3954 5224 3615 4616 5694 4236 4108 4689 2557 2562 2826
3332 2826 424 -1059 -442 -2301 -3922 -3212 -4765 -6235 -4345 -4544 -6104 -4184 -3206 -3977 -2261 -910
3348 -910 -1989 267 1599 231 1192 3411 2124 2154 3437 2689 2211 4111 2938 1706 3486 3244 1798
3365 1798 2688 2759 1399 2725 3220 568 1853 2312 426 560 1002 -976 -1048 375 -1561 -2366 -974
3382 -974 -1757 -2961 -1767 -2008 -3004 -937 -965 -3203 -862 -316 -1684 -882 -379 -1627 -944 -11 -1925 -1990
3400 -1990 -622 -2130 -2543 -1448 -2717 -2926 -857 -1628 -2976 -718 -1014 -1737 -132 265 -486 1402 1600
3417 1600 450 1577 2537 1418 2110 3294 2058 2528 3864 2481 1778 3864 2992 2091 3094 2051
3433 2051 1198 2764 1907 197 1072 1164 -461 -346 -174 -2064 -912 -932 -3056 -2376 -1459 -2931 -3121 -1710
3451 -1710 -2994 -2820 -1791 -2507 -2997 -1258 -1584 -3125 -1582 -1440 -2395 -688 -719 -2020 -742 329 -359
3468 -359 239 1764 697 1351 3033 1816 1992 3933 3246 2361 3859 3098 2487 3369 2555 1041 1925 1864
3486 1864 283 841 1154 -290 105 1132 -783 -335 1153 -264 -493 666 -482 -530 582 -899 -1339
3503 -1339 -62 -922 -2695 -1643 -2167 -3248 -2381 -2124 -3802 -2508 -1701 -3020 -2243 -665 -1621 -1214 -127
3520 -127 -1006 -950 362 7 -871 472 -588 -574 558 -168 -1249 272 494 -807 648 1719 1188 2178
3538 2178 3431 2538 3061 4853 3973 3427 4878 3813 3243 3961 2064 813 1875 137 -1489 -741 -1575
3555 -1575 -3183 -2195 -2270 -3486 -2139 -1604 -2866 -2433 -927 -1549 -1372 -289 -1445 -1277 75 -1245 -2358
3572 -2358 -608 -1339 -2449 -1408 -1662 -2660 -1005 -805 -1743 -549 751 256 1294 2338 1623 2981 3520
3589 3520 2537 2374 3631 2187 1232 2297 914 -119 985 64 -1575 -379 -537 -1650 -403 -26
3605 -26 -819 970 1562 470 1042 2217 1142 1227 1447 -412 -808 180 -1733 -3349 -2189 -3532 -4499 -3767
3623 -3767 -4032 -5152 -3405 -3101 -3753 -2015 -1098 -1358 -115 985 453 1397 2699 1211 1066 2390 1231
3640 1231 827 1252 411 -357 1005 406 -112 1399 1780 1083 2362 3321 2940 4209 5192 3889 4726 5455
3658 5455 4016 3936 4165 2484 1450 2090 193 -1476 -619 -1426 -2773 -1966 -2405 -3240 -1486 -1662 -2619 -1140
3676 -1140 -322 -1538 -876 -310 -1632 -1140 -745 -3009 -3007 -2250 -3928 -4798 -4021 -4717 -5111 -3698 -3612 -4009 -1772
3695 -1772 -909 -1564 656 1794 1332 2799 3748 2302 3003 4009 2380 1502 1849 210 -217 -243 -1619
3712 -1619 -2320 -861 -1819 -2481 -934 -289 -903 1247 1527 827 2686 3240 2097 2649 3270 1801 1702 1950
3730 1950 309 -404 90 -1586 -2223 -1692 -2398 -2645 -1387 -1558 -2223 -215 217 -553 1020 1415 851 1300
3748 1300 2094 632 1013 1870 257 -85 1132 -395 -711 704 -173 -109 1748 1829 1993 3994 4365 3693
3766 3693 5636 5747 4747 5922 5702 3707 3592 3820 1020 778 -28 -2055 -3065 -2909 -5009 -5939 -4613
3783 -4613 -5202 -5951 -4266 -4323 -4304 -2435 -2011 -2663 -1011 -692 -1593 -976 -857 -2105 -1699 -1320 -2727 -3453 -2008
3802 -2008 -3772 -3967 -2457 -3398 -3215 -1617 -1764 -1902 -11 174 -78 1485 1531 510 1742 2013 734
3819 734 666 1325 -173 129 984 -325 87 1532 1048 1395 2789 3115 2985 4986 5308 4751 6267 5722
3837 5722 4628 5717 4925 2970 2937 2081 -227 -747 -1068 -3169 -3559 -3275 -4489 -4243 -3169 -3893 -3397 -1729
3855 -1729 -2030 -1799 392 715 360 2041 2380 1550 2377 2531 644 1466 1883 373 520 956 -298 31
3873 31 1314 34 -11 1633 1027 627 1792 1021 680 1735 791 -587 333 -59 -1708 -1617 -1889 -3368
3891 -3368 -3180 -2763 -3869 -3310 -1922 -2922 -2426 -627 -851 -810 749 151 -66 1207 834 -208 358 -273
3909 -273 -2084 -1773 -1682 -3984 -3893 -3481 -4972 -4622 -3776 -4370 -3643 -2079 -2504 -1352 772 727 1117 2933 3138
3928 3138 3050 4485 4440 3409 4539 4682 3113 3900 4148 2943 2913 3334 2103 2711 3830 2466 2590 3671
3946 3671 2764 2394 3069 2459 1050 1940 1259 -770 -167 -834 -2460 -2171 -2280 -3671 -2765 -2630 -3830 -2659
3964 -2659 -1648 -2847 -1778 -283 -681 -669 942 406 -129 939 541 -417 265 -742 -1992 -1167 -1623
3981 -1623 -2950 -2219 -1886 -3366 -2196 -1415 -2129 -1332 120 -147 144 1953 1443 1207 2574 2125 1479 2816
3999 2816 2007 605 1634 1483 45 640 442 -442 -242 432 -809 -577 450 -449 -605 98 -735 -967
4017 -967 163 -848 -1467 -923 -1560 -2730 -2102 -2029 -3423 -2023 -2260 -3017 -1986 -941 -1736 -786 739 -257
4035 -257 1137 2213 1649 1769 3503 2304 2750 3365 2740 2151 2819 2049 804 2183 1829 50 1028 1526
4053 1526 446 1208 1687 538 978 2087 959 1300 1798 861 569 1621 22 -803 171 -1024 -1696
4070 -1696 -1015 -1689 -2718 -1910 -1898 -2966 -1908 -1596 -2799 -2142 -1276 -2398 -1626 -926 -2005 -2206 -1000 -1866
4088 -1866 -2370 -905 -1742 -2174 -1191 -1571 -2031 -793 -656 -1396 361 821 232 1379 2592 1806 2131 3387
4106 3387 2012 2583 3579 2641 1969 2964 1798 1082 1944 1346 441 1525 1052 -320 1059 790 -114 472
4124 472 1009 -297 74 740 -841 -485 -78 -1319 -1582 -373 -1551 -2287 -1133 -2006 -2892 -1524 -1568 -2246
4142 -2246 -1220 -672 -1624 -562 -163 -880 137 658 -355 226 1171 43 316 1104 227 -278 1107 333
4160 333 -27 1320 1040 60 1563 1379 843 1703 1954 1102 1932 2548 865 1364 1759 430 207 870 -546
4179 -546 -701 -70 -1077 -1679 -777 -1132 -2389 -1101 -1365 -2240 -1149 -1146 -2077 -1199 -955 -2213 -1556 -920 -1923
4198 -1923 -1712 -599 -2152 -1877 -960 -1757 -1579 -445 -945 -736 906 226 297 1843 1992 1057 1997 2315
4216 2315 1415 2231 2796 1263 1893 2376 901 1157 1871 1107 593 1730 805 318 1201 934 249 1679
4234 1679 1042 627 1718 1209 -69 771 1140 -860 -645 -53 -1888 -1347 -724 -2383 -2577 -1541 -2288 -2562
4252 -2562 -1471 -2141 -2152 -920 -1423 -1748 -566 -531 -1496 -51 177 -1086 -191 585 -627 -508 749 -284
4270 -284 142 1197 142 460 1635 1132 1322 2484 1905 1575 3011 2494 1333 2374 2091 550 1326
4287 1326 1534 -325 -112 225 -1162 -833 -448 -1996 -1469 -650 -1862 -2056 -775 -1254 -1655 -210 -926 -1536
4305 -1536 -415 -663 -1888 -678 -726 -1957 -1566 -1166 -2315 -1819 -1089 -2370 -1515 -731 -1276 -881 228 -401
4323 -401 -68 999 726 451 1946 1454 775 1628 1744 617 1885 2004 754 1682 2297 1004 1762 2541
4341 2541 1638 1868 2866 1933 1814 2990 2164 1480 2319 1574 496 1158 476 -1137 -333 -487 -2076 -1656
4359 -1656 -1621 -3127 -2429 -1813 -3166 -2640 -1357 -1950 -2180 -684 -1117 -822 169 -382 -564 265 95 -626 557
4378 557 373 -703 294 540 -1053 91 726 -694 365 1156 -55 642 1420 791 488 1554 967 248
4396 248 1528 803 257 1233 209 -998 435 107 -947 -15 279 -1088 -263 434 -876 -304 766
4413 766 -528 -380 341 -591 -1056 -233 -946 -1822 -900 -1693 -2898 -2011 -2098 -3279 -2122 -1814 -2783 -1964 -602
4432 -602 -1615 -676 632 -19 579 1738 1245 1564 2812 2352 2132 3263 2625 1987 2894 2518 1687 2782
4450 2782 2579 1570 1931 2419 1437 1576 2373 1302 1770 2146 1039 636 1399 450 -398 501 -627 -1327
4468 -1327 -536 -1093 -1935 -885 -996 -2012 -1166 -999 -2152 -1159 -772 -1559 -1239 -35 -1121 -1041 -318 -1474
4486 -1474 -1370 -760 -1761 -2281 -1216 -1844 -2580 -1829 -1465 -2336 -1050 -807 -1743 -819 183 -650 628 1550
4504 1550 740 1045 2305 1175 1563 2569 1597 1110 2184 1173 828 1525 1020 24 938 708 -470 506
4522 506 456 -575 -37 106 -1128 -472 31 -1459 -1424 -509 -2117 -1837 -923 -1671 -2062 -637 -1370 -1680 -684
4541 -684 -582 -1109 361 800 149 1002 1495 438 1410 2410 1307 1575 2321 924 1227 2167 1094 695
4559 695 1881 776 587 1372 927 329 1446 1349 630 1459 1471 660 1331 1635 162 893 1630 312 256
4578 256 934 -482 -759 122 -821 -1171 -591 -1104 -2200 -1471 -1455 -2441 -1731 -1809 -2771 -2082 -1620 -3266 -2450 -1909
4598 -1909 -2868 -3132 -1778 -2655 -2582 -1646 -2142 -1955 -671 -802 -1055 396 411 -114 1386 1808 1038 2262 2372
4617 2372 1720 2438 2761 1436 1742 2411 1758 1104 2050 889 672 1476 652 108 1352 309 -306 738
4635 738 727 -168 1046 943 -409 600 554 -958 -29 227 -928 -987 17 -1251 -1011 -375 -779 -1187 -154
4654 -154 -926 -1251 -125 -339 -1086 149 89 -1067 151 109 -972 -430 -13 -1012 -341 370 -437 -474 755
4673 755 128 345 1599 1184 934 2037 1689 1312 2581 1767 1183 2029 1552 487 1337 1104 -489 0
4691 0 147 -1198 -939 -706 -1720 -1751 -1101 -2015 -2310 -934 -1770 -2241 -1279 -1662 -2147 -1141 -1312 -2154 -1281 -859
4711 -859 -2147 -1163 -873 -1394 -818 189 -865 -308 928 -154 -109 1519 1083 879 1791 1310 866 2469
4729 2469 1769 760 1734 1236 543 1650 1489 -76 957 1480 366 980 1911 768 1284 2074 1488 860
4747 860 2252 1578 1152 1782 1037 387 560 452 -946 -557 -959 -1945 -1345 -1325 -2284 -1810 -1404 -2593 -2192
4766 -2192 -1321 -2177 -2185 -1013 -1718 -1851 -587 -1375 -1552 -557 -635 -1474 155 -171 -868 -40 817 -51 378 1257
4786 1257 302 1031 2047 1473 1417 2325 1756 1415 2390 1618 980 1567 1064 127 629 266 -676 -51 -421 -890
4806 -890 -597 -120 -1009 -908 -214 -917 -401 671 -383 -448 429 -177 -563 282 -127 -1210 -437 -839 -1554
4825 -1554 -881 -1071 -1657 -1165 -1052 -1590 -949 90 -1324 -813 599 134 287 1344 586 425 1901 1007
4843 1007 739 1615 1103 589 1539 1551 650 1436 1655 791 1495 1864 1444 1625 2125 1264 1300 1916 530 388
4863 388 1166 23 -415 -224 -880 -2008 -1110 -2029 -3026 -2224 -2116 -2965 -2343 -2047 -2747 -1882 -1091 -2001 -948
4882 -948 133 -783 -713 432 -355 -841 486 -22 -654 118 -208 -956 -28 56 -870 69 333 -657 511
4901 511 1261 282 812 1752 1100 1130 2070 1328 920 2109 1100 668 1526 540 520 632 408 -281 509 629
4921 629 -567 612 898 -208 287 971 -283 -262 527 -553 -919 57 -1101 -1562 -958 -1915 -2393 -1335
4939 -1335 -1965 -2645 -1619 -1555 -2323 -1039 -597 -1120 -28 895 36 1136 2013 1443 1804 2530 1769 1387 2657
4958 2657 1735 1113 1630 1043 709 1550 887 -6 990 1358 172 804 915 444 722 1087 499 538 949 -375
4978 -375 -328 230 -842 -940 -367 -1463 -2130 -813 -1531 -2230 -1094 -1299 -1774 -866 -953 -1624 -704 -485 -1065 -522
4998 -522 -129 -1327 -920 -264 -1412 -1427 -658 -1673 -1691 -723 -1283 -1556 -545 -538 -886 428 940 237 1269
5017 1269 2146 1621 2512 2968 1996 2431 2972 2086 1875 2180 934 845 1325 293 -521 290 -62 -754 -203
5036 -203 -532 -1052 -518 -761 -1299 -446 -81 -1048 -844 -263 -1309 -1048 -622 -1407 -1272 -385 -1440 -1547 -602
5055 -602 -628 -1303 -10 -117 -848 445 599 175 1149 1753 504 1745 1934 728 944 1618 513 370
5073 370 956 265 7 894 160 -445 707 481 -53 1118 1115 400 1560 1701 1051 1647 1630 337 894 1489
5093 1489 67 -160 285 -974 -1416 -1264 -2269 -2695 -1718 -2594 -3200 -2323 -2483 -2866 -1595 -2158 -2417 -1391
5111 -1391 -1191 -1638 -1165 -696 -1477 -711 19 -833 -727 162 -337 -530 263 79 145 1343 1001 879 1914
5130 1914 1718 1616 2652 2419 1738 2032 2304 1268 1849 1803 819 499 974 -197 -194 556 -450 -877 251
5149 251 -173 -434 525 276 -291 694 570 22 907 1170 24 650 584 -450 -306 -79 -1142 -1296 -726
5168 -726 -1791 -1950 -1052 -1905 -1731 -731 -1376 -1613 -117 -27 -456 187 936 -5 871 1096 504 838 1431
5187 1431 633 575 1199 384 635 1076 523 441 1263 1052 364 1005 1003 300 937 1092 -27 569 266 -874
5207 -874 -562 -554 -2074 -1629 -1368 -2693 -2343 -1762 -2727 -2840 -1955 -2315 -2218 -1285 -1163 -1523 -84 -33 -649 156
5227 156 740 34 730 536 -35 6 368 -333 -228 618 -398 -304 499 -230 -234 1100 502 639 1839 1840 1176
5248 1176 2249 2559 1476 2540 2415 1608 1862 2344 1157 1066 1315 17 266 1031 156 -67 512 199
5266 199 -580 256 246 -248 272 47 -1112 -183 -385 -1523 -1041 -1079 -2149 -1900 -1829 -2589 -2537 -2101 -2458 -2289
5286 -2289 -1458 -1835 -1488 -313 -339 -340 790 853 437 1598 1589 1151 1422 1498 555 1020 1198 94 422 590 -446
5307 -446 54 546 -284 -645 668 370 -6 776 805 302 1047 629 171 839 726 -226 213 -23 -1084 -1204
5327 -1204 -629 -1796 -1441 -638 -1489 -1532 -580 -1201 -1083 -173 -791 -699 424 135 -684 287 155 -657 364
5346 364 0 -398 -14 235 -738 -452 26 -226 -127 1029 708 933 1874 1568 1538 2570 2307 1713 2641 2234
5366 2234 1732 2183 1886 1002 1031 837 -77 -78 268 -1113 -986 -327 -1227 -1339 -251 -937 -979 -358 -526 -1218
5386 -1218 -305 -481 -1332 -581 -765 -1786 -1026 -1201 -2132 -1604 -1361 -2126 -1622 -945 -2121 -1216 -589 -952 -527
5405 -527 412 164 351 1394 940 732 1826 1640 399 1257 1334 265 504 954 171 549 809 237 474
5424 474 1100 608 1046 1451 1406 1032 1711 1139 1256 1423 967 299 525 271 -546 -496 -495 -1840 -1031 -1143 -2367
5445 -2367 -1679 -1037 -2078 -1719 -843 -1385 -1345 -61 -475 -787 -80 -141 -817 136 -127 -603 55 -72 -1049 -310
5465 -310 -137 -780 -305 532 -352 471 1179 565 1055 1496 1003 1207 2167 1602 1176 1798 1462 515 1276 1095
5485 1095 -374 277 162 -904 -193 -116 -1092 -788 -189 -1001 -656 262 -238 -620 245 -222 -438 115 -716
5504 -716 -1059 -665 -705 -1782 -894 -1208 -1774 -1140 -1270 -1764 -1029 -591 -1098 -530 74 21 73 1141 759 620
5524 620 1642 1067 993 1611 1443 659 1487 1459 414 1108 1035 588 1036 1199 428 572 1387 512 690 1379
5544 1379 978 391 1187 533 304 530 -60 -679 -230 -684 -1450 -615 -1247 -1818 -1284 -1448 -1954 -1463 -746 -1554
5564 -1554 -1331 -693 -1305 -662 33 -517 -1129 -94 -194 -702 -138 -296 -695 44 -234 -809 -62 450 -578
5583 -578 -118 576 -3 385 853 787 1028 1934 1369 1524 1920 1597 1321 2071 1619 970 1048 927 355 788 445
5604 445 -307 204 532 -435 -454 14 -820 -482 -121 -946 -853 -305 -979 -1546 -750 -903 -1461 -640 -1129 -1541 -847
5625 -847 -1184 -1887 -774 -411 -1048 -335 150 -369 -60 929 195 572 1540 635 904 1599 1101 954 1392 1009
5645 1009 502 1439 1090 482 701 308 -186 273 532 -488 238 493 183 146 900 -171 -56 871 93
5664 93 -85 751 303 -535 95 -248 -1222 -383 -1083 -1415 -1137 -1082 -1869 -1176 -1049 -1910 -1496 -716 -1465 -1417 -552
5685 -552 -1076 -1275 -328 -774 -984 -20 -375 -632 397 384 -118 792 1080 152 1225 1192 786 1190 1822 1538
5705 1538 1545 2261 1404 1618 2360 1422 861 1394 687 127 773 297 -786 -235 -352 -1256 -882 -740 -1588 -1316
5725 -1316 -869 -1473 -1047 -451 -1071 -822 37 -640 -614 254 -457 -532 161 -196 -1074 36 -110 -1073 -256 -255 -943
5746 -943 -569 -403 -1076 -157 199 -624 -48 414 93 305 1074 770 541 1664 1226 604 1440 1014 386 1538
5766 1538 1348 712 1159 1149 626 1007 1350 423 698 890 351 766 1229 177 -106 376 -505 -1100 -505 -1371
5786 -1371 -1890 -1382 -1746 -2679 -1754 -1916 -2390 -2000 -1604 -1785 -1430 -353 -1325 -779 548 77 183 1127 686
5805 686 365 1036 1129 439 916 440 -114 866 379 -279 317 283 -291 231 801 188 342 1610 850 540
5825 540 1347 687 743 1147 591 455 948 253 -297 -8 270 -721 -250 82 -773 -478 174 -574 -419 527
5845 527 -300 -380 280 -301 -600 -432 -609 -1006 -641 -946 -1948 -1308 -1391 -2031 -1044 -1030 -1614 -872 -257 -477 34
5866 34 1121 661 1053 1796 1401 1774 2274 1769 1359 2119 1571 900 1320 610 170 847 530 -535 313 317
5886 317 -550 313 125 -260 466 448 -315 -81 672 -213 -463 47 -803 -1327 -667 -1381 -2113 -1358 -1644 -2408
5906 -2408 -1649 -1663 -1844 -1214 -948 -1195 -387 335 -403 -194 850 159 507 1004 -15 111 671 -26 -519
5925 -519 302 -179 -727 208 335 -240 548 1030 605 1191 1422 1308 1717 2546 1476 1946 1940 1173 1475 1364
5945 1364 884 -191 626 -229 -1141 -457 -754 -1417 -789 -777 -1111 -469 -130 -926 -185 516 -484 -178 -11
5964 -11 -760 -556 -47 -1010 -1386 -599 -1251 -1926 -1130 -1614 -1711 -1182 -888 -1129 -267 -153 -196 744 1644 1004 1470
5985 1470 1814 1246 1471 1850 1213 1091 1464 565 123 457 235 -206 203 -248 -523 212 184 -429 456 726
6005 726 32 371 957 6 113 432 -976 -922 -390 -1196 -1863 -1324 -1704 -2077 -1601 -1197 -1872 -1029 -914 -906 251
6026 251 240 -172 553 1002 302 813 982 668 331 891 -116 -354 213 -487 -626 -142 -593 -548 512 295
6046 295 74 1299 1824 1062 2186 2365 1630 2207 2298 1447 1734 1843 766 450 1149 -117 -535 -350 -870
6065 -870 -1378 -577 -1142 -1648 -636 -649 -1186 -660 -227 -1053 -603 -405 -1145 -935 -913 -1720 -1307 -1237 -1659 -1919 -1070
6086 -1070 -2005 -1586 -1082 -1076 -1025 137 42 197 1069 1464 841 1662 2137 1444 1727 1739 803 497 1209 329 150
6107 150 134 -288 -762 -51 -209 -1034 444 -78 -24 921 760 720 1046 1332 467 1141 1163 41 437 713 -416
6128 -416 -717 -286 -1026 -1260 -806 -1460 -1425 -904 -1487 -1303 -597 -306 -878 39 122 -450 228 418 -137 -96 390
6149 390 -569 -387 -52 -704 -322 36 -62 -352 568 574 560 1311 1276 1244 2110 2125 1140 2047 1939 1186 1494 1201
6171 1201 462 -181 105 -469 -853 -713 -1563 -1406 -942 -1757 -1579 -681 -885 -1184 -291 -261 -866 179 -37 -806
6191 -806 -230 -75 -984 -588 -486 -1376 -1176 -875 -1358 -1424 -1023 -1027 -1393 -238 -425 -333 871 730 466 1265 1628
6212 1628 713 1498 1393 681 1153 1148 379 940 773 193 612 472 210 169 858 439 275 1314 1121 909
6232 909 1390 1208 416 1138 602 58 240 -22 -964 -595 -523 -1588 -1410 -1212 -2093 -1654 -1087 -1321 -1548 -673
6252 -673 -981 -812 -22 -137 -398 150 252 -436 173 106 -636 -103 -275 -693 -739 -189 -413 -336 311 -219 288
6273 288 1068 631 626 1421 1500 1430 1641 1638 614 1232 1148 86 727 310 -63 137 -42 -782 -920 -421 -1132 -808
6295 -808 -329 -904 -767 -237 -485 -710 -100 -359 -999 -176 -459 -1192 -372 -176 -1427 -758 -475 -1419 -570 -461
6315 -461 -990 -505 398 -170 34 785 553 681 1261 948 670 1401 854 343 844 828 -85 544 788 -14
6335 -14 323 732 81 279 917 200 534 964 501 681 1470 866 671 1079 529 214 247 288 -477 -174 -541
6356 -541 -1422 -795 -775 -1769 -1592 -1127 -1958 -1437 -1067 -1643 -1506 -787 -1293 -1189 -426 -560 -1117 -44 -466 -391
6376 -391 67 62 -36 328 884 116 396 957 545 713 1612 968 1018 1730 1103 657 1846 1022 429 1325 690
6397 690 -95 430 282 -251 175 -76 -675 -300 -24 -991 -477 169 -351 -280 409 -415 -242 335 -538 -331
6417 -331 299 -227 -728 134 -495 -1013 -228 -365 -1015 -726 -620 -1395 -974 -371 -1028 -856 -52 -785 -287 203
6437 203 98 -138 764 256 62 950 858 94 1421 1195 737 1107 1427 761 1189 1422 915 895 1178 481
6457 481 356 757 265 63 558 3 -709 -78 -650 -1248 -482 -764 -1663 -615 -953 -1472 -1017 -891 -1767 -1119
6477 -1119 -576 -809 -852 -330 -948 -968 -77 -452 -408 217 -121 -285 566 407 48 691 717 251 998 776 222
6498 222 706 910 406 301 1067 299 321 789 33 432 729 656 442 910 740 315 1143 857 -29 643 672
6519 672 28 469 85 -72 315 140 -742 -540 -157 -892 -823 -490 -948 -1216 -664 -1009 -1301 -674 -597 -1262 -188
6540 -188 -438 -699 -312 -344 -622 -370 -100 -429 -275 -5 -360 338 740 116 690 1121 684 783 1181 1189 853
6561 853 1339 1129 836 1327 902 494 799 1066 6 480 598 -254 163 302 -410 -665 -14 -204 -718 57
6581 57 -439 -818 -306 -358 -731 -257 -542 -1239 -465 -828 -1224 -1017 -570 -1551 -1091 -599 -1061 -1136 -212 -849 -736
6602 -736 484 -74 12 875 260 511 705 785 239 1115 714 511 545 431 22 508 824 -168 167 993 279
6623 279 583 748 424 600 1362 879 603 1643 900 505 871 740 -79 358 239 -612 -341 -143 -1070 -942
6643 -942 -482 -1089 -788 -375 -1216 -1091 -268 -739 -1015 -462 -676 -762 -57 -399 -875 -455 -200 -805 -301 -111
6663 -111 -769 48 403 -196 301 812 688 858 1482 1048 1170 1332 1311 1172 1475 1034 618 881 846 -153 -22
6684 -22 -117 -597 -400 -195 -568 -791 -329 -588 -345 121 -587 -317 230 -457 -378 104 -258 -652 -433 -375 -754
6705 -754 -303 -764 -1402 -844 -670 -1572 -1027 -420 -1024 -612 -175 -570 -189 524 81 57 840 201 144 719 667
6726 667 268 434 664 -55 564 686 -125 878 901 394 939 1165 867 1361 1708 1018 1258 1340 1017 551
6746 551 1372 557 27 47 -41 -847 -817 -855 -1712 -1461 -1035 -1629 -1182 -854 -1103 -957 -578 -431 -407 123 -163 -378
6768 -378 -33 36 -189 67 -188 -771 -55 -137 -707 -298 -116 -422 7 321 34 459 826 561 347 1345 740
6789 740 615 1267 689 231 989 277 -75 495 124 -256 349 232 -255 -13 152 -382 213 278 -149 383
6809 383 379 -268 366 377 -234 -685 -206 -454 -940 -905 -984 -1399 -1185 -1267 -1586 -1005 -759 -1152 -398 -466 -806 -81
6831 -81 318 -44 563 1274 694 636 1289 636 562 1052 761 253 952 496 444 531 655 436 522 885 336 1149
6853 1149 1478 593 945 1196 540 812 1017 478 73 151 -70 -834 -579 -672 -988 -555 -973 -1263 -1009 -794
6873 -794 -1249 -487 -293 -1013 -424 -267 -646 -589 27 -491 -970 -252 -319 -339 -255 -433 -974 -363 -405 -684 47 31
6895 31 60 702 843 435 643 1336 839 1182 1303 893 496 1066 671 545 692 318 -326 271 225 -147 -185
6916 -185 -14 -69 258 407 -408 136 392 16 190 440 -334 -98 230 -477 -591 -415 -1021 -1095 -592 -1064 -1269
6937 -1269 -648 -995 -1138 -559 -405 -689 -446 195 -526 -24 656 -75 192 706 216 444 834 246 492 716
6957 716 550 291 522 691 542 708 856 518 913 1320 748 1028 1207 610 687 664 71 65 460 -317 -470
6978 -470 54 -801 -911 -390 -999 -1256 -625 -650 -1154 -610 -347 -628 -483 -347 -517 -13 343 -394 -532 -85
6998 -85 -555 -581 165 -605 -700 -128 -666 -770 -144 -372 -493 470 201 28 112 384 309 516 1288 474 556 1409
7020 1409 489 695 1065 799 242 792 355 381 802 624 -51 562 336 143 199 290 40 200 88 -659 -144
7041 -144 -108 -1123 -810 -661 -1230 -1161 -945 -1127 -1254 -958 -1171 -967 -537 -580 -977 -386 -12 -305 255 500 3
7062 3 654 510 370 373 810 338 424 855 350 100 606 128 -190 314 340 165 427 541 231 541 701 347
7084 347 562 583 111 674 720 222 132 420 -510 -620 126 -373 -728 -128 -474 -592 -304 -536 -741 -269 -370
7105 -370 -1000 -433 -329 -788 -490 -431 -1288 -744 -436 -928 -985 -422 -409 -723 -320 -505 -332 119 86 106 421 459
7127 459 193 925 919 513 1308 1121 650 1028 1043 531 694 1126 567 201 744 174 7 140 -42 -523 370
7148 370 -109 -333 402 -368 -404 -505 -404 -612 -58 -71 -614 -464 -762 -1064 -553 -479 -665 -661 -654 -859 -273 -102
7170 -102 -363 -703 -211 -324 -774 -30 105 -432 -138 92 -277 162 205 17 170 500 313 239 527 435 279
7191 279 841 469 396 928 701 425 824 904 524 774 671 295 321 470 -330 -43 535 -769 -343 58 -861
7212 -861 -755 -398 -419 -923 -474 -889 -919 -298 -699 -1053 -379 -201 -1111 -391 -305 -718 -168 -34 -305 -308 461 -137
7234 -137 130 398 53 143 763 82 352 710 387 355 558 652 429 909 892 153 619 693 208 466 689 31
7256 31 121 481 136 92 330 222 -111 201 -223 -105 277 94 -296 -17 -176 -758 -295 -93 -766 -424 -142
7277 -142 -793 -813 -469 -629 -1098 -620 -484 -820 -129 -421 -909 -22 -141 -162 257 -98 -36 588 389 293 197 562
7299 562 305 582 800 296 188 1054 223 521 784 261 558 1078 909 142 784 729 -19 343 699 -164
7319 -164 165 230 -181 -251 -182 -439 -585 -209 -944 -936 -640 -537 -725 -437 -416 -963 -296 -634 -678 63 -517 -743
7341 -743 -52 24 -677 -436 28 -390 -404 75 -193 79 400 -40 175 677 585 131 759 495 507 960 545
7362 545 412 934 727 382 907 860 393 324 690 145 362 558 -317 -165 172 -129 -406 276 -134 -546 -280
7383 -280 -331 -524 -92 -154 -561 -365 -576 -771 -737 -200 -1151 -1262 -334 -1050 -680 -273 -671 -428 -80 -213 -208 87
7405 87 119 152 511 297 -69 419 410 -62 303 430 182 376 724 380 165 369 452 343 854 438 64 395
7427 395 398 146 765 592 -32 408 257 181 745 166 -450 -103 237 -676 -651 -133 -583 -820 -386 -239 -785
7448 -785 -245 -438 -829 -453 -403 -712 -247 -281 -832 -301 -229 -862 -359 76 -781 -171 88 -27 180 1000 164
7469 164 57 547 497 128 847 602 90 823 616 141 747 584 156 543 532 -46 215 183 -468 98 -25
7490 -25 -407 -344 93 -189 -334 -61 -420 -106 204 -127 -638 -306 -451 -574 -188 -240 -752 -456 -586 -755 -376
7511 -376 -199 -1003 -519 -139 -387 -392 141 -337 -268 417 305 83 404 302 304 308 280 378 479 732 158 466 736
7534 736 293 632 598 158 759 1065 669 378 776 595 315 881 440 -308 9 194 -479 -473 -465 -795 -357 -719
7556 -719 -527 -560 -164 -799 -703 -618 -757 -868 -134 -704 -391 166 -122 -73 -75 91 -192 -91 -140 -132 -40 338 -215
7579 -215 436 387 -199 226 363 -30 304 678 190 304 1030 564 491 567 311 91 489 694 77 739 519
7600 519 -170 491 516 143 460 445 -43 169 287 -76 -31 -172 -226 -489 12 -148 -708 -351 -557 -965 -567
7621 -567 -728 -1207 -582 -532 -811 -806 -364 -580 -550 -166 -347 -433 52 258 217 658 265 274 625 442 335 863 349
7644 349 432 728 713 330 529 520 184 677 792 96 330 685 6 526 796 210 -82 196 191 37 404 -34
7666 -34 -751 -153 -209 -320 -411 -425 -576 -297 -24 -674 -661 -38 -544 -351 -359 -408 -450 33 -272 -599 -530 -427 -853
7689 -853 -284 -666 -912 -140 -128 -154 -109 453 -272 41 699 -198 530 926 512 774 1166 612 518 834 711
7710 711 584 858 343 331 610 245 194 226 156 -74 -253 51 -549 -358 107 -572 -675 207 -504 -675 -163
7731 -163 -904 -762 -263 -495 -687 -375 -353 -943 -298 -57 -354 -184 -212 -724 -97 219 -583 145 254 -107 -101
7752 -101 97 5 132 531 353 102 546 184 12 290 261 382 105 228 296 715 633 581 336 634 428 738
7774 738 401 369 244 462 -61 -90 624 204 -617 -136 -258 -841 -609 -661 -663 -331 -375 -894 -991 -650 -851 -616
7796 -616 -162 -558 -177 -92 -26 -634 -144 -80 -551 91 279 -254 448 499 -82 533 583 91 509 861 109 430
7818 430 622 174 401 529 -129 301 749 584 -15 589 324 -109 272 57 -68 221 205 -424 146 327
7838 327 -424 -258 317 -360 -304 185 -192 -169 -8 -390 -539 100 -438 -694 -205 -279 -576 -361 -569 -852 -458
7859 -458 -386 -644 -593 -97 -225 -108 539 -55 -286 529 526 68 438 228 287 959 640 334 545 489 239 595
7881 595 833 9 234 577 268 240 439 287 101 495 15 -5 86 -401 -510 -113 -412 -873 -173 -443 -457
7902 -457 -424 -413 -643 -604 -293 -379 -204 -79 -279 -220 71 -234 -539 33 -367 -560 114 -130 -88 185 159 -562
7924 -562 -59 308 -271 214 231 41 467 599 279 157 557 423 314 962 412 569 631 458 392 487 325
7945 325 75 505 386 -169 90 15 -454 55 -113 -377 -339 -367 -235 -143 -155 -395 -430 -158 -601 -784 -411 -799
7967 -799 -527 -249 -428 -1037 -503 -256 -500 -231 35 -308 140 459 19 162 437 -115 80 739 91 181
7987 181 158 394 154 249 159 -142 292 92 -29 305 685 45 354 295 -32 274 684 145 76 469 -28 175
8009 175 -54 -48 -488 3 -344 -245 -41 -76 -828 -76 -195 -582 -299 -194 -250 -523 -211 -686 -333 -97 -405 -440
8031 -440 -84 -712 -491 114 -113 -179 190 263 -46 273 528 8 601 632 528 799 916 346 312 744 277
8052 277 602 727 282 468 257 146 208 409 -110 -337 -27 -75 -557 -299 -53 -438 -353 -287 -532 -197 -185 -412
8074 -412 -511 -99 -615 -306 -185 -488 -497 -249 -480 -669 -61 -11 -215 42 -606 -391 -25 -288 -414 -209 298
8095 298 -201 -112 193 -18 7 381 -56 -23 733 105 522 505 480 324 697 432 384 610 881 474 827 599
8117 599 65 540 391 24 60 307 -388 -226 -150 40 -360 77 -281 -524 -272 -66 -837 -50 -202 -444 -125
8138 -125 -323 -349 -171 -322 -509 -186 -38 -440 -447 116 -8 -218 295 11 -176 506 92 197 372 512 111
8159 111 205 215 221 371 406 55 143 482 -329 -142 69 95 -197 120 -9 -124 125 348 -26 200 46 -38 39
8182 39 201 -182 -39 135 -700 -144 -296 -693 -494
8191d94
$$ Imaginary data points
##PAGE= N=2
##DATA TABLE= (X++(I..I)), XYDATA
0 0 0 0 0 0 -8 8 -8 8 -16 16 -22 29 -32 40 -48 62 -70 87 -102 118 -141 165 -190 217 -253 288 -328 372
28 372 -424 478 -538 607 -680 763 -850 948 -1050 1172 -1297 1439 -1592 1765 -1953 2165
44 2165 -2398 2658 -2953 3290 -3676 4122 -4650 5282 -6056 7033 -8304 10043 -12568 16608
58 16608 -24110 42912 -190661 -237942 88204 18738 -29381 78952 330150 414302 341722
69 341722 187936 203662 342495 371028 172252 -1505 -25378 59935 83517 -42696 -207352
80 -207352 -161686 4759 61017 8285 13153 120112 288801 372718 308798 261409 356292 444253
92 444253 410611 311833 236718 240207 278963 211942 77743 51170 111800 125784 93095 59554
104 59554 69869 169945 271970 275723 264520 310841 351005 363449 354770 301289 239441 183191
116 183191 75893 -37954 -89085 -150122 -257385 -336269 -384234 -420675 -415050 -407300 -416557 -366384
128 -366384 -276094 -229252 -185196 -103853 -23472 46248 83129 58876 51492 86880 63867 -17158
140 -17158 -73325 -118877 -170260 -210054 -274636 -339418 -331268 -309663 -335974 -334501 -279613 -223125
152 -223125 -170744 -135914 -114431 -37006 59808 63897 23019 30557 55884 64220 36855 -47166
164 -47166 -109291 -82921 -67021 -114092 -142112 -124872 -87532 -35601 -9324 1399 77098 175473
176 175473 208320 220113 257203 285747 307460 306750 248974 196378 184560 139124 59432 13083
188 13083 -23502 -69492 -97853 -122738 -126444 -75241 -35679 -40348 -3734 82962 153551 203022
200 203022 229424 235574 280979 338000 315134 258002 239327 221059 176633 118990 41103 -11995
212 -11995 -14478 -45638 -113413 -130618 -104749 -89121 -74467 -70253 -64145 -4899 56277 46879 31165
225 31165 52917 60538 45648 16657 -36109 -67782 -72357 -121121 -188821 -202600 -200227 -215276 -223929
238 -223929 -233400 -223323 -159898 -108458 -106477 -80049 -20888 14392 34933 47767 41424 50399 56546
251 56546 8694 -38633 -40404 -56495 -101355 -138535 -170317 -174723 -143237 -143531 -168673 -136059 -71324
264 -71324 -32358 -1782 30979 67182 131025 175253 158380 151133 177801 175969 143879 108440
276 108440 67077 50345 51603 8180 -48354 -49288 -34901 -42449 -42642 -39488 -26574 18754 48623
289 48623 45825 72281 114711 118110 108790 105725 93286 92092 82491 26232 -19058 -15168 -25575
302 -25575 -62679 -82988 -91627 -85970 -61095 -63149 -75346 -36100 12814 23420 33770 55782 77743
315 77743 111746 120068 80976 64150 80395 61382 17483 -12345 -37645 -46083 -44182 -73339 -99925
328 -99925 -77394 -57244 -63378 -54153 -34674 -12302 24385 37375 25270 47757 83279 74169 53080
341 53080 44609 30441 21380 6744 -38259 -66055 -56303 -66513 -93635 -94677 -84954 -71317 -49864
354 -49864 -52532 -58217 -18482 18762 14000 15745 35351 48468 62463 58244 25382 17547 30319
367 30319 7221 -27478 -36397 -40336 -38988 -34591 -52682 -57129 -18775 2048 -8337 1376 25286
380 25286 42371 63123 64327 48940 64824 85287 65071 42693 40202 29613 18559 3286
392 3286 -31212 -43174 -24506 -32767 -55755 -46753 -30807 -22167 -9198 -13018 -19417 7155 25082
405 25082 7521 4384 17691 18667 17269 5395 -21299 -21802 -9766 -34610 -61367 -55260 -49078 -48940
419 -48940 -43855 -52469 -49377 -15044 -2105 -14822 -3970 17490 25786 32675 28556 17664 35969
432 35969 50733 28159 15222 27269 26717 20164 14114 -3018 -1964 20387 15031 -1120 13047
445 13047 29887 31659 34524 27342 22023 41723 44347 18169 13733 26700 20927 11643 1434 -16106
459 -16106 -12870 -1911 -23763 -42361 -29804 -23945 -28526 -28169 -34493 -30605 -6229 -6051 -23280 -11265
473 -11265 5571 1336 137 -2971 -10366 4140 13926 -6404 -11733 6374 6922 -1461 -4041 -13367
487 -13367 -8462 6737 -5692 -20538 -4357 6626 -504 -384 -2932 -4956 13041 15585 -3750
500 -3750 2467 23243 21549 17651 19557 17534 29614 41015 24522 15961 33009 33351 20068 15460
514 15460 7058 4079 13805 2337 -19843 -12853 -3397 -17375 -26173 -28996 -33680 -23864 -20425 -38351
528 -38351 -36561 -16576 -18342 -26113 -23901 -26955 -22253 -10757 -23425 -34396 -16192 -6771 -16372 -14678
542 -14678 -8781 -4116 11251 13765 1913 13833 32782 26030 20934 25088 22303 26447 29363 8445
556 8445 -2579 8199 -1484 -24092 -31153 -37406 -42451 -36802 -45398 -56272 -38264 -23007 -27979 -23343
570 -23343 -10092 -1944 14928 25106 17591 27805 49799 45054 34733 37298 32845 28018 26920
583 26920 7463 -8599 -98 -3190 -21183 -22250 -17890 -17205 -6387 -4799 -12243 3507 22268 15311
597 15311 13255 25049 28023 33559 38878 27615 24920 39560 33438 18744 22155 24135 24389 32853
611 32853 30377 27591 47815 60712 52412 55680 65545 63406 63960 60006 41290 36857 37852 13095
625 13095 -12337 -20038 -34760 -52080 -63404 -85636 -98786 -88780 -90572 -103413 -93645 -77625 -68305
638 -68305 -50227 -38943 -36412 -15297 3430 -1777 -1703 7465 3046 -1339 -4477 -21349 -30402 -27899
652 -27899 -44499 -64892 -63447 -64548 -69996 -65046 -64579 -63727 -43608 -31202 -34491 -20719 -2036 1041
666 1041 5656 10136 5182 12686 22484 8771 -2094 6498 7827 5112 8969 4991 6762 26506
680 26506 33833 32360 49382 66406 71667 84005 91191 87455 94103 96004 75483 63273 60750 43136
694 43136 24564 11486 -8431 -19661 -18378 -31107 -41692 -31608 -24105 -20698 -4086 8707 19034
707 19034 43828 59684 60150 75491 91993 89327 86440 83002 68322 60008 53921 29600 10776
720 10776 6499 -8179 -23377 -26530 -34604 -39727 -31844 -35096 -42371 -27521 -14750 -18033 -15028 -12240
734 -12240 -16918 -11938 -12430 -32263 -42904 -43858 -57696 -68499 -72883 -85329 -88830 -80368 -84315 -85551
748 -85551 -67378 -56774 -53284 -37549 -26841 -23373 -9483 -1732 -7020 -3167 -1191 -14878 -22995
761 -22995 -28214 -44889 -56092 -63073 -80016 -83292 -72026 -73065 -74499 -57726 -42109 -26126 -300
774 -300 13405 22784 49052 72028 79392 90353 97371 93835 97736 97009 80143 72591 69869 50344
788 50344 35847 32632 23004 18917 26071 21998 19232 33983 42965 45893 57741 62387 58688 64715
802 64715 65997 57445 58571 54236 34418 24070 19218 2310 -8820 -12985 -26798 -31413 -21482 -21616
816 -21616 -21583 -7363 833 5922 20102 25550 25610 34756 34248 21973 20717 17482 800 -10525 -22868
831 -22868 -45158 -53637 -53580 -68937 -81077 -80114 -81362 -76541 -60197 -53485 -46203 -26022 -14502 -8624
845 -8624 7071 14012 10827 15927 13592 132 -1711 -4245 -20853 -31264 -37412 -53814 -61466 -58198
859 -58198 -62888 -63452 -54572 -51860 -44373 -24276 -14307 -10599 3253 10788 12795 22977 23318 11289
873 11289 11254 12338 1241 -3071 -5966 -17096 -18235 -12732 -17553 -15091 -2075 1846 9417 26720
887 26720 35855 46304 66782 73266 70401 77499 78665 71175 70980 64886 44836 35686 30698 16483
901 16483 9960 6160 -8409 -12651 -5611 -7077 -3902 7850 9861 14468 30284 34325 32798 42248
915 42248 42119 32622 30843 23215 7803 1994 -6475 -26071 -35242 -38478 -47944 -50015 -48438 -55676 -53935
930 -53935 -39270 -34766 -30242 -16678 -12367 -8610 6369 10922 6843 9390 5558 -4791 -4921 -8168
944 -8168 -21612 -25952 -28009 -37946 -37723 -31640 -34840 -30215 -18072 -15903 -9705 6569 14718 20173 31244
959 31244 31447 29682 38530 38422 26890 22242 14789 1772 -121 -5824 -21078 -24730 -22062 -28057 -25935
974 -25935 -17619 -17617 -12671 -597 1489 5482 19263 22341 20175 25031 21960 15557 18112 12756 -1584
989 -1584 -5555 -10465 -21993 -21909 -20816 -29118 -28706 -21949 -21191 -12995 917 1952 5267 19177 23816
1004 23816 25832 33099 30283 24772 29272 25420 12947 10891 6799 -4540 -7728 -11557 -21357 -17791
1018 -17791 -11238 -16450 -15315 -5387 -2393 4883 15365 12968 12167 21758 21464 16258 17641 11815 1076
1033 1076 443 -3627 -14596 -16091 -19347 -30264 -29288 -24136 -27725 -24257 -16780 -16194 -8513 4922 6703
1048 6703 9742 21235 21517 19286 23119 20853 16231 19505 13723 1726 2947 3531 -3250 -3678 -4704
1063 -4704 -10422 -4007 4779 1526 4663 14958 16544 20105 28589 26666 25443 30917 24652 15524 16758
1078 16758 12585 2440 72 -5950 -15135 -12887 -13203 -23547 -23389 -19550 -23518 -20599 -13358 -14979 -12015
1093 -12015 -4351 -7607 -7647 -212 -3738 -11264 -10980 -15823 -22015 -19123 -24481 -34005 -30896 -28435 -34385
1108 -34385 -31061 -26237 -27074 -20194 -12989 -15695 -8385 5889 7863 8935 15478 15629 17600 24605 18072
1123 18072 9218 13502 12811 5875 7145 5743 537 5203 7651 1553 5002 11422 7315 9576 16354
1138 16354 15264 18302 24383 19263 17407 23735 19316 11857 13245 8931 2441 3959 -8 -7071 -1440
1153 -1440 424 -6918 -5170 -421 -945 3582 6389 -3 3208 13228 10649 8171 11964 8876 6378
1168 6378 9093 1722 -4739 -664 -3217 -11127 -9041 -7065 -9317 -4352 -3004 -8528 -2322 4995 908
1183 908 1923 7990 6900 8910 13305 7859 5467 10942 5792 -2265 -550 -3880 -9560 -9265 -13910
1198 -13910 -20425 -15107 -13304 -20800 -19973 -15380 -18491 -16376 -13842 -19126 -16345 -9168 -13579 -16288 -9669
1213 -9669 -9804 -11455 -9389 -13836 -16119 -7634 -8320 -14867 -9685 -5007 -5422 145 2574 -1546 5174 12127
1229 12127 6657 7814 14644 13017 13583 16713 11802 11676 18328 13837 7401 11973 11171 7162 9990
1244 9990 7793 4296 10658 12983 6287 9666 15507 12250 12113 13387 8912 11621 16069 8242 4312
1259 4312 9398 6917 2526 2671 -2915 -6911 -2136 -6210 -14650 -11456 -9064 -13788 -13011 -12775 -16437 -11054
1275 -11054 -7599 -14443 -13712 -5791 -7657 -7540 -4121 -6750 -4452 2531 -665 -4362 2872 5291 1486
1290 1486 4371 4746 2622 9282 10025 3191 6770 13283 9072 8258 9685 5692 7849 11555 3741 868
1306 868 7353 5512 598 2357 -134 -1966 2907 -609 -7860 -2390 340 -5369 -4751 -3975 -6324 -1684
1322 -1684 776 -7183 -5364 1274 -2648 -5509 -2833 -5536 -5467 -940 -6269 -10732 -3674 -3315 -9117 -8079
1338 -8079 -7743 -9957 -5257 -6007 -12887 -7262 -790 -5065 -4668 -644 -1456 1726 6215 769 520 9156
1354 9156 8015 3977 7402 7649 6831 10901 6722 1209 6600 8191 130 -370 1128 -2104 896 1161
1370 1161 -6025 -4465 2040 -3334 -7502 -4343 -6103 -6004 -2740 -8249 -10226 -3090 -3071 -8769 -5807 -4434
1386 -4434 -6068 -2320 -3324 -8016 -1403 5022 -354 403 6198 5943 8532 11851 6926 7654 15561 12551
1402 12551 7804 11996 12561 11470 14323 10499 6208 12645 13472 5017 5952 9486 7341 9376 10495
1417 10495 5031 8543 15275 9459 5532 9392 8013 6133 7235 1329 -1641 4446 1084 -7430 -5664
1432 -5664 -5218 -9836 -10049 -12662 -18909 -14592 -11333 -18708 -19518 -13923 -14952 -15158 -13464 -17797 -16680 -10062
1448 -10062 -14433 -19079 -13046 -11466 -12884 -10037 -11814 -13621 -6350 -4821 -11751 -8624 -2574 -3062 -921
1463 -921 981 -1248 3956 10694 5405 3965 10362 9588 7589 9544 5923 4887 11300 8264 851
1478 851 4899 7951 3866 3971 3139 -486 5004 7087 791 1812 8126 6558 6069 7124 3087 4797
1494 4797 9576 3575 -1572 4086 4657 159 1557 -276 -2384 3117 1443 -5534 -2283 3237 649
1509 649 739 2245 505 5473 10051 3563 2827 10127 8850 5227 6704 4778 4072 8998 5729 25
1525 25 5348 7643 3372 3177 2718 494 5242 5597 -2130 -72 5900 2297 -4 1293 -2102 -2440
1541 -2440 231 -6358 -11417 -5948 -7024 -13302 -12638 -13456 -14588 -10750 -13253 -20038 -14662 -9677 -14021
1556 -14021 -13835 -11187 -12078 -7935 -3979 -9511 -8896 -1320 -2770 -6647 -3623 -3806 -3530 512 -3045 -6408
1572 -6408 1210 4702 -255 865 3216 2572 7496 9060 3730 6888 14212 11299 8990 12773 12161
1587 12161 12330 14444 8411 6213 12336 11006 4518 5378 5479 3335 6609 4172 -2214 2284 5756
1602 5756 -469 -1843 945 -1027 -411 691 -4765 -4463 1427 -3016 -8726 -5925 -6623 -7969 -5593 -9988
1618 -9988 -13193 -6184 -4160 -9797 -8171 -4059 -4695 -1729 -716 -4221 551 6757 2810 1233 5756
1633 5756 5710 5899 8081 3284 1981 8376 6374 252 3295 4570 2148 4665 3616 295 5562 8233
1649 8233 2013 1711 6031 4704 5251 5302 740 1788 7152 1879 -3299 309 -781 -3994 -3128 -6356
1665 -6356 -8579 -2782 -3128 -9901 -7874 -3331 -4854 -4006 -4295 -7513 -3181 1508 -4540 -5868 -454 -1335
1681 -1335 -2680 -945 -4303 -4282 1280 -1600 -6936 -2733 591 -1094 581 393 -679 5623 8013 2680
1697 2680 3783 8526 6382 6566 8017 4106 5122 8597 2702 -1218 2966 1665 -2950 -3132 -5399
1712 -5399 -7253 -2517 -4420 -10583 -6868 -3032 -5706 -5970 -4695 -6962 -3411 -1430 -8076 -7931 -2029
1727 -2029 -3053 -5869 -4717 -6551 -5689 -896 -4460 -9040 -3863 -804 -2953 -645 593 -253 5456
1742 5456 7344 2747 6251 11543 8832 7503 9880 8533 9604 12959 7323 5159 10718 10055 6221
1757 6221 7941 6722 5765 9923 8534 4091 8475 12033 7519 7126 8710 6613 8559 7862 717 -443
1773 -443 4064 680 -4234 -3831 -6797 -7548 -5613 -9891 -13793 -8914 -8440 -13145 -11622 -9628 -10118 -5919
1789 -5919 -6236 -10634 -7206 -2087 -5737 -7296 -4945 -6636 -5090 -2839 -7277 -7878 -2036 -2559 -6100 -2930
1805 -2930 -1679 -2083 1579 610 -2177 3648 7511 2918 3466 5896 4827 6227 6009 705 1135 5315
1821 5315 618 -2894 -108 -433 -1169 152 -3663 -5261 1573 2112 -3346 -1632 686 -29 3227 2657
1837 2657 -1887 1115 4568 -517 -2160 6 -1849 -2607 -1702 -5524 -5531 268 -1671 -5211 -1223 363
1853 363 -182 2972 2645 920 6497 9183 4715 6580 10209 8054 8206 8722 5012 6561 10601 5257
1869 5257 2087 5878 6362 5160 6780 3802 2526 7717 7041 1788 3386 5107 1916 1896 960 -2714
1885 -2714 -433 968 -6113 -8144 -5381 -7827 -9226 -8699 -12491 -11937 -6688 -8741 -11548 -6798 -5586
1900 -5586 -7515 -5214 -5219 -6501 -1393 -813 -5586 -3924 -94 -2520 -2606 -1926 -4646 -2481 856 -3348 -4487
1917 -4487 792 763 -498 2925 2392 3137 8065 6951 2932 7135 10006 6831 6749 6843 4567 7487 9291
1934 9291 3066 2108 5534 3224 1169 2486 114 547 3654 294 -2715 1457 1914 -1868 -1296 -2579
1950 -2579 -5263 -2324 -3200 -8911 -7613 -4999 -8530 -8675 -7545 -9277 -7969 -5268 -8331 -8262 -2391 -2499
1966 -2499 -3978 -1051 -108 990 5432 4042 60 4603 6486 2748 3118 3964 2304 4472 5414 677
1982 677 1505 5785 3171 1306 3683 2878 3782 7198 3633 1145 6231 6452 2721 3877 3619 1055
1998 1055 3160 1795 -2337 -348 2196 -1931 -2430 -815 -2103 -823 971 -3431 -3249 1441 -112
2013 -112 -3023 -542 -1354 -2463 192 -2255 -5505 -2400 -1566 -6152 -5500 -3201 -4424 -2754 -1408 -4446
2029 -4446 -1203 3847 1709 965 4604 4583 5595 8316 5901 4419 8607 7863 3661 4706 5528 2594
2045 2594 3478 1663 -2657 -331 1395 -3064 -3786 -1649 -3342 -2872 -1555 -5041 -5427 -2037 -4507 -7680
2061 -7680 -5190 -5681 -7458 -6534 -8461 -10496 -7291 -6147 -10559 -8951 -6595 -7476 -5397 -3823 -5881 -3251
2077 -3251 1476 -824 -1417 2277 2069 1528 3135 962 1 3987 2648 -742 1347 2895 1291 3239
2093 3239 3370 1289 5280 8164 5286 6574 10839 10203 10954 12265 10051 10313 13457 9965 7009 8584
2109 8584 7448 4360 5099 2476 -241 2600 1784 -2916 -1687 365 -2089 -1823 -1350 -3679 -2209 614
2125 614 -3075 -4588 -1554 -3072 -4989 -4363 -6708 -7919 -5128 -6710 -9721 -6302 -4569 -6232 -4348
2140 -4348 -3280 -3989 -135 2393 -541 973 5136 3685 3335 4856 2715 2553 4109 951 -2099 670
2156 670 -1143 -3980 -2451 -3072 -4570 -827 -801 -4029 -988 1774 38 860 1614 257 1977 3520
2172 3520 -48 -1144 1096 -1215 -4039 -3426 -5399 -7470 -4833 -6871 -9662 -5817 -4401 -6040 -3964
2187 -3964 -2596 -3065 -60 1371 -998 768 4150 1970 1711 3258 1490 1453 3754 438 -926 2631
2203 2631 1914 -544 2055 3446 2922 6261 7390 5654 9012 11447 9612 9765 10646 8436 8787 9792
2219 9792 4848 3855 5726 1805 -1461 -466 -2529 -4660 -2921 -4802 -6407 -3091 -1854 -4285 -2304
2234 -2304 -735 -2112 -310 344 -2960 -1956 -23 -3823 -5015 -3583 -6100 -7168 -5550 -8122 -9461
2249 -9461 -6145 -6378 -8229 -5523 -3237 -2787 352 1905 690 4463 6829 4291 5361 6848 4692
2264 4692 4867 5912 2060 1946 4235 1126 -630 1186 1106 -84 2163 1209 743 4416 5208 3350 5341
2281 5341 6148 4472 5046 4937 941 1081 1658 -3004 -4977 -4199 -6223 -8060 -6913 -9013 -9764 -7048 -7352
2298 -7352 -8726 -5286 -3846 -4334 -938 -366 -1691 936 2625 -786 -822 993 -1476 -1785 -1389 -3889
2314 -3889 -4179 -1926 -3669 -4574 -1399 -886 -1125 2441 2358 2158 6935 7304 5166 7717 9435 6943 7266
2331 7266 7566 3823 3486 4258 338 -1504 584 -1910 -2625 -1062 -2517 -2675 800 235 -1359 2172
2347 2172 2769 1096 3130 3280 814 2646 2700 -1086 -1640 -954 -3863 -4920 -4520 -6885 -6801 -4208 -5850
2364 -5850 -5780 -1623 -1520 -1564 2230 3316 3136 6841 7365 5251 7315 8452 5875 6300 6318 3455 3519 3794
2382 3794 148 -514 1525 -527 -1224 894 -31 -169 2684 1766 210 2838 2983 491 1307 878 -1953
2399 -1953 -1448 -2181 -5992 -6285 -5498 -9074 -9728 -8511 -10120 -10243 -7700 -8732 -8629 -4378 -4274 -4523 -1624
2416 -1624 -969 -2139 288 294 -2581 -515 -67 -3442 -3045 -2191 -4897 -4086 -3154 -5771 -4538 -1309 -2130
2433 -2130 -1616 2015 2790 3478 7405 7266 7027 10625 10864 9050 10791 10400 8073 8883 8688 4819 5621
2450 5621 6126 2951 2208 3431 1186 963 2640 722 146 2848 1608 -89 2058 1123 -1002 -15
2466 -15 -1178 -3972 -2481 -3033 -5737 -5100 -3863 -5920 -5077 -3139 -4597 -3507 -100 -1015 19 3073
2482 3073 2877 3083 5752 5170 3654 6161 4977 2097 3048 2007 -1390 -1161 -1293 -4301 -3814 -2687 -5341
2499 -5341 -4756 -2844 -3976 -3631 -996 -1545 -1462 1948 1101 533 3127 2555 782 2357 1565 -622 109
2516 109 -81 -3190 -2519 -1921 -4694 -4449 -3207 -5460 -5129 -3193 -5321 -5848 -3702 -5030 -5601 -3387 -4309
2533 -4309 -5305 -3167 -3445 -5283 -3166 -2353 -4172 -2153 285 -814 1564 4362 3053 5292 8194 7651
2549 7651 8557 11118 10064 9935 12053 10688 8726 10309 8619 5504 6270 4438 1023 1599 589 -3090
2565 -3090 -2331 -2438 -4732 -4145 -2587 -4457 -4072 -1822 -3247 -3222 -385 -1607 -2173 933 175 -1016 1393
2582 1393 635 -1154 143 293 -2247 -850 -463 -2845 -2085 -938 -3460 -3001 -1477 -4022 -4380 -2289
2598 -2289 -3930 -4278 -2227 -3334 -4456 -2127 -1867 -2582 -63 438 -665 1663 3287 2189 4501 6316
2614 6316 4486 6351 8323 6749 7135 8689 6166 5234 7087 4373 2760 3848 1721 -1080 -51
2629 -51 -1724 -4406 -3459 -4669 -7753 -6536 -6183 -8389 -7641 -6394 -8122 -7153 -4796 -5872 -5388 -2541 -3134
2646 -3134 -3030 95 -57 -389 2521 2451 1896 4540 4746 2947 4396 4406 2085 2866 3523 939 757 1898
2664 1898 -729 -1078 234 -1619 -2530 -846 -1937 -2363 209 -158 -949 1463 1416 397 3165 3500 1439
2681 1439 3451 3926 1701 2644 3654 1264 1402 2369 65 -229 1225 -921 -2275 -594 -2094 -3599
2697 -3599 -1801 -2429 -4153 -2721 -2876 -4884 -3573 -3276 -5487 -4058 -2908 -4428 -3321 -1167 -2102 -804
2713 -804 1879 1076 2287 5229 4659 4762 8300 7964 6985 9494 9470 7742 8115 7771 5144 5766 5103 1493
2731 1493 1031 1283 -1662 -1989 -1642 -3941 -3749 -1841 -3688 -3913 -1644 -2664 -3431 -1091 -1428 -3011 -512
2748 -512 -1053 -3555 -1918 -1986 -4520 -3804 -3660 -6042 -5508 -4231 -6357 -5603 -3274 -4779 -4340 -1658 -2639
2765 -2639 -2444 -100 -275 -1740 598 641 -1392 258 197 -1708 -248 -233 -2382 -1164 292 -1276 -327
2782 -327 2523 1661 3072 5619 4788 5339 8120 7458 6140 8520 7126 5278 6453 5091 1627 2148
2798 2148 1463 -2041 -1741 -1824 -4307 -3729 -2860 -4522 -3759 -1104 -2455 -2342 393 -41 -423 1997 855
2815 855 -490 1213 633 -1379 -543 -1010 -3656 -2245 -2212 -4391 -3139 -1342 -2784 -1901 1040 588 1973
2832 1973 4778 3936 4365 6849 6286 4756 6473 5443 3014 3886 2297 -930 101 -339 -3450 -3185
2848 -3185 -2137 -4083 -3129 -1519 -2834 -1867 718 -189 -144 2109 1308 585 1885 296 -1582 -486 -2150
2865 -2150 -5180 -4260 -4829 -7382 -6389 -5921 -7647 -6005 -3803 -5069 -3246 -503 -592 431 3235 2448 3060
2882 3060 5236 3384 2041 3768 2441 334 1262 -16 -2586 -1067 -278 -2663 -1029 1090 239 1846
2898 1846 3974 3716 5253 7872 7021 6903 9155 7841 5886 6669 4221 1167 1959 -176 -3847 -3675
2914 -3675 -4116 -6641 -6219 -5696 -6694 -5551 -3366 -4746 -3683 -583 -1387 -940 733 -452 -831 1094 -788
2931 -788 -2792 -1832 -3549 -5570 -4125 -4760 -6524 -4873 -3617 -4498 -2131 306 -69 2202 4518 4363
2947 4363 5969 8319 6850 6515 8570 6694 4678 5191 3213 881 1471 11 -2597 -1596 -1380 -2613
2963 -2613 -937 413 -43 2087 4146 2615 4292 6731 5291 4877 6030 3833 2410 2944 185 -2751
2979 -2751 -2204 -3935 -6682 -6040 -6819 -8089 -6018 -5152 -6254 -3575 -1197 -1498 80 2326 1669 2591 4329
2996 4329 2262 1775 3033 910 -1244 -662 -1920 -4178 -2953 -4102 -5893 -3512 -2219 -3559 -1143
3011 -1143 1075 625 3179 4712 3599 4791 6710 4720 3462 4180 2003 353 346 -2398 -4385 -3677
3027 -3677 -4979 -7099 -5905 -6320 -7001 -4311 -3728 -4577 -1825 654 -643 391 2279 1075 1154 1680 -538
3044 -538 -1587 -245 -2168 -4348 -2784 -3802 -5035 -2973 -2573 -3313 99 1950 2124 4834 7663 7660 9816
3061 9816 11402 9909 10825 11652 9255 7683 7629 5360 3254 3495 753 -1291 -266 -991 -3191 -1319
3077 -1319 -588 -1343 900 2199 1280 3552 5091 3646 3918 5151 2904 2235 2292 -833 -2074 -1606 -4417
3094 -4417 -6875 -5641 -6584 -7880 -6529 -6728 -7643 -5157 -4619 -5366 -3373 -1626 -2871 -1901 -1204 -2875 -2753
3111 -2753 -1958 -4413 -5709 -4560 -6051 -6771 -5287 -6323 -6445 -2881 -2692 -2934 649 2839 2680 5306
3127 5306 6902 6463 8271 9497 6619 6936 7056 3959 2193 2181 -1191 -3130 -2618 -5143 -7093 -5464
3143 -5464 -6141 -6780 -4496 -4545 -3980 -1385 291 -780 1976 3904 3060 3985 5016 3362 3962 4926 2566
3160 2566 1859 3031 1365 774 1960 1169 771 3098 2956 1765 4335 5073 3683 5189 5849 3920 4912
3177 4912 4593 1909 2080 2827 -410 -998 -467 -2584 -2496 -1107 -2588 -2596 373 767 650 3501 3984 3490
3195 3490 6103 5864 4254 4985 5218 2449 1138 536 -2806 -4317 -4878 -8310 -10329 -9451 -11532 -12762
3211 -12762 -11460 -11692 -11689 -9076 -8646 -8685 -5086 -3693 -4220 -2019 -379 -979 866 1783 -226 1148 2726
3228 2726 1014 1167 2433 1441 1503 3089 1826 1599 4255 3690 2503 4533 4862 3419 4718 4330 2217
3245 2217 3040 3016 291 -99 95 -2010 -1915 -1106 -2854 -2617 -45 -1360 -813 1565 1771 2088 4420 4821
3263 4821 4198 6697 6716 4337 5436 5139 2656 2418 1521 -1423 -1774 -1467 -4303 -4983 -4056 -5234 -5796 -4094
3281 -4094 -4692 -4483 -1926 -1823 -2014 628 1363 1299 3588 3734 2740 4308 4568 2651 3399 4344 2634 2812
3299 2812 3188 1349 1712 2990 1253 300 2089 739 -112 967 -576 -1948 -478 -1807 -3966 -3198
3315 -3198 -3612 -6002 -5934 -5837 -7502 -6621 -5994 -6766 -6277 -4254 -4635 -3921 -1733 -1843 -1304 1488 1230 798 2688
3334 2688 2893 1993 3184 2726 1027 2275 2292 -320 76 741 -949 -579 355 -1160 -418 1368 359
3351 359 -48 2043 2097 1616 3382 3219 2598 4103 4126 2579 3821 4215 1942 3019 3032 1161 1862 2316
3369 2316 379 422 1778 -144 -447 625 -680 -1557 -215 -1807 -3404 -1679 -2551 -3944 -3166 -3471 -4955
3386 -4955 -3174 -3374 -4676 -3414 -2299 -3706 -2479 -1072 -1830 -772 1226 163 543 2720 2336 1981
3402 1981 3107 2880 2555 3756 3212 1582 3147 3185 1361 2070 2052 629 1636 2311 271 288 1659 279
3420 279 -97 691 -408 -860 431 -1137 -2046 -465 -1054 -2615 -1389 -913 -2324 -1284 -1077 -2772 -2106
3437 -2106 -1086 -2298 -1772 -1263 -2288 -1722 -833 -1984 -2220 -403 -1827 -2374 -520 -1118 -1549 202 -74
3454 -74 -1019 972 1541 -50 997 2165 1028 1818 2548 783 1331 2689 1381 1378 2217 1452 1367 2482
3472 2482 1399 389 2374 1630 754 1925 2027 1121 2050 1761 275 1163 1661 -733 -661 59 -1593 -2088
3490 -2088 -1394 -3059 -3543 -1900 -3503 -4137 -2694 -2827 -3381 -2113 -2192 -2966 -1185 -548 -1668 -12 724
3507 724 -564 241 1203 -666 292 1532 113 51 1478 1516 680 2564 2011 1891 3786 3392 2093 3658
3525 3658 3559 2610 3451 3139 1272 2393 2457 -439 -175 256 -1217 -1870 -1457 -2738 -2664 -1483 -2246 -2880 -1222
3544 -1222 -1206 -1659 -17 -362 -1097 697 386 -1162 -488 81 -1718 -1824 -1445 -2829 -2884 -1925 -3573 -3789
3562 -3789 -1698 -2638 -2205 -641 -1014 -855 1071 1306 569 2403 3345 1859 3212 3252 1901 2630 3023 1492
3580 1492 1567 2577 999 1384 1735 892 1257 2691 2129 1583 3386 2856 2129 3076 2669 1294 2223 1414
3598 1414 -636 -255 -523 -2961 -2889 -2981 -4515 -4342 -3917 -5260 -5056 -3474 -3876 -3396 -1612 -1935 -1607 375
3616 375 168 -945 756 647 -575 -75 12 -1270 -907 -606 -2561 -1493 -964 -2011 -1691 50 -662 103
3634 103 2061 1344 1747 4099 4046 3141 4042 3691 2432 3452 2931 831 1072 943 -1404 -1026 -742 -2362
3652 -2362 -1755 -1014 -2207 -1567 -86 -591 -714 848 1151 485 1959 1139 -229 948 509 -1272 -852
3669 -852 -746 -2455 -2326 -1717 -2818 -2257 -953 -2047 -1463 364 -104 776 2707 2527 2276 4211 3794 2774
3687 2774 4141 3353 1866 2570 1582 -53 906 549 -1200 -635 410 -370 -217 1224 489 1640 2969
3704 2969 2373 2096 3686 2806 1728 2360 956 -352 -142 -1280 -3810 -3552 -4223 -6281 -5738 -5954 -7230
3721 -7230 -6195 -4858 -6031 -5266 -3228 -3612 -2637 -1159 -1426 -1271 670 -86 -1100 58 -75 -1316 -536
3738 -536 -426 -2013 -487 142 -858 -648 1061 581 1592 3046 2243 3265 4887 3828 3625 4896 4064
3755 4064 2998 3589 2342 871 1654 553 -967 -215 -1 -1234 -568 377 -150 680 2503 1788 2397
3772 2397 4006 3607 3501 4271 3017 2532 3254 1644 -431 86 -1208 -2938 -2983 -3403 -4618 -3988 -3734 -4999
3790 -4999 -3649 -2186 -2503 -1517 91 -408 659 2283 1791 1355 2785 2243 1348 2446 1392 503 1179
3807 1179 927 -460 422 841 -460 182 846 175 1142 1662 467 845 1500 -88 -876 -305 -1754 -3203
3825 -3203 -2540 -3924 -5293 -4747 -5187 -6569 -5418 -5321 -5767 -4255 -3349 -3361 -1879 -274 -325 653 1867 1445
3843 1445 2184 3500 2067 1559 2434 930 -329 344 -414 -1514 -663 -987 -2290 -832 -121 -905 263
3860 263 1704 1618 2780 4066 3719 4523 5718 4664 4307 5399 4450 3743 4751 3348 2092 2996 2517
3877 2517 1258 1950 2127 962 2017 2083 544 1205 1757 556 277 752 -1066 -1523 -1290 -3146 -4122 -3481
3895 -3481 -4670 -5795 -4988 -5314 -5850 -4361 -4021 -4666 -2333 -1537 -1900 204 1107 879 1805 2864 1898 2410
3913 2410 3251 1474 1121 1421 148 -662 -195 -1173 -2435 -1417 -1520 -2837 -1082 -680 -1696 -149 347
3930 347 -365 552 1773 368 857 1749 473 558 964 -390 -722 137 -845 -1738 -378 -994 -1798 -203
3948 -203 -261 -1121 116 384 -406 399 945 -518 333 904 -938 -813 -135 -1638 -1752 -639 -1341 -1907 -572
3967 -572 -944 -1055 719 1203 1043 2805 3593 3518 4413 4964 4198 4846 5461 3984 4427 4424 2888 2314 2481 1000
3987 1000 -54 786 -824 -1486 -362 -1020 -2054 -1083 -1063 -2058 -1007 -613 -2039 -1530 -901 -2249 -2145 -1289
4005 -1289 -3021 -2932 -1893 -3127 -3403 -2380 -3175 -3426 -2166 -2377 -2793 -1089 -1287 -1423 -358 25 -829 723
4023 723 762 -346 322 852 -571 -318 415 -203 -604 263 -470 -263 1008 469 600 2091 1860 1421 2919
4042 2919 2956 2367 3488 3792 2307 3092 2993 1588 1574 1843 120 -271 682 -988 -1314 -557 -1543 -2184 -926
4061 -926 -1634 -2096 -791 -1066 -1833 -593 -544 -1718 -557 -528 -1730 -942 -676 -1821 -1370 -416 -1396 -1240 371
4080 371 -260 -468 934 698 594 2238 1915 1197 2524 2278 1032 2008 2458 898 1486 1699 417 88
4098 88 892 -447 -108 732 -495 -442 941 -310 -603 687 -267 -400 489 67 -976 -521 -179 -1643
4116 -1643 -1236 -824 -2312 -2218 -1507 -2595 -2614 -1557 -2629 -2604 -1051 -2006 -1744 -618 -791 -944 260 129
4134 129 -596 636 510 -252 696 884 -307 639 1113 75 918 1760 1055 1275 2479 1769 2125 3410
4152 3410 2622 2402 3420 2694 2137 2725 2313 1097 1618 1387 -47 352 458 -684 -807 144 -1453 -1184
4170 -1184 -482 -1640 -1622 -355 -1484 -1507 -494 -1419 -1953 -558 -1434 -2243 -1124 -1756 -2489 -1477 -1414 -2678
4188 -2678 -1473 -982 -1904 -1336 -27 -915 -255 1127 79 226 1523 894 453 2025 1357 524 1586
4205 1586 1485 744 1402 854 191 995 1275 373 1048 1513 366 1002 2096 657 829 1817 755 270
4223 270 1208 47 -494 -36 -1029 -1823 -1237 -1605 -2809 -1911 -1961 -3144 -1980 -1625 -2396 -1764 -804 -1897 -1227
4242 -1227 -86 -774 -613 183 -245 -392 752 66 -657 714 396 -607 931 1084 140 1180 1738 689
4260 689 1951 2624 1598 1958 3000 1994 1904 3048 1826 1208 2393 1019 558 1424 573 -170 681 150
4278 150 -926 381 490 -641 262 601 -687 43 491 -993 -1030 -189 -1365 -1589 -1174 -2411 -2578 -1418
4296 -1418 -2587 -3347 -1952 -2371 -3187 -1958 -1996 -2317 -1284 -519 -1098 -123 982 -143 602 1397 829 634
4314 634 1930 858 753 1914 914 1042 1658 1212 554 1572 1181 117 1775 1484 214 1040 1513
4331 1513 540 830 1251 -112 -227 241 -1014 -1069 -448 -1833 -2501 -1028 -2075 -2549 -1345 -1222 -2073 -584
4349 -584 -619 -1163 -360 125 -849 66 652 -647 -21 331 -569 -449 160 -883 -1284 55 -1036 -1272 261
4368 261 -173 -571 712 1206 516 1802 2314 1523 2453 3176 2262 2816 3519 2238 2497 2958 2035 1624 2445
4387 2445 1199 643 1487 837 -4 1113 274 -641 326 285 -963 -479 -538 -1630 -1364 -861 -2506 -2554 -1781
4406 -1781 -3313 -3149 -2587 -3463 -3681 -2062 -2517 -2958 -1295 -1427 -1662 -286 -258 -713 759 803 -47 1003
4424 1003 1393 95 627 1067 -88 -137 1044 -291 -357 299 -562 -766 582 282 -193 1394 1101 31
4442 31 1735 1733 827 1407 1834 897 1166 1695 80 120 848 -113 -107 391 -361 -634 -173 -699 -1230 -210 -687
4463 -687 -1021 -31 -382 -1280 -424 -457 -1350 -748 -658 -1725 -1292 -322 -1273 -741 -3 -723 -495 1221 653 428
4483 428 2131 1538 1996 2816 2626 2074 3221 3437 2107 2883 2574 1481 1767 1989 515 575 1136 -102
4501 -102 -506 328 -765 -1420 60 -788 -1078 -151 -1027 -1747 -665 -648 -2163 -1127 -1014 -2435 -1553 -1195
4519 -1195 -2360 -2088 -1674 -2708 -2195 -1468 -2391 -2181 -1093 -1821 -2020 -616 -1174 -1615 -641 -882 -1606 -388
4537 -388 -468 -1069 -9 79 -846 -65 711 -511 290 1377 873 1464 2284 1766 1816 3185 2625 2240 3411
4556 3411 3237 2274 3112 2665 1545 1910 1763 518 849 845 -466 -369 -45 -1015 -939 -191 -1453 -1131 -292 -1054
4576 -1054 -1710 -336 -1100 -1598 -360 -717 -1414 -447 -136 -1250 -368 -270 -962 -97 267 -396 -4 1155 314
4595 314 466 1491 555 507 1665 947 408 1152 991 -64 860 487 -393 483 155 -660 129 546 -473
4614 -473 42 837 -127 539 1222 139 25 1390 -212 -773 629 -94 -1269 -275 -1300 -2082 -1034 -1851
4632 -1851 -2768 -1871 -1884 -2944 -1959 -1628 -2516 -2307 -835 -1791 -1848 -443 -1410 -1277 -292 -569 -704 648 389
4651 389 -243 1112 1433 278 1659 2308 1253 2454 2630 1838 2744 3265 2489 2168 3187 2010 2202 2948
4669 2948 1302 975 1764 1103 18 852 152 -484 38 -149 -859 -119 136 -904 -380 180 -700 -456 242
4688 242 -725 -719 33 -1073 -900 -240 -1541 -1883 -1108 -1579 -2066 -1593 -1218 -2603 -1077 -760 -1930 -731 -465
4707 -465 -1088 -894 171 -849 -390 725 -117 163 1295 401 350 1278 891 214 1329 1339 518 1801 1911
4726 1911 1381 2232 2239 1135 1760 1884 900 1163 1411 -80 73 419 -870 -1553 -708 -1593 -2208 -1201 -2258
4745 -2258 -2385 -1106 -1599 -2106 -726 -799 -1740 -426 88 -713 28 863 -466 230 660 -118 57 775 -195
4764 -195 80 1137 351 241 1073 999 507 1106 1441 654 1518 1813 621 1773 2317 846 1199 1672 425
4783 425 472 1473 218 -65 981 478 -227 848 566 -362 677 368 -510 415 462 -817 -277 -232 -1713
4802 -1713 -822 -974 -2400 -1978 -1790 -2896 -3026 -2524 -3125 -3103 -2105 -2372 -2636 -1227 -1162 -1686 -167 -171 -554 682
4822 682 1256 534 1426 2115 773 1283 2077 1267 899 1712 697 1073 1853 831 752 1735 1151 931 1966
4841 1966 1304 654 2039 1500 355 977 1163 -305 222 343 -723 -883 -284 -1311 -1498 -227 -1058 -1433
4859 -1433 -504 -625 -1368 28 -264 -967 311 -176 -709 -50 -184 -1267 -415 -357 -1279 -1121 -754 -1484 -1394
4878 -1394 -579 -1640 -1245 145 -668 -483 1017 739 429 1605 2100 1469 2565 2716 1317 2291 2451 925
4896 925 1751 1654 407 444 1034 62 -306 731 -58 -519 495 -610 -894 335 -491 -1545 -723 -768 -1727
4915 -1727 -1256 -1597 -2154 -2159 -1443 -2503 -2052 -1562 -2552 -2175 -1120 -1838 -1743 -48 -513 -605 924 672 343 1361
4935 1361 994 471 1442 1184 344 700 827 -268 406 428 -664 85 671 178 -75 1111 739 833 1987
4954 1987 1615 1367 2496 2102 1138 2246 2379 862 1342 916 40 570 440 -939 -1113 -284 -1331 -1663
4972 -1663 -840 -1582 -1501 -979 -1549 -1516 -606 -897 -1179 -683 -1121 -1600 -701 -443 -1714 -1006 -487 -1711 -724 -281
4992 -281 -994 -378 572 67 568 1695 1269 1276 2228 2103 1734 2755 2064 1360 2252 1915 684 1001 1164 -281
5012 -281 445 127 -1406 -975 -443 -1150 -1220 -35 -889 -870 67 -587 -907 37 -260 -925 -3 -489 -990 -385
5032 -385 -415 -1897 -1369 -1271 -2243 -1653 -1526 -2379 -2041 -930 -2094 -1305 -550 -1101 -937 374 -347 -475 817
5051 817 516 -103 767 817 344 938 976 411 843 1291 682 1373 2236 1571 1752 2918 2067 2374 2802 1984
5071 1984 1911 2873 2048 703 1580 1081 16 303 -161 -1303 -1009 -1061 -1991 -1561 -1241 -2056 -1637 -1004 -1596
5090 -1596 -1400 -321 -606 -759 384 -160 -476 242 165 -645 213 -139 -865 -436 -256 -892 -130 -87 -1072 -473
5110 -473 284 -205 -297 862 453 279 1268 854 811 1345 1044 445 1178 622 191 778 253 -613 213 112
5130 112 -524 -172 516 -430 -360 497 -133 -59 672 -38 -405 245 -617 -1242 -948 -1355 -2064 -1618 -2081 -2817 -2236
5151 -2236 -2265 -2890 -2283 -1752 -2655 -1432 -651 -1343 -412 991 139 668 1875 1221 1450 2320 1997 1156 2164
5170 2164 1875 1204 1749 1481 861 1422 1560 592 1127 1821 819 1062 1832 1071 914 2122 1341 858 1487
5189 1487 882 41 555 181 -533 10 -660 -1265 -851 -790 -1548 -1146 -455 -1345 -1134 -555 -1312 -501 -176 -763
5209 -763 -504 -134 -1138 -1034 -602 -1154 -1569 -1238 -1506 -2312 -1643 -1415 -2095 -1112 -508 -1198 -289 355 249 590
5229 590 1418 1197 1477 2324 1605 1757 2469 1603 1413 1555 1172 141 970 403 -388 2 -114 -1042 -645 -141
5249 -141 -993 -354 -147 -1137 -698 -138 -556 -886 -156 -513 -1276 -197 -1027 -1411 -857 -1086 -1308 -951 -644 -1512
5269 -1512 -390 -166 -496 185 743 73 636 1582 868 1022 1935 1176 965 1464 1019 264 850 565 -222
5288 -222 770 735 132 774 890 418 1065 1425 946 1410 1923 1161 1713 2242 1520 1090 1531 758 -106 562
5308 562 -403 -1268 -888 -1443 -2252 -1673 -1990 -2865 -1668 -1957 -2602 -1366 -1076 -2024 -1601 -802 -1347 -1228 -600
5327 -600 -1245 -1513 -333 -899 -1323 -598 -805 -1180 -288 -272 -855 262 832 131 969 1904 1374 1542 2067 1597
5347 1597 1808 2189 1391 1354 1714 781 150 1069 342 -324 70 45 -544 216 265 -165 54 663 -14 530 1558
5368 1558 3 244 541 114 66 347 -691 -973 -524 -1479 -1946 -1261 -1352 -2343 -1593 -1529 -1929 -855 -886 -994
5388 -994 -224 335 -5 281 1146 360 769 1258 399 717 1352 315 -61 849 362 -185 1082 665 -17
5407 -17 1047 1177 662 1464 1839 735 1365 1467 617 1002 1150 179 45 394 -612 -1234 -533 -1541 -1951
5426 -1951 -1424 -1963 -2054 -1492 -1522 -1890 -1180 -873 -1285 -635 -159 -1053 -368 89 -461 -47 171 -489 -737 41
5446 41 -581 -970 -132 -536 -622 -5 -56 -199 935 1218 378 1697 1763 1115 1940 2452 1301 1833 2212 1116
5466 1116 1106 1599 666 483 823 351 -253 145 419 -600 126 130 -407 175 296 -422 -178 220 -391 -624
5486 -624 -137 -1366 -1341 -887 -1716 -1676 -1317 -1853 -2440 -1486 -1720 -1667 -955 -975 -1381 -198 -121 -346 725 310 90
5507 90 797 1215 331 694 1065 391 718 968 405 308 970 431 210 877 772 460 1254 1378 589 1455 1578
5528 1578 793 1218 1437 538 466 736 249 -14 284 -912 -892 -464 -1104 -1381 -801 -1021 -1727 -605 -1127 -1309
5548 -1309 -355 -104 -1083 -553 -318 -1001 -665 -375 -1190 -735 -86 -1274 -714 -474 -993 -929 -182 -183 -542 781
5568 781 755 68 1448 1273 1115 1669 1950 887 1746 2093 1061 1172 2058 787 647 1227 -144 132 463
5587 463 -308 -533 158 -449 -740 -132 -501 -997 -478 -128 -1117 -446 65 -1042 -677 -395 -1404 -1067 -610
5606 -610 -1573 -1760 -802 -1465 -1587 -645 -986 -1642 -340 -303 -1226 -10 -14 -26 401 728 184 754 979 128 746
5627 746 1314 500 992 997 347 436 1240 786 446 1440 1345 832 1500 1633 938 1709 1363 935 1206 1163 366 757
5649 757 675 -676 -51 -109 -818 -1225 -344 -1523 -2041 -1120 -1777 -2095 -1312 -1724 -1995 -1026 -1089 -2107 -730 -728
5669 -728 -1014 -463 152 -645 -177 541 -462 -243 554 14 258 671 463 354 914 742 351 976 917 607
5689 607 992 1227 276 1332 1109 207 428 1213 461 393 680 141 110 759 -143 -463 380 -372 -266 398
5709 398 -99 -391 102 305 -542 315 298 -851 -161 -73 -1330 -1081 -741 -1461 -1597 -965 -1791 -1829 -1431 -1798
5729 -1798 -1617 -830 -1311 -1443 -517 -201 -269 510 671 136 1295 1641 728 1697 1873 1361 1216 2151 1092
5748 1092 1299 1570 775 728 1458 527 392 911 529 -87 678 113 -277 124 573 -712 -96 76 -1103
5767 -1103 -1000 -761 -1070 -1253 -807 -1490 -1401 -918 -1371 -1195 -368 -687 -1208 173 -111 -575 600 424 -411
5786 -411 54 440 -7 -174 265 -588 -143 -106 -1123 -813 -65 -809 -458 255 -160 -121 1010 664 557 1680
5806 1680 1689 1443 1777 2250 1560 1862 1882 1030 1232 1323 149 300 729 -134 -848 -348 -538 -1366 -254 -745
5826 -745 -1470 -683 -959 -1463 -515 -423 -1461 -1006 -693 -1660 -1188 -1016 -2033 -1644 -884 -1702 -1508 -719 -810 -1031
5846 -1031 -35 -215 -278 964 808 655 1697 1895 1002 1647 1827 1067 1438 1468 385 516 992 141 -146
5865 -146 446 -71 -256 594 -186 47 1294 589 483 1402 966 974 1294 1342 320 921 958 -275 -205 -60 -1020
5886 -1020 -1083 -586 -1454 -1795 -1297 -1540 -1778 -1144 -1065 -1376 -179 -297 -595 150 28 -620 0 -131 -854 -466
5906 -466 -128 -718 -582 -161 -621 -360 246 -368 -132 567 968 1089 1708 1386 1281 2160 1658 1248 2002 1517
5926 1517 607 1424 906 -496 -253 48 -1120 -861 -563 -1514 -882 -473 -904 -1127 105 -427 -650 20 33
5945 33 -668 134 -50 -839 -217 -288 -1450 -1067 -1021 -1749 -1259 -1047 -1669 -1298 -334 -782 -884 353 331 660 1469
5966 1469 1204 1033 1823 1694 1375 1648 1597 873 1128 1140 -122 311 667 -383 -47 567 53 229 815 488
5986 488 387 1329 1095 791 1566 1214 470 1093 745 -452 -126 -240 -1402 -959 -870 -2383 -1849 -1136 -2217
6005 -2217 -2033 -1146 -1628 -1315 -379 -610 -953 79 -105 -682 417 -248 -986 -197 -797 -1292 -497 -609 -1110
6024 -1110 -535 -264 -809 -303 764 251 808 1820 1517 1754 2300 1811 1725 2592 1873 1105 1877 1156 47
6043 47 357 124 -1121 -596 -538 -1255 -821 -1004 -1140 -1028 70 -627 -247 642 294 119 772 30 -465 293
6063 293 -254 -805 -242 -676 -1568 -1149 -897 -1535 -1293 -110 -1135 -314 726 53 141 964 872 576 1413 1283
6083 1283 744 1163 570 336 666 487 -590 114 127 -565 -18 587 -229 523 988 330 689 1727 1048
6102 1048 1119 1999 1362 863 1204 537 -195 258 -754 -1930 -1329 -1588 -2685 -2174 -1880 -2905 -2067 -1628 -2447
6121 -2447 -1732 -840 -1290 -727 180 -294 -516 447 -255 -253 512 -267 -253 140 86 -364 110 285 -251 183 904
6142 904 511 1003 1554 1100 1101 2128 2089 1291 2215 1250 1286 1581 841 290 514 84 -667 -413 -250 -910 -514
6163 -514 132 -633 -141 108 275 494 764 344 214 936 -134 -64 271 -463 -1104 -850 -1201 -1927 -1179 -1638
6183 -1638 -2115 -1661 -1439 -1585 -1344 -517 -895 -263 766 127 402 1429 820 717 1348 938 750 1125 410
6202 410 147 801 289 -262 575 257 -355 172 1118 230 602 1195 545 863 1274 768 719 967 252 -246
6222 -246 60 -380 -984 -597 -1056 -1743 -1104 -1304 -1760 -1164 -809 -1342 -626 -103 -873 -538 455 -355 -210 296
6242 296 52 -356 378 -14 -579 339 -192 -954 108 -115 -474 271 764 23 1057 1267 1057 1365 1828
6261 1828 1657 1468 1966 1198 1086 1649 793 557 832 39 -353 341 -231 -776 -227 -539 -829 -289 -42 -532
6281 -532 -164 317 -216 -121 534 -714 -706 -122 -1171 -1060 -709 -1229 -1406 -1334 -1325 -1668 -925 -1246 -1523 -965 -695
6302 -695 -1046 -185 67 -442 205 530 -329 696 905 215 377 1130 418 364 844 408 435 1084 706 171
6322 171 1433 1025 741 1337 1618 744 1255 1642 953 937 1115 250 -136 395 -617 -730 -312 -934 -1243 -1039
6342 -1039 -1295 -1661 -768 -919 -1385 -573 -571 -863 -381 165 -497 -12 223 -486 -108 644 -528 9 755 0
6362 0 -168 279 -56 -468 402 20 -46 786 770 304 658 862 424 933 638 144 710 1138 135 517 808
6383 808 298 140 701 414 69 461 258 215 604 536 -223 509 435 -388 72 37 -1006 -558 -521 -1085 -1073 -1028
6405 -1028 -1629 -1592 -1086 -1882 -1764 -1104 -1190 -1232 -764 -739 -704 -237 -124 -466 211 879 326 783 857 740 899 1291
6427 1291 1045 899 1426 874 1224 1455 1131 702 1033 762 203 724 607 56 632 419 -277 319 365 -400
6447 -400 -208 422 -677 -387 60 -735 -791 176 -489 -558 -37 -578 -696 -364 -448 -680 -204 2 -1013 -495
6467 -495 -333 -660 -527 -275 -1064 -710 86 -993 -247 -146 -532 -740 384 -36 -426 210 145 -38 802 515
6487 515 457 1074 1174 334 992 1020 789 883 1329 971 927 1126 427 654 988 186 74 227 -353 -355 48 -491
6509 -491 -946 -279 -829 -1162 -756 -888 -1160 -970 -730 -1393 -1036 -578 -1092 -930 -131 -662 -435 -17 -407 -598
6529 -598 73 -198 -580 -165 41 -487 580 217 -72 619 825 400 550 1046 532 910 1121 935 773 1190
6549 1190 972 540 973 915 121 885 140 -26 438 165 -205 742 363 -467 152 301 -448 387 197 -269
6569 -269 -273 70 -496 -678 -239 -876 -1222 -593 -844 -1282 -739 -955 -1495 -793 -653 -822 -596 -38 -601 -116 246
6590 246 -411 166 652 19 226 340 161 122 471 451 -203 592 557 89 504 911 243 853 1410 799 1341
6611 1341 1174 568 839 1109 453 394 361 64 -258 366 -573 -1177 -451 -911 -1462 -938 -1088 -1127 -835 -605 -1315
6632 -1315 -430 -434 -720 -342 -10 -733 -551 66 -818 -442 52 -520 -410 -84 -334 -301 181 231 -153 419 479
6653 479 497 892 899 466 1005 1282 1036 916 1486 983 404 758 492 142 970 96 2 541 188 -24 416
6674 416 248 -14 458 344 -106 696 343 -38 388 434 -61 -263 -248 -849 -1023 -1100 -1490 -1800 -1036 -1712 -1772
6695 -1772 -1050 -1000 -1660 -483 -790 -1122 -263 200 -179 95 876 292 321 794 403 347 596 168 275 541
6715 541 308 294 807 949 363 732 972 383 1120 1265 683 744 788 251 141 592 -158 -475 -54 -1036 -913
6736 -913 -400 -685 -1197 -648 -694 -912 -365 -166 -656 -325 165 -528 -8 644 -238 -4 89 -443 -335 19 -603
6757 -603 -848 -520 -815 -929 -323 -779 -691 119 -108 -274 687 896 214 1380 1290 884 983 1650 1081 1103 1487
6778 1487 624 726 1315 23 420 488 243 195 715 420 -140 336 98 -89 388 108 -240 162 -18 -719
6798 -719 -855 -309 -1378 -1392 -887 -1749 -1347 -1421 -1518 -1305 -1080 -1342 -1155 -92 -569 -690 93 322 -150 497
6818 497 502 163 180 518 44 270 333 -51 162 92 -242 34 497 -42 337 771 729 379 999 932 891 1384 978
6841 978 547 948 861 445 600 379 -538 -227 -95 -855 -889 -336 -441 -371 -172 -570 -499 -38 -254 -469 -53
6862 -53 129 -457 172 -243 -729 -251 -265 -1040 -492 -669 -872 -396 -552 -395 -520 -86 -304 -72 719 669 520
6883 520 889 768 877 1166 1108 907 1091 1022 394 100 568 -288 125 262 76 103 467 183 64 603 428
6904 428 -70 483 235 -68 546 164 -164 -51 -386 -1166 -711 -601 -1595 -1100 -1097 -1514 -1209 -780 -1202 -1140 -569
6925 -569 -1106 -811 -161 -160 -590 299 312 17 700 450 155 635 504 -54 107 549 -132 216 804 195 283
6946 283 749 456 495 1162 665 455 1006 775 522 488 811 165 452 523 -71 340 -69 -522 -262 106 -242
6967 -242 -453 1 -503 -274 142 -493 -466 167 -294 -539 330 -553 -759 -599 -488 -915 -962 -610 -1252 -949 -345
6988 -345 -1090 -865 -301 -524 -61 500 117 187 843 461 572 1142 832 924 1162 965 986 1116 916 409 623
7009 623 706 276 390 296 -143 314 540 79 -31 500 -268 -153 245 35 -548 185 -418 -933 -353 -813 -988
7030 -988 -532 -703 -1003 -867 -318 -829 -647 -9 -534 -315 -180 -320 -16 401 -29 -319 365 180 -166 145
7050 145 156 -364 57 -218 -535 -25 292 -323 445 448 41 560 721 753 954 1332 1054 651 1302 971 639
7071 639 1143 490 371 695 187 -262 -145 -22 -418 -358 -347 -546 -575 -110 -1062 -680 -738 -807 -1049 -360 -898 -787
7093 -787 -246 -394 -1046 -362 -593 -794 -190 -287 -621 53 -10 -85 184 295 467 522 761 634 802 1032 349
7114 349 264 822 664 371 796 767 -10 779 411 -225 188 524 -394 370 896 -218 109 368 -35 -248
7134 -248 669 139 28 402 74 -104 32 -190 -668 -287 -625 -1077 -419 -378 -1062 -533 -882 -915 -763 -880 -1190
7155 -1190 -951 -191 -584 -668 60 -116 -627 4 116 -412 562 436 320 388 447 209 306 750 233 857 856 441
7177 441 595 926 483 409 901 471 267 676 451 -5 848 374 -440 112 -238 -478 25 -46 -625 -495 -142
7198 -142 -956 -106 30 -678 -778 -251 -696 -408 -99 -589 -482 -338 -699 -547 -83 -237 -944 -256 29 -694
7218 -694 -281 117 -339 337 85 174 380 912 277 410 454 90 291 872 721 340 1252 463 235 852 678
7239 678 552 441 519 -115 422 485 76 57 548 -93 -89 414 -107 -248 -40 -586 -459 -119 -444 -465 -775 -678
7261 -678 -866 -826 -825 -967 -653 -540 -758 -637 -327 -691 -733 151 -215 -22 276 236 51 521 166 -108 430 657
7283 657 -214 522 419 225 615 514 450 423 986 374 600 788 543 382 1117 284 460 874 348 126 541
7304 541 59 -19 121 -213 -222 148 -294 -740 45 -354 -755 -799 -294 -566 -559 -210 -797 -599 -137 -660 -971 -134
7326 -134 -193 -697 -426 -541 -664 -139 -343 -310 209 191 89 334 677 -98 642 782 471 686 948 471 649
7347 649 1216 532 384 900 813 335 807 533 284 589 145 256 173 426 -281 -207 311 -243 44 27 -270
7368 -270 -280 111 -716 -422 -80 -226 -894 -435 -869 -839 -610 -316 -894 -174 -805 -866 -495 -45 -773 -592 -194
7389 -194 -326 -326 539 -197 73 454 213 1 646 159 179 476 457 175 722 720 338 614 619 437 903 927 87
7412 87 455 912 290 369 734 31 -189 138 60 -365 -199 -444 -895 -286 -798 -822 -549 -431 -827 -537 -334
7433 -334 -887 -360 -472 -628 -354 -107 -510 -541 91 -550 -115 293 -282 -405 107 10 -288 381 314 -202 348
7454 348 545 144 605 784 401 655 959 616 582 643 324 192 547 98 -27 610 -107 -21 146 261 -160
7475 -160 557 630 62 269 302 -243 85 594 -206 -268 9 -576 -729 -192 -934 -1012 -497 -734 -1362 -597 -606 -808
7497 -808 -541 -404 -852 -144 -167 -459 -59 284 -426 51 265 -48 110 411 254 293 649 548 24 847 521
7518 521 301 609 562 189 835 531 208 604 571 59 448 583 80 89 366 -177 -340 212 -155 -637 -114
7539 -114 -503 -574 -144 -146 -516 -91 -135 -657 -178 -56 -694 -470 -126 -749 -670 -602 -444 -552 64 -269 -435 -181
7561 -181 -301 -271 370 40 -314 108 61 -172 772 532 210 473 812 216 475 930 360 732 898 550 576
7582 576 727 475 -57 562 217 48 385 290 -258 345 -15 -388 -98 51 -511 -370 -254 -766 -691 -383 -740
7603 -740 -918 -203 -1068 -891 -209 -735 -712 -325 -522 -519 -373 149 -296 217 121 -113 48 176 -433 3 552
7624 552 -102 213 361 276 -307 495 -22 -68 382 200 306 544 346 295 442 581 116 571 901 31 354
7645 354 689 115 218 698 -127 -123 357 -134 -561 261 -341 -402 -359 -632 -732 -77 -671 -775 -763 -622 -762 -902
7667 -902 -224 -546 -543 -301 -720 -393 -178 -543 -200 131 62 -52 363 550 174 617 445 62 528 830 199
7688 199 783 774 288 794 336 371 374 443 -18 149 459 95 -59 395 137 -347 196 -69 -73 171 2 -174 -66
7711 -66 -222 -196 -124 97 -441 -297 -47 -326 -129 -245 -376 -643 -334 -603 -599 -144 -730 -699 -148 -688 -787 -334
7733 -334 -304 -261 -127 83 -31 38 226 -80 246 357 342 186 664 442 355 783 387 433 805 711 408 737
7755 737 712 375 696 734 38 108 186 -471 -414 77 -348 -546 -148 -746 -529 -75 -567 -883 -246 -106 -604 -587
7777 -587 -211 -753 -159 -311 -267 -246 35 -190 -113 128 -490 51 38 -194 -92 43 -12 -86 498 3 -177 336
7799 336 512 57 277 661 23 449 673 96 531 764 201 325 960 218 572 328 201 147 963 327
7819 327 -154 648 -46 -215 145 241 -367 -131 -185 -450 -510 -312 -715 -574 -121 -846 -662 -406 -1090 -867 -474
7840 -474 -503 -1048 -399 -361 -398 213 125 -322 51 422 -273 203 289 -51 113 531 20 -40 499 213 247 495
7862 495 335 7 729 426 130 456 583 -49 433 218 3 819 25 -15 -47 140 38 152 265 -210 -318
7883 -318 -117 -409 -437 -158 -96 -578 -140 -382 -795 -300 58 -588 -306 -69 -952 -252 -434 -877 -784 -315 -767
7904 -767 -444 -108 -677 -165 165 52 -439 224 103 225 655 297 563 705 710 593 554 754 559 693 321
7925 321 289 560 297 -77 25 421 -148 -385 -31 -13 -260 195 -228 -233 115 -367 -631 78 -248 -733 -413
7946 -413 -273 -687 -421 -327 -638 -602 44 -272 -329 -213 -346 -446 -176 -221 -207 -188 -109 76 130 -44 -229 143 88
7969 88 -182 153 337 240 225 342 269 422 524 520 202 798 489 496 755 260 294 551 415 378 636 474 -563
7992 -563 370 135 -411 -193 -72 -348 -284 -315 -397 -546 -347 -467 -521 -524 -771 -773 -303 -699 -423 -164 -258 -391 -464
8015 -464 -179 -344 -104 -140 -540 -68 202 -219 254 685 275 -25 609 495 12 717 382 501 618 340
8035 340 229 657 574 101 428 276 -23 76 187 198 56 221 114 463 125 155 74 222 113 -144 208 59
8057 59 -319 41 36 -333 -320 -171 -589 -508 -184 -797 -421 -327 -377 -375 -451 -599 -824 78 -138 -529 -205 19 -297
8080 -297 259 219 -244 468 540 8 38 670 266 505 521 458 464 832 494 548 650 427 145 514 359 129 521
8103 521 -48 -79 264 -41 -263 -336 -162 -306 -170 -191 -564 -160 -131 -399 -423 -60 -686 -481 78 -297 -623 -257
8125 -257 -21 -270 -254 -289 -424 -92 160 -447 -211 -223 -33 -127 -53 6 -146 256 225 681 695 98 26 496 322
8148 322 376 692 407 107 361 409 473 567 908 299 167 747 102 502 486 369 173 174 8 9 251 -27 -552
8171 -552 -76 -390 -609 -502 -757 -1071 -472 -471 -699 -393 -390 -658 -322 -92 -305 -413 -152 -52 -74 93
8191I3
##END NTUPLES=NMR FID
##END=
