##TITLE=1H_ANY-157C-1
 CDCl3, 8 sc, 
 5.6.2019
##JCAMPDX= 6.0         $$ Bruker NMR JCAMP-DX V2.0
##DATA TYPE= NMR FID
##DATA CLASS= NTUPLES
##ORIGIN= UXNMR, Bruker Analytische Messtechnik GmbH
##OWNER= root
$$ XWIN-NMR		Version 3.5
$$ Wed Jun  5 14:33:01 2019 Russian Standard Time (UT+4h)  she@DPX200
##.OBSERVE FREQUENCY= 200.13155
##.OBSERVE NUCLEUS= ^1H
##.DELAY= (6, 6)
##.ACQUISITION MODE= SIMULTANEOUS
##.ACQUISITION SCHEME= undefined
##.AVERAGES= 8
##.DIGITISER RES= 18
##SPECTROMETER/DATA SYSTEM= spect
##.PULSE SEQUENCE= zg30
##.SOLVENT NAME= CDCl3
##.SHIFT REFERENCE= (INTERNAL, CDCl3, 0, 15.7039)
##AUDIT TRAIL= $$ (NUMBER, WHEN, WHO, WHERE, WHAT)
$$ ##TITLE= Audit trail, XWIN-NMR		Version 3.5
$$ ##JCAMPDX= 5.01
$$ ##ORIGIN= Bruker BioSpin GmbH
$$ ##OWNER= she
$$ F:/spectra/data/she/nmr/H-F/1/audita.txt
$$ ##AUDIT TRAIL=  $$ (NUMBER, WHEN, WHO, WHERE, WHAT)
(   1,<2019-06-05 14:31:20.51 +0400>,<she>,<DPX200>,
      <created by zg, POWCHK disabled, PULCHK disabled
       configuration hash MD5:
       00 E9 B6 7A A2 85 ED C7 34 08 36 98 17 FE 4E 26
       data hash MD5: 16K
       D7 F3 F6 0F 2A 6F 43 07 8C FF EB 68 92 79 AE 30>)
$$ ##END=
$$ 
$$ hash MD5
$$ 12 E2 D2 96 49 13 0B D4 25 A7 1F 23 54 3E 2E A3
##$RELAX= 
##$RELAX= 
##$RELAX= 
##$RELAX= 
##$RELAX= 
##$RELAX= 
$$ Bruker specific parameters
$$ --------------------------
##$DU= <F:/spectra>
##$EXPNO= 1
##$NAME= <H-F>
##$PROCNO= 1
##$TYPE= <nmr>
##$USER= <she>
##$AMP= (0..31)
100 100 100 100 100 100 100 100 100 100 100 100 100 100 100 100 100 100 
100 100 100 100 100 100 100 100 100 100 100 100 100 100 
##$AQSEQ= 0
##$AQ_mod= 1
##$AUNM= <au_zg>
##$AUTOPOS= <>
##$BF1= 200.13
##$BF2= 200.13
##$BF3= 200.13
##$BF4= 200.13
##$BF5= 200.13
##$BF6= 200.13
##$BF7= 200.13
##$BF8= 200.13
##$BYTORDA= 1
##$CFDGTYP= 0
##$CFRGTYP= 5
##$CHEMSTR= <none>
##$CNST= (0..31)
1 1 145 1 1 1 1 1 1 1 1 1 1 1 1 1 1 1 1 1 1 1 1 1 1 1 1 1 1 1 1 1 
##$CPDPRG= <>
##$CPDPRG1= <>
##$CPDPRG2= <>
##$CPDPRG3= <>
##$CPDPRG4= <mlev>
##$CPDPRG5= <mlev>
##$CPDPRG6= <mlev>
##$CPDPRG7= <mlev>
##$CPDPRG8= <mlev>
##$CPDPRGB= <>
##$CPDPRGT= <>
##$D= (0..31)
0 1.2 0 0 0 0 0 0 0 0 0 0.03 0 0 0 0 0 0 0 0 0 0 0 0 0 0 0 0 0 0 0 0 
##$DATE= 1559730679
##$DBL= (0..7)
120 120 120 120 120 120 120 120 
##$DBP= (0..7)
150 150 150 150 150 150 150 150 
##$DBP07= 0
##$DBPNAM0= <>
##$DBPNAM1= <>
##$DBPNAM2= <>
##$DBPNAM3= <>
##$DBPNAM4= <>
##$DBPNAM5= <>
##$DBPNAM6= <>
##$DBPNAM7= <>
##$DBPOAL= (0..7)
0.5 0.5 0.5 0.5 0.5 0.5 0.5 0.5 
##$DBPOFFS= (0..7)
0 0 0 0 0 0 0 0 
##$DE= 6
##$DECBNUC= <off>
##$DECIM= 24
##$DECNUC= <off>
##$DECSTAT= 4
##$DIGMOD= 1
##$DIGTYP= 9
##$DL= (0..7)
0 120 120 120 120 120 120 120 
##$DP= (0..7)
150 150 150 150 150 150 150 150 
##$DP07= 0
##$DPNAME0= <>
##$DPNAME1= <>
##$DPNAME2= <>
##$DPNAME3= <>
##$DPNAME4= <>
##$DPNAME5= <>
##$DPNAME6= <>
##$DPNAME7= <>
##$DPOAL= (0..7)
0.5 0.5 0.5 0.5 0.5 0.5 0.5 0.5 
##$DPOFFS= (0..7)
0 0 0 0 0 0 0 0 
##$DQDMODE= 0
##$DR= 18
##$DS= 0
##$DSLIST= <SSSSSSSSSSSSSSS>
##$DSPFIRM= 0
$$ [...]
##$SUBNAM2= <"">
##$SUBNAM3= <"">
##$SUBNAM4= <"">
##$SUBNAM5= <"">
##$SUBNAM6= <"">
##$SUBNAM7= <"">
##$SUBNAM8= <"">
##$SUBNAM9= <"">
##$SW= 24.9336996594482
##$SWIBOX= (0..15)
0 0 2 0 0 0 0 0 0 0 0 0 0 0 0 0 
##$SW_h= 4990.01996007984
##$TD= 16384
##$TD0= 1
##$TE= 0
##$TE2= 300
##$TE3= 300
##$TEG= 300
##$TL= (0..7)
0 120 120 120 120 120 120 120 
##$TP= (0..7)
150 150 150 150 150 150 150 150 
##$TP07= 0
##$TPNAME0= <>
##$TPNAME1= <>
##$TPNAME2= <>
##$TPNAME3= <>
##$TPNAME4= <>
##$TPNAME5= <>
##$TPNAME6= <>
##$TPNAME7= <>
##$TPOAL= (0..7)
0.5 0.5 0.5 0.5 0.5 0.5 0.5 0.5 
##$TPOFFS= (0..7)
0 0 0 0 0 0 0 0 
##$TUNHIN= 0
##$TUNHOUT= 0
##$TUNXOUT= 0
##$USERA1= <user>
##$USERA2= <user>
##$USERA3= <user>
##$USERA4= <user>
##$USERA5= <user>
##$V9= 5
##$VALIST= <valist>
##$VCLIST= <CCCCCCCCCCCCCCC>
##$VD= 0
##$VDLIST= <DDDDDDDDDDDDDDD>
##$VPLIST= <PPPPPPPPPPPPPPP>
##$VTLIST= <TTTTTTTTTTTTTTT>
##$WBST= 1024
##$WBSW= 4
##$XGAIN= (0..3)
0 0 0 0 
##$XL= 0
##$YL= 0
##$YMAX_a= 548404
##$YMIN_a= -667339
##$ZGOPTNS= <>
##$ZL1= 120
##$ZL2= 120
##$ZL3= 120
##$ZL4= 120
##$ABSF1= 10
##$ABSF2= 0
##$ABSG= 5
##$ABSL= 3
##$ALPHA= 0
##$AQORDER= 0
##$ASSFAC= 0
##$ASSFACI= 0
##$ASSFACX= 0
##$ASSWID= 0
##$AUNMP= <proc_1d>
##$AZFE= 0.1
##$AZFW= 0.1
##$BCFW= 1
##$BC_mod= 2
##$BYTORDP= 1
##$COROFFS= 0
##$CY= 11.3945322036743
##$DATMOD= 1
##$DC= 2
##$DFILT= <>
##$DTYPP= 0
##$F1P= 18.9103706918063
##$F2P= -1.10871071338519
##$FCOR= 0.5
##$FTSIZE= 0
##$FT_mod= 4
##$GAMMA= 1
##$GB= 0.15
##$INTBC= 1
##$INTSCL= 1
##$ISEN= 128
##$LB= 0.24
##$LEV0= 0
##$LPBIN= 0
##$MAXI= 10000
##$MC2= 0
##$MEAN= 0
##$ME_mod= 0
##$MI= 1.114404
##$NCOEF= 0
##$NC_proc= 0
##$NLEV= 6
##$NOISF1= 3.799351
##$NOISF2= 2.8
##$NSP= 1
##$NTH_PI= 0
##$NZP= 0
##$OFFSET= 15.70392
##$PC= 1
##$PHC0= -8497.768
##$PHC1= 13.40018
##$PH_mod= 1
##$PKNL= yes
##$PPARMOD= 0
##$PSCAL= 0
##$PSIGN= 0
##$REVERSE= no
##$SF= 200.130013532006
##$SI= 16384
##$SIGF1= 3
##$SIGF2= 2
##$SINO= 400
##$SIOLD= 16384
##$SREGLST= <1H.CDCl3>
##$SSB= 0
##$STSI= 0
##$STSR= 0
##$SW_p= 3612.71676300578
##$SYMM= 0
##$S_DEV= 0
##$TDeff= 0
##$TDoff= 0
##$TI= <>
##$TILT= no
##$TM1= 0
##$TM2= 0
##$TOPLEV= 0
##$USERP1= <user>
##$USERP2= <user>
##$USERP3= <user>
##$USERP4= <user>
##$USERP5= <user>
##$WDW= 1
##$XDIM= 8192
##$YMAX_p= 0
##$YMIN_p= 0
$$ End of Bruker specific parameters
$$ ---------------------------------
##NTUPLES= NMR FID
##VAR_NAME=  TIME,          FID/REAL,        FID/IMAG
##SYMBOL=    X,             R,               I
##VAR_TYPE=  INDEPENDENT,   DEPENDENT,       DEPENDENT
##VAR_FORM=  AFFN,          ASDF,            ASDF
##VAR_DIM=   8192,          8192,            8192
##UNITS=     SECONDS,       ARBITRARY UNITS, ARBITRARY UNITS
##FACTOR=    0.0002004,     1,               1
##FIRST=     0,             0,               0
##LAST=      1.6414764,     0,               0
##MIN=       0,             -667339,         0
##MAX=       1.6414764,     548404,          0
$$ Real data points
##PAGE= N=1
##DATA TABLE= (X++(R..R)), XYDATA
$$ [...]
479 84422 33118 -85698 -77774 31403 65707 -28149 -125783 -93200 18345 24914 -90694 -131544
491 -131544 -24843 61739 9683 -89481 -84746 32163 98683 15322 -69894 2719 126568
502 126568 115725 2442 -41849 42692 133238 87739 -33759 -34788 83447 118111 7353
513 7353 -83795 -36577 70414 81121 -22878 -74746 21118 109521 45148 -60941 -43424 60966
525 60966 97770 10944 -77316 -29344 76474 50743 -81339 -122627 -31750 36888 -20756 -127027
537 -127027 -125827 -13631 27391 -81549 -165502 -89265 31218 36019 -51773 -85805 964 92402
549 92402 49208 -47645 -24076 86699 116133 33542 -34836 1585 83076 71151 -35172 -69030
561 -69030 20695 76843 11565 -62106 -30455 60757 78715 -14195 -77326 6714 121845 101046
573 101046 -1388 -24223 53747 112215 61774 -30463 -19893 80947 98288 -7536 -81783
584 -81783 -39997 25421 6994 -75892 -108034 -41493 8681 -45971 -103225 -58579 13780 4226
596 4226 -65645 -88965 -14078 67111 31862 -66753 -67917 19447 44415 -29538 -86616 -38480
608 -38480 57375 59513 -48727 -104564 -21710 66960 44321 -25136 -30875 34186 82063 48136
620 48136 -2105 31587 98185 83307 16297 8531 64768 96944 49673 -23854 -23489 36046 26364
633 26364 -59536 -82927 -4934 52238 2235 -96745 -115654 -17822 63286 15167 -69375 -53318
645 -53318 26142 48018 -9020 -57455 -22146 49397 37956 -44958 -64765 -423 32191 -9732
657 -9732 -58053 -54842 -20579 -22447 -65066 -58548 18487 48998 -25087 -91428 -48322 58319 102107
670 102107 33003 -38958 10602 111791 102381 3361 -28251 49086 122438 88200 -11950 -37999
682 -37999 44788 99859 44978 -24627 -19095 23688 32745 1043 -14437 22462 47798 -7292
694 -7292 -67734 -31464 44599 45454 -21087 -55069 -9093 42149 -5127 -102693 -95004 15742 58957
707 58957 -32273 -136900 -121874 -9004 52667 -24011 -119026 -88739 8740 34001 -17579 -46526
719 -46526 -8314 41172 22432 -34469 -24954 46537 67537 19885 -6609 16537 34415 5727
731 5727 -36208 -16006 60738 72113 -22388 -89384 -27958 72980 80590 -9452 -66971 4531
743 4531 112587 97297 -7966 -32754 50838 110424 62577 -31212 -48042 30157 79431 20857
755 20857 -55896 -58598 -28608 -28565 -50532 -50383 -19904 -9090 -59115 -99843 -51223 20597 8905
768 8905 -51116 -53489 16307 67783 25250 -53889 -37764 64775 96003 5047 -77136 -44291
780 -44291 54483 89980 9875 -76545 -49515 34495 48643 2605 -9075 31252 64101 42123
792 42123 -1673 8073 62907 74242 34046 21797 47297 46809 6480 -24759 -2273 47406 35826
805 35826 -52304 -97650 -30456 45636 19771 -70879 -108637 -42913 37891 19461 -58737 -59839
817 -59839 15088 46770 -2803 -59037 -52556 4830 31781 -9574 -50073 -38071 -24473 -46435
829 -46435 -59492 -35288 -4832 -11328 -53321 -64730 -4860 46751 10808 -44458 -19139 53910
841 53910 76958 27807 -16383 23683 105111 102178 7873 -41145 14405 89729 90119 18413 -36442
854 -36442 -13384 30524 15711 -19108 -6083 22560 12704 -15860 -16502 15531 36680 5665 -32603
867 -32603 -6839 43339 29943 -29034 -43805 3477 43920 7823 -76048 -88662 -763 56526
879 56526 -430 -83872 -82890 -14193 23291 -20087 -74809 -47595 23433 30403 -18456 -37351 -7611
892 -7611 25384 24855 3778 8874 39199 33691 -7925 -6730 45135 60860 9052 -41218 -17079
905 -17079 62259 85474 7705 -57819 -11727 68231 61490 -12513 -45198 12579 85253 62531
917 62531 -31099 -59169 11067 63551 30872 -29156 -41234 -3233 15696 -23271 -57044 -34551
929 -34551 -13702 -44750 -72862 -46274 -2600 -3617 -54072 -82188 -30543 35778 15071 -51971
941 -51971 -47402 29869 72309 22027 -56161 -48437 44576 87279 15352 -56957 -28528 44706
953 44706 56850 -4631 -55594 -25604 37848 37356 -9440 -12712 26569 41312 18772 2578 27082
966 27082 66402 58155 10899 10985 64817 75720 13226 -38271 -13790 46759 51068 -24594 -78788
979 -78788 -30144 36812 10715 -68465 -88743 -26921 34239 11475 -60812 -69506 -1088 33741
991 33741 -9349 -51767 -34284 11509 23077 -12231 -37910 -12537 8307 -24278 -54017 -24686
1003 -24686 17963 11321 -32867 -51653 -5016 50165 30458 -29173 -21587 49004 84314 46391
1015 46391 -4965 4246 63586 80518 18883 -26129 11036 64069 51517 -5752 -36101 -9766
1027 -9766 27153 11841 -29530 -23143 15311 16010 -16611 -26391 -295 25781 11249 -26966 -21127
1040 -21127 31482 44646 -7975 -46906 -24622 15196 10514 -41809 -71410 -30447 14987 -13117
1052 -13117 -71155 -72540 -24656 5124 -15152 -48158 -33674 18894 30103 -9916 -24956 10870
1064 10870 40698 29918 5740 9490 44300 54678 13416 -13862 18730 52928 31088 -11338
1076 -11338 -15145 24901 53613 18709 -35058 -24270 32956 45128 4742 -20075 4127 41195
1088 41195 34453 -15299 -34047 7907 36300 4023 -33736 -26268 2584 5554 -29297 -55928
1100 -55928 -30884 4043 -14660 -52647 -42739 -2065 6587 -28035 -58603 -33289 23700 29407
1112 29407 -21129 -38560 6348 41057 18937 -24673 -27407 19640 48126 10726 -32470 -11173
1124 -11173 33251 27728 -12206 -26277 7760 48216 35517 -7755 -2622 44875 54456 14870
1136 14870 -5813 23897 63186 55967 5712 -12160 30871 56603 12237 -36909 -23631 21962
1148 21962 29554 -19786 -65729 -42635 7441 -5739 -59973 -67106 -18879 12790 -10050 -51456
1160 -51456 -45708 6533 23300 -21258 -47082 -9089 31610 18244 -26474 -39952 -2639 27206
1172 27206 -5374 -47436 -24114 26809 26830 -19415 -42165 -9050 37911 29853 -19629 -21617 35545
1185 35545 64237 28398 -9520 4298 49058 60421 16886 -14579 19682 59963 34558 -19141
1197 -19141 -26474 10831 32697 3974 -37207 -23554 25560 26308 -23933 -43008 -7785 25953
1209 25953 12512 -28427 -33683 10208 31637 -12939 -53847 -31554 10588 8532 -32813 -55573
1221 -55573 -25837 12161 -8840 -58655 -54416 -4215 14728 -12182 -36054 -15195 30495 37072
1233 37072 -4628 -19745 24705 60601 40946 6851 7936 40876 55331 19255 -18403 2691
1245 2691 44185 34792 -7364 -18770 8587 31581 11917 -27534 -24357 21906 36579 110
1257 110 -23160 -341 29359 24316 -11595 -27564 5730 35825 9180 -30752 -25727 2899 3400
1270 3400 -28587 -53329 -35029 1065 -6191 -46703 -51494 -15733 547 -20550 -41936 -28024
1282 -28024 11717 24505 -9522 -31553 -196 31607 17008 -14519 -14148 18308 41368 17841
1294 17841 -18116 -5864 32159 30370 -3463 -12565 14984 42270 33671 -325 -5274 30842 46642
1307 46642 17218 -2774 18046 45185 38416 2174 -18142 7574 32316 4328 -36154 -27731
1319 -27731 6962 10308 -23329 -52948 -38550 -674 -700 -40066 -48660 -11226 13057 -5044 -34209
1332 -34209 -32685 1895 20752 -7034 -30301 -3954 27751 12159 -24064 -29715 -1808 19052
1344 19052 -1434 -34178 -20690 20897 21100 -17349 -30637 459 36432 32163 -4465 -10799 35351
1357 35351 63996 30074 -8504 5818 45136 54041 20793 -8444 11790 46040 28492 -17347
1369 -17347 -22741 8921 22158 -1304 -29863 -22105 12131 12289 -31710 -47557 -8196 23415 3374
1382 3374 -34078 -34688 5472 26447 -12791 -54294 -31170 16676 13468 -30382 -49906 -21635 15240
1395 15240 3659 -43676 -48376 1172 28908 1948 -26273 -12799 23230 32157 -265 -18204
1407 -18204 17763 51859 30379 -5094 2419 34906 41597 8770 -20566 1579 45176 35832
1419 35832 -15851 -29659 8857 38002 17027 -26391 -28166 22113 49571 10873 -29203 -9666
1431 -9666 29083 26836 -10007 -29731 -4836 27214 8910 -35853 -39031 -7760 -1052 -29094 -48655
1444 -48655 -32913 -1845 -5244 -44957 -53984 -12438 12305 -14502 -42263 -21889 23693 36306
1456 36306 -1701 -31766 318 47914 38323 -5662 -15959 18191 48709 32672 -10965 -19098
1468 -19098 19135 37082 8336 -11641 8052 33247 27931 -1390 -11080 17845 39160 15746
1480 15746 -8821 8935 35995 27757 -4362 -20433 2153 30323 12105 -32493 -34155 5536
1492 5536 18543 -15334 -51600 -43723 -2333 11724 -23657 -49145 -21462 12442 3461 -25500
1504 -25500 -32673 -10831 11927 4213 -18608 -12505 9466 2437 -22465 -23025 988 16437 1569
1517 1569 -25160 -18363 20183 28036 -8288 -25816 5273 39646 36054 4005 -7914 26085 59315
1530 59315 37195 -4411 -3054 31394 47566 26234 -4780 -7096 16172 16042 -14968 -25670 -3223
1543 -3223 7396 -9444 -25940 -20449 -2008 -417 -26406 -34334 -1581 20915 -1739 -32019 -25746
1556 -25746 7910 24468 -5751 -44139 -30476 16744 23696 -16536 -41375 -23387 6908 6552
1568 6552 -25656 -38375 -5286 22229 7589 -14338 -8033 12206 19533 9680 4012 22013 41727
1581 41727 24158 -2545 8407 37241 36435 6693 -12424 7047 41734 34013 -13026 -27177
1593 -27177 11830 38176 13290 -25120 -25647 14753 41709 12018 -31430 -24772 11589 18534 -5510
1606 -5510 -22860 -12746 5823 -2391 -32410 -35387 -9505 -6158 -31964 -40334 -19031 1074 -9241
1619 -9241 -38643 -40147 236 24706 -3983 -33675 -13988 29519 39694 5745 -26111 -5344
1631 -5344 41510 41061 -2871 -17290 14755 41094 25517 -12273 -22677 9533 33064 14050
1643 14050 -8025 2626 19705 13547 -1749 -1896 19841 35151 13468 -13364 2976 36526
1655 36526 29669 -8676 -25604 -3199 25357 12927 -30914 -39604 -1010 18663 -14878 -52332
1667 -52332 -45606 -7160 13209 -12416 -44225 -30401 3196 1977 -24285 -27569 -4201 15073
1679 15073 6161 -16341 -13313 12638 14306 -11119 -15691 9301 23661 7023 -16493 -11669 23029
1692 23029 37707 4623 -24163 -723 39401 42701 12722 -7193 11110 40709 31432 -5371
1704 -5371 -7761 25015 39362 16150 -12439 -15365 5630 15028 -6244 -21281 -6281 4663 -11379
1717 -11379 -27497 -18584 1531 5235 -17686 -35305 -13124 18920 10401 -20860 -25487 -2021 12302
1730 12302 -4144 -31459 -26360 9407 19592 -14459 -40415 -26040 1354 7545 -10669 -23022
1742 -23022 -5493 16550 6326 -12165 -1942 20977 24722 11521 4812 18922 38017 30552
1754 30552 5386 7142 32030 33419 7199 -9660 4449 30959 29267 -8116 -31273 -7972
1766 -7972 19099 9827 -15007 -17414 1841 14060 -3160 -28257 -19426 10755 12490 -13163 -25020
1779 -25020 -12992 397 -3975 -22337 -25887 -7831 -3804 -25861 -33342 -10681 8068 -2772 -28879
1792 -28879 -34883 -6230 21017 7960 -18057 -8626 20914 25805 3151 -13977 696 32142
1804 32142 34269 1764 -12927 8897 27076 15244 -3730 -4319 14177 24594 7991 -7753
1816 -7753 8922 29817 19181 -2916 -3140 16408 29504 15815 -6458 -32 25075 19224 -15089
1829 -15089 -27516 -4969 18124 8386 -26681 -42373 -17420 3602 -15529 -40033 -31076 -5731
1841 -5731 316 -18178 -34426 -18454 10610 7220 -19870 -21730 4012 18175 7410 -8880 -6298
1854 -6298 14048 15754 -9045 -16979 10185 30498 14707 -12267 -14984 10589 28694 11289 -13104
1867 -13104 81 31012 30954 4167 -8050 9451 33149 27818 -1756 -9499 16647 30031 8845
1880 8845 -13129 -9103 8027 10167 -10987 -25872 -7336 13908 -787 -27506 -26528 -5317 4173
1893 4173 -9464 -26375 -16383 9323 5913 -23820 -32052 -7398 11471 1417 -22495 -26570 -2205
1906 -2205 13399 -7048 -28253 -14657 8802 7611 -9756 -15185 4257 26188 16923 -8168 -4375
1919 -4375 22901 33275 17793 6372 14489 31520 29085 3906 -5226 17748 32401 13720 -8707
1932 -8707 -5864 11918 17374 -2877 -22469 -10222 13224 7524 -15512 -18179 -306 11010 -192
1945 -192 -20328 -18389 6437 13367 -8154 -21621 -8123 4647 -4118 -23298 -28594 -9725 5494
1958 5494 -10170 -30492 -21546 -1356 -1274 -15970 -22447 -7257 14279 11003 -10058 -9997 14411 23811
1972 23811 9159 -3931 3729 23791 28880 9663 -2838 12297 25513 12467 -3795 741
1984 741 17521 24466 9565 -8180 -227 20859 17372 -3000 -6168 10555 20646 10012 -9536
1997 -9536 -11273 7945 12036 -10795 -24869 -10507 3930 -2658 -22601 -31390 -16506 -1580 -13480
2010 -13480 -31596 -22292 -791 1122 -13943 -23674 -12244 7421 6865 -12321 -12576 10244 18806
2023 18806 2309 -11843 -5346 12157 16503 -1536 -13328 3597 21413 10942 -8025 -7390 9996
2036 9996 21711 11954 -4520 3614 27286 27531 4796 -3210 11814 25965 19995 1322 -2653
2049 -2653 15069 22383 1020 -17464 -7975 7633 4973 -12937 -23887 -11772 4191 -6349 -29110
2062 -29110 -26178 -4512 2066 -12145 -23983 -15089 5439 5882 -17665 -26045 -4473 11077 576
2075 576 -15032 -13695 2631 11407 -4153 -20697 -7910 15133 13386 -5065 -8792 6286 20693
2088 20693 14274 -4556 -2281 22550 30048 11184 324 11501 25491 21931 3846 -5509 10524
2101 10524 25309 11305 -8958 -6053 9285 11361 -4743 -19064 -9428 13203 11492 -12721 -19412
2114 -19412 -2540 8346 -1345 -15888 -15106 1581 8157 -9523 -24288 -13309 248 -6094 -21891
2127 -21891 -26510 -12755 1000 -7509 -26681 -22593 -1605 1223 -13047 -16807 -1870 15842 14945
2140 14945 -2546 -6571 14227 26629 13808 1463 7979 23020 27226 11760 -3900 4449 21655
2153 21655 16588 -1281 -2809 10476 16783 7647 -5872 -3963 11683 13123 -3662 -7753 7194
2166 7194 15990 6113 -9583 -12169 1574 10694 -3827 -19940 -12348 2993 -953 -18264 -26615
2179 -26615 -16714 -1318 -4735 -21878 -21814 -2789 2992 -8908 -17349 -10682 2657 7277 -3319 -9559
2193 -9559 2455 12502 3167 -7884 -3175 8771 12602 2520 -6767 3402 20381 13987 -4958
2206 -4958 -4808 12843 23236 16291 2618 3585 20678 26141 9101 -2367 7495 19465 16695 3874
2220 3874 -4420 1798 9835 -915 -16127 -11556 1106 -1836 -15011 -20277 -12310 -1974 -7664 -23426
2234 -23426 -21882 -3357 1843 -11061 -18494 -10009 3317 3795 -13195 -22383 -4827 14196 6104
2247 6104 -12265 -13841 -1011 7331 443 -11811 -6705 10516 11214 -3052 -5120 6564 14464 10386
2261 10386 1700 2889 17245 23413 9434 1343 13230 24481 16104 41 -3609 11786 25869
2274 25869 13682 -8922 -8255 7940 9545 -4336 -13355 -6250 8276 7135 -13507 -22521 -7341
2287 -7341 5641 -1544 -13921 -15066 -6073 -325 -8954 -18968 -10581 -91 -9419 -23629 -19284 -3081
2301 -3081 4380 -5388 -20356 -16642 2232 6800 -6955 -10090 5592 19361 14369 -2711 -8505
2314 -8505 11044 29463 19543 1702 3309 15997 18363 8796 24 4895 16012 10981 -5341
2327 -5341 -5743 9302 15161 5982 -4691 -4488 5909 10182 -28 -3919 10442 17372 2017 -15726
2341 -15726 -14528 2733 14056 1149 -19542 -19591 -4109 -4012 -17210 -22563 -14394 -4135 -6973 -21634
2355 -21634 -25107 -7873 5074 -3269 -13936 -11238 -2431 3123 626 -1090 7692 14517 2127 -11610
2369 -11610 -4006 13642 19561 10195 -2088 -1189 10951 12761 704 656 16067 23132 11970 -2352
2383 -2352 -2633 14202 26315 14547 -3720 -2586 7597 8824 2622 -151 1540 2647 -5962 -19020
2397 -19020 -15353 1098 3733 -8132 -16047 -13949 -8826 -8487 -14193 -12087 3236 7569 -9551 -22128
2411 -22128 -13620 3778 9502 -1114 -15002 -12113 1710 1606 -7318 -5864 3131 4894 -3119 -12120
2425 -12120 -7712 10304 19486 8575 -977 2139 7395 7894 9983 15482 22883 21635 5923 -4929
2439 -4929 6998 23670 21079 6593 -1214 2191 9391 6161 -5340 -4979 6973 6238 -10085 -19236
2453 -19236 -11119 3648 7927 -5404 -19376 -15670 -6386 -7962 -10661 -4326 189 -4122 -15540 -22768
2467 -22768 -13361 2750 2002 -11371 -13992 -5978 -3347 -8047 -11510 -4397 9324 9250 -8174 -15088
2481 -15088 2169 19704 18378 4932 -3340 3180 14482 13185 5599 10385 19787 14276 -131
2494 -131 -5357 2887 16429 18096 4395 -3244 3605 5889 -1306 -1978 6467 12983 7528 -7566 -13949
2509 -13949 468 15489 6957 -10901 -14269 -5286 231 -5063 -14181 -11150 -200 -4868 -22329
2522 -22329 -26948 -12309 1364 677 -10981 -17872 -9557 -533 -4170 -7422 2893 11341 5787 -4268
2536 -4268 -5570 5866 18226 12969 -1584 -863 11379 13223 4583 779 7321 16043 12049 -3743
2550 -3743 -8380 9401 22857 15583 1692 -1524 4953 11690 7160 -96 5253 14629 6592 -8699
2564 -8699 -10840 -1834 5111 908 -11863 -15874 -6270 -3322 -12935 -15879 -7713 -3274 -9139 -18999 -19400
2579 -19400 -4360 7542 -1518 -16255 -14166 -2117 1413 -2948 -7242 -2163 7168 4278 -9939
2592 -9939 -10631 3495 11206 5490 -1572 -1457 6959 12753 5851 1158 9905 17637 10716 3578 5994
2607 5994 15358 20395 12555 -222 1290 12441 11219 1343 -1333 4868 7902 1722 -10722 -13404
2621 -13404 -357 6543 -3198 -12808 -8983 -3006 -3111 -8219 -12498 -5926 1531 -4096 -14040 -10743 -990
2636 -990 -218 -7537 -14460 -12127 -2778 -1190 -10139 -11369 -1437 1516 -6197 -11504 -6912 4230 11050
2651 11050 3558 -4418 2431 13038 11153 5073 5593 12113 17582 13727 4614 5737 16038 15179 4606
2666 4606 468 5711 10696 9296 1292 -3064 4535 7968 -2023 -8701 -2508 4805 4702 -3754 -10726
2681 -10726 -6210 2460 -2810 -14105 -11884 -2173 -1264 -8624 -15653 -14284 -5111 -3130 -12838 -16429 -6652
2696 -6652 -179 -4360 -9566 -8763 -768 4636 -1433 -8191 138 11651 9379 18 -1611 4549 10468
2711 10468 7999 -730 1067 12268 13455 2179 -2625 3656 11217 11752 3403 -1432 7394 16498
2725 16498 9161 -695 1625 9461 10525 4007 -2770 994 9851 6081 -7760 -10469 -2197 678
2739 678 -5411 -12404 -13201 -5103 -2159 -12990 -20645 -12519 -3365 -6191 -13128 -13911 -5803 1698 -3741
2754 -3741 -14232 -9256 3697 4618 -3195 -5536 -127 7958 7687 -2130 -5334 5997 12965 6388 508
2769 508 4512 11525 13042 5367 -1874 5932 17040 12867 3030 3408 10658 12914 7914 -326 608
2784 608 10563 11202 -543 -4988 1712 5737 794 -7509 -10568 -2188 4543 -3314 -13482 -8967 -703
2799 -703 -3000 -10175 -13118 -7965 171 -1954 -12155 -12303 -3023 -1123 -7932 -12252 -9018 -1124 1253
2814 1253 -7081 -12513 -4056 3548 -1521 -7458 -3667 4911 9905 5950 -1072 2960 13864 13148 5270
2829 5270 5579 12531 16324 13989 6222 3385 11098 13929 4397 -1693 3921 8409 6024 -1289 -6198
2844 -6198 -1279 4522 -615 -8997 -4725 3390 2176 -4810 -9248 -7005 -15 -231 -9402 -11373 -2884
2859 -2884 -422 -7342 -13310 -12299 -6048 -2434 -8782 -14032 -6813 1069 -2955 -8458 -6325 -109 3693
2874 3693 1770 -2934 809 10813 10197 1369 -255 5194 10382 9803 4215 2229 9581 12906 4484
2889 4484 -1051 5310 11675 10321 4693 1711 5879 12474 8604 -478 878 6789 6786 1738 -2426 -2397
2905 -2397 2395 1316 -9369 -13325 -5951 -2024 -7963 -12631 -11248 -6431 -5026 -11708 -16978 -9308 539
2920 539 -2880 -9473 -8910 -4060 896 -596 -6791 -5810 4270 5470 -2647 -4651 1741 7014 5432
2935 5432 -1470 -4347 4607 12021 6660 1203 4930 10157 8289 4390 2164 7383 16026 12826 2100
2950 2100 1225 8936 10481 5152 310 1327 7651 8182 -1907 -7629 236 5158 -533 -7804 -9613
2965 -9613 -4666 375 -3346 -11955 -10011 -3429 -6054 -12972 -13282 -7015 -866 -2530 -12001 -14909 -5467
2980 -5467 -467 -6059 -8494 -3798 1288 672 -5057 -7478 393 9192 4365 -4005 -1544 6763 10532
2995 10532 7974 2448 3275 11558 11954 3484 2629 11942 15993 10743 3507 44 6035 11060 5592
3010 5592 -543 3319 6965 1317 -5261 -5983 -446 5779 1397 -8407 -8863 257 2165 -4168 -7378
3025 -7378 -4878 -1036 -1903 -8930 -11365 -1967 3215 -5535 -13719 -13198 -7037 -2207 -4190 -9501 -7949
3040 -7949 -1152 -3558 -9521 -6321 1773 6329 4527 -659 -1039 7616 11893 5620 2824 8698 11617
3055 11617 8211 3968 3145 9455 14454 7217 -2692 -133 7503 9125 5500 2282 2110 6038 4091
3070 4091 -3469 -3422 5906 8051 568 -5521 -6516 -3376 -751 -5362 -10317 -7363 -3908 -9598 -14112 -10380
3086 -10380 -5589 -4219 -8691 -15042 -12207 -1452 42 -5782 -6322 -1353 418 -1434 -4711 -4115 4931
3101 4931 9376 1580 -4779 -1584 3844 4978 3954 1669 4284 8873 6102 1006 4928 12670 11601
3116 11601 6580 3965 6167 11985 13647 6721 3590 8578 8652 1594 -1405 1620 6491 7099 -1440
3131 -1440 -10179 -6858 765 -1178 -6235 -7021 -4733 -3376 -5346 -10883 -9463 -1659 -1620 -8854 -10961 -6209
3147 -6209 -2950 -2784 -6487 -8614 -4023 -682 -6037 -8553 -1310 4683 2884 -2941 -6774 -2447 6841
3162 6841 7117 244 1254 7561 7749 3186 1279 3792 10287 12556 4491 -240 6093 11227 8018
3177 8018 3850 2929 4388 6447 3396 -1543 2234 8041 2996 -5317 -6811 -2562 1005 446 -5933
3192 -5933 -8303 -2634 -1865 -9415 -12006 -6465 -1720 -1997 -8081 -13244 -8144 -478 -3411 -9923 -8051
3207 -8051 -3609 -2252 -3731 -5804 -3759 3341 3009 -4609 -5140 3083 7793 6597 3835 3172 6777 9759
3223 9759 5132 1957 8976 14439 10287 3386 1607 5381 10692 8510 456 -45 6410 6847 1748
3238 1748 -647 1761 4938 4758 -1762 -5496 1231 5988 1615 -3748 -3597 -2757 -2406 -5246 -8607 -5730
3254 -5730 -403 -4763 -12983 -12780 -7656 -4932 -6943 -10462 -11031 -4014 -1574 -7267 -8842 -2698 1369
3269 1369 4 -3350 -4227 1191 7442 4952 -1428 -123 5027 4980 3488 3236 5981 9683 8680 2341
3285 2341 1395 8650 11031 7279 4914 5722 7578 8403 4082 -20 3663 7713 2386 -3605 -3220 354
3301 354 1752 -1447 -7822 -8584 -3207 -2809 -7639 -7432 -3983 -2838 -4670 -8252 -9447 -3648 689 -3416
3317 -3416 -6990 -4195 -1338 -2840 -4820 -5678 -2659 1140 -984 -6518 -3451 2832 2142 -1122 -2442
3332 -2442 -663 4291 6457 2338 1271 7252 9584 5371 2966 4527 8395 11900 8907 3806 5500
3347 5500 9507 6414 2511 3198 5300 5885 3629 -1222 -1676 2637 2800 -3756 -5505 -2794 -1505 -2776
3363 -2776 -5849 -8242 -4636 -2342 -8032 -11893 -8057 -3171 -3827 -6772 -9375 -8394 -3746 -3479 -8201 -6774
3379 -6774 -1316 -243 -2868 -4204 -2511 1626 3988 -56 -2194 3870 7647 4974 2419 3816 6093
3394 6093 7970 5622 1364 5003 10716 8479 2773 2409 4732 6753 6046 1691 660 5690 7408
3409 7408 1254 -1768 1285 3640 2950 -547 -3229 -329 3063 -837 -6382 -4868 -2287 -3193 -5545
3424 -5545 -8202 -7309 -2854 -3740 -10479 -11189 -6339 -3964 -6206 -7540 -7001 -2890 38 -3671 -7151 -1785
3440 -1785 3406 1866 -330 347 2750 6108 5270 646 1336 7088 7987 3977 3835 5978 8389 8090
3456 8090 3331 1556 6554 10198 5580 2250 4226 6089 5558 2799 -842 991 5263 2908 -2946
3471 -2946 -3131 127 -88 -2899 -6167 -7589 -2764 -894 -6425 -8151 -5100 -2886 -5557 -7843 -8037 -4734
3487 -4734 -1381 -3815 -8310 -5677 -1580 -2585 -4727 -5241 -3193 413 1448 -3133 -3541 2492 3769
3502 3769 192 -691 2130 5718 7130 4962 2193 5565 9638 6827 3837 5797 8066 8994 7963
3517 7963 3914 3159 6934 6207 1178 392 3263 3746 1389 -2193 -3928 -1319 707 -4225 -6931 -3862
3533 -3862 -1510 -3157 -5545 -6502 -5832 -2991 -4156 -8190 -6301 -1881 -2144 -5105 -6910 -6263 -2875 -1873
3549 -1873 -5351 -6275 -1348 393 -2527 -3598 -1470 497 2515 1591 -737 2894 7429 5783 2382
3564 2382 3371 5929 7608 6805 4278 4094 8512 8859 3620 2058 4888 5903 4941 2931 1577 3353
3580 3353 5553 1349 -2520 81 2426 610 -1536 -3585 -2971 -459 -2153 -7621 -7684 -3678 -4005 -7230
3596 -7230 -8539 -7385 -5802 -4706 -8282 -10229 -5272 -2303 -4439 -5199 -3649 -1352 748 -248 -3488
3611 -3488 -802 4643 4104 1155 1668 3726 5090 4249 1788 1590 6249 7774 3529 2151 5351 6410
3627 6410 5805 4254 2141 4575 7997 6051 1853 2967 5640 4506 1494 -313 188 3587 3011 -2950
3643 -2950 -4207 -782 -848 -4258 -5923 -5723 -3345 -1803 -5159 -8726 -6476 -3501 -5075 -7525 -6458 -4920
3659 -4920 -2763 -3282 -7050 -5731 -1220 -1008 -4621 -3978 -1151 1815 2252 -391 -1754 2063 5044 2420
3675 2420 1375 4477 6763 7167 5441 2249 4105 8490 6966 3058 3726 6945 6837 4491 2148 1283
3691 1283 4078 4852 882 -1481 1667 2665 227 -2051 -3101 -2492 -364 -2557 -6075 -4549 -739 -2591
3707 -2591 -6224 -6863 -5602 -3175 -2891 -5994 -6689 -2239 -2136 -5594 -6226 -4051 -2369 -830 -2731 -4724
3723 -4724 -1495 2240 157 -2254 -493 1845 3307 3716 1977 3050 7439 6500 3053 3630 7160 8020
3739 8020 7109 5842 5010 6686 7568 4033 1389 3777 5433 3633 1751 -227 163 2222 599 -3360
3755 -3360 -3051 -168 -1291 -3328 -3476 -3557 -2656 -2629 -6103 -7678 -4177 -2876 -5197 -6779 -6316 -5521 -4594
3772 -4594 -5695 -7629 -5277 -1202 -2950 -5176 -3228 -1080 -499 203 -1729 -618 3153 4211 1407
3787 1407 1368 3856 4308 3897 2837 2543 4988 7536 5081 2337 4768 6243 4599 4042 4123 5065 6991
3804 6991 5871 1975 1825 4457 3695 675 188 -405 263 671 -2684 -5534 -3429 -2192 -5203 -6713
3820 -6713 -5562 -4309 -3470 -5132 -7956 -6547 -3012 -3528 -5485 -4201 -2219 -1511 -1979 -3094 -3699 -154
3836 -154 1406 -1994 -1933 1368 2644 2321 920 108 1957 4969 3690 1402 3860 6701 5659 3808
3852 3808 3219 3548 6011 6609 3072 2635 5515 4727 2141 1499 1247 2525 2931 370 -2007 464 2184
3869 2184 -829 -3159 -2883 -2687 -1802 -2359 -5359 -4746 -1916 -3770 -7910 -7614 -5305 -4409 -4091 -6280 -7632
3886 -7632 -4593 -3082 -5319 -5901 -3284 -1588 -1528 -1738 -2413 -407 3258 2533 -676 1003 4556 4730 4235
3903 4235 4205 4576 6498 6747 3231 2573 6935 8161 5966 4721 3789 4301 5163 3354 979 2892 5098
3920 5098 2103 -589 -1209 -293 844 207 -3209 -3919 -1002 -674 -3221 -3576 -2680 -2780 -3387 -4919 -6084
3937 -6084 -3298 -525 -3545 -5969 -5474 -4281 -4214 -4384 -4929 -3910 -824 -1751 -4809 -3741 -226 621 328
3954 328 165 -343 2154 4098 2624 1256 4155 5670 3656 3277 3702 4987 7310 5715 2923 2872 5183
3971 5183 4489 3113 3702 4335 4117 3557 520 -1018 1829 2749 -168 -2041 -2036 -1904 -2187 -3457 -5557 -4517
3989 -4517 -2807 -4961 -7584 -5897 -3969 -4177 -4315 -5596 -6458 -3489 -2496 -4221 -2979 -260 -490 -1932
4005 -1932 -2256 -2233 102 2679 1086 -835 1462 2515 1482 1322 2053 2872 4944 4305 1721 2955 6456
4022 6456 6048 4176 4195 4291 5198 5956 4080 3249 4808 5638 1858 224 1427 1987 1879 751 -1735 -1764
4040 -1764 -129 -2332 -4621 -3503 -2122 -2952 -3800 -5476 -6421 -3656 -2870 -6036 -6662 -4326 -3639 -4373 -4449
4057 -4449 -4904 -3640 -1552 -3472 -5126 -2398 488 359 -139 15 464 2130 2859 852 2091 5304
4073 5304 5446 2990 3098 3552 4751 5666 4028 2660 5045 6457 3829 2348 3134 3555 3649 2815 156
4090 156 727 3296 2309 -636 -662 -118 -565 -1363 -2701 -3462 -1004 -358 -3673 -5651 -3715 -3590 -3971 -4443
4108 -4443 -5041 -4369 -2537 -3819 -6527 -5194 -2523 -3090 -3729 -3657 -2955 -586 256 -2203 -1968 1453 1893
4125 1893 1026 1087 2677 3860 5480 4261 2019 3647 6145 4869 3826 4695 5166 5442 4592 2155 1679
4142 1679 4631 5033 1835 1327 2384 2147 1524 23 -1463 -128 1049 -1374 -3444 -2190 -1095 -2230
4158 -2230 -3118 -5040 -5196 -3216 -3060 -5836 -5078 -2875 -3991 -5132 -5062 -4952 -3095 -1388 -3040 -4350 -1889
4175 -1889 -845 -1817 -1821 -750 -77 1608 1191 -503 991 3731 3113 1632 2559 3305 4451 5337 3976
4192 3976 3425 5562 6117 3512 3278 4547 5058 5012 4150 1972 2293 3782 1425 -310 405 1057 -134
4209 -134 -941 -2586 -3483 -1597 -1702 -4515 -4634 -2833 -3030 -4211 -4384 -4768 -4202 -3008 -4642 -6032 -3534
4226 -3534 -1892 -3070 -3423 -3426 -2992 -1601 -889 -2402 -1369 1805 900 -669 411 1326 2064 3006 2327 1699
4244 1699 3862 5184 3182 2761 4166 4152 4622 4188 2701 3871 5955 4312 1962 2686 3156 2854 1889
4261 1889 1282 789 1882 1259 -1964 -2589 -1089 -1484 -2367 -2612 -3293 -3534 -2440 -3596 -6080 -4248 -2836
4278 -2836 -4014 -4891 -4700 -4260 -2950 -2930 -5133 -4542 -1742 -1692 -2965 -1718 -193 -114 560 -81 -732 1661
4296 1661 3891 2584 1925 3302 3993 4343 4082 2696 3644 5644 4859 2530 3281 4833 3777 3305 2619
4313 2619 1512 3181 4271 1391 270 1887 1896 439 -405 -1158 -823 505 -989 -3573 -2207 -1218 -3400
4330 -3400 -4220 -4377 -3970 -3527 -3170 -5163 -6001 -3097 -3326 -4793 -4388 -3578 -2538 -1420 -2087 -3218 -1286
4347 -1286 761 -866 -1556 609 1598 2549 2844 1460 1240 3527 4086 2141 2962 4656 5006 4746 3733
4364 3733 2892 3949 5245 3328 1777 4019 4142 2788 2119 1091 786 1783 907 -1992 -1169 575 -814
4381 -814 -2269 -2373 -3439 -2468 -2071 -3674 -4660 -2672 -2138 -4246 -4357 -4166 -3722 -2880 -3072 -4816 -3041 -1179
4399 -1179 -2226 -3652 -2238 -1642 -1249 -711 -1106 -1489 1399 2217 97 730 2189 2814 3441 3343 2838 4183
4417 4183 5946 3988 2466 4621 5475 4755 4420 3943 3070 4355 4045 1333 1499 2969 1995 548 445
4434 445 -575 -418 416 -1626 -3701 -2300 -1362 -2889 -3419 -2969 -3939 -3587 -3572 -5763 -4762 -2369 -3017 -4459
4452 -4459 -3561 -2945 -2775 -2313 -2925 -3474 -942 -184 -1665 -1510 202 572 869 610 323 1426 3153 2688
4470 2688 1502 2847 3972 3109 3135 2940 2956 4257 5321 2883 2258 3743 3503 2219 2383 2043 2232 3149
4488 3149 1441 -559 823 1710 -239 -1334 -978 -1797 -1428 -1341 -3450 -3754 -2209 -3231 -5186 -4506 -3799
4505 -3799 -3677 -3381 -4454 -5303 -3869 -2385 -3739 -4070 -1473 -1185 -1467 -1047 -1580 -1104 1781 1620 195
4522 195 1318 2992 2760 2811 2668 2587 3757 4296 2531 2043 4272 4513 3480 3354 2685 2414 3971 3383
4540 3383 1422 2933 3717 1833 331 530 300 437 870 -1257 -1911 -102 -701 -2952 -3087 -2734 -2805 -2621
4558 -2621 -3634 -4847 -3505 -1979 -3855 -4875 -3855 -3229 -3221 -2720 -3596 -3318 -1193 -1530 -3614 -2421 -364
4575 -364 -338 106 402 -344 1202 2638 1463 870 2932 3788 3158 3478 3507 3671 5168 4865 2363 3419
4593 3419 4971 3721 2613 2767 2348 2498 2843 620 -375 1241 1313 -484 -758 -703 -1444 -1449 -1777 -3738 -2756
4612 -2756 -1145 -2832 -3912 -3634 -3190 -3451 -3118 -3782 -4328 -2194 -1902 -3487 -3394 -1978 -1716 -2042 -1812 -2212
4630 -2212 -732 1012 -80 -1055 330 1383 1019 1345 1253 1861 3627 3923 2163 2495 4180 3849 2929
4647 2929 3432 3672 4101 4479 2734 1417 2808 3872 1899 1426 1630 1008 945 794 -1069 -1348 280 -1160
4665 -1160 -2728 -2185 -1842 -2595 -2049 -3354 -4504 -3625 -2552 -4469 -4239 -2914 -3140 -3591 -3562 -4015 -3351 -1227
4683 -1227 -1619 -2829 -1156 -363 -1219 -626 -123 351 1442 2093 727 1052 3015 2854 2539 2743 2462 2798
4701 2798 3718 3699 2559 4065 4902 2865 2107 2799 2727 3245 3669 1761 1380 2180 1136 -246 274 289 -296
4720 -296 -346 -1201 -2778 -1606 -1095 -2840 -3402 -2676 -3116 -3539 -3364 -3461 -3672 -2424 -3219 -4892 -3836 -2434
4738 -2434 -2392 -2227 -1752 -2539 -1732 -1059 -1917 -1159 1149 1628 401 710 812 1551 2972 2730 1890 2715 3935
4757 3935 2914 2808 3798 3963 3990 3572 2161 1708 3877 3689 2212 1881 1929 922 865 517 -73 712 1523
4776 1523 -658 -2064 -1691 -1484 -1952 -1642 -2416 -3151 -2475 -2904 -4264 -3427 -1966 -2845 -3496 -3828 -4036 -2615
4794 -2615 -955 -2083 -2746 -1723 -1768 -2058 -1052 -30 266 1541 1003 -847 171 2191 2392 2345 3026
4811 3026 2642 2957 3252 2800 2665 4648 4501 2837 2119 2948 3045 3487 3211 1675 1377 1873 639 -102 1346
4830 1346 1313 451 -686 -1971 -2941 -961 -635 -2008 -1936 -2503 -3202 -3658 -3192 -3132 -2805 -2109 -3534 -4653 -3141
4849 -3141 -2253 -2501 -2299 -2167 -2932 -1952 -1178 -1749 -807 852 358 -922 -243 223 1552 3276 2486 2046
4867 2046 2644 3232 1771 2435 3561 3858 3913 3333 1954 2210 3864 3519 2395 2707 2332 1078 1554 1660
4885 1660 1277 1805 1285 -1128 -2000 -702 -908 -987 -1335 -2274 -3245 -2623 -3513 -3901 -2448 -1841 -3051 -3722 -3481
4904 -3481 -3654 -2196 -1430 -2474 -2496 -1280 -1803 -1977 -629 -332 -243 514 -579 -1323 770 2028 1577 1598
4922 1598 2171 1526 2047 2590 2144 3462 4561 3769 1643 2209 3119 2937 3810 3184 1737 2070 2604 597
4940 597 918 2110 1193 295 -149 -1336 -903 283 -608 -2408 -2061 -2333 -3389 -3176 -2390 -2756 -2493 -2627
4958 -2627 -4447 -5043 -2858 -2662 -2941 -2916 -2315 -2677 -2123 -1984 -2261 -832 529 -702 -914 329 898 1471
4976 1471 2486 1407 1207 2453 2640 1767 3095 3856 3187 3031 2664 1899 2796 4129 3100 2206 2478 2122
4994 2122 1133 1697 1406 815 1629 852 -1068 -1048 471 -589 -715 -1132 -2248 -2017 -1677 -2219 -2981 -1786
5012 -1786 -2388 -3556 -3383 -3247 -3076 -1959 -1675 -3401 -3005 -2149 -2783 -2708 -1501 -1477 -1009 -578 -1159 -1160 755
5031 755 1531 504 1070 1513 1830 2597 3184 2445 3016 3788 2652 2347 3350 3944 3183 3385 2589 1614 2698
5050 2698 2659 1066 1423 2155 1089 300 363 -716 -415 339 -1228 -2050 -1415 -1544 -2396 -2500 -2458 -2980 -2418
5069 -2418 -2496 -3893 -3393 -2336 -2349 -3030 -2596 -2683 -2930 -1613 -1863 -1960 -587 -162 -1276 -1154 60 115 703
5088 703 1157 657 668 2333 1993 1003 2372 2476 2155 2889 2631 2345 3605 3632 2218 2446 3145 2615 2393
5107 2393 2918 1798 1804 2284 1214 -84 403 628 -627 -647 -877 -2221 -1576 -1576 -2681 -2873 -2100 -2631 -3256
5126 -3256 -3123 -2889 -3190 -2358 -2991 -3851 -2664 -1903 -2613 -2660 -1288 -1438 -1097 -599 -1296 -626 732 678 55
5145 55 1135 1974 1540 1523 2053 1536 3091 3429 2313 2245 3255 3011 2545 2701 2288 1660 2786 2235 1001
5164 1001 1745 2148 840 417 875 273 331 487 -715 -951 -500 -1218 -2404 -1850 -1787 -2623 -1688 -2555 -3861
5183 -3861 -2945 -2359 -3337 -3170 -2715 -2821 -2484 -1765 -2387 -2635 -1177 -1502 -2155 -555 -141 -160 342 280 48 938
5203 938 2016 1152 1219 2729 2853 2798 3131 2672 2405 3364 3251 2304 3139 3372 2310 2034 2183 1862 1478 1893
5223 1893 895 62 884 773 -863 -638 -809 -1440 -1060 -1387 -2602 -2213 -1322 -2171 -3151 -2406 -2427 -2567 -2159
5242 -2159 -2367 -2825 -1915 -1845 -2760 -2770 -1839 -1971 -1432 -1065 -1527 -571 460 -233 -523 519 1246 908 1720 1494
5262 1494 1605 2769 2647 1958 1922 2854 2555 2522 2795 2322 2270 2988 2323 1221 2266 2319 1500 1293 1193 512
5282 512 572 402 -1073 -555 501 -968 -1679 -1730 -1926 -2308 -2193 -2459 -3568 -2424 -1863 -3142 -2883 -2625 -2565
5301 -2565 -2594 -2260 -2486 -2227 -920 -1478 -1713 -594 -444 -872 -398 11 -132 991 1702 821 943 2002 1560
5320 1560 1733 2849 2375 2277 3251 2778 1657 2884 3599 2601 2366 2356 1519 2082 2350 1419 967 1437 772
5339 772 -253 96 -106 -679 -457 -661 -2147 -1553 -1467 -2264 -2148 -1940 -2508 -2450 -2322 -3056 -3362 -2030 -2386 -3013
5359 -3013 -2354 -2298 -2219 -1693 -1581 -1793 -877 -224 -870 -1125 810 1044 635 1231 1146 675 1766 1913 1432 2217
5379 2217 2812 1867 1902 2263 2089 2860 3227 2363 1893 2294 2225 1622 2215 1769 988 1039 829 -402 550 932
5399 932 -625 -1270 -987 -1810 -1725 -1428 -1958 -2382 -1558 -2399 -3561 -2595 -2018 -2412 -2135 -1866 -2722 -2322 -1743 -2014
5419 -2014 -1955 -864 -968 -1471 -1094 -665 -355 845 930 -20 578 1284 1257 1396 2725 2350 2467 2807 1814 1628
5439 1628 3305 3394 2463 2583 1988 1870 1882 2212 1318 1432 1789 504 15 543 206 204 -132 -831 -1447 -801
5459 -801 -665 -1917 -1458 -1178 -2331 -2714 -2573 -2748 -2658 -1507 -2299 -3359 -2391 -2501 -2563 -1826 -1345 -1575 -605
5478 -605 -721 -1767 -908 508 583 174 581 436 906 1645 1464 1509 2053 2282 1496 1888 2574 2700 3322 3091
5498 3091 1703 1839 2879 2586 2180 2613 2023 1162 1365 1037 -16 857 1010 -308 -986 -550 -1025 -1595
5516 -1595 -1402 -1937 -2127 -1749 -2723 -3055 -2263 -1612 -2006 -2214 -2573 -2981 -2411 -1578 -1976 -1855 -892 -1694 -1721 -1256
5536 -1256 -1071 -693 581 366 -63 303 1133 710 1155 1565 1996 1944 2063 1745 1887 3286 2594 1899 2319
5555 2319 2243 1941 2376 2360 1377 2208 1842 541 782 1104 793 391 403 -718 -995 -312 -965 -1401 -1237 -1255
5575 -1255 -2447 -2194 -2123 -2621 -1946 -1806 -2747 -3105 -2358 -2073 -1858 -1244 -1501 -2307 -1284 -1263 -1622 -321 220
5594 220 -354 -193 463 281 571 1444 980 1487 2307 1755 1373 2188 2547 2307 2494 2405 1783 2342 2804 2321
5614 2321 1798 2309 1398 1028 1434 825 847 1381 426 -925 -703 -83 -736 -613 -372 -1515 -1647 -1226 -2130
5633 -2130 -2504 -1352 -1516 -2466 -2303 -2943 -2719 -1705 -1474 -2557 -2435 -1762 -2376 -2013 -998 -689 -808 -167
5651 -167 -588 -1135 661 912 530 1230 1702 1186 1490 1864 1906 2547 3148 2070 1663 2355 2575 2443 2807 2459
5671 2459 1284 2120 1876 590 1438 1369 934 366 2 -672 -577 127 -558 -1428 -956 -1410 -2077 -1609 -1981 -1826
5691 -1826 -1600 -2144 -2823 -2563 -1755 -1835 -2194 -1712 -1852 -1910 -1437 -1404 -1379 -869 -530 -985 -642 -79 -234 634 1026
5712 1026 548 716 1803 1359 1139 1748 2404 1861 2164 2034 1437 2433 2642 1955 2217 2534 2103 1758 1825 1332
5732 1332 1020 1483 492 -391 310 290 -558 -724 -790 -1667 -1655 -1283 -2463 -1845 -1295 -2187 -2430 -2032 -2640 -2454
5752 -2454 -1874 -2129 -2568 -1860 -1415 -2007 -1638 -1364 -1266 -1100 -313 -804 -233 802 236 497 767 778 1003 1564
5772 1564 1722 1525 2053 2414 1589 1415 2328 2027 2024 2061 1701 1511 2265 1815 1167 1833 1657 659 461 880 -109
5793 -109 413 519 -617 -684 -413 -503 -1517 -935 -1117 -1512 -1567 -1987 -2593 -2050 -1347 -2331 -2199 -2129 -2172 -1947 -1845
5814 -1845 -1850 -1894 -901 -1015 -1349 -687 -262 -374 370 611 -7 603 1764 966 1180 2043 2058 1743 1733 2025 1574
5835 1574 2572 2206 1421 2239 2507 1604 1301 1720 1289 1465 1626 844 364 922 277 -384 -98 -776 -869 -955
5855 -955 -942 -1487 -1509 -1178 -2260 -2100 -1395 -2054 -1879 -1714 -2329 -2488 -1624 -1910 -2188 -1822 -1309 -1359 -1161 -706 -1460
5876 -1460 -658 428 76 -220 427 803 829 1337 1320 1075 1921 1749 1665 1955 2654 1659 2096 2106 1648 1928 2333
5897 2333 1674 891 1872 1388 968 926 991 249 356 472 -510 -541 -39 -890 -976 -779 -1399 -1696 -1609 -1860 -2250
5918 -2250 -2074 -2004 -2347 -2229 -1971 -2032 -1492 -1535 -1874 -1667 -946 -1364 -1602 -347 -607 -783 56 93 -54 681 1074
5939 1074 204 612 1399 1363 1589 2079 1544 1705 2654 1812 1432 2407 2635 2049 2217 2252 1439 1493 1491 627 596 1132
5961 1132 398 -76 195 -379 -688 -297 -1135 -1397 -1111 -1132 -1829 -1826 -1499 -1767 -1899 -1762 -2532 -2167 -1732 -1952 -2393
5982 -2393 -1664 -1719 -2173 -1571 -1151 -1303 -507 -153 -364 -561 512 775 566 1006 1040 805 1870 1486 1178 1597
6002 1597 2290 1651 1990 1887 1210 1682 2319 1277 1282 2050 1511 1110 1074 886 645 1219 741 -242 63 458
6022 458 -891 -661 -537 -1056 -1281 -1200 -1710 -1799 -1609 -1652 -2480 -1690 -2019 -2329 -1768 -1637 -2027 -1774 -1233 -1374 -1513
6043 -1513 -592 -469 -716 -204 -524 -383 429 658 -95 989 1314 887 1457 1631 1127 1647 2351 1751 1629
6062 1629 2349 2259 1486 1891 1940 1499 1599 1321 593 1089 1395 342 44 454 -84 -301 94 -830 -644 -744
6082 -744 -762 -1771 -1363 -1214 -1705 -1615 -1242 -2258 -2202 -1269 -2221 -2443 -1392 -1642 -1703 -1042 -1437 -1439 -601 -473 -1027
6103 -1027 -550 265 196 196 845 749 838 1582 899 1048 1773 1654 1408 1757 1926 1623 2153 2070 1160 1574 2401 1619
6125 1619 1660 1528 1260 1058 1209 354 -149 470 599 -609 -497 -408 -1061 -1158 -1209 -1750 -1525 -1073 -1854 -2443 -1841
6146 -1841 -1493 -1905 -1823 -1521 -2056 -1312 -1528 -2175 -1401 -667 -989 -1167 -815 -785 -728 450 66 -210 447 851
6166 851 583 1173 1426 1179 1929 2004 1340 1654 2325 1695 1659 2071 1471 1519 1423 1227 945 1023 1162 477 454 1135
6188 1135 514 168 62 -269 -905 240 -709 -1331 -690 -775 -1416 -1648 -1540 -2048 -1851 -1396 -2231 -2100 -1153 -1691
6208 -1691 -1641 -1325 -1009 -1536 -924 -726 -1064 -330 246 -274 19 472 229 311 1220 817 740 1328 1246 746 1479
6229 1479 1411 1303 2141 1948 1078 1804 2294 1287 1295 1858 1391 1295 1451 774 326 852 672 -616 -126 -98 -840
6250 -840 -424 -769 -1250 -1294 -986 -1851 -1753 -1501 -1575 -1697 -1586 -1915 -2175 -1457 -1372 -2026 -1546 -971 -1320 -1185 -572
6271 -572 -868 -586 -103 -414 -390 409 909 156 832 1122 951 1062 1908 1313 2197 2307 1644 1574 1745 1740 1368
6292 1368 1684 1194 1089 1441 1097 506 951 1217 320 127 179 -566 -195 45 -436 -794 -699 -944 -1602 -849
6312 -849 -1296 -1742 -1093 -1115 -2032 -1985 -1439 -1325 -1767 -1388 -1351 -1545 -1000 -1031 -1247 -365 -265 -676 -375 -342 -195 549
6334 549 440 226 499 1133 806 994 1708 1608 1634 1653 1690 1246 2164 1923 1406 1758 2005 1244 1170 1461 694
6355 694 687 1260 363 -228 -45 -37 -265 30 -478 -1024 -871 -930 -1454 -1327 -701 -1396 -1675 -1491 -1943 -1646 -1195 -1390
6377 -1390 -1888 -1333 -1278 -1655 -1009 -879 -906 -938 -131 -935 -611 546 662 233 766 815 725 1285 1364 1155 1724
6398 1724 1912 1047 1186 1599 1680 1840 1707 1348 959 1520 1461 830 1176 1357 779 635 335 -76 485 623
6418 623 -282 -898 -421 -891 -1115 -1124 -1067 -1115 -804 -1330 -2114 -1399 -1106 -1751 -1428 -1229 -1741 -1529 -853 -1602 -1058
6439 -1058 -314 -655 -993 -844 -384 -434 24 288 64 550 1064 607 678 1288 1357 1557 1394 1352 1346 1808 1917 1622
6461 1622 1840 1855 1244 1291 1533 1033 1425 1568 417 122 641 266 -164 25 -213 -614 -389 -477 -1694 -1046
6481 -1046 -594 -1454 -1662 -1209 -1217 -1427 -1194 -1913 -1925 -984 -1593 -1635 -1139 -882 -1391 -906 -548 -1041 -588 211 -143
6502 -143 386 433 442 370 907 702 666 1518 1411 1037 1038 1772 1459 1584 1863 1469 1406 1603 1166 1198 1716 956 630
6525 630 875 871 449 654 584 -299 -354 33 -382 -624 -782 -1199 -1247 -1016 -1411 -1706 -1079 -1161 -2050 -1710 -1103 -1586
6547 -1586 -1334 -1270 -1650 -1169 -927 -882 -1600 -764 -444 -751 38 18 -131 396 536 275 628 1171 1136 999 1281
6568 1281 986 1083 2117 1563 1142 2076 1707 1716 1550 1697 981 1286 1365 572 899 1419 191 -6 -3 -183 -159
6589 -159 227 -458 -1133 -799 -443 -1354 -1225 -1244 -1630 -1633 -1127 -1630 -1710 -986 -1305 -1756 -1166 -1307 -1434 -775 -807 -1643
6611 -1643 -406 -13 -545 -582 -227 -44 32 639 400 520 1012 789 615 1424 1518 1250 1416 1518 1301 1375 1625
6632 1625 1126 863 1797 1034 1030 1084 838 777 1180 396 -376 306 218 -76 -594 -443 -763 -584 -532 -1154 -1586 -1204
6654 -1204 -1284 -1844 -1686 -1356 -1741 -1417 -1243 -1786 -1083 -992 -1073 -1064 -775 -606 -622 -478 -600 -636 408 330 -36 557
6676 557 1004 764 880 1135 1059 1383 1846 1321 978 1967 1876 1351 1454 1362 1146 1645 1237 547 847 878 191
6697 191 255 471 85 -120 293 -511 -725 -252 -529 -1191 -904 -907 -1171 -1227 -1200 -1772 -1541 -787 -1870 -1810 -1233 -1457
6719 -1457 -1773 -1135 -1387 -1433 -740 -775 -1153 -609 189 -335 -109 55 208 529 1129 419 316 1508 1351 774
6739 774 1224 1380 1354 1534 1520 996 1376 1803 733 1097 1240 938 860 1135 936 277 820 545 -278 -383 -243
6760 -243 -342 -598 -352 -1234 -1073 -622 -1242 -1749 -1233 -1167 -2003 -903 -1200 -1562 -983 -1136 -1466 -1474 -447 -1200 -870
6781 -870 -726 -515 -337 178 -95 -187 301 548 568 935 986 1132 1026 1544 908 1039 1617 1346 984 1441 1853
6802 1853 1045 1495 1181 833 1069 970 539 866 966 234 175 47 -394 -335 208 -311 -850 -604 -657 -1271 -720
6823 -720 -984 -1789 -1275 -1104 -1654 -1528 -1276 -1251 -1564 -964 -1027 -1131 -755 -727 -1070 -490 -212 -607 -243 40 -66
6844 -66 676 913 374 495 1091 913 740 1286 1167 1458 1410 1440 961 1128 1854 961 1205 1362 1309 812 893 651
6866 651 435 635 310 -215 35 -138 -621 -339 -650 -940 -813 -849 -1213 -1562 -958 -1228 -1692 -1461 -1392 -1613 -1010
6887 -1010 -846 -1501 -868 -869 -1425 -1031 -609 -1036 -468 105 -410 -379 137 224 196 923 961 656 1246 909 843 1228
6909 1228 1783 1324 1215 1507 1019 1189 1269 1279 658 1626 1356 418 871 809 475 614 390 -277 -225 252 -318
6930 -318 -266 -216 -311 -901 -867 -1279 -1406 -949 -1071 -1736 -1340 -1059 -1238 -996 -1209 -1248 -1381 -722 -813 -1275 -1 -328
6952 -328 -712 -598 -312 -156 193 433 393 631 823 705 597 1065 866 1226 1179 1267 1106 1334 1331 1303 1488 1309
6974 1309 782 1236 1191 502 418 985 400 -166 154 133 -441 -511 -453 -801 -736 -518 -1175 -963 -669 -1232 -1445 -1107
6996 -1107 -1655 -1270 -817 -1243 -1540 -762 -926 -1191 -823 -513 -747 -237 -494 -515 -197 115 419 99 694 996
7016 996 388 1097 1006 534 1376 1252 919 932 1262 1451 970 1324 934 1086 1314 918 671 1214 990 387 649
7037 649 522 -265 161 425 -339 -450 -376 -735 -1026 -874 -1049 -1099 -723 -1104 -1731 -1159 -932 -1247 -1293 -874 -1529
7058 -1529 -1041 -620 -1329 -951 -481 -622 -949 -464 -207 -630 192 -54 -69 404 767 444 248 899 990 1241
7078 1241 1372 899 1104 1716 1170 744 1502 1483 1216 1201 853 876 1062 1055 455 161 459 108 60 117 -537 -583
7100 -583 -340 -548 -1018 -746 -689 -983 -934 -1038 -1275 -1289 -1321 -1531 -1408 -1067 -987 -1330 -972 -956 -1133 -567 -506 -557 -47
7123 -47 -43 -279 -7 455 315 552 597 443 534 1438 1315 690 899 1379 987 1132 1228 1192 933 1373 1075 711
7145 711 1326 723 713 923 553 237 417 327 -339 313 -106 -313 -766 -424 -563 -1068 -706 -1123 -1394 -763 -1394
7166 -1394 -1280 -973 -1029 -1530 -953 -924 -1471 -1208 -364 -697 -825 -308 -452 -226 -158 -102 -58 473 728 152 464
7187 464 892 509 707 1037 688 1231 1589 951 869 1238 1663 1120 1148 721 407 717 1031 453 360 568 23
7208 23 -134 251 -8 -446 37 -535 -1107 -532 -682 -1010 -948 -1269 -1088 -1051 -1089 -1178 -1172 -783 -1213 -1673 -1046 -890
7230 -890 -1014 -553 -706 -1006 -268 -100 -624 -118 276 149 437 195 434 232 1298 746 837 891 1285 829
7250 829 1058 1212 895 1541 1379 602 759 1063 1028 752 776 672 294 464 79 114 56 219 -457 -458 -494 -478 -482
7273 -482 -368 -849 -1209 -432 -937 -1153 -1085 -1305 -1094 -1130 -1151 -1440 -646 -765 -951 -902 -304 -446 -554 -161 -323
7294 -323 -78 182 412 -136 276 512 444 1366 598 639 643 1111 736 869 1167 1135 745 881 944 591 1031 1211
7316 1211 604 529 591 72 219 309 285 132 -28 -297 -678 -172 -412 -571 -492 -654 -706 -761 -734 -1185 -1050 -759
7338 -759 -1227 -1045 -1094 -1336 -1128 -730 -706 -1091 -355 -243 -646 54 132 56 133 205 177 455 927 453 463 879 1040
7361 1040 723 981 1004 1104 1287 1328 732 1051 1195 756 1007 1060 704 515 789 489 191 410 543 -65 -190
7382 -190 -26 -379 -534 -236 -1007 -676 -543 -1143 -1409 -894 -889 -896 -732 -1249 -1193 -1241 -792 -1226 -617 -469 -675 -609
7404 -609 -99 -425 -226 -54 107 -311 339 493 221 521 781 356 583 1101 676 1034 1417 917 916 1097 794
7425 794 999 1315 731 763 983 701 518 280 180 70 344 257 -84 -325 -193 -650 -637 -436 -499 -812 -606
7446 -606 -861 -1085 -816 -574 -1225 -1021 -980 -886 -1184 -965 -899 -660 -493 -527 -665 -317 -76 -324 -189 -221 -221 329
7468 329 500 120 467 832 438 533 961 858 746 1213 870 930 1042 1044 1182 874 1360 617 606 820 357 224
7490 224 609 410 -39 17 -97 -346 -147 -325 -513 -502 -496 -487 -599 -575 -1219 -900 -885 -1265 -789 -733 -879 -1365 -1102
7513 -1102 -723 -725 -544 -638 -665 -556 -92 -435 -260 8 175 67 399 574 268 1086 852 327 1185 1467 746
7534 746 850 1009 827 936 1045 861 816 1176 667 480 576 794 338 740 217 75 277 11 -297 -354 -84
7555 -84 -324 -589 -601 -724 -1110 -417 -833 -1167 -651 -592 -1047 -1124 -745 -1035 -556 -642 -652 -1131 -219 -345 -635 -327
7577 -327 123 -228 371 294 -71 250 342 88 513 873 661 842 1038 1081 712 1381 1033 317 834 844 780 716
7599 716 543 744 585 997 11 179 478 123 5 -155 -22 -491 -282 -92 -588 -758 -562 -938 -713 -672
7619 -672 -1001 -711 -841 -697 -1004 -630 -502 -586 -423 -450 -925 -329 230 -263 -308 11 -9 -62 213 633 384 639
7641 639 633 275 814 1101 842 992 1196 890 715 955 671 772 1248 766 478 1060 798 401 566 82 235
7662 235 73 -164 -247 -462 -381 -317 -308 -264 -847 -569 -465 -701 -1234 -977 -722 -624 -928 -703 -1062 -849 -550 -1094
7684 -1094 -782 -70 -512 -744 30 -386 -294 232 172 -44 459 489 151 305 654 674 492 890 711 772 980
7705 980 719 541 825 1128 904 574 641 453 514 620 -34 274 128 186 -144 93 -219 -231 -229 -121 -642 -767
7727 -767 -666 -993 -758 -604 -952 -787 -845 -1152 -988 -542 -744 -1022 -701 -358 -503 -197 -353 -603 -527 9 -314
7748 -314 -396 17 142 362 525 61 121 612 607 674 685 887 852 827 844 456 937 1064 598 521 1038 708 254
7771 254 628 428 280 26 554 -337 61 -57 -387 -532 -237 -687 -737 -503 -766 -968 -639 -519 -1005 -927 -982
7792 -982 -761 -412 -802 -1011 -646 -311 -608 -721 -122 -457 -252 -79 -348 -443 381 305 253 347 448 412 642 891
7814 891 799 534 1370 663 633 790 755 615 846 498 365 866 805 284 534 483 87 -238 -8 -172 -227 -7
7836 -7 -381 -468 -461 -402 -1093 -691 -449 -1160 -584 -743 -856 -833 -678 -753 -768 -587 -725 -452 -225 -586 -506 -162 -168 -590
7860 -590 38 99 -86 305 388 -64 213 385 522 501 925 880 724 787 762 755 1403 984 867 622 869 639 620
7883 620 573 379 524 484 207 4 76 22 -33 -166 -321 -536 -512 -302 -1074 -628 -217 -717 -1066 -637 -724 -788 -761
7906 -761 -447 -790 -598 -702 -994 -572 -247 -514 -401 159 -25 27 93 417 210 287 358 370 652 480 453 792
7928 792 545 534 749 581 650 691 812 695 600 870 705 580 670 367 438 321 484 193 -58 16 6 -207 -115
7951 -115 -116 -439 -436 -225 -556 -880 -580 -1096 -1118 -754 -815 -781 -791 -952 -788 -691 -683 -740 -333 -896 -611 -353 18 -271
7975 -271 31 45 -157 810 621 293 473 986 610 479 558 607 711 945 712 676 1041 1033 587 659 629 611 465
7998 465 389 232 210 371 679 -71 -183 -256 -632 -173 -259 -665 -297 -346 -1009 -534 -817 -853 -762 -632 -790 -955
8020 -955 -537 -522 -808 -479 -397 -490 -446 -280 -626 -219 130 -139 -314 302 169 -74 833 480 486 670 638 601 562
8043 562 899 855 475 853 272 434 950 651 369 769 481 466 252 314 178 205 465 -299 -125 -140 -219 -374
8065 -374 -194 -548 -741 -526 -510 -722 -815 -835 -795 -918 -631 -808 -491 -743 -1117 -613 -423 -420 -95 -488 -483 -211 -219
8088 -219 -146 -170 117 54 143 238 239 423 506 468 442 714 818 894 176 750 562 726 772 461 523 312 681 471
8112 471 57 210 373 95 127 -189 -186 -44 -131 -461 -363 -609 -668 -626 -360 -753 -902 -473 -718 -970 -622 -418
8134 -418 -865 -344 -873 -881 -627 -549 -501 9 -230 -390 -69 125 -197 191 366 239 234 519 860 240 479 811
8156 811 505 424 808 830 873 893 686 764 710 503 468 728 90 252 161 120 -248 -204 65 -304 -241 -324 -541 -275
8180 -275 -630 -712 -729 -157 -304 -816 -545 -600 -753 -591 -696
8191f96
$$ Imaginary data points
##PAGE= N=2
##DATA TABLE= (X++(I..I)), XYDATA
0 0 0 0 0 8 -8 0 -8 8 -8 16 -20 24 -29 36 -45 52 -64 76 -88 103 -122 141 -164 188 -216 247 -283 318 -363
29 -363 409 -458 516 -579 644 -720 806 -891 991 -1100 1219 -1346 1493 -1655 1829 -2028
45 -2028 2253 -2504 2790 -3125 3512 -3971 4529 -5219 6094 -7255 8874 -11291 15294 -23130
59 -23130 44308 -220841 -667339 -204159 288383 344172 -1788 -174651 -32023 165841 58457
70 58457 -127116 -61148 164218 147364 -99394 -278321 -188906 1006 33798 -96481 -111409
81 -111409 -17220 -80785 -263185 -186357 172989 394650 173657 -231418 -277349 151129 488295
92 488295 310684 -41065 -38182 245441 340488 65439 -213284 -64777 332202 378420 -19849
103 -19849 -314154 -163152 163064 262874 95069 -57760 -15835 54553 2894 1243 156730
114 156730 234261 62785 -171186 -194431 6703 149879 11142 -196161 -138989 39314
124 39314 -43903 -326369 -386410 -82946 222589 107096 -316256 -470913 -140464 209937
134 209937 165686 -94177 -182357 -23929 130495 70536 -57155 6389 156687 108865 -80150
145 -80150 -132778 -7057 105332 67802 -36472 -29574 49391 -16634 -170441 -111174 152209
156 152209 265877 65935 -199633 -189030 101208 282683 111943 -117168 -50795 174499
166 174499 211129 25807 -108658 3367 201946 165632 -77829 -176688 -34842 85661
176 85661 32816 -77971 -109408 -72631 -84919 -160517 -127537 44630 102093 -68692 -221019
187 -221019 -143554 49936 108255 -30109 -134373 -2162 173456 89474 -134737 -143326 87940
198 87940 245425 114316 -143707 -177991 58015 210641 81955 -90200 -70748 49052
208 49052 87074 30526 16076 120759 194242 89072 -35001 32927 176558 166916 33716
219 33716 -24011 69553 151796 28945 -175454 -148846 75719 137713 -67792 -251850 -174948
230 -174948 49277 105611 -93299 -244432 -107311 100451 77654 -91303 -130822 12924
240 12924 135058 52469 -122544 -124884 25277 59531 -61867 -125337 -61884 -19772 -103214
251 -103214 -212563 -160448 29263 83703 -82542 -186387 -39951 155257 146989 -19690 -78649
262 -78649 96355 272519 178380 -37631 -29590 175532 250079 79441 -109968 -72100 124035
273 124035 172729 -7401 -136400 -46921 64096 14865 -95888 -85511 48706 116934 6770
284 6770 -100544 -5877 140329 94639 -62198 -83740 56332 142994 18994 -168756 -145546
295 -145546 44546 74395 -121205 -246476 -127848 57235 57193 -123641 -212565 -58413 107503
306 107503 39594 -114161 -89102 77326 150851 44801 -77536 -24427 121422 115758 -25180
317 -25180 -54651 65055 124028 25365 -94979 -67117 75552 110253 -32067 -114246 15878
328 15878 160953 113227 -34541 -60821 79788 189937 97835 -55490 -19448 137229 147851
339 147851 -10099 -117899 -52929 67231 50223 -95609 -148742 -34404 34985 -64518 -172297
350 -172297 -133480 -18310 6798 -91993 -150861 -46184 72441 15054 -111248 -90545 46853
361 46853 109922 25867 -74434 -29368 101230 98185 -49793 -109682 -2250 93190 43064
372 43064 -69921 -78900 38719 102570 2277 -93967 -19941 105378 101548 6279 -25956 57704
384 57704 138845 82480 -30084 -7554 117746 138961 30550 -40376 11137 92390 61238
395 61238 -67872 -109244 -939 68366 -19218 -119302 -89767 7968 27387 -63183 -127798
406 -127798 -47011 66347 33388 -79804 -86772 7774 50481 -21017 -108101 -76671 37799
417 37799 48823 -69022 -122864 -36472 37652 -9148 -98449 -92437 21374 87307 4739 -80552
429 -80552 -13307 104587 102442 12087 -12835 79048 170756 122203 -1530 -5515 102894 125136
441 125136 16820 -60395 -9606 81512 67035 -55188 -109654 -11382 72149 4706 -90011
452 -90011 -57407 54272 88706 -3196 -89525 -28519 87958 67144 -53121 -73274 27009
463 27009 86123 11079 -104985 -104666 5618 35236 -80454 -156625 -78255 19195 -9893 -117171
475 -117171 -144800 -37756 60279 7755 -87937 -41668 87670 110178 12232 -51162 14602
486 14602 122611 108625 -10941 -39531 68805 127042 38572 -61852 -36117 72133 103022
497 103022 831 -76230 4483 112909 70608 -48951 -62415 43316 117627 54954 -51983
508 -51983 -30869 88266 99610 -26743 -100322 -28803 62981 35267 -83038 -125540 -31870
519 -31870 34649 -49934 -147934 -101371 13041 30994 -58306 -114123 -37157 69701 38344 -77952
531 -77952 -79956 39597 99217 24875 -65610 -39294 67335 82158 -37789 -107302 -15195 86623
543 86623 46686 -62306 -84759 5101 73953 16683 -68439 -21610 98432 113271 24853 -17290
555 -17290 49585 129033 105242 6920 -9944 82197 118029 26268 -52754 -17019 52086 31911
567 31911 -72382 -121525 -33707 54959 -2991 -118525 -119676 -25259 21461 -35383 -102822 -62181
579 -62181 46337 57132 -44432 -87628 -8756 64094 33658 -44797 -58517 10960 47247 -20510
591 -20510 -80334 -33386 30487 3842 -62835 -60405 23548 86550 38554 -46414 -22856 80015
603 80015 99962 23440 -13674 49858 125308 95418 -16099 -52393 41393 112043 51995 -37155
615 -37155 -37058 24121 47638 -4561 -56309 -23473 38184 16590 -45594 -34261 34413 58768 8457
628 8457 -45889 -23925 41630 32438 -46913 -60561 13450 40068 -41381 -132607 -122336 -22739
640 -22739 28945 -46536 -132811 -98161 -8633 2036 -57348 -82756 -25561 47119 34266 -34774
652 -34774 -29511 55008 89062 39440 -955 21490 61546 59203 20166 19467 71652 71246 -17709
665 -17709 -72975 -12145 76815 76999 -13999 -74475 -12936 80184 53594 -44808 -51188 43127 98086
678 98086 40088 -51493 -50359 42544 82750 7949 -62262 -37319 16007 17047 -21420 -39213
690 -39213 -12191 1575 -49476 -93155 -42883 30339 14900 -55126 -69994 -10083 37475 -4409
702 -4409 -72532 -36607 75199 92359 -15677 -93866 -39657 72924 96415 -4566 -90445
713 -90445 -37557 64337 65626 -8252 -35473 9757 51697 28531 -18787 1500 73499 84047
725 84047 25690 2356 37444 59600 35499 7976 31305 83982 67254 -34600 -85633 -13904
737 -13904 62646 23453 -85496 -127512 -49216 34798 -10228 -118398 -119289 -15724 34876 -24357
749 -24357 -95023 -70756 26084 67068 -1569 -68935 -42472 12817 17005 -7163 -10331 8226
761 8226 5563 -41113 -69818 -19415 38558 7768 -57680 -48589 22862 56178 6892 -50060 -8148
774 -8148 96184 111470 17894 -35387 33859 129950 127900 27709 -45638 245 82371 71613
786 71613 -2014 -24425 9858 25265 -9279 -48352 -30962 23703 29088 -16293 -26886 7247
798 7247 14092 -15869 -26971 6843 45631 23393 -52032 -72566 4141 59860 2597 -92552
810 -92552 -105203 -27863 32815 -9638 -90584 -79895 3111 27110 -27706 -62614 -22280 48694
822 48694 70464 26537 -7493 19277 47256 31803 18727 39168 54145 30292 -12603 -20458
834 -20458 26959 54719 1051 -56273 -25251 40791 40384 -19757 -50912 -1536 65892 45639
846 45639 -41942 -60611 23445 92591 63637 -17342 -54272 -12366 34946 11835 -35171 -30196
858 -30196 -7819 -27099 -60897 -59225 -30303 -18812 -49108 -75400 -41349 9509 -6211 -56709
870 -56709 -50198 9337 40315 406 -58838 -40507 53612 92756 17185 -56897 -27556 51364
882 51364 71808 15529 -32734 2042 65250 54054 -8709 -23169 18122 47816 37672 14276
894 14276 17957 44276 40496 5944 10658 57123 60291 2908 -32765 4346 66346 59158 -29325
907 -29325 -82029 -22563 49428 18723 -62821 -78163 -12330 39129 -3644 -91316 -92753 -3901
919 -3901 42806 -5579 -60943 -48874 4155 24410 -11848 -38349 -8512 18034 -9926 -35606
931 -35606 -7897 23973 4281 -47011 -60646 -6784 44038 10247 -53769 -35009 44682 68014
943 68014 7081 -48613 -11378 84723 108069 25808 -32903 19439 94057 83970 11084 -27999
955 -27999 12794 66469 44982 -20369 -32728 1842 4395 -31345 -48791 -25676 3240 -10445
967 -10445 -50656 -41618 13820 22488 -34009 -60617 -11387 47976 37116 -35542 -68842 -8247
979 -8247 49736 7232 -72161 -71737 110 40603 -3432 -73397 -66616 8595 35841 -16511 -50547
992 -50547 -13182 39286 43941 8629 -6593 27021 53980 27045 3766 35270 68331 43925
1004 43925 -6156 -17808 23666 56508 18068 -43156 -29377 38729 53923 -374 -42246 -15468
1016 -15468 44242 51832 -7491 -37787 13547 63031 33795 -27316 -42776 -5361 25706 -291
1028 -291 -46562 -41799 -7354 -15769 -55547 -63122 -34915 -16333 -34368 -62559 -45551 7609 17616
1041 17616 -30466 -49592 -3240 44034 36364 -6293 -16136 32088 69860 30879 -26724 -16243
1053 -16243 35969 49737 12910 -21509 -5474 36930 34900 -12651 -24475 17061 42493 22207
1065 22207 -1257 7661 38434 42808 5233 -13049 25741 56514 25867 -15519 -9953 27006
1077 27006 37164 -7917 -56827 -38144 15759 13148 -39306 -60911 -29649 1836 -12636 -55305
1089 -55305 -58723 -8252 19580 -15556 -47878 -26769 7853 7158 -23669 -38273 -7077 25619
1101 25619 3593 -33713 -18633 20960 19342 -18804 -37210 -3751 44258 36723 -16474 -25624
1113 -25624 27317 57305 27030 -8421 5183 54463 72602 28894 -10261 17520 58084 40101
1125 40101 -7446 -16723 16710 39672 10772 -36703 -32275 10823 11283 -33787 -47579 -10952 20415
1138 20415 2589 -41364 -45198 4719 29313 -13229 -48582 -16749 33024 29501 -21082 -51482
1150 -51482 -17663 28307 7686 -49270 -48685 1700 18927 -18201 -55452 -39517 11776 22496
1162 22496 -21085 -35992 12822 52507 30290 -8628 -5731 38680 63551 30079 -6318 21775
1174 21775 67324 51339 -2026 -17461 19314 51689 27240 -25381 -25506 26634 39734 -10091
1186 -10091 -45396 -19615 23779 24894 -18190 -39205 1041 37579 5396 -44762 -37133 6318
1198 6318 18123 -18147 -54087 -36533 6616 -3000 -56263 -66463 -20849 8433 -12918 -47204
1210 -47204 -39307 7684 25567 -15489 -42529 -2964 44080 35012 -4852 -13802 22562 53480
1222 53480 25979 -21036 -9888 39490 44413 2371 -22413 -493 33488 25821 -18050 -26986
1234 -26986 20796 51097 21981 -10492 2512 38111 46284 12417 -14531 13855 52837 33358
1246 33358 -14192 -20516 9179 20436 -8263 -44779 -37703 3212 6086 -39970 -61123 -31985
1258 -31985 -5043 -17334 -48507 -50604 -10317 18242 -8265 -40687 -20926 16975 17186 -11137
1270 -11137 -22093 4071 34866 20603 -20650 -21212 15898 25481 -2777 -20643 -1438 31835
1282 31835 33268 -2805 -18973 17271 47615 25883 -3958 5938 39771 51943 21947 -10337
1294 -10337 5286 41285 31399 -8318 -14722 12690 26684 4322 -31498 -33105 137 10146
1306 10146 -22784 -40239 -13291 11113 -1211 -31956 -36923 -3914 21307 -5138 -38817 -19915
1318 -19915 17211 11796 -25929 -45330 -22536 11035 3292 -37684 -42011 -2510 15133 -12486
1330 -12486 -37695 -24430 12105 26070 253 -16273 16116 48615 30148 -646 7470 41857
1342 41857 56929 31885 2508 16377 50154 38030 -7828 -18810 13467 35015 13877 -25412
1354 -25412 -28597 12786 30229 -11601 -45310 -19123 22773 22136 -13830 -33170 -6195 26104
1366 26104 6482 -35627 -30339 8437 16456 -13088 -37238 -24850 3525 -2255 -44083 -52757 -9158
1379 -9158 16088 -12919 -46249 -33404 9767 24517 -11890 -39786 -3173 46886 35785 -9237
1391 -9237 -17218 19455 48111 27135 -16613 -13874 35559 51862 11606 -18238 793 33035
1403 33035 31282 -2115 -14880 21063 49025 20133 -15107 -95 33894 33660 487 -18119
1415 -18119 8800 43285 23095 -30477 -37613 4148 21430 -13430 -53916 -47291 -1165 13088
1427 13088 -33629 -68714 -37560 5436 -2156 -36515 -41543 -6330 24205 4687 -32873 -23362
1439 -23362 16905 23867 -4013 -16201 4926 28967 17842 -19765 -24276 15837 32262 -3281
1451 -3281 -28839 -4137 34222 31314 -10186 -29622 9708 53752 35857 -8420 -6098 35345
1463 35345 56335 30151 -9800 -8460 31226 42022 4594 -18352 1919 19820 2547 -28178
1475 -28178 -33061 -5365 9419 -17290 -41301 -20126 5818 -7297 -36106 -37896 -7783 16769
1487 16769 -1948 -38357 -29062 14952 22242 -16936 -42898 -22050 17590 21326 -18611 -40205
1499 -40205 -6929 24674 7528 -22351 -18440 11435 31438 20784 327 9154 33218 27943
1511 27943 5609 10912 36158 42870 21308 -2502 5566 35784 32697 -9096 -25037 7173 31528
1524 31528 11149 -24714 -30349 2898 25725 -1957 -39310 -25461 16966 26689 -703 -25146
1536 -25146 -16738 9628 10380 -18694 -26304 -1613 5963 -17089 -34037 -26093 -11038 -14351 -36195
1549 -36195 -39661 -8191 9019 -17778 -42443 -23489 13464 22238 -6566 -30216 -3540 45417
1561 45417 44929 879 -14885 15425 44166 35128 1901 -6292 25170 44017 16829 -11729 -3244
1574 -3244 17554 17966 4001 -2181 12277 25070 6801 -16026 -909 27914 20814 -9901 -19978
1587 -19978 4239 29514 12307 -33367 -39009 3163 21154 -14261 -49321 -37569 2438 16027
1599 16027 -20932 -58110 -38310 5636 9752 -17904 -27588 -8639 12025 5396 -17556 -13166 16312
1612 16312 20368 -5257 -11483 11241 23676 5680 -19971 -15546 20796 34026 -982 -27451
1624 -27451 -83 39382 35783 -1957 -22136 8681 52286 43246 -2769 -9187 28694 48779
1636 48779 22992 -12393 -12798 20896 35921 6034 -22492 -12944 2373 -9335 -27758 -26063 -8176
1649 -8176 -1577 -23508 -44072 -22636 9816 -500 -35108 -38047 -4177 21762 5220 -31300
1661 -31300 -28757 13740 27632 -10383 -39479 -18708 21159 28256 -4896 -32832 -13615 20988
1673 20988 14788 -13721 -12756 14390 28107 13739 -5406 1961 28220 29813 5486 3689 29566
1686 29566 37636 15006 -5904 3060 30515 32381 -5397 -30144 -1949 32754 20858 -16726
1698 -16726 -30696 -7085 18693 4933 -28235 -23758 12513 20837 -9160 -32635 -22687 2466
1710 2466 9222 -12866 -27235 -11426 -285 -18038 -32530 -20332 -3308 -6574 -27808 -37066 -11431
1723 -11431 16786 3660 -26320 -20626 11448 24879 8969 -8219 5677 40144 43567 6811
1735 6811 -12548 12096 39714 34619 9420 -3110 12058 27533 11399 -11224 -1991 18152
1747 18152 14304 -4335 -9444 4160 18157 8175 -13560 -7800 18318 18241 -7782 -16275 4205
1760 4205 23956 12591 -23981 -38280 -9052 15682 -3021 -32337 -31005 -10094 -3939 -21933
1772 -21933 -39995 -24820 5803 4492 -22235 -27578 -5964 9266 3651 -10709 -8474 11017 16302
1785 16302 -3198 -7729 15796 28022 9147 -14426 -12027 16810 34783 13912 -13494 -1540
1797 -1540 27199 26125 790 -7793 13143 39494 33169 -295 -9949 16237 31683 12569 -8929
1810 -8929 -6374 8857 12483 -9205 -25479 -11360 4638 -10971 -33942 -28442 -7319 1011 -14490
1823 -14490 -32141 -20357 5437 604 -27089 -27922 4082 23682 7431 -23223 -26695 3740 22319
1836 22319 -287 -24219 -11625 12851 10581 -11792 -23269 -4590 20191 11487 -15158 -11441
1848 -11441 18639 29429 13687 -586 7974 27704 28175 6639 2696 29499 42739 17989 -8749
1861 -8749 -4552 20383 29185 5303 -19285 -6231 19490 10114 -21333 -28322 -6013 12334 716
1874 716 -26737 -27720 1893 13232 -11510 -30166 -17403 1985 786 -18669 -27734 -7591 9152
1887 9152 -8970 -33738 -25809 -583 5333 -10723 -22057 -9323 13702 8494 -17809 -17651 13413
1900 13413 30300 14332 -5808 -1496 24041 34823 11884 -7444 9406 31495 22359 56
1912 56 -3697 13264 25202 9160 -16419 -10543 17560 21064 -31 -10698 1312 15541 9923
1925 9923 -10717 -13159 11848 23568 532 -19711 -10604 7605 7228 -14160 -29417 -15318 5224
1938 5224 -5590 -31127 -30891 -11256 -4396 -18342 -32967 -24502 1466 7346 -14029 -21441 -724
1951 -724 14676 6101 -7409 -3742 17873 28650 10677 -7802 3697 23664 18002 -73 -3097
1964 -3097 11948 25261 15623 -6682 -5000 18908 24163 4378 -6234 6097 23404 22424 2450
1977 2450 -7422 8638 20744 5106 -11225 -3410 11465 9810 -9278 -24933 -15382 3179 -3553
1990 -3553 -25909 -25446 -6405 453 -12254 -26923 -21244 284 5334 -15076 -22956 -2486 12467
2003 12467 1885 -15760 -17195 428 12981 -740 -17488 -6227 13857 10185 -8395 -13381
2015 -13381 1115 17786 13874 -3960 -1303 21807 28351 9422 -1004 12318 29450 29230 10024
2028 10024 951 17374 30605 13203 -8410 -5452 10943 14270 -1584 -18045 -10930 8102 2613
2041 2613 -21870 -26870 -6571 5350 -4901 -20814 -19540 -440 5751 -14285 -26415 -9726 7680
2054 7680 1379 -15751 -20152 -6264 6269 -5650 -25703 -19181 4343 6700 -10833 -19304 -6233
2067 -6233 11484 8719 -11526 -13545 12111 26927 12246 -2598 4081 21136 25065 9552 -3221
2080 -3221 11448 31022 22702 359 -2409 13467 21950 9396 -8330 -4601 17124 19517 -3621
2093 -3621 -13475 1037 13347 5803 -10484 -13920 3662 15337 -1081 -20958 -13805 2439 -25
2106 -25 -17474 -27225 -15137 3221 -3552 -28009 -31356 -9301 749 -11073 -21792 -14527 3618
2119 3618 8990 -6318 -15270 1598 17783 10330 -2927 -560 14824 23616 11756 -6088 -620
2132 -620 18518 17067 -1220 -5181 9006 19493 10992 -7410 -8697 12420 21898 6785 -4852
2145 -4852 5448 20315 18857 2900 -7932 2801 18814 10919 -9173 -9611 3884 4911 -8535
2158 -8535 -21076 -17318 -3605 -4864 -21744 -24867 -8662 -1908 -14216 -25752 -20658 -4104 4506
2171 4506 -8005 -20142 -7304 9504 3799 -12117 -14020 326 13262 6942 -9746 -7898 10813
2184 10813 14239 -839 -7053 3539 16557 17619 6891 2249 14673 23923 13006 3122 10834
2197 10834 21952 20899 8676 686 8980 20590 9740 -10839 -8884 8176 11959 -2118 -15445
2210 -15445 -12863 1755 3989 -13504 -21905 -6770 6036 170 -12424 -15336 -5840 2788 -5814
2223 -5814 -18025 -10258 3429 -1430 -15300 -17461 -7406 -84 -7322 -20376 -16093 2680 5618
2236 5618 -9505 -14447 -2040 9680 7256 -5532 -8073 12051 28721 16802 -1663 2188 18342
2249 18342 24519 14892 3711 9057 23002 19214 1288 -1633 10157 13583 4767 -4149 -2864 8367
2263 8367 9944 -5287 -13068 -613 8843 -1729 -15438 -13433 2591 11556 -3365 -23621 -18276
2276 -18276 1082 1552 -14196 -19819 -10272 1195 -3846 -21970 -26286 -7130 5595 -4565 -16589
2289 -16589 -12333 223 5959 -1275 -7748 2464 13969 5689 -5763 2399 18506 19805 5502
2302 5502 -6874 -645 16762 17896 871 -2849 12254 19991 9088 -6908 -6579 14026 27649
2315 27649 12808 -5699 -38 15188 15862 4385 -2334 3731 11802 4992 -11448 -10842 2958 3342
2329 3342 -11677 -22478 -19301 -9478 -7056 -16989 -20676 -7473 -1849 -16616 -27504 -15432 5200
2342 5200 12357 -1772 -17881 -10622 8423 9887 -3983 -6540 4524 11956 5801 -7444 -7626 9595
2356 9595 18180 4143 -7758 -1423 9761 13003 9384 6957 12657 16675 5724 -3263 8068 25830
2370 25830 24286 8366 -3215 26 11026 10330 -2895 -5444 7055 8574 -6811 -18811 -13560
2383 -13560 2819 9095 -6316 -22650 -16406 -971 227 -7529 -9897 -7247 -6061 -11776 -18797 -11538
2397 -11538 3886 2689 -13131 -19764 -13492 -6300 -5570 -9224 -6530 4498 5837 -9743 -16128 117
2411 117 18451 18923 5934 -3737 4667 19914 19771 8610 9143 17756 16035 6098 805 7078 19339
2426 19339 20598 3613 -8663 -3194 4627 3240 2533 4560 5600 465 -12049 -16408 -983 14156
2440 14156 6176 -10696 -14066 -5814 1539 -1722 -11186 -10528 242 -1922 -17561 -21793 -8378 4221
2454 4221 1516 -13673 -23835 -14280 -974 -1531 -5379 -128 3339 -2008 -9399 -8386 4693 18551
2468 18551 14710 -521 -1360 9446 12662 6454 4639 10486 18404 13606 -3233 -6651 11542 24670
2482 24670 14672 -2204 -6798 3436 14101 11385 1657 3627 10885 3622 -9741 -9756 1484 10937
2496 10937 5577 -10464 -17905 -9584 -4971 -12344 -13950 -6676 -4084 -12070 -23002 -23084 -5810 6721
2510 6721 -4479 -20658 -16698 -1680 5260 243 -5795 -1631 8321 4321 -10132 -8698 9241 18585
2524 18585 10310 -3789 -8431 1921 11297 6727 1498 9397 15422 7428 -1670 1867 13907 22171
2538 22171 14149 -173 2603 16301 16590 5251 1157 7590 11379 3863 -10227 -11595 4958 12684
2552 12684 -1922 -18152 -17604 -7607 -2134 -6702 -13393 -7814 138 -7125 -19346 -15659 -2012 3577
2566 3577 -2905 -13858 -12910 -1810 1856 -7880 -10409 -1349 2194 -4943 -11172 -6808 6994 14257
2580 14257 2603 -11043 -3807 11119 14088 7828 4823 10153 16913 12840 701 2092 17143
2593 17143 21003 9869 883 2373 8961 11165 2668 -3635 2844 8530 -419 -7817 -3032 4930
2607 4930 5587 -3645 -13412 -8915 3435 2201 -8978 -10194 -2497 -1379 -8669 -16937 -15469 -2635
2621 -2635 2471 -9977 -18908 -12724 -5043 -6215 -10738 -11524 -4691 2485 -1843 -9814 -2787 9383 8892
2636 8892 1478 -989 4673 13985 15010 5467 4378 13618 14700 4590 804 6583 15070 15276 4670
2651 4670 -3991 2350 11823 6917 -1610 -327 6283 8571 3263 -5004 -2414 7352 6147 -5826 -8032
2666 -8032 -494 3003 -1333 -9002 -11583 -5479 -2513 -12099 -17698 -9270 -1656 -5324 -13445 -16346 -9575
2681 -9575 -508 -4125 -13001 -8446 3455 4104 -4720 -7979 -2508 6288 7689 -1692 -4429 6383 11886
2696 11886 4840 -786 2468 9299 11865 5825 607 8544 19167 13275 2571 3228 11670 15496
2710 15496 11073 3104 4435 13672 11644 -1377 -6427 1293 6054 1620 -7683 -11867 -4495 1819
2724 1819 -7316 -17847 -13034 -3802 -4575 -11026 -14558 -8614 -193 -3542 -14440 -13519 -1688 2024 -4457
2739 -4457 -8857 -6661 1093 3137 -6568 -11919 -1975 6957 1873 -5935 -4067 3581 8262 2328 -5777
2754 -5777 370 13452 12901 2533 1727 8821 14468 11666 2989 1177 12554 17288 7877 686 5462
2769 5462 10629 8876 174 -5204 2077 10470 3401 -8465 -6802 1028 1353 -5635 -11110 -8410 541
2784 541 389 -10925 -14204 -5754 -1608 -7470 -14292 -12704 -4386 656 -7587 -16345 -9632 24 -2695
2799 -2695 -9209 -9021 -1410 5666 3421 -4888 -3141 8429 10414 3276 1483 7561 14406 14071 6047
2814 6047 1197 9433 15995 8139 878 4623 11041 11146 3474 -3516 314 9350 6546 -3388 -2476
2829 -2476 5282 7104 1785 -4086 -4725 3449 5814 -3725 -8547 -2041 2633 -2930 -10543 -12939 -7806
2844 -7806 -2945 -8612 -16925 -11777 -3923 -6766 -14148 -14738 -8938 -2136 -1500 -8392 -7646 2710 5936
2859 5936 -980 -4578 82 7342 9334 3264 -1225 5712 12809 6522 -317 3144 8910 10622 6783
2874 6783 3031 6150 13940 11688 2252 1626 9230 12155 9284 3605 1557 6456 8423 -962 -7249
2889 -7249 -626 4184 -733 -8213 -10533 -5977 -1364 -5977 -14717 -11709 -3213 -3602 -8506 -9911 -6688
2904 -6688 -2085 -2112 -9819 -11073 -1371 2744 -4198 -8246 -5082 -662 -550 -5907 -8820 -763 7538 2548
2920 2548 -4655 -2122 4887 8063 6125 1783 3639 13025 13950 5406 3597 11201 14981 10076 3934
2935 3934 2428 9947 14690 6513 -853 2420 6013 2397 -2719 -3747 704 5691 595 -10447 -10185
2950 -10185 -1409 53 -6867 -10431 -7545 -2284 -2513 -11269 -14402 -5143 644 -6313 -12553 -9910 -3036
2965 -3036 849 -3106 -9709 -6909 1202 -492 -6446 -3952 3870 7138 3780 -4387 -4466 6030 11296
2980 11296 4384 1281 6680 10311 7739 2741 2103 9714 15708 8397 -1016 2784 11094 11201 5009
2995 5009 -505 259 6534 6545 -2286 -3281 4933 6908 -880 -8121 -7409 -1030 3775 -2329 -8883 -5723
3011 -5723 -1543 -7428 -12868 -10991 -5604 -2243 -7569 -16247 -14635 -4482 -2698 -10025 -11593 -6238 -1759
3026 -1759 -1669 -5722 -4910 5115 9963 1408 -4719 742 9494 12376 8798 3174 4409 10017 7575
3041 7575 1366 4024 11052 11416 5908 509 1193 8636 11353 4019 445 6757 9339 4430 635
3056 635 1925 6466 8079 -91 -9097 -4886 3432 2347 -4822 -8779 -8362 -5719 -6904 -12988 -11109
3071 -11109 -1953 -1022 -9193 -13350 -9489 -3929 -1396 -4506 -8102 -3814 699 -4208 -7612 -2576 2267
3086 2267 1016 -3481 -7504 -3208 6656 6639 -950 -1586 4719 6752 4486 3258 5930 13148 15193 6683
3102 6683 411 6136 12243 10714 6585 3870 4155 6276 2944 -3502 -394 4958 1600 -5705 -7403
3117 -7403 -3808 783 179 -6357 -9005 -3228 -1760 -7577 -8441 -3773 103 -2059 -9163 -14327 -8288
3132 -8288 237 -1881 -8924 -8179 -4620 -3453 -4745 -7408 -4907 2862 3506 -3921 -4027 3191 7001 5482
3148 5482 2782 1796 6230 9863 5607 3112 9956 13941 8910 2507 1599 6849 13724 11741 2925
3163 2925 2506 8458 6820 926 -431 2783 6827 5537 -2857 -7035 -625 3974 -1112 -6836 -6599
3178 -6599 -4557 -2701 -5490 -9213 -6242 -1163 -6091 -13725 -11790 -4997 -1603 -4186 -9617 -10417 -3920
3193 -3920 -2494 -8646 -9442 -1658 2878 215 -5073 -6539 -106 7326 4173 -2492 246 6278 6806
3208 6806 4324 2677 4814 9414 7843 947 1022 8933 11845 7159 3293 2775 5756 7620 3558 983
3224 983 7152 11420 4374 -2405 -1711 2902 6041 2037 -5979 -6509 135 -422 -7513 -9697 -6761 -4944
3240 -4944 -6599 -11702 -12847 -5790 -811 -6191 -10884 -8001 -3875 -2261 -2943 -3750 -539 4512 965
3255 965 -5667 -2936 4519 6227 2741 -85 306 5475 7234 1464 -607 5986 9134 5052 2191
3270 2191 3291 8091 12358 8069 1149 3065 8479 7819 3979 3482 4955 5518 2348 -3691 -4372 2072
3286 2072 3689 -2298 -5586 -3651 -2291 -2248 -5916 -8108 -3696 233 -5290 -10167 -7109 -2597 -2278 -5847
3302 -5847 -10870 -10158 -3978 -2537 -8064 -8267 -3917 -3428 -5833 -7303 -5946 89 4136 380 -3061 1684
3318 1684 5798 4745 3884 4995 8067 10944 8822 3863 6633 12025 10158 4694 3236 5738 8417
3333 8417 8019 3102 399 4712 5601 -159 -2794 -103 2521 3192 -524 -5451 -3798 363 -2489 -6412
3349 -6412 -4743 -1773 -2220 -4992 -8293 -7632 -2632 -2692 -8354 -9136 -4340 -2301 -4610 -6352 -6847 -3258
3365 -3258 -786 -4767 -7221 -1568 3396 1659 -1854 -2818 -119 4734 4707 471 1636 7634 7019 2937
3381 2937 2387 4791 7712 8648 4176 1959 7308 10427 5802 2380 4291 6123 5893 3430 -95 2735
3397 2735 7316 3340 -3457 -3537 -495 402 -1906 -5737 -7080 -3136 -2296 -8678 -11432 -6815 -4602 -6012
3413 -6012 -8759 -9693 -6177 -2076 -5054 -9556 -5887 -707 -1433 -3306 -2924 -1116 2792 2273 -2577 -2941
3429 -2941 3903 5469 2184 776 2246 5227 6241 2353 -39 5243 9919 6539 3295 4177 6540
3444 6540 8637 6386 2166 2987 8510 7856 2669 1496 3987 4404 2176 -1849 -4006 756 3210 -2608
3460 -2608 -6685 -4246 -2171 -3611 -6453 -7883 -6037 -1873 -3813 -9137 -8212 -3537 -3676 -6405 -8621
3475 -8621 -6940 -2352 -433 -5088 -7274 -2556 286 -2154 -3653 -1371 2144 4719 2786 -1416 2331
3490 2331 7405 5974 3207 4226 6657 8989 8386 4454 3341 8098 9005 3885 2355 5312 7020
3505 7020 5822 2549 -809 2085 4715 942 -2807 -456 2011 900 -1513 -4393 -4645 -760 -818 -5884
3521 -5884 -6106 -2305 -2195 -5309 -7417 -7969 -4712 -2883 -6758 -9482 -5580 -2431 -5004 -6684 -6493 -4462
3537 -4462 -1421 -1862 -4375 -2162 3152 2786 -576 -212 2499 5568 6821 4095 2831 7570 9501 4937
3553 4937 3458 6044 7521 7130 5339 3316 5045 8185 4756 573 1760 4046 4074 2156 74 -502
3569 -502 2469 2152 -3520 -5092 -1190 -336 -3055 -5042 -5560 -4248 -3119 -6720 -9818 -6560 -3054 -4649
3585 -4649 -6512 -6745 -5244 -2651 -2856 -6647 -5065 158 355 -2783 -2861 -778 1226 1539 -1478 -2014 2213
3602 2213 5198 2333 256 2365 4523 5089 3874 2067 4218 9298 8094 3654 4574 6988 7382 6059
3618 6059 3842 3556 6916 6726 1501 -724 1799 2454 -399 -2748 -4009 -2165 16 -2818 -7268 -5466
3634 -5466 -3264 -4369 -6988 -7093 -5725 -2761 -3228 -7738 -8055 -3162 -2524 -5925 -6251 -3908 -1650 -535
3650 -535 -3174 -5415 -2052 2464 563 -1495 354 3262 4640 3876 703 2247 6843 6626 2759 3211
3666 3211 6753 7739 6376 3735 2283 5112 7371 3805 1661 4287 5647 3976 1580 -385 842
3681 842 4009 2319 -2824 -1971 1264 251 -3287 -5147 -4791 -2502 -2289 -5957 -8014 -4081 -3239 -6463
3697 -6463 -7987 -7289 -5775 -3567 -5043 -7825 -5116 -1133 -3142 -6203 -5113 -2237 450 916 -1498
3712 -1498 -1126 3065 3881 748 926 4375 5738 5992 4870 3321 5530 8731 5590 2628 4594 6602
3728 6602 6127 4918 3017 2798 5160 4297 -51 69 3845 3565 1341 -39 -697 120 1513 -2180 -4498
3745 -4498 -1738 326 -2429 -4986 -5510 -4726 -3310 -4480 -7913 -6783 -3392 -3815 -6810 -6096 -4335 -3512
3761 -3512 -3017 -4536 -4616 -150 2047 -613 -1282 493 1838 2234 2057 935 3356 6261 4552 1276
3777 1276 3105 5669 5534 4644 3774 4131 7168 7241 3532 2975 5583 5218 3542 2690 2243 3169 4103 926
3795 926 -2410 -1004 268 -2507 -4149 -3949 -3242 -2381 -3913 -7229 -7014 -3142 -3475 -5978 -5712 -4157 -3334
3812 -3334 -2945 -5032 -6128 -3008 -1397 -3859 -4827 -2841 -1328 -1367 -2551 -3994 -2309 1480 1295 -1279
3828 -1279 739 3390 3711 3354 2873 3123 6368 7732 4463 4289 7589 8002 5671 4463 4230 5231 7576
3845 7576 4886 1971 3535 5237 2920 153 -273 97 1861 1136 -2233 -3362 -607 -1327 -4498 -5447
3861 -5447 -4391 -3272 -3607 -5713 -7684 -5128 -2764 -5345 -7696 -5859 -3865 -3156 -3370 -4405 -3789 -438
3877 -438 -971 -4219 -2419 989 2336 1425 265 -128 2358 4353 1747 977 4003 5232 4246 3179
3893 3179 2836 4121 6391 4713 1354 2918 5727 5025 3063 2643 2672 3558 3232 -113 -718 2789 3643
3910 3643 212 -2031 -2074 -1525 -1000 -2085 -4491 -2916 -1072 -3928 -6805 -5821 -4427 -4014 -4622 -7198 -7054
3927 -7054 -4047 -3232 -5855 -5436 -3190 -3016 -3189 -2729 -2605 525 3372 669 -1074 1387 3550 3709 3645
3944 3645 4088 4629 6577 5429 2310 3305 7112 6936 4472 3682 3572 4962 5957 4028 1690 3790 4743
3961 4743 1961 266 1282 1917 2452 686 -2887 -2724 -378 -1572 -3634 -2990 -2586 -3774 -4531 -6243
3977 -6243 -6539 -3286 -2227 -5107 -6368 -4652 -3918 -3740 -4120 -4987 -3816 -1426 -3062 -4940 -2139 -529
3993 -529 -833 -1617 -2303 -1872 1030 2420 855 1409 4102 3982 2226 2767 3940 6105 7867 5995 3473
4010 3473 5660 6737 4664 4042 4450 4484 4425 3377 568 733 3241 1987 -1692 -1649 -1178 -1060 -931 -2357
4028 -2357 -3800 -1970 -1926 -4842 -6041 -3864 -2773 -3382 -4165 -5771 -5077 -2997 -3868 -5831 -3685 -1447
4044 -1447 -2279 -2881 -3523 -3075 -600 754 -1270 -1691 1594 2409 1273 1471 1997 2979 4360 2700 1080
4061 1080 3747 6448 5115 3334 3402 4255 4668 5264 2923 3268 5915 5160 1519 1196 2506 2724 2486
4078 2486 865 -934 550 1646 -1557 -4025 -2062 -1677 -3133 -4016 -5378 -5267 -2246 -3303 -6700 -6158
4094 -6158 -4352 -4251 -5470 -5157 -4751 -2821 -1811 -4358 -5355 -1947 -258 -1300 -947 -368 341 2443 1625
4111 1625 -157 1699 4697 3846 2372 3199 3663 4940 5444 3255 2196 5174 6269 3432 3163 4452
4127 4452 4569 4622 3077 642 2065 4591 3188 447 987 1380 473 -450 -2337 -2783 -209 -371 -3992
4144 -3992 -4879 -2887 -3099 -4296 -4830 -5871 -4409 -2491 -4895 -6242 -3982 -2312 -3752 -4334 -4347 -3677 -803
4161 -803 -101 -2525 -2082 913 537 -1058 -76 1370 2876 4194 2486 1351 3931 5111 3609 3547 4789
4178 4789 5120 5670 4857 3051 3815 5927 4030 1712 2414 2881 2578 2332 427 -862 790 705 -2191
4195 -2191 -2909 -690 -729 -1772 -2551 -4055 -3949 -1978 -3317 -4958 -3704 -2469 -3785 -4875 -5087 -4809 -3008
4212 -3008 -2313 -4821 -4701 -1848 -1690 -3081 -2572 -1946 -1103 470 -329 -874 1739 3636 2312 1425 2402
4229 2402 2895 3906 4684 3564 3833 6259 5185 2948 3281 4405 4668 4491 3468 2277 3349 3919 1278
4246 1278 50 1525 1701 88 -50 -1436 -1598 180 -1359 -4470 -3365 -2151 -3295 -4148 -4201 -4258 -3442
4263 -3442 -3334 -6140 -6125 -3325 -3225 -4047 -3709 -3432 -3105 -1965 -2602 -3772 -1359 977 -478 -1208 307
4280 307 1096 1972 2461 913 1317 4319 3956 2279 3090 4538 4202 3978 3456 2505 4269 6043 3602 2290
4298 2290 3609 3738 3073 2691 1240 1329 3127 1741 -975 -828 552 -712 -2056 -2831 -3433 -2235 -1746
4315 -1746 -4317 -5686 -3924 -3479 -5082 -5274 -4678 -4087 -2425 -3083 -5334 -3786 -1704 -2294 -3619 -1970
4331 -1970 -1005 -17 457 -1055 -1389 1891 2149 845 1015 2785 2801 3755 3016 1853 3270 5508 3742
4348 3742 2101 4399 5273 4612 4201 2690 2351 4553 4075 1473 1307 3117 1927 934 79 -1025 -157
4365 -157 563 -1578 -3249 -1746 -895 -2436 -3715 -3967 -3864 -3108 -3217 -5124 -4406 -2494 -3402 -5034 -4553
4382 -4553 -4322 -3737 -2265 -3472 -4009 -1674 -310 -2184 -2142 -458 718 1465 1717 401 1905 4022 3190
4399 3190 1941 3333 4148 3860 4298 3815 3355 5155 5233 2540 2455 3611 3952 2806 2520 1488 1702 2842
4417 2842 723 -1222 565 1211 -267 -1166 -1542 -1711 -1389 -1117 -3374 -3503 -1871 -2208 -3993 -3899 -3469 -3256
4435 -3256 -2741 -4252 -5319 -3427 -1566 -3142 -3693 -2493 -2304 -1947 -1801 -2365 -1494 1242 823 -608 239
4452 239 1856 1974 2550 2632 2138 4082 5236 3313 2931 5246 5054 4267 3817 3167 3765 4673 4008 1910
4470 1910 2699 3186 1572 676 903 568 980 1046 -1669 -2533 -1195 -1259 -3339 -3167 -2529 -3158 -2999 -4049 -5323
4489 -5323 -3906 -2510 -4146 -5317 -3666 -3542 -3062 -2501 -3527 -3171 -1164 -1363 -2892 -1487 404 170
4505 170 752 44 -861 696 2546 1345 1082 2875 3279 2480 2647 2452 2874 4653 4768 2630 3113 4944
4523 4944 3923 3033 3226 2895 3093 3500 1364 738 2623 2125 -189 -1115 -1117 -1033 -730 -966 -3076 -2782 -1431
4542 -1431 -3092 -4879 -4262 -3620 -3245 -2947 -4106 -4717 -2790 -2371 -4485 -3804 -2394 -2231 -2026 -1549 -2222 -879
4560 -879 864 -470 -1277 697 1921 1751 2271 1850 2306 3559 3575 1624 2364 4564 4413 3578 3481 2749
4578 2749 3014 4001 2547 1336 2848 3509 1581 1008 1118 845 1273 740 -1421 -1367 731 -484 -2109
4595 -2109 -2096 -2270 -2520 -2550 -3651 -4156 -2750 -2184 -4330 -4284 -3760 -3673 -3826 -3698 -4167 -3131 -1333 -2455 -3794
4614 -3794 -2005 -680 -937 -587 -491 -566 1541 2410 450 980 3000 3254 2891 3249 3232 3451 5183 3970
4632 3970 2943 3784 4494 3516 2805 3443 3148 3729 3316 1144 663 2095 1473 -243 252 610 -305 -640
4650 -640 -1801 -3112 -1690 -747 -2841 -3366 -2863 -3150 -3702 -3046 -3833 -4196 -2374 -2884 -4324 -3184 -1911
4667 -1911 -2233 -2252 -2197 -2814 -1427 16 -1369 -970 671 617 -30 608 728 1225 3181 2814 1336 2294 3723
4686 3723 2796 2783 3262 3159 3785 4274 2607 2688 4206 3628 2402 2153 1954 1547 2035 1427 -327 529 778
4705 778 -1176 -2422 -1669 -1589 -1610 -1697 -3327 -3823 -2475 -2825 -4378 -3722 -2472 -3229 -3329 -3336 -4065 -2693 -1384
4724 -1384 -2766 -3211 -1725 -885 -1447 -1000 -400 -256 1054 345 -849 851 3006 2462 2260 2388 2093 2381
4742 2381 3651 2653 2772 4965 4312 2387 2775 3344 3023 3643 2949 1327 1854 2897 1265 318 1338
4759 1338 1269 -27 -618 -1650 -1959 -661 -440 -2254 -3124 -2709 -3467 -3419 -3008 -3279 -3072 -2210 -4103 -5028 -3671
4778 -3671 -2500 -2908 -2464 -2590 -2798 -1523 -1163 -2394 -1049 651 -18 -444 -79 720 1755 3043 2108
4795 2108 1139 2478 3239 2392 3129 3972 3613 3757 3215 1602 2440 4515 3999 2404 2610 1963 1293 1675
4813 1675 1322 624 1650 1652 -1076 -1522 -639 -144 -675 -1068 -2811 -3057 -1943 -2754 -3634 -2110 -1991 -3271
4831 -3271 -4117 -4271 -4063 -2195 -1264 -2896 -3087 -2396 -2487 -2325 -1114 -378 -461 611 -192 -1225 809 2376
4849 2376 2039 1590 2109 1598 2101 3317 2665 2938 4322 3339 1717 2093 3372 3709 4256 3137 1655 1725
4867 1725 2268 1060 1131 2085 1483 540 -383 -1420 -1399 346 -810 -2361 -2010 -2279 -3140 -2525 -2420 -2729 -2742
4886 -2742 -2798 -4284 -4396 -2353 -1997 -2381 -2392 -3032 -3439 -2094 -1745 -2311 -398 287 -1015 -1785 -513 43
4904 43 1119 2015 1405 958 2389 2357 2227 3074 3707 3364 3295 3081 1854 3624 4868 3671 2440 2527 2062
4923 2062 1647 2245 1959 1572 1988 887 -1008 -1152 271 -118 -778 -1178 -2727 -2367 -1861 -3016 -3029 -1692
4941 -1692 -2598 -3994 -3600 -3594 -2825 -2038 -2000 -3764 -3198 -1958 -2724 -2081 -634 -565 -655 -208 -1186 -1375 1336 1689
4961 1689 907 1046 1449 1418 1815 2192 1940 3161 3852 2648 1778 3437 3458 3131 3475 2427 1561 3224 2858
4980 2858 1652 1821 2577 1283 271 270 -388 200 975 -581 -1946 -1639 -1490 -2990 -2645 -2388 -2849 -2424
4998 -2424 -2428 -4159 -3905 -2062 -2639 -3356 -3019 -3318 -2929 -1646 -2035 -2417 -948 -781 -2035 -1406 -105 610
5016 610 1478 1803 549 808 2677 2189 1897 3374 3580 2738 3057 2400 2141 3680 3811 2093 1902 2887
5034 2887 2207 2212 2104 1448 1333 1943 706 -276 496 856 233 -246 -952 -1707 -1332 -900 -2278 -2333 -1515 -2457
5054 -2457 -3050 -2857 -3056 -3197 -2055 -2778 -3816 -2576 -2029 -2896 -2583 -1665 -1902 -1506 -1127 -1567 -1086 960
5072 960 1019 -260 275 737 904 1949 2327 1681 3009 3140 2036 2246 3233 3382 3427 3526 2553 2466 3343 3060
5092 3060 1471 2092 2171 1246 814 663 -116 245 567 -1300 -1965 -1101 -1253 -2149 -1949 -2164 -2616 -2304 -2688
5111 -2688 -3469 -2813 -2023 -2465 -2952 -2515 -2841 -2710 -1752 -2472 -2283 -921 -1557 -2103 -975 -293 -686 -329 188
5130 188 183 704 1982 1524 1350 2219 1950 1705 2500 2465 2304 3794 3308 2342 2841 3109 2492 2082 2595 1924
5150 1924 1780 2667 1225 355 1368 583 -18 137 -619 -993 -739 -1211 -2469 -2251 -1943 -2845 -3394 -2489 -3095
5169 -3095 -2756 -2317 -3820 -3587 -2573 -2844 -3145 -2145 -1735 -1922 -1277 -1201 -1561 -595 234 -279 -276 1057 968 1239
5189 1239 1828 1568 1421 2430 2601 1789 2655 3219 2716 2677 2868 2349 2530 2898 2140 1362 2393 2303 1199
5208 1199 1417 952 520 299 530 -749 -457 285 -645 -1690 -1306 -1946 -1971 -1569 -2496 -2882 -2226 -2069 -3124
5227 -3124 -3221 -2827 -2779 -2488 -2494 -2888 -2385 -1261 -1845 -2318 -1707 -712 -861 159 -34 -127 1209 1813 679 772
5247 772 2427 2371 2414 2827 2567 2350 3430 2681 1667 3084 3392 2561 2300 2392 1940 2168 2617 898 660
5266 660 1478 1001 -93 383 -337 -908 -474 -1197 -1980 -1430 -1362 -2557 -2299 -2419 -2873 -2666 -2591 -3228 -2952 -1581
5286 -1581 -2073 -3200 -2293 -1886 -2190 -1563 -1392 -1925 -822 -65 -1118 -742 22 259 364 788 1004 1170 2232
5305 2232 2309 1543 2333 3037 2235 2703 3286 2843 3296 3424 2281 1884 2098 2278 1476 2005 1638 931 1019 336
5325 336 -557 150 143 -506 -1083 -686 -1403 -1726 -1323 -1760 -2617 -1766 -2203 -3506 -2305 -2214 -2529 -2666 -2516 -3218
5345 -3218 -2653 -1651 -1867 -2036 -896 -1182 -1406 -943 -682 -520 1234 1031 -54 730 1630 1274 1586 2179
5363 2179 1969 2068 2815 2085 1967 3245 3366 2310 2336 2173 1969 2693 2765 1756 1676 2121 849 138 751 498
5383 498 416 -45 -1127 -1509 -1103 -1268 -1921 -1723 -1759 -2610 -3061 -2587 -2850 -2417 -1762 -2433 -3178 -2576 -2567 -2168 -1353
5404 -1353 -1251 -2096 -1214 -1204 -1697 -802 476 355 177 826 212 744 1913 1570 1546 2892 2408 1704 2359
5423 2359 2559 2624 3121 2953 1630 1725 2800 2105 1784 2441 1620 1064 1232 839 348 1370 1469 -362 -600
5442 -600 -695 -1039 -1139 -247 -1796 -1698 -1414 -2504 -3451 -2473 -2078 -2959 -2560 -3094 -3419 -2385 -1688 -2686 -1932 -1255
5462 -1255 -1882 -1773 -1170 -938 -59 836 45 -701 563 887 896 1542 1910 1624 1709 2238 1382 1857 2990 3037
5482 3037 1994 2204 2447 1962 2620 2499 1693 1933 1832 616 904 1072 890 359 350 -1150 -1190 -691 -965 -1494
5502 -1494 -1212 -1479 -2157 -2187 -2389 -2570 -1665 -1292 -2912 -3043 -1959 -2301 -2299 -1751 -2125 -2468 -1536 -1457 -1891 -983
5522 -983 -66 -690 -967 -38 -401 924 1803 1202 1290 2169 1555 1104 2182 2721 2464 2925 2606 1645 2244 2978
5542 2978 2405 1878 2497 1549 1273 1780 1141 851 1612 849 -479 -486 -167 -771 -498 -631 -1501 -1765 -1557 -2481
5562 -2481 -2766 -1563 -2111 -2595 -2551 -2893 -2968 -2172 -1880 -2418 -1925 -1246 -1848 -1412 -873 -980 -683 -183 -726 -685
5582 -685 703 642 525 1244 914 580 1324 1747 1506 2142 3251 2310 1888 2418 2467 2555 2650 2747 1746 2348 1955
5603 1955 907 1598 1811 944 585 345 -193 -217 589 -470 -1425 -1228 -1358 -1970 -1826 -1505 -2113 -1346 -2101
5622 -2101 -3311 -2967 -2257 -1949 -2389 -1946 -2287 -2230 -1638 -1872 -1898 -704 -633 -1120 -611 269 125 1048 1447 595
5642 595 809 1624 1221 1219 2516 2339 2176 2129 1696 1299 2556 2957 1584 1873 2392 1530 1326 1745 1258 1331
5662 1331 1832 785 47 391 446 -451 -158 -400 -1376 -1047 -1231 -1809 -1557 -1220 -1681 -2810 -2349 -2611 -2239
5681 -2239 -1551 -2298 -2695 -1846 -1982 -2539 -1805 -1222 -1282 -760 -465 -1278 -1025 593 242 -221 962 691 953
5700 953 1820 1756 1405 2469 2423 1866 1830 2821 2449 2901 2913 1824 2025 2341 1818 1280 1867 1735 1000 471 490
5721 490 -394 321 211 -912 -1211 -498 -882 -1866 -1590 -1705 -2000 -1493 -1875 -2939 -1871 -1446 -2017 -2191 -1723
5740 -1723 -2444 -2114 -1363 -1830 -1754 -616 -1172 -1437 -749 -295 -311 -74 686 -88 618 1380 705 1331 1981 1659
5760 1659 1634 2197 1728 1753 3016 2539 1599 2312 2248 1858 1766 2210 1428 1501 1686 616 407 1010 1071 198 41
5781 41 -238 -893 -745 -855 -2090 -1735 -1418 -2142 -2118 -1855 -2365 -2176 -1775 -2903 -2909 -1638 -1951 -2191 -1639 -1126
5801 -1126 -1678 -1362 -1114 -1438 -243 328 53 -151 540 404 607 1331 1303 1082 1913 2122 1456 1557 2189 1988
5821 1988 2082 2442 1480 2181 2492 1880 1260 1826 1759 1156 1049 928 713 761 607 -464 -572 -216 -1063 -1016 -659
5842 -659 -1646 -1771 -1220 -1580 -2415 -1513 -1955 -2533 -2133 -1863 -1971 -2181 -1459 -2282 -1913 -1108 -1332 -1733 -757 -726
5862 -726 -819 -270 174 -282 638 1002 207 758 1829 1680 1676 2226 1473 2021 2459 1946 1317 2334 2390 1745 1799
5883 1799 1565 1396 1511 1666 955 732 1338 204 29 -21 -412 -433 -38 -1081 -1739 -815 -1073 -2099 -1802
5902 -1802 -1677 -1967 -1843 -2034 -2699 -2371 -1547 -1840 -2030 -1780 -1521 -1457 -941 -812 -1145 -742 -340 -697 -455 238
5922 238 188 399 1075 880 1002 1549 1705 1199 2198 2245 1764 1986 2396 1430 2111 2558 1495 1437 2146 1840 1159
5943 1159 1392 970 419 625 38 -560 -54 167 -500 -821 -615 -1075 -997 -799 -1717 -2037 -754 -1498 -2064 -1912
5963 -1912 -1836 -2379 -1704 -1842 -2432 -1989 -1240 -1599 -1738 -825 -654 -796 -375 -543 -279 762 670 6 766 1393
5983 1393 837 1070 1379 1523 1601 2035 1812 1505 2346 2122 1638 1991 1843 1661 1958 1882 827 1408 1686 738
6003 738 319 720 45 -200 150 -773 -1092 -845 -947 -1825 -1617 -1465 -1686 -1789 -1941 -2555 -2376 -1484 -1925 -1925 -1431
6024 -1431 -1469 -1844 -1059 -1126 -1256 -429 -421 -1033 -334 385 -222 279 810 283 613 1434 1136 1109 1558 2091 1617
6045 1617 2022 1996 1614 2135 2203 1574 1847 2247 1565 894 1237 987 743 1223 662 108 404 284 -549 -407
6065 -407 -269 -1136 -894 -661 -1505 -1325 -1064 -1561 -2515 -1861 -1551 -2057 -1654 -1952 -2486 -1631 -1871 -2313 -1427 -896
6085 -896 -898 -994 -402 -451 -479 536 -34 -365 685 1074 510 920 1233 1288 1780 1699 1280 1531 2254 1818 1635 2127
6107 2127 1994 1677 1985 1655 1035 1743 1934 433 709 379 207 437 197 -471 -1003 -502 -785 -1786 -1305
6126 -1305 -1336 -1791 -1464 -1594 -2118 -1499 -1044 -2025 -2124 -1366 -1567 -1779 -1439 -1730 -1321 -929 -724 -1490 -664 -362
6146 -362 -606 -22 172 275 826 1182 682 990 1893 1494 1494 1567 1361 1525 2152 2021 998 1622 1975 1141 1558
6167 1558 1596 707 1132 1241 471 595 1039 759 -174 399 -52 -746 -605 -505 -1472 -1356 -726 -1504 -2191 -1311
6187 -1311 -1763 -2005 -1748 -2294 -2406 -1305 -1516 -1788 -1273 -1063 -1483 -1416 -715 -622 -650 214 -411 -422 433 745 237
6208 237 766 863 979 1625 1358 886 1551 2055 1459 1541 1838 1965 1920 2310 1514 1736 1831 1509 889 863 1300 796
6230 796 556 121 -376 -191 190 -779 -1127 -485 -965 -1307 -1293 -1310 -1809 -1276 -1359 -1979 -1745 -1132 -1990 -1710 -1537
6251 -1537 -1673 -1621 -1112 -1386 -1401 -54 -484 -671 -231 -32 -261 524 870 542 1242 1425 1211 945 1514 1558
6271 1558 1586 1844 1637 1494 1990 1981 1442 1627 1529 1040 1135 1243 568 823 1308 396 -154 222 -20 -218 -149 -276
6293 -276 -1325 -1146 -1052 -1383 -1515 -973 -1659 -2130 -1554 -2066 -1882 -1475 -1563 -2093 -1407 -1151 -1709 -1232 -774 -948
6313 -948 -686 -569 -1158 -278 439 207 395 610 675 485 1331 1252 1042 1406 1671 1219 1355 1750 1777 1879 2094
6334 2094 1302 1263 1739 1191 935 1586 1312 495 389 26 -435 240 387 -237 -815 -372 -851 -1272 -753 -987
6354 -987 -1287 -845 -1474 -2150 -1814 -1120 -1725 -1375 -1604 -2304 -1490 -1100 -1755 -1106 -662 -1185 -1262 -447 -236 -73
6374 -73 419 221 -205 278 1033 125 989 1561 1026 1348 1223 1275 1230 2087 2218 1354 1568 1777 1381 1544 1629
6395 1629 1071 1422 1437 344 141 698 540 -2 65 -521 -967 -661 -509 -1676 -1341 -871 -1413 -1709 -1512 -1663
6415 -1663 -1475 -801 -1635 -2024 -1480 -996 -1802 -867 -828 -1023 -771 -936 -1177 -390 -266 -70 -57 384 333 349 1256
6436 1256 887 805 1835 1434 916 1318 1818 1323 1467 1831 1489 1666 1664 995 886 1518 1312 341 1003 634
6456 634 81 359 549 -391 -488 -159 -708 -545 -616 -735 -1499 -704 -1409 -1694 -1314 -1156 -1569 -1453 -1434 -1905 -1331
6477 -1331 -1074 -1430 -1334 -715 -1084 -1501 -574 -479 -591 104 -213 -443 277 785 306 539 982 1177 1386 1153
6497 1153 1124 1615 2333 1854 985 1980 1526 1328 1355 1774 1134 1339 1512 747 589 1162 371 109 185 106 49
6518 49 73 -612 -1015 -204 -668 -1523 -1163 -1528 -1666 -1466 -1401 -1840 -1896 -1389 -1631 -1832 -1158 -1485 -1744 -846 -831 -1162
6540 -1162 -572 -229 -686 -180 232 150 215 883 584 752 1033 1430 687 1214 1671 1378 1675 1316 988 1642
6560 1642 1536 1271 1255 1537 1382 666 1266 915 272 784 416 42 401 482 -353 -267 -318 -648 -809 -881 -1364
6581 -1364 -1507 -1053 -1235 -1582 -1383 -1483 -1380 -1387 -1415 -1884 -1415 -1175 -1567 -1325 -572 -973 -879 -192 -481 -500 211
6602 211 404 -21 359 703 590 897 1167 783 1172 1443 1142 1222 1989 1414 1585 1396 1425 1313 1641 1503 735
6623 735 1075 1181 728 275 695 101 -82 472 -691 -706 -599 -605 -1361 -928 -1178 -1733 -1422 -1397 -2000 -1316 -1072
6644 -1072 -1529 -1552 -1191 -1411 -1470 -827 -1319 -1335 -663 -488 -932 -416 -353 -355 -36 -24 -26 560 1157 521 605 1466 1397
6667 1397 1108 1326 1497 1367 1817 1836 935 1284 1506 1096 971 1249 1128 651 866 598 93 688 447 -348
6687 -348 -73 -94 -233 -232 -402 -1365 -723 -726 -1215 -1509 -1090 -1388 -1519 -1532 -1532 -1815 -1432 -1340 -1934 -1528 -604 -862 -784
6710 -784 -596 -594 -388 2 -11 -344 468 447 31 501 989 964 1152 1431 827 1170 1519 1362 1494 1469 970 1242
6732 1242 1563 1710 1022 1455 1299 592 503 640 661 226 302 -183 -413 179 -727 -909 -649 -622 -1332 -953 -1209
6753 -1209 -1356 -1117 -1189 -1767 -1541 -1234 -1558 -1198 -1234 -1220 -1343 -644 -951 -1173 -311 -482 -248 -144 -18 -76 643
6774 643 499 359 408 1016 1006 585 1322 1643 1338 1554 1365 865 1512 1687 1276 1176 1089 868 1046 1216 663
6795 663 584 732 404 75 428 -20 -209 -486 -531 -960 -766 -658 -938 -1170 -1153 -1543 -1637 -1584 -1453 -1521 -1274 -1138
6817 -1138 -1822 -964 -1067 -1070 -1118 -685 -666 -706 13 -496 -322 170 314 244 561 806 752 1400 1388 925 1193 1324
6839 1324 1520 977 1431 1319 1543 1483 1093 976 1565 1309 766 998 1244 471 438 3 -132 -331 86 -393
6859 -393 -932 -320 -744 -1027 -880 -1077 -1444 -825 -968 -1352 -1772 -898 -1337 -1153 -1204 -1495 -1281 -642 -986 -1059 -610
6880 -610 -151 -665 -410 -264 -167 584 745 416 483 923 1174 615 1219 1045 1284 1395 1107 983 1475 1782 663
6901 663 704 843 968 1190 1233 1016 1123 786 328 279 431 136 -201 -213 -315 -756 -641 -541 -1207 -1212 -826 -1138
6923 -1138 -1423 -1356 -1360 -1375 -1203 -1516 -1434 -989 -891 -1208 -500 -607 -637 -413 -334 -501 -222 198 5 280 520 241
6945 241 675 917 913 912 1367 1334 1105 1146 936 1221 1308 1490 1138 1268 1307 1307 713 1140 845 691 585 147 -178
6968 -178 546 124 -591 -466 -447 -711 -936 -501 -863 -1007 -790 -1126 -1719 -1026 -1072 -1586 -1169 -1200 -1587 -1367 -830
6989 -830 -1309 -1180 -671 -974 -657 -343 -152 -347 319 272 240 427 639 242 828 925 856 1066 948 1113 1059 1414
7011 1414 1340 818 1186 1140 1143 1189 1024 529 736 1346 606 291 708 514 64 230 -317 -529 -208 -869 -1101
7032 -1101 -733 -636 -1100 -1107 -1097 -1440 -1181 -1046 -1415 -1466 -1247 -1213 -1416 -1110 -898 -1156 -835 -395 -587 -339 -270 -230
7054 -230 -45 61 13 776 1052 472 590 1021 1216 608 1198 1259 1107 1212 1526 844 1197 966 822 854 1414
7075 1414 609 810 700 486 190 771 208 -264 -10 -198 -407 -613 -456 -938 -722 -411 -1025 -1446 -964 -1128
7095 -1128 -1416 -1349 -1253 -970 -1304 -1098 -1307 -1092 -605 -1050 -1037 -728 -280 -321 35 -201 -130 411 479 112 452 834
7117 834 682 930 1141 728 1022 1444 997 955 1433 1536 912 1200 1035 880 1116 1187 459 400 583 -191 137
7138 137 381 16 -217 344 -554 -1001 -389 -236 -949 -763 -861 -1326 -1103 -982 -1539 -1154 -936 -916 -1195 -997 -1148
7159 -1148 -945 -356 -746 -591 -172 -246 -802 -126 243 182 123 514 200 393 1215 787 495 806 1051 901 983
7180 983 1260 1052 1325 1415 742 759 1105 742 544 665 686 438 493 458 255 414 412 -401 -409 -254 -550 -510 -198
7203 -198 -867 -1105 -523 -1106 -1370 -1104 -1324 -1241 -1017 -1037 -1322 -888 -683 -1208 -822 -458 -425 -498 -161 -465 -194
7224 -194 429 396 0 291 654 299 948 786 714 1064 1329 1047 726 1508 1132 1071 1093 1082 1241 1295 1242 519
7246 519 745 747 251 259 337 -50 129 81 -299 -428 -359 -369 -524 -634 -948 -1230 -887 -974 -1248 -728 -900 -1055 -1408
7269 -1408 -691 -1099 -1217 -584 -798 -945 -185 -395 -825 -165 23 -42 132 215 -93 337 874 592 723 930
7289 930 593 419 1028 1041 1239 1641 1343 481 1123 1055 952 925 840 733 444 655 359 -462 556 -53 -141
7310 -141 -98 -329 -518 -183 -280 -1119 -722 -701 -840 -1115 -402 -1200 -933 -882 -1179 -1141 -910 -442 -1121 -1037 -581 -1023
7332 -1023 -561 -488 -551 -192 204 33 -103 -125 63 412 759 646 515 826 1299 762 1066 1384 1147 540 1142
7353 1142 842 868 1137 720 531 850 1120 292 544 441 4 25 462 -67 23 67 -227 -586 -404 -733 -583
7374 -583 -864 -1012 -1261 -643 -1153 -1028 -942 -643 -847 -763 -751 -1195 -916 -500 -681 -489 -351 -310 -470 147 -51
7395 -51 -113 399 735 557 415 736 533 967 999 863 424 1255 1063 811 1119 1104 1171 899 658 614 680 839
7417 839 377 -122 770 46 24 63 -33 -97 -111 -543 -601 -567 -275 -864 -1078 -679 -866 -1069 -883 -1127 -1182 -314 -887
7440 -887 -1274 -991 -738 -881 -813 -429 -380 -479 -162 -593 -206 107 2 110 207 517 456 1043 954 571 875 1512
7462 1512 756 951 1172 638 1173 1164 891 752 1054 808 653 439 588 245 363 215 -141 -113 -46 -145 -433
7483 -433 -383 -467 -575 -536 -853 -1076 -788 -897 -1214 -1073 -721 -1097 -1051 -832 -1071 -993 -491 -1055 -861 -504 -55 -458
7505 -458 -297 179 151 444 243 189 449 825 454 495 1117 762 602 1091 883 782 1314 1150 713 893 908
7526 908 769 1050 876 430 544 887 100 -89 397 134 -234 236 -301 -561 -215 -531 -857 -875 -269 -852
7546 -852 -982 -904 -1217 -1060 -940 -1010 -905 -960 -559 -1216 -770 -709 -481 -754 -369 -505 -221 -110 -160 81 443 186
7568 186 109 615 648 247 885 1227 490 908 808 647 951 934 881 900 1201 1004 534 777 675 575 591 260
7590 260 -143 285 469 -272 -187 -318 -348 -604 -621 -859 -678 -650 -806 -853 -503 -801 -1224 -899 -808 -1361 -732 -1016
$$ [...]
8191C32
##END NTUPLES=NMR FID
##END=
