##TITLE=1H_ANY-156E-4
 D2O, 8 sc, 
 6.2.2019
##JCAMPDX= 6.0         $$ Bruker NMR JCAMP-DX V2.0
##DATA TYPE= NMR FID
##DATA CLASS= NTUPLES
##ORIGIN= UXNMR, Bruker Analytische Messtechnik GmbH
##OWNER= root
$$ XWIN-NMR		Version 3.5
$$ Wed Feb  6 15:00:10 2019 Russian Standard Time (UT+4h)  she@DPX200
##.OBSERVE FREQUENCY= 200.1313
##.OBSERVE NUCLEUS= ^1H
##.DELAY= (6, 6)
##.ACQUISITION MODE= SIMULTANEOUS
##.ACQUISITION SCHEME= undefined
##.AVERAGES= 8
##.DIGITISER RES= 18
##SPECTROMETER/DATA SYSTEM= spect
##.PULSE SEQUENCE= zg30
##.SOLVENT NAME= D2O
##.SHIFT REFERENCE= (INTERNAL, D2O, 0, 15.7039)
##AUDIT TRAIL= $$ (NUMBER, WHEN, WHO, WHERE, WHAT)
$$ ##TITLE= Audit trail, XWIN-NMR		Version 3.5
$$ ##JCAMPDX= 5.01
$$ ##ORIGIN= Bruker BioSpin GmbH
$$ ##OWNER= she
$$ F:/spectra/data/she/nmr/H-F/1/audita.txt
$$ ##AUDIT TRAIL=  $$ (NUMBER, WHEN, WHO, WHERE, WHAT)
(   1,<2019-02-06 14:58:52.51 +0400>,<she>,<DPX200>,
      <created by zg, POWCHK disabled, PULCHK disabled
       configuration hash MD5:
       00 E9 B6 7A A2 85 ED C7 34 08 36 98 17 FE 4E 26
       data hash MD5: 16K
       D0 83 46 06 7C BF 40 7B 72 60 11 7A C1 AD D1 7E>)
$$ ##END=
$$ 
$$ hash MD5
$$ 29 20 2F FF 10 2D 89 9D CA 31 62 DF B8 73 60 8A
##$RELAX= 
##$RELAX= 
##$RELAX= 
##$RELAX= 
##$RELAX= 
##$RELAX= 
$$ Bruker specific parameters
$$ --------------------------
##$DU= <F:/spectra>
##$EXPNO= 1
##$NAME= <H-F>
##$PROCNO= 1
##$TYPE= <nmr>
##$USER= <she>
##$AMP= (0..31)
100 100 100 100 100 100 100 100 100 100 100 100 100 100 100 100 100 100 
100 100 100 100 100 100 100 100 100 100 100 100 100 100 
##$AQSEQ= 0
##$AQ_mod= 1
##$AUNM= <au_zg>
##$AUTOPOS= <>
##$BF1= 200.13
##$BF2= 200.13
##$BF3= 200.13
##$BF4= 200.13
##$BF5= 200.13
##$BF6= 200.13
##$BF7= 200.13
##$BF8= 200.13
##$BYTORDA= 1
##$CFDGTYP= 0
##$CFRGTYP= 5
##$CHEMSTR= <none>
##$CNST= (0..31)
1 1 145 1 1 1 1 1 1 1 1 1 1 1 1 1 1 1 1 1 1 1 1 1 1 1 1 1 1 1 1 1 
##$CPDPRG= <>
##$CPDPRG1= <>
##$CPDPRG2= <>
##$CPDPRG3= <>
##$CPDPRG4= <mlev>
##$CPDPRG5= <mlev>
##$CPDPRG6= <mlev>
##$CPDPRG7= <mlev>
##$CPDPRG8= <mlev>
##$CPDPRGB= <>
##$CPDPRGT= <>
##$D= (0..31)
0 1.2 0 0 0 0 0 0 0 0 0 0.03 0 0 0 0 0 0 0 0 0 0 0 0 0 0 0 0 0 0 0 0 
##$DATE= 1549450731
##$DBL= (0..7)
120 120 120 120 120 120 120 120 
##$DBP= (0..7)
150 150 150 150 150 150 150 150 
##$DBP07= 0
##$DBPNAM0= <>
##$DBPNAM1= <>
##$DBPNAM2= <>
##$DBPNAM3= <>
##$DBPNAM4= <>
##$DBPNAM5= <>
##$DBPNAM6= <>
##$DBPNAM7= <>
##$DBPOAL= (0..7)
0.5 0.5 0.5 0.5 0.5 0.5 0.5 0.5 
##$DBPOFFS= (0..7)
0 0 0 0 0 0 0 0 
##$DE= 6
##$DECBNUC= <off>
##$DECIM= 32
##$DECNUC= <off>
##$DECSTAT= 4
##$DIGMOD= 1
##$DIGTYP= 9
##$DL= (0..7)
0 120 120 120 120 120 120 120 
##$DP= (0..7)
150 150 150 150 150 150 150 150 
##$DP07= 0
##$DPNAME0= <>
##$DPNAME1= <>
##$DPNAME2= <>
##$DPNAME3= <>
##$DPNAME4= <>
##$DPNAME5= <>
##$DPNAME6= <>
##$DPNAME7= <>
##$DPOAL= (0..7)
0.5 0.5 0.5 0.5 0.5 0.5 0.5 0.5 
##$DPOFFS= (0..7)
0 0 0 0 0 0 0 0 
##$DQDMODE= 0
##$DR= 18
##$DS= 0
##$DSLIST= <SSSSSSSSSSSSSSS>
##$DSPFIRM= 0
$$ [...]
##$SUBNAM2= <"">
##$SUBNAM3= <"">
##$SUBNAM4= <"">
##$SUBNAM5= <"">
##$SUBNAM6= <"">
##$SUBNAM7= <"">
##$SUBNAM8= <"">
##$SUBNAM9= <"">
##$SW= 20.0189088683792
##$SWIBOX= (0..15)
0 0 2 0 0 0 0 0 0 0 0 0 0 0 0 0 
##$SW_h= 4006.41025641026
##$TD= 16384
##$TD0= 1
##$TE= 0
##$TE2= 300
##$TE3= 300
##$TEG= 300
##$TL= (0..7)
0 120 120 120 120 120 120 120 
##$TP= (0..7)
150 150 150 150 150 150 150 150 
##$TP07= 0
##$TPNAME0= <>
##$TPNAME1= <>
##$TPNAME2= <>
##$TPNAME3= <>
##$TPNAME4= <>
##$TPNAME5= <>
##$TPNAME6= <>
##$TPNAME7= <>
##$TPOAL= (0..7)
0.5 0.5 0.5 0.5 0.5 0.5 0.5 0.5 
##$TPOFFS= (0..7)
0 0 0 0 0 0 0 0 
##$TUNHIN= 0
##$TUNHOUT= 0
##$TUNXOUT= 0
##$USERA1= <user>
##$USERA2= <user>
##$USERA3= <user>
##$USERA4= <user>
##$USERA5= <user>
##$V9= 5
##$VALIST= <valist>
##$VCLIST= <CCCCCCCCCCCCCCC>
##$VD= 0
##$VDLIST= <DDDDDDDDDDDDDDD>
##$VPLIST= <PPPPPPPPPPPPPPP>
##$VTLIST= <TTTTTTTTTTTTTTT>
##$WBST= 1024
##$WBSW= 4
##$XGAIN= (0..3)
0 0 0 0 
##$XL= 0
##$YL= 0
##$YMAX_a= 354438
##$YMIN_a= -380422
##$ZGOPTNS= <>
##$ZL1= 120
##$ZL2= 120
##$ZL3= 120
##$ZL4= 120
##$ABSF1= 10
##$ABSF2= 0
##$ABSG= 5
##$ABSL= 3
##$ALPHA= 0
##$AQORDER= 0
##$ASSFAC= 0
##$ASSFACI= 0
##$ASSFACX= 0
##$ASSWID= 0
##$AUNMP= <proc_1d>
##$AZFE= 0.1
##$AZFW= 0.1
##$BCFW= 1
##$BC_mod= 2
##$BYTORDP= 1
##$COROFFS= 0
##$CY= 11.3945322036743
##$DATMOD= 1
##$DC= 2
##$DFILT= <>
##$DTYPP= 0
##$F1P= 18.9103706918063
##$F2P= -1.10871071338519
##$FCOR= 0.5
##$FTSIZE= 0
##$FT_mod= 4
##$GAMMA= 1
##$GB= 0.15
##$INTBC= 1
##$INTSCL= 1
##$ISEN= 128
##$LB= 0.24
##$LEV0= 0
##$LPBIN= 0
##$MAXI= 10000
##$MC2= 0
##$MEAN= 0
##$ME_mod= 0
##$MI= 1.114404
##$NCOEF= 0
##$NC_proc= 0
##$NLEV= 6
##$NOISF1= 3.799351
##$NOISF2= 2.8
##$NSP= 1
##$NTH_PI= 0
##$NZP= 0
##$OFFSET= 15.70392
##$PC= 1
##$PHC0= -9044.27
##$PHC1= 16.40004
##$PH_mod= 1
##$PKNL= yes
##$PPARMOD= 0
##$PSCAL= 0
##$PSIGN= 0
##$REVERSE= no
##$SF= 200.130013532006
##$SI= 16384
##$SIGF1= 3
##$SIGF2= 2
##$SINO= 400
##$SIOLD= 16384
##$SREGLST= <1H.CDCl3>
##$SSB= 0
##$STSI= 0
##$STSR= 0
##$SW_p= 3612.71676300578
##$SYMM= 0
##$S_DEV= 0
##$TDeff= 0
##$TDoff= 0
##$TI= <>
##$TILT= no
##$TM1= 0
##$TM2= 0
##$TOPLEV= 0
##$USERP1= <user>
##$USERP2= <user>
##$USERP3= <user>
##$USERP4= <user>
##$USERP5= <user>
##$WDW= 1
##$XDIM= 8192
##$YMAX_p= 0
##$YMIN_p= 0
$$ End of Bruker specific parameters
$$ ---------------------------------
##NTUPLES= NMR FID
##VAR_NAME=  TIME,          FID/REAL,        FID/IMAG
##SYMBOL=    X,             R,               I
##VAR_TYPE=  INDEPENDENT,   DEPENDENT,       DEPENDENT
##VAR_FORM=  AFFN,          ASDF,            ASDF
##VAR_DIM=   8192,          8192,            8192
##UNITS=     SECONDS,       ARBITRARY UNITS, ARBITRARY UNITS
##FACTOR=    0.0002496,     1,               1
##FIRST=     0,             0,               0
##LAST=      2.0444736,     0,               0
##MIN=       0,             -380422,         0
##MAX=       2.0444736,     354438,          0
$$ Real data points
##PAGE= N=1
##DATA TABLE= (X++(R..R)), XYDATA
$$ [...]
2408I25j031n34n06o56L82P24R81Q46K54Q8n06p73r01m46m34K63M92Q82J056Q1
$$ 925 -106 -640 -1146 -1802 -1420 -696 285 1131 1385 1473 967 194 -707 -1153 -1587 -1324 -832 50 1106 1187
2428A187J68l45m89q42q32n42N70N2P12J175O97M8k23m94q05j014l44j37L03Q65
$$ 1187 1355 1010 521 -321 -1153 -1695 -1125 -1073 -361 814 1511 1559 1336 842 37 -977 -1321 -1458 -1155 -290
2448b90Q23O88M2k56j18p89r46l20k54K16P31P25P03L31j06j19p53r15k85l89
$$ -290 533 1221 1263 1007 889 100 -846 -1166 -1420 -1204 -473 252 955 1286 1180 1061 308 -607 -892 -1281
2468a281O4O31P12O39L88K4k37o30o85n57m34o1O55O13O53N75J89J1o40o91q63
$$ -1281 -1217 -586 126 765 1153 1177 940 310 -375 -932 -1366 -1427 -772 -159 494 1069 1258 1269 629 -62 -925
2489i25m62k38P39O28Q21j4M29N54q64n88p81m43j40K07Q88J50J066K59r5m40
$$ -925 -1387 -1625 -886 -258 563 549 978 1532 668 80 -701 -1144 -1284 -1077 -189 -39 1027 1286 1191 751
2509G51k84n82j028J04k07O38P15O96J43J29j24o65o39p09N4j27L73N92N96M40
$$ 751 467 -115 -1143 -1039 -1246 -608 107 803 946 1075 951 286 -353 -1062 -1008 -1135 -762 -170 426 866
2529H66K25l30k26n21o47l07J02r0R58L83L16L90j62m06m65o80l21j72R4N28N13
$$ 866 1091 761 535 14 -633 -940 -838 -928 30 413 729 1119 957 551 86 -594 -915 -1087 -993 -465 48
2550D8Q38M11m06r3n86o86j65p9l37O47K64N42O45j85J40l88q66m29k77O5M44
$$ 48 886 1297 891 798 212 -474 -639 -718 -1055 -408 -144 398 1043 858 998 610 -256 -685 -962 -897 -453
2571d53K26O25M74l7k0l63n30l35m46k5K42M87K23O05M09j15n37m34l16k15n87
$$ -453 -227 398 872 835 815 452 -78 -413 -859 -884 -642 -155 68 673 1082 967 430 -4 -320 -535 -1122
2592a122M55M40M12M13K67n3m8n62n50j97j68J14K75M48K40N07P0l82l04m86j97
$$ -1122 -667 -227 185 598 865 812 764 202 -348 -545 -713 -599 -324 124 364 871 941 559 255 -231 -428
2613d28l53jJ70L46M37N14L01j95n05J11o89n65J95RK10K97O89K08j12P6n91l53
$$ -428 -781 -782 -612 -266 171 685 986 791 286 397 -292 -857 -662 -653 -443 -146 543 751 639 715 124 -229
2635b29R1n36P0L56K03N76J37j9r6l09k10l85l09j73J98O46K44N14p3k08l6l99
$$ -229 -138 -674 -604 -248 -45 531 668 649 553 244 34 -351 -660 -833 -635 11 255 769 696 488 452 53
2657E3n19j70j21J87M14J21L47M79j5l40j53l67l88n8P1J75L28K54J93K0n3k35
$$ 53 -466 -636 -757 -570 -156 -35 312 791 776 436 283 -84 -472 -530 -459 -284 44 298 491 511 458 223
2679B23k79n60q9K72j73O40J72l1K67l7K9l55o50q0K5K71K04L61K51j72k7o4q7
$$ 223 -56 -616 -705 -433 -606 34 206 175 442 405 434 79 -571 -651 -626 -355 -151 210 461 289 262 198 111
2702A11l42k74k91L12K07J77N91O6j99J38m37k29l97K06kK68J94K7L35m3J73l95
$$ 111 -231 -505 -796 -484 -277 -100 491 557 358 496 59 -170 -567 -361 -363 -95 99 126 461 418 591 196
2724A96k96k88n5j42M35k26L24P78l9r8j22n57k71j02K19m19O84q1L27O0k11M58
$$ 196 -100 -388 -443 -585 -150 -376 -52 726 687 589 467 -90 -361 -463 -244 -663 21 -60 267 327 116 574
2746E74m19k71l53m2r0K22J87M60N8J1J27k88m34p0Ro0K0M72J41J6K18k85l9m07
$$ 574 155 -116 -469 -511 -601 -379 -192 268 326 337 464 176 -258 -328 -319 -379 -359 113 254 270 488 203 164 -243
2770b43J01m31L9K04R2J93J80K12p8j01L1k27j48j3k75J5N29J16L2K87m45P7l99
$$ -243 -142 -573 -534 -330 -238 -45 135 347 269 168 199 -28 -176 -189 -464 -449 80 196 228 515 70 147 -252
2793b52P8m7j12J39K5K32Q5J12Ql9k08j58P2j46m0M00k22L52N4m5nRn04k1K99
$$ -252 -174 -221 -333 -194 -169 63 148 260 268 229 21 -137 -65 -211 -251 149 -73 279 333 288 283 292 -212 -233 66
2818F6k68K50n8J04oK69O6l20j41n9m93L47n2J75K01J6K00k8M4j76l19o0jj37
$$ 66 -202 48 -10 94 88 357 423 103 -38 -97 -590 -243 -295 -120 81 97 297 269 313 137 -182 -242 -243 -380
2842c80K23L30J4kP7k27k8k50j0M1L8o0r7M40K98l89K97N3k89N5m51L7M8K76M2
$$ -380 -157 173 187 185 262 35 7 -243 -253 -212 -174 -234 -331 109 407 18 315 368 79 134 -317 -280 -232 44 86
2867H6j07J72O5j67Q1j27k30j74L22J0j21K21p3k2L4J12M9n6l33K6J07j53K95
$$ 86 -21 151 216 49 130 3 -227 -401 -79 -69 -190 31 -42 -64 -30 82 131 75 -258 -232 -125 -278 17
2890A7J46k31J83nQ0k39J62m18K21k71K10M08k85L77k59l8j85J61k01J35j16J30
$$ 17 163 -68 115 110 190 -49 113 -305 -84 -355 -145 263 -22 355 96 58 -127 34 -167 -32 -148 -18
2912a8jJ11K39K9l02K24j74k39o0n3j71K64J99J10J03j54J59j46k28l50n9L74
$$ -18 -19 92 331 360 58 282 108 -131 -191 -244 -415 -151 48 158 261 107 266 120 -108 -458 -517 -143
2934a43j9O1K37R1p8Rq0l96K30kj65j09K51K48j43K54L8j68j87j01k1K7J14N3
$$ -143 -162 -101 136 227 149 158 78 -318 -88 -90 -255 -364 -113 135 -8 246 284 116 -71 -172 -193 -166 -52 1
2958AQ3K2J66K4k44L5j54n30L95qJ90K44m3nn3J59l33qL2l87K35j84J65J41L93
$$ 1 84 106 272 296 52 87 -67 -597 -202 -210 -20 224 181 176 123 282 -51 -59 -27 -414 -179 -363 -198 -57 336
2983C36N4j53J16l3l45l13J57k54M19Q2L9K68L19o53l50M10m51o3N6j14L90j04
$$ 336 390 237 353 320 -25 -338 -181 -435 -16 66 105 373 692 39 -311 99 -352 -415 -359 -473 -83 -187
3005a87M21J55k11L9l88L3J26k80J31J0L04k07M7L12q2l75r6l2jj7R6J95J25J34
$$ -187 234 389 178 217 -171 -138 -12 -292 -161 -151 153 -54 -7 305 223 -152 -248 -280 -281 -298 -202 -7 118 252
3029B52j75N27m16l47m4l3L04k61J77j35M73j32J24k58n9k5j85L1l39K41J61M15
$$ 252 77 604 188 -159 -203 -236 68 -193 -16 -151 322 190 314 56 -3 -28 -213 -182 -521 -280 -119 296
3051B96K28l53J34q4j79l28m2J20j13K90K98l8L08l00k24j36k19Q1L3J6J84P3
$$ 296 524 171 305 221 42 -286 -328 -208 -321 -31 267 229 537 237 13 -123 -342 -261 -228 -212 -28 45
3073D5J96R7P0K15n15l39J35k25o6J03K61L36j12Q0L2j69k77j39j55l07O04n7
$$ 45 241 338 408 623 108 -231 -96 -321 -387 -284 -23 313 201 281 313 144 -133 -272 -427 -734 -130 -187
3095a87L36L75j98J37k15l57l11r6j7N55j18J03K89OK49k98k88l37j88k97M79
$$ -187 149 524 326 463 248 -109 -420 -516 -533 22 -96 7 296 302 551 253 -35 -372 -560 -857 -378
3116c78K21P2M67J1j26Q6q5n59j43J00m8L30N5M39J75k69j15k07j65j99l90K71
$$ -378 -157 -85 382 393 267 353 268 -291 -434 -334 -382 -52 3 442 617 348 233 26 -139 -338 -728 -457
3138d57L75r5M23J12M43k52l15k80m08J55J49k31K12L43M62o6l47n5J3n55l00
$$ -457 -82 -177 246 358 801 549 234 -46 -454 -299 -150 -381 -169 174 636 570 223 168 181 -374 -674
3159f74n9J13L43L63J29L19j7K6n96j9k95kn9J99L10L99J17k05K01m56j86j66
$$ -674 -733 -620 -277 86 215 534 517 543 -53 -72 -367 -369 -428 -229 81 480 597 392 593 137 -49 -215
3181b15m06J73J67J12L95O3J67M8l59j8n78k79J49J48L48J59L94M9q5j11j15j81
$$ -215 -621 -448 -281 -169 226 289 456 504 145 127 -451 -730 -581 -433 -85 74 468 517 432 321 206 25
3203B5m74m18K52M41K52q9N40R5m17k1l27l42k25M70k07K50M26N83l16J85p60
$$ 25 -449 -867 -615 -174 78 -11 529 624 207 186 -141 -483 -708 -238 -445 -195 231 814 498 683 -77
3224g7j08n73J09K70o1L43L87K53n9K42n72k24j64j37l19Q1M19M94K41J07ml02
$$ -77 -185 -758 -649 -379 -440 -97 290 543 484 726 154 -70 -234 -371 -690 -609 -190 304 545 652 648 346
3246C46l78k35r6j72p0L87%P63N3k53Q0l62m18k72M6M9J58J98O42J71r0p6M9p54
$$ 346 -32 -267 -363 -535 -605 -218 -218 545 598 345 425 63 -355 -627 -581 -532 -374 -176 466 637 547 471 520 -234
3270b34l07m0RJ23L00O00J28l4j43r0l05n38k94P2K24M0Q01L45k2n0Q6o17n22
$$ -234 -541 -581 -572 -449 -149 451 579 545 402 312 7 -531 -825 -753 -529 -489 312 657 635 585 671 54 -468
3293d68k03J08nK69K55O79L1j34m30J18l24l34J4q5kN96L65L43j70p1k31l47m73
$$ -468 -671 -563 -568 -299 -44 635 666 532 102 220 -104 -438 -424 -509 -511 85 450 793 623 552 321 -26 -499
3316d99j97J24K78K37L42L45O8j62k02m75l93Q7n73L93M47L93J27M15j27j36k00
$$ -499 -696 -572 -294 -57 285 630 698 536 334 -141 -534 -447 -1020 -627 -180 213 340 755 628 492 292
3337B92p92j70K02q7J25O16M70N4j41j26l66k04j39l54J7K44R4J002J16J57m35
$$ 292 -500 -670 -468 -555 -430 186 656 710 569 443 77 -127 -266 -620 -603 -359 -265 737 853 1010 575
3358E75m40l59n25K15j93M60j67Q73K69J34k50l59j78n29k37k50M20L9Q43L3K21
$$ 575 135 -224 -749 -534 -727 -267 -434 439 708 842 592 233 55 -474 -711 -961 -541 -502 341 374 595
3379E95P3l76l49p1o02k08M22R1N04M58L33k75l04j49m24l06j39J28L41J58M30
$$ 595 668 292 -57 -128 -730 -938 -516 -425 79 537 870 595 291 142 -282 -588 -727 -599 -258 -100 330
3400C30L60J59l37m59k44l60j61P1K35L03L99K57K43l79J47q70k05k68N4K55L83
$$ 330 690 849 512 53 -191 -551 -712 -641 -406 -103 296 553 796 417 564 -306 -511 -779 -725 -470 -87
3421h7J02M85M51mp07m10j56l78q1k4O20L70K93J28R1l91k61m76k39K70k60L05
$$ -87 15 500 951 947 240 -170 -326 -704 -785 -809 -189 181 474 602 693 302 41 -435 -674 -404 -664 -359
3443c59L17M60K32L00l71k14o55k56j44L3M39N57JK96P5l61k45k17o30L2k32O42
$$ -359 -42 418 650 950 579 365 -290 -546 -690 -657 -218 339 340 636 711 350 105 -112 -742 -710 -942 -300
3465c00J46N14M57j66P6l70k95p75J05P8j58P08j4N51L27j97j97n36k49m84J96
$$ -300 -154 360 817 651 727 357 62 -713 -608 -530 -688 20 6 557 884 687 490 -46 -295 -779 -583
3486e83k12N91K74L46L19O5j86o58j58m37k36L54L9M98M96k4N15n2q22k13l91
$$ -583 -795 -204 70 416 735 800 614 -44 -202 -639 -875 -521 -482 16 512 488 1003 951 129 -84 -475
3507d75l96L07K24K57N38L03J71j21o10j60p57j23j06K64N34M06M11N1J43m46
$$ -475 -871 -564 -340 -83 455 758 929 808 198 38 -719 -842 -948 -684 -150 256 667 718 861 415
3527D15m69n44k40J20j17N53O33J43L36Pn18l35l75m38n6P8M76L88P65m6p9l63
$$ 415 -54 -598 -838 -718 -835 -282 351 494 830 837 319 -16 -391 -829 -885 -807 -331 57 822 776 697 334
3549C34j41n81k67l36J80N19K67M01M61J4m77j96n60m06N9J58O6M57K74O45k42
$$ 334 193 -388 -655 -991 -811 -292 -25 376 837 851 374 178 -382 -788 -729 -571 -505 -48 226 871 629
3570F29k43j14l87k60m61K6L26L85M84L95L3n4j09o41l78o03oK85L24O79K90J95
$$ 629 386 272 -115 -375 -836 -810 -484 -99 385 780 813 759 650 9 -369 -972 -978 -693 -369 310 600 795
3592G95k06K9m94m30l80l12K99L29M18N61J36O7p6n61n20m53n1RL11L91L80N68
$$ 795 589 618 124 -306 -686 -998 -699 -370 48 609 745 812 736 175 -345 -798 -849 -840 -529 -138 242 810
3614H10L65m25m71o15n34P7r6M31L82M96L44L29l32n19l71l62j94n7o5N08P14
$$ 810 1175 750 279 -336 -870 -793 -889 -458 -76 420 764 1093 761 242 -129 -491 -685 -742 -807 -299 415
3635D15M79n2J17m44m08o07l88J57j22N02O24M19J76j77M7m21n66o60k1m3N82
$$ 415 894 842 959 515 107 -500 -888 -731 -853 -351 273 692 868 691 738 317 -249 -909 -930 -973 -391
3656c91L28L38O55j65N0m73n52m26l47O3M70L09M97L39K09k10l60l32o53k67J07
$$ -391 -63 275 930 765 815 342 -210 -636 -983 -920 -450 -141 356 695 904 694 334 2 -651 -918 -811
3677h11J77M91N50K79K84k5n13l86n20l60k62L43M92K95O28L41o7m48m75k41l79
$$ -811 -634 -143 407 686 970 945 432 46 -474 -834 -1096 -753 -261 34 662 1003 936 488 13 -228 -607
3698f07n42R5P34M29N25L70k56k13m90l39n00l40J39P30J85L78P54j3p0l87p97
$$ -607 -1149 -1054 -320 109 634 1004 748 535 45 -294 -794 -1134 -995 -265 -80 298 1052 1039 969 582 -215
3719b15n03j96o1J99N54P90L57J25K5m21q72m58k42k26L20K92O19P14J15j64j22
$$ -215 -718 -914 -975 -776 -222 568 925 1050 1075 654 -218 -676 -918 -1144 -824 -532 87 801 916 752 630
3740F30m97p30k26k31N1N58O63K60K95J46k87m00l68n71l89n6M83O68M28M76L39
$$ 630 133 -597 -823 -1054 -1003 -445 218 478 773 919 632 232 -136 -707 -1096 -1152 -669 -1 427 903 1242
3761A242m27m62n16n78k82K48J54L83Q58K28k7q7m50k69o72O0l29K35M50N50L07
$$ 1242 815 353 -163 -741 -1023 -775 -621 -238 620 848 821 734 284 15 -657 -597 -926 -691 -241 309 616
3782F16L66o4j11q19m06l59k75J88M87M28O87K28o4m1n77o22o02k68M51L42M24
$$ 616 982 918 807 -12 -418 -777 -1052 -864 -377 51 738 966 902 861 284 -338 -940 -1208 -757 -415 9
3803IN76N83N6o37j25o70q46p1J76L17N24O85J71K03k11k22n33p35l03P3K36M34
$$ 9 585 1168 1224 587 462 -208 -1054 -1125 -949 -632 -108 577 748 951 740 518 -15 -750 -1053 -980 -744 -310
3825c10O84L22L92K48o35o61p95k81j25L07L46O04O47Q3q2o1l49r84j37j93L46
$$ -310 374 696 1088 1336 701 40 -755 -1036 -1161 -854 -508 96 743 826 744 683 334 -650 -787 -980 -634
3846f34K39L40P52N11l02n9o06k76p63m99L92P4R69O56L18p7n79j28m40o65j16
$$ -634 -395 -55 697 1208 906 847 241 -35 -798 -1297 -905 -831 138 794 1112 1035 456 328 -112 -777 -893
3867h93j31L86M46P66N01k30J83o14m42m78p63K96J04M61N74N74k0J96m81l54
$$ -893 -1024 -638 -192 574 1075 845 1028 414 -28 -506 -1269 -973 -869 -408 166 740 720 916 435 81
3887H1n31k33m44K53L00O47M65K40L64l68k90n05m33n38j56O19M57O31K41J33
$$ 81 -450 -683 -1127 -874 -574 73 538 778 1142 774 484 -21 -454 -992 -1148 -529 -72 559 800 933
3907I33j32m32l62r47R8k17M40J70P03O36j32O4m21o31m95p4j28P3O06L28R29
$$ 933 801 369 7 -940 -842 -1059 -619 -449 254 890 758 822 401 -230 -725 -799 -927 -854 -248 80 1009
3928A009p4J12l80o37m36l91k41K39K65O07L89M36J37l34n32k80n88j39r5L36
$$ 1009 935 1047 667 30 -406 -797 -1038 -799 -534 73 462 898 1035 701 169 -111 -699 -838 -933 -597
3948e97N19O08O34k88j8m47p85j49l52k52N61N66L20M92L53k83k37n54o39m57
$$ -597 -78 530 1164 876 858 411 -374 -523 -875 -1127 -566 0 320 812 1165 882 645 91 -548 -1005
3968a005j46L90P46J36O95R0p6j89n07m97o11m5O4Q37K81M17l5K4J3l66l70n49
$$ -1005 -1151 -761 -15 121 816 906 830 641 134 -363 -974 -1019 -955 -118 163 580 545 569 582 216 -154 -703
3990g03l35K06J00M13R54J66N39n73l22p13m29l07p6P03J89P71J5L94p1m98o77
$$ -703 -1038 -832 -732 -319 635 801 1340 767 445 -268 -697 -1004 -1080 -377 -188 583 598 992 921 423 -254
4011b54k48j19j30Q7M92O71L69J82j31l33l06r59l14oL52K94M64N33K13J92n29
$$ -254 -502 -621 -751 -664 -172 499 868 1050 919 586 280 -679 -993 -999 -647 -353 111 644 857 1049 520
4032E20l40m23j024J64M20L97M06N78K90j37m3o10j85o43M3l41L54P36L74L72
$$ 520 180 -243 -1267 -1103 -683 -286 120 698 988 851 808 198 13 -630 -587 -928 -574 162 536 908
4052I08M5j01m70n13m29l10j32M40L91N33K65L66p5l81n93n22n4l47J35K76M51
$$ 908 953 852 382 -131 -560 -870 -1002 -562 -171 362 627 993 918 537 -56 -578 -632 -979 -844 -568 -117
4073a17Q38L10q2m44j79q32j93k41Q0J99O33N80L02K04m55j86o21k97n29K53L64
$$ -117 721 1031 949 505 326 -506 -699 -940 -860 -661 -28 552 854 1058 603 417 -204 -501 -1030 -777 -413
4094d13K20M08N34K48j30l50p54l11k29R9k3L86P38K46K73l76k0p02l75l98r9
$$ -413 -193 215 749 997 867 517 -237 -548 -777 -678 -701 -315 423 669 942 566 546 -156 -531 -929 -1028
4115a028M04L8O48M24K65J29k18p15m40j08k37q1M00M33O22L10K95m10n82m93
$$ -1028 -624 -586 62 486 751 880 662 -53 -493 -601 -838 -919 -519 -86 536 846 1141 731 149 -344
4135c44j51k77r8M21L26O43K20O7k46j98n56l17l24K54O8L97M62J81L25m2m20
$$ -344 -495 -772 -870 -449 -123 520 740 807 561 363 -193 -510 -834 -580 -512 -115 347 528 853 811 391
4156C91m82n80J5j18J22L22M92O59l8L0m20n01l53l89j45K07M32M84N49K20J6
$$ 391 -91 -671 -656 -774 -652 -330 162 821 783 813 393 -108 -461 -850 -995 -788 -356 128 677 897 913
4177I13l87m12k74m83j45m4L74N48N77L5M1Om03l60n56l02m7L19O61N44N98k30
$$ 913 526 114 -160 -643 -788 -832 -458 90 667 702 743 749 346 -14 -570 -872 -919 -600 61 605 1203 973
4199I73k79k78o66k15k38Lj49P60K39O4P46k89m05k02l31n74J13j27Q13J96K78
$$ 973 694 416 -250 -465 -703 -700 -849 -89 150 214 960 671 266 64 -267 -841 -728 -855 -42 154 432
4220D32L37j1r1o91k58n43j12N18k6N45M20M45l75o6k34p80k34l79K32L85M70
$$ 432 769 758 667 -24 -282 -825 -937 -419 -445 100 520 965 590 524 290 -490 -724 -1103 -871 -486 -16
4241a6M36K22L57k41m28m84l27j24LJ18K92M29L55K33k32k7q20j74l15j10J19
$$ -16 420 642 999 758 330 -154 -481 -605 -602 -484 -192 237 592 825 593 566 -254 -428 -743 -853 -734
4262g34L34M51O35J31Q1n63l71n00j58J24k96N81L21K91L14J93n3m97m24m59j04
$$ -734 -400 51 686 817 898 335 -36 -536 -694 -570 -866 -285 36 327 641 834 781 284 -140 -599 -703
4283g03K3L47K23K18L82k3J47m19k36l04l97O9J46L88M06M14J97j86n25l11m02
$$ -703 -680 -333 -110 108 490 467 614 195 -41 -345 -742 -673 -527 -139 267 681 878 692 167 -144 -546
4304e46j13j3J05N91R9l1O04j3j73l27l87m57j03L41J85L67K77M83Jn13O4r34
$$ -546 -659 -672 -567 24 123 92 696 683 510 183 -204 -661 -764 -423 -238 129 406 889 890 377 441 -493
4326d93l63L6L67l8O68P7O52j88k35l42o06k6n23K76K36K18O94M61j38j52k56
$$ -493 -856 -820 -453 -491 177 254 906 718 483 141 -465 -491 -1014 -738 -502 -284 410 871 733 581 325
4347C25o04l89l9nJ18L02N45N25K5r4k65n29j47m21j79L48K85M51J47L12O5l42
$$ 325 -279 -668 -707 -712 -594 -292 253 778 803 709 444 -85 -232 -653 -832 -484 -199 252 399 711 776 434
4369D34j78j99p26j24K8M92L33L10K08O9k02l36m08k95j29j11M98K2M89O15k42
$$ 434 256 57 -669 -793 -765 -273 60 370 578 647 445 109 -299 -594 -723 -834 -336 -314 175 790 548
4390E48m1j30o34p2l21k4o3R76l1N22L8k21k50k11m82k89n1K02L59M73J43J07
$$ 548 507 377 -257 -329 -650 -674 -737 239 208 730 768 547 297 86 -396 -685 -736 -534 -175 298 441 548
4412E48R1j15m64l49j52j23M59LJ56K68L95j58R5m36o85m10K59j47K05O85L73
$$ 548 639 524 60 -289 -441 -564 -105 -102 54 322 717 559 654 218 -467 -877 -618 -765 -560 125 498
4433D98K8K91n74j7o49k50J4j88M06M9Q11J38Q0j46j33l53n35m7J22q1K98M49
$$ 498 526 817 243 226 -423 -673 -659 -847 -441 -392 419 557 637 491 358 5 -530 -577 -455 -536 -238 211
4455B11K33M72l08l25k81k92o28M50O5K20O45J05K21j73j49j77p26r6k13L86J5
$$ 211 444 916 608 283 2 -290 -918 -468 -403 -183 462 567 788 615 466 289 -437 -533 -746 -360 -345
4476c45L96J71M10L16o27k54k99l44k15K3J45Q84K37Q8K1K54m66o75j74m54K11
$$ -345 51 222 632 948 321 67 -232 -576 -791 -768 -623 261 498 586 607 861 395 -280 -454 -908 -697
4497f97K62K95L82L15K24l02j13l73l44n45N56k33N19M03L71J36l48j13j53o20
$$ -697 -435 -140 242 557 781 479 366 -7 -351 -896 -340 -573 -54 349 720 856 508 395 242 -378
4517c78k72N3O6L42L47K50J37J64m41k47j67o17Q5qJ2P45K66L67o4m86J18m00
$$ -378 -650 -597 -531 -189 158 408 545 709 268 21 -146 -763 -678 -686 -674 71 337 704 640 154 272 -128
4539a28o99N0M7L73N48k0K52K73k55j96l89k23k4k00M2N61K15N7L25J90m78l41
$$ -128 -827 -777 -730 -357 191 171 423 696 441 245 -144 -367 -391 -591 -549 12 227 284 609 799 321 -20
4561b0j85m18OK63K12K78K49K28K8j01m46m55k7l23m2L48M86M73K85j9j97l62
$$ -20 -205 -623 -617 -354 -142 136 385 613 641 540 94 -361 -388 -711 -753 -405 81 554 839 820 623 261
4583B61m11m15j16m9K62L99L65L4M94l14k77p1p29J2j8k3N97J09K25K02K18n00
$$ 261 -150 -565 -681 -730 -468 -69 296 330 824 510 233 162 -567 -555 -573 -596 1 110 335 537 755 255
4605B55k87j41m17j16L16J21K51K75N74k17j58m26m68M5j45Q8K13L04M49K8k9
$$ 255 -32 -173 -590 -706 -390 -269 -18 257 831 614 456 30 -438 -393 -538 -450 -237 67 516 544 515
4626E15k59j62m93k91J21jK34L42rK90L92k35k16k77k85k00j09J59L56L41M84
$$ 515 256 94 -399 -690 -569 -570 -336 6 -3 287 679 444 228 -49 -334 -534 -643 -484 -128 213 697
4647F97k00k9J5m72k18p50L30J37K72L43K27L12q4k29p6m70j56j96j78L41L87
$$ 697 497 468 483 11 -207 -957 -627 -490 -218 125 352 664 580 351 275 -195 -351 -547 -725 -384 3
4668CL12K79K75m98k67k59o89J60J84J64L94L27J03Q5J09m22l56k72l09J00R9
$$ 3 315 594 869 371 104 -155 -844 -684 -500 -336 58 385 488 573 682 260 -96 -368 -677 -577 -478
4689d78M77J42M99l04J06m12K7n30R1N8k24M20K28L23L74k21k61k00n05p2n26
$$ -478 -1 141 640 336 442 30 57 -473 -382 -324 -548 -128 100 423 797 576 315 115 -390 -462 -988
4710i88N58L93K71j63M84k9k33l76j34k94k81L67J14J47M91L78j97l0J23o14k68
$$ -988 -430 -37 234 71 555 526 293 -83 -217 -511 -792 -425 -311 -164 327 705 508 478 601 -13 -281
4731b81l73K4K64K09L65J15N94n07K4m63r2m15k24J93L79M96K88r2j8J01n06m32
$$ -281 -654 -630 -366 -157 208 323 917 410 434 -29 -121 -536 -760 -567 -188 308 596 504 486 587 81 -351
4753c51l18J67k75L57M64M05j0M6o7m22k04k65k47L35J5M43L23M57rl85l13k05
$$ -351 -669 -502 -777 -420 44 449 439 485 418 -4 -208 -473 -720 -385 -370 73 396 853 844 459 146 -59
4775e9l38m22K69K38M31O7L69M7M1Q5p73m41m75K99K27M12R1M07K10P5l49k78
$$ -59 -397 -819 -550 -312 119 186 555 602 643 728 -45 -486 -961 -662 -435 -23 68 475 685 760 411 133
4797A33l89j59n02J14L23N26L44J03j5m6k61l48k69l45K23K91L79K18L78J5k58
$$ 133 -256 -415 -917 -803 -480 46 390 493 478 432 171 -177 -446 -791 -568 -277 102 320 698 713 455
4818D55k86j35n57j49J32n4K67P64o4L21l21q6l25m97j6Mj51O00L84N34Q8j22
$$ 455 169 34 -523 -672 -540 -594 -327 437 373 694 373 287 -38 -535 -551 -547 -698 -98 286 820 908 786
4840G86l99m20k07k58j84j9L34P53M88m18L20l79K8n84k94j78R6q8N12M59L50
$$ 786 387 -33 -240 -498 -682 -701 -367 386 874 456 776 397 425 -159 -453 -631 -535 -623 -111 348 698
4861F98m2j93k87l94j63l07M14q0J05N72L99q3k05k42n11j35k01O4j17M83N07
$$ 698 656 463 176 -218 -381 -688 -274 -354 -249 323 722 639 434 192 -319 -454 -655 -591 -708 -225 282
4882B82J94Jj9j36m03k38j84k06L99K93J60L12K7K55l45l23l08k66q6J94N4M89
$$ 282 476 477 458 322 -81 -319 -503 -709 -310 -17 143 455 482 737 392 69 -239 -505 -591 -397 -343 146
4904A46P1L77j03k15l4m96k17q2J2J21O19K96K04k88J83l84m14k13k36r1N19K03
$$ 146 217 594 491 276 242 -254 -471 -553 -541 -420 199 495 699 411 594 210 -204 -417 -653 -744 -225 -22
4926b2L66J79K22N2n83l79l44j91K68l9K54M61L51K35j46k11l61m05j56j50J98
$$ -22 344 523 745 797 214 -165 -509 -700 -432 -471 -217 244 595 830 684 473 112 -293 -449 -599 -401
4947d01K07K59N06j12J72j15l39l84l90O8N8N3N90J6N83j12l33P4k58m44l40K96
$$ -401 -194 65 571 459 631 516 177 -207 -597 -529 -471 -418 172 188 771 659 326 400 142 -302 -642 -346
4969c46J97R7L01M28mj50n8l42m86l04o9M19MP02r2K39Q1k22n69J18n44j45J73
$$ -346 -149 -52 249 677 673 523 465 123 -363 -667 -736 -317 -313 389 297 536 617 395 -174 -56 -600 -745 -572
4992e72K68P94O5J3J93l94j20n45m2m16R9L25K47L18L1M25j39j33m63m61k09M2
$$ -572 -304 490 555 568 761 367 247 -298 -340 -756 -657 -332 -85 233 264 689 550 417 -46 -507 -716 -674
5014f74J01O15J93J66L58l32j22j64n01k78K56l79M72L77M48K30k1m64k68m75
$$ -674 -573 42 235 401 759 427 305 141 -360 -638 -382 -761 -289 88 536 766 745 281 13 -462
5034d62k08j69L66J66L83N52j29L66k28m15n68l14j89J94K67L07O56J80l9k55
$$ -462 -670 -839 -473 -307 76 628 499 865 637 222 -346 -660 -849 -655 -388 -81 575 755 716 461
5054D61j98p22N4l83l0L99M74L26R1K01J45j31q86j38l08k18O49LM59K41K0M38
$$ 461 263 -459 -405 -788 -818 -419 55 381 472 673 818 687 -199 -337 -645 -863 -214 -211 248 489 509 947
5076I47m62m91m03j66j49J97M51K86J51L49J3k37k52l52n95O8k00N17L91J07M31
$$ 947 485 -6 -409 -575 -724 -527 -76 210 361 710 723 486 234 -118 -713 -645 -845 -328 63 170 601
5097F01K10m19j70l50k21m48J09K56M26K05N78j9k15k58l25m39k94R0N03M8K79
$$ 601 811 392 222 -128 -349 -797 -688 -432 -6 199 777 758 543 285 -40 -479 -773 -683 -180 -132 147
5118A47M85O2J10m97l74Nl29j61J62l7L96L52L99J6l79k83l56l08j10K60K01M21
$$ 147 632 694 804 307 -67 -62 -391 -552 -390 -427 -31 321 720 736 357 74 -282 -590 -700 -440 -239 182
5140A82J92K24K48j41n62k38l46j44n0K14M65J53O21j71j80j92l79n49K04r7q8
$$ 182 374 598 846 705 143 -95 -441 -585 -635 -421 44 197 818 647 467 275 -104 -653 -449 -546 -634
5161f34L39L25M70L87l12k49k47l42l36P7Q7K91K92K24M61k32k78j35j97n52j06
$$ -634 -295 30 500 887 575 326 79 -263 -599 -522 -435 -144 148 372 833 601 323 188 -9 -561 -667
5182f67L24j15N50M69N6J08m39n0n25k97M7j04K70M4N52L92J49j44m83n9o94p3
$$ -667 -343 -458 92 561 617 725 286 236 -289 -586 -539 -643 -373 -329 223 615 764 620 137 78 -616 -689
5204f89R3J39L95J22O72j18O7n82j65l72j49j30J54L20J76P78l10K64j03m78n31
$$ -689 -596 -457 -62 60 732 614 681 99 -66 -438 -587 -717 -563 -243 -67 711 401 665 562 84 -447
5225d47m25K14J01M59J38J30N49r7n01K62m81l31l12J25K92L57N20o8K86j26n99
$$ -447 -872 -658 -557 -98 40 170 719 622 121 383 -98 -429 -741 -616 -324 33 553 485 771 645 46
5246D6M4n13l4jj87N85K38K53K39J13k27m62m40k12j41J06M03J52O75j03M5k14
$$ 46 90 -423 -457 -458 -645 -60 178 431 670 783 556 94 -346 -558 -699 -593 -190 -38 637 534 579 365
5268C65m79j78l15o4L17J56K45L70L72l74K09m35m94k33k12J65K00K05M72K27
$$ 365 -114 -292 -607 -671 -354 -198 47 417 789 415 624 189 -305 -538 -750 -585 -385 -180 292 519
5288E19R1k2n54k32k22l03P6J43L22K16P92l20M2k02k27m15n25K82N2L42K43J83
$$ 519 610 588 34 -198 -420 -723 -647 -504 -182 34 826 506 548 346 119 -296 -821 -539 -487 -145 98 281
5310B81M03j47n04r0k63l02J89kJ79L83K64M21j56k11k14o05m3p1j9J15O08J73
$$ 281 684 537 33 -57 -320 -622 -433 -435 -256 127 391 812 656 445 231 -374 -417 -488 -507 -392 216 389
5332C89L65j56R5n52r0l69k96n2J44N68M51P6J60n1m03m41k63j23p9J64L30J9
$$ 389 754 598 693 141 51 -318 -614 -666 -522 46 497 573 733 682 279 -162 -425 -548 -627 -463 -133 -114
5354a14M41K81k02P7m26m26j91j05J87K87M18K65J30J24k24j51o85p7m99J83M83
$$ -114 327 608 406 483 57 -369 -560 -665 -478 -191 227 492 622 746 522 371 -314 -391 -890 -707 -224
5375b24%P14j33L8K28j66l34n34r6J3L54O6M54m9L33n10K95m17l99l44J37K0K39
$$ -224 -224 490 357 395 623 457 123 -411 -507 -494 -140 -74 380 331 664 154 449 32 -367 -711 -574 -554 -315
5398c15M99J36L69j00k24m10m51k7O5k90N20L72J33L46Q1k87j85o20k42j19K96
$$ -315 184 320 689 589 365 -45 -496 -523 -458 -748 -228 144 277 623 704 417 232 -388 -630 -749 -453
5419d53K01K13M76O3J9j10r7o31l79J41O4J65n1O37L74J54k49j05l12n91k31q8
$$ -453 -252 -39 437 500 519 409 312 -319 -698 -557 -493 -328 -379 258 632 786 537 432 120 -471 -702 -790
5441g90L49K07J77L97K99k48Q8o47l41j14M9l3L50M27M36M2j04j96m1o41j45k16
$$ -790 -441 -234 -57 340 639 391 479 -168 -509 -623 -574 -607 -257 170 606 648 544 348 307 -334 -479 -695
5463f95p4P41j8L32K88M0k26l52P8l61k61n3J56O34R1Q0J50k0j54m09l25P8m6
$$ -695 -769 -28 -46 286 574 614 388 36 114 -247 -508 -561 -405 229 320 400 550 530 376 -33 -358 -280 -326
5486c26J1J28M05l9M58l5k89j00m34k36j33K44j74M82N42l4j69q3J30n81k76j6
$$ -326 -315 -187 218 179 637 602 313 213 -221 -457 -590 -346 -520 -38 504 470 301 218 348 -233 -509 -525
5508e25O0L85J49K86K91j18l46J57n45o7l91K12K92K30Q7L46m2J31m7l40l50l93
$$ -525 -465 -80 69 355 646 528 182 339 -206 -273 -664 -452 -160 70 157 503 461 592 545 205 -145 -538
5530e38K95j80K88M42J03j01M21j98m51m34J27n17P3M18J20K30L97Lk35j68n85
$$ -538 -243 -423 -135 307 410 309 730 532 81 -353 -226 -743 -670 -252 -132 98 495 498 263 95 -490
5551d90P9l05K90N55O1K78m38M82j81k74k60j45l88L66o9L25K95L86j6j91q6l47
$$ -490 -411 -716 -426 129 190 468 30 512 331 57 -203 -348 -736 -370 -439 -114 181 567 551 360 274 -73
5573g3k59j95Q7L06R1L77k9M4Q7k06k38o8m28M7K14K52R3K56J91k39Q6j90l38
$$ -73 -332 -527 -440 -134 -43 334 305 349 436 230 -8 -76 -504 -457 -243 9 102 358 549 310 396 206 -132
5596a32p02K74L67qJ01L43J5K68k12l83q2p7j45R1Q4K60L21J70q4m07J96m74J03
$$ -132 -834 -560 -193 -201 -100 243 258 526 314 -69 -151 -228 -373 -282 -198 62 383 553 469 62 258 -216 -113
5619a13m48M71j83J31J5N23o0J25k29k44j79l93K81j80L60J79M35J24l94o1p4
$$ -113 -561 -90 -273 -142 -127 396 336 461 232 -12 -191 -584 -303 -483 -123 56 491 615 221 160 86
5640H6k04l51m8M76l59N30J49J57j3k32Pl41l05K6j25L85J05M33n6M7j05k27j7
$$ 86 -118 -469 -517 -41 -400 130 279 436 423 191 198 -143 -448 -422 -547 -162 -57 376 320 367 262 35 18
5663A8m76l49N64J1J40K39K97j02K3k08k42m08J10j71N38J5K28R7L44j41k98j90
$$ 18 -458 -807 -243 -232 -92 147 444 342 365 157 -85 -493 -383 -554 -16 -1 227 324 668 527 229 39
5685C9m7m07l3O9J2O57J7K35p3k60j39j90J2k12J60k03L46L52K08l60o0j28j80
$$ 39 -8 -415 -448 -379 -367 290 307 542 469 209 70 -120 -108 -320 -160 -363 -17 335 543 183 123 -5 -185
5708a85P2j30k90L69K01J89K24j03O5l01j79k95L3n5oL85J72K77p8j08r3l25K2
$$ -185 -113 -243 -533 -164 37 226 450 347 412 111 -68 -363 -330 -385 -391 -6 166 443 365 257 164 -161 -139
5731a39j46m61L74K22L19NK66M6p3l84rn19OL08k06L46K65N7K05k00j50j22m71
$$ -139 -285 -746 -372 -150 169 174 440 486 413 29 20 -499 -493 -185 -391 -45 220 277 482 282 132 10 -461
5754d61L23m8J13pL11j40L49m14P4j98k28k20L8K38L17NK30N9K39k75p6l60m62
$$ -461 -138 -186 -73 -80 231 91 440 26 100 -98 -326 -546 -508 -270 47 52 282 341 580 305 229 -131 -593
5777e93K00j37M66K22J88K49k87j23j0m24j94J98rJ23J84j8M01p3Ml12m0l95J91
$$ -593 -393 -530 -64 158 346 595 308 185 175 -249 -443 -245 -254 -131 53 35 436 363 367 55 15 -380 -189
5800a89k01J38M77k2J47K84m30j61J58m97k99R3J52K46K14Q1J69k7j56k97j63
$$ -189 -390 -252 225 203 350 634 204 43 201 -296 -595 -502 -350 -104 110 191 360 333 177 -120 -283
5821b83j52j03L34J31j6O85k52k7L3k77m52J07q5j56N8O82J99j44K21k29l75j64
$$ -283 -435 -538 -204 -73 -89 596 344 317 350 73 -379 -272 -357 -513 -455 227 426 282 503 274 -101 -265
5843b65k5k78M42l25L48N46P3m01J67J5l28l04l8nJ53N89r4kM46m54n38L40o27
$$ -265 -290 -568 -126 -451 -103 443 516 115 282 297 -31 -335 -373 -378 -225 364 270 268 714 260 -278 62 -565
5866e65O9J06J86J06L80K74l22K91l95j24m23j43K47j48M93KK49L00k93j50J7
$$ -565 -496 -390 -204 -98 282 556 234 525 130 6 -417 -560 -313 -461 32 34 283 583 290 140 157
5887A57m67j87o6L69r8N51R8Pl5qk38k37o1j54r8K47J47L82K33r4m6j19j61o36
$$ 157 -310 -497 -563 -194 -292 259 357 364 329 321 83 -154 -215 -369 -467 -220 -73 309 542 448 402 283 122 -514
5911e14k5K70j93J90O63j74M86Q8p02o3m48J65l19P2K99K63L62L06n01R8j46m70
$$ -514 -539 -269 -462 -272 391 217 703 791 89 26 -422 -257 -576 -504 -205 58 420 726 225 323 177 -293
5933b93M2j70J67L7K73J36K58N0k40m1l07l65Jk07M39L60K16K46k21Jm73l3l91
$$ -293 -251 -421 -254 -217 56 192 450 500 260 219 -88 -453 -452 -659 -220 140 356 602 381 382 -91 -124 -515
5956e15J49l2J53J59M38n7K04n9l37p1p4n01K48J07J6J18J24M41J33l95k28k80
$$ -515 -366 -398 -245 -86 352 295 499 440 103 32 -42 -543 -295 -188 -172 -54 70 511 644 249 21 -259
5978b59q6K45q1k7K54K53O9K53m69j85Jl06j25K31j1J30J08L36l6N0j55m14j56
$$ -259 -345 -100 -181 -208 46 299 368 621 152 -33 -32 -338 -463 -232 -243 -113 -5 331 295 345 190 -224 -380
6001c80J0m52M02O29N5L3L05k56p2j10l15k56n5j32K94N18K56j07O8k01m99K9
$$ -380 -370 -822 -420 209 264 297 602 346 274 164 -151 -407 -462 -594 -300 218 474 367 435 234 -265 -236
6023b36k61J37p4K76L37K81PQ5j33n06j92m1k08K65o3M34l2M19m2j40l69k00j04
$$ -236 -497 -360 -434 -158 179 460 467 552 419 -87 -279 -320 -528 -263 -326 108 76 495 453 313 -56 -256 -360
6046c60j57K66M5J40K80M50K1j65n09j3l10l20K44k29M84L06L36P3J0l86l08j48
$$ -360 -517 -251 -206 -66 214 664 685 520 11 -2 -312 -632 -388 -617 -133 173 509 582 592 206 -102 -250
6068b50m09L02k99O31L08Q5P5L9k71l17j17r8L2k14M36K10L48j67M4K91l48n83
$$ -250 -659 -357 -656 -25 283 368 443 482 211 -106 -223 -321 -289 -503 -67 143 491 324 368 659 311 -272
6090b72r6l52L32J18M02Q5L19n5n6l70k80k5k33l2N7N2N92J94K60l47j56n4n47
$$ -272 -368 -720 -388 -270 132 217 536 481 425 55 -225 -250 -483 -515 -458 -406 186 380 640 293 137 83 -464
6113d64p1k4L02J23M05J46k0p9k22k03l69j08R8J16K92J18J57K38j33O4l30k05
$$ -464 -535 -559 -257 -134 271 417 397 318 96 -107 -476 -584 -486 -370 -78 40 197 435 302 366 36 -169
6135a69l25K86l30L64J21L42J12L15k88k19l80l32o6q2K17O15K51J70j95j22j
$$ -169 -494 -208 -538 -174 -53 289 401 716 428 209 -171 -503 -569 -651 -434 181 432 602 407 285 284
6156B84k41m92L11m76q1N04O00j6K93l60O9k13p45K1j30J65J65L69L34K18j7k79
$$ 284 43 -449 -138 -614 -695 -191 409 393 686 326 395 182 -563 -542 -672 -507 -342 27 361 579 562 283
6178B83k3m80k72J03j21M93j49M89J57n0j4l02p0m76j82N2L19L33qJ66M27j85
$$ 283 260 -220 -492 -389 -510 -17 -166 323 480 430 416 114 44 -432 -614 -562 -243 90 82 248 675 490
6200D90k49m91J20n40O5J13N54K09pJ43M15l23n44p1m94j5J21O11K53L35m59K77
$$ 490 241 -250 -130 -670 -605 -492 62 271 264 407 822 499 -45 -116 -610 -625 -504 107 360 695 236 513
6222E13j98k79j76j98k75K84L10J47J60P0J96k80j51m08j21m95J44M13J59M06
$$ 513 315 36 -140 -338 -613 -329 -19 128 288 358 554 274 123 -285 -406 -901 -757 -344 -185 221
6242B21J97L07k26j68m01k06k18J48R1M16Q9L49K90m24k02k77l34j10k62K42M01
$$ 221 418 725 499 331 -70 -276 -494 -346 -255 161 250 599 889 465 263 -14 -348 -458 -720 -478 -77
6263g7J99K8L70m9K8l84l92k60nP8J07N20J19L65n6k16r1n01l60l6k00N36L60
$$ -77 122 150 520 471 499 115 -277 -537 -542 -464 -357 163 282 647 591 375 284 -217 -577 -613 -813 -277 83
6286H3L05J9K24l11q1m8o45k29nJ67K55L89M22J54l14k42j37n18j34j38J14K42
$$ 83 388 407 631 320 239 191 -454 -683 -688 -521 -266 123 545 699 385 143 6 -512 -646 -784 -670 -428
6308d28N45L67K62m71J60k97m50k73j9R9K99K40M05J55Q2k33l98j01m68K74j50
$$ -428 117 484 746 275 435 138 -312 -585 -604 -505 -206 34 439 594 676 443 45 -56 -524 -250 -400
6329d00j1K72M50P2l7R7l91j73k68q3q4K27L46K54J94J2J69m93k12l64l1j24j30
$$ -400 -411 -139 311 383 346 443 52 -121 -389 -472 -556 -329 17 271 465 477 646 153 -59 -423 -454 -578 -708
6352g08M45M24N27j03p8j48l10n12o3j5O7K58L55m2O80o7k69j79k13l94k88k00
$$ -708 -263 161 688 585 507 359 49 -463 -526 -541 -474 -216 139 97 777 710 441 262 49 -345 -633 -833
6374h33L73N20L66J31%k60j87l22l31M8n6k6L50L41L27j70M44m63l26k18J7k91
$$ -833 -460 60 426 557 557 297 110 -212 -543 -495 -551 -577 -227 114 441 271 715 252 -74 -292 -275 -566
6396e66P2M89L18j25L43j89K32n99l08k02N8J00K29L12J16j15K86J49o52r7l37
$$ -566 -494 -5 313 188 531 342 574 -25 -333 -535 -477 -377 -148 164 280 165 451 600 -52 -149 -486
6417d86j59L30J21K31L94J41p2k80k16l51j96j78M52l28O22K46L40j12l50l26
$$ -486 -645 -315 -194 37 431 572 500 220 4 -347 -543 -721 -269 -597 25 271 611 499 149 -177
6437a77J43l99j23J29N3L46M61k18L56j01k81j36m52m75M34J19L51l7K78K97p5
$$ -177 -34 -433 -556 -427 -374 -28 433 215 571 470 189 53 -399 -874 -440 -321 30 -7 271 568 493
6458D93j43j33k44m84o9K44K40O0M30J85l75L5L1l60n33K3j6M06L60Q9K58O5q9
$$ 493 350 217 -27 -511 -580 -336 -96 -36 394 579 204 239 270 -90 -623 -600 -616 -210 150 239 497 562 473
6481D73m42m98n2l18L21K45J87K50K72J28k26j90q5n49j06j29R5M91M86N6K13
$$ 473 31 -467 -519 -837 -516 -271 -84 166 438 566 340 150 65 -484 -590 -719 -624 -133 353 409 622
6502F22o0m27j90k20o6l53J47K14M85Q1L94k43j3j95k74j31m4J22q2K07L73K58
$$ 622 562 135 -55 -275 -341 -694 -547 -333 152 233 627 384 371 176 -98 -229 -273 -151 -233 -26 347 605
6524F05o9j4m21l88l51J46q4K42M93J30L4N5N4r9m06n88M71l46o4M92J40O37l75
$$ 605 536 522 101 -287 -638 -492 -576 -334 159 289 323 378 432 333 -73 -661 -190 -536 -600 -108 32 669 294
6547B94qk59J9n33J00k3k3K54L55K04K68J53n41p3l64m63mL18J80L33J2M64l84
$$ 294 286 27 46 -487 -387 -410 -433 -179 176 380 648 801 260 187 -177 -640 -644 -326 -146 187 199 663 279
6570B79J39k74m29k14k9j68M77M84mL76r2l07j48k50l11k19K06L14J40J77K66
$$ 279 418 144 -285 -499 -528 -696 -219 265 261 637 545 238 90 -160 -471 -690 -484 -170 -30 147 413
6591D13Q0j74j28k28l69k32r5L16J89M91J75Q0J85m70r1k87k62j47J61J67N13
$$ 413 493 319 191 -37 -406 -638 -733 -417 -228 263 438 518 703 233 142 -145 -407 -554 -393 -226 287
6612B87j60M97k54nn11o4k21O6j5K1L88N72n2O9k08l60l37k96J95P8m7L75J93
$$ 287 127 624 370 365 -146 -210 -431 -365 -380 -359 29 601 549 618 410 50 -287 -583 -388 -310 -357 18 211
6635B11J52K18ml08m71p0p7m47N44J91O13k20J76O9k75j2o48q4J20P6P7N3O03
$$ 211 363 581 577 269 -202 -272 -349 -796 -252 -61 552 332 508 577 302 290 -358 -442 -322 -246 -169 -116 487
6658D87oJ04j96k96l44j49J05kj80L42M11J30O3q4m13k44k24O2L8N7L00M18p8
$$ 487 481 585 389 93 -251 -400 -295 -297 -477 -135 276 406 469 385 -28 -272 -496 -434 -396 -339 -39 379 301
6681C01J31K8j56m85m0m97k3N05J61M09J16P1r8l57k32j80k08K46K2p4N77K34
$$ 301 432 460 304 -181 -221 -718 -741 -236 -75 334 450 521 423 66 -166 -346 -554 -308 -286 -360 217 451
6703D51J92r4k09j71m30l93K41Q4K29J04K70J10o4J6l69o7k19k76N6N30N5L52
$$ 451 643 549 340 169 -261 -654 -413 -329 -100 4 274 384 320 336 -33 -100 -319 -595 -539 -9 46 398
6725C98K31J85j98l73l14k33k23K97j80L37L88K32j18Q7m5m96l00j53O0K43j84
$$ 398 629 814 616 243 -71 -304 -527 -230 -410 -73 315 547 429 516 471 -25 -325 -478 -418 -175 -359
6746c59O11R4L34j3m63k81k77p4j88M20p0O37q0K97K44m10l52m70j4l29K9L20
$$ -359 252 346 680 667 204 -77 -354 -428 -616 -196 -266 371 291 588 832 422 70 -400 -414 -743 -714 -394
6768c94L16M87J92o5j70k65k57l21q4Q8J11M96J77OL50k15j80m01k30j52P1J14
$$ -394 -78 409 601 536 366 101 -156 -477 -561 -473 -362 134 311 317 667 452 272 -129 -359 -511 -440 -326
6790c26J92L61J20L28j67l40k82l75j81J38J29J00N33J28K52m4l87o0m62p8j66
$$ -326 -134 227 347 675 508 168 -114 -489 -670 -532 -403 -303 230 358 610 566 179 119 -343 -421 -587
6811e87J46j24O49K73J72K33l84j43o22j34Q2j86L91K76mM72J21j14j96o09j87
$$ -587 -441 -565 84 357 529 762 378 235 -387 -521 -439 -625 -234 42 38 510 631 517 321 -288 -475
6832d75j45rL79K24M74M6J10j20j69k15m28q0j05M8J93K88K43M92o03J30j77k78
$$ -475 -620 -629 -250 -26 448 494 604 484 315 100 -328 -408 -513 -465 -272 16 259 751 148 278 101 -177
6854a77k79n9k28O53J29K79L17Q8l31j80n26p5J76j60N8L55Q9J93M15j78j96o01
$$ -177 -456 -515 -743 -90 39 318 635 723 392 212 -314 -389 -213 -373 -315 40 129 322 737 559 363 -238
6876b38m11K88R3j2J04N42K51j53J97n05j66j48m33J91L7L55N8M81k51J14j14
$$ -238 -649 -361 -268 -280 -176 366 617 464 661 156 -10 -158 -591 -400 -363 -8 50 531 280 394 280
6897B80l75l09J4j03J21K32L15l3J45L12j57l34m22M9n7R4o5N50J16M5k06K57
$$ 280 -95 -404 -390 -493 -372 -140 175 142 287 599 442 108 -314 -265 -322 -228 -293 257 373 418 212 469
6919D69m52k25R6n79K32K43L03J41M07j89l1k41l07k63j62l1L47J20L62M29j81
$$ 469 17 -208 -112 -691 -459 -216 87 228 635 446 415 174 -133 -396 -558 -589 -242 -122 240 669 488
6940D88q8k87k40j67j61j15p3N57J08K84K29M3n41L07m13l47k08J82M46nO40m3
$$ 488 400 113 -127 -294 -455 -570 -643 -86 22 306 535 578 37 344 -69 -416 -624 -442 4 -1 639 596
6962E96k38J53l42l24k14o3j6k3N46K40J74J0k02j77j63k18l59K10mM88R2N85
$$ 596 358 511 169 -155 -369 -432 -448 -471 75 315 489 499 297 120 -43 -261 -620 -410 -414 74 166 751
6984G51r2k45k46l32k00j04j54K98K04L42K20L0K31k05m94n51j7L4j0P13j39O28
$$ 751 659 414 168 -164 -364 -468 -622 -324 -120 222 442 472 703 498 4 -547 -564 -530 -540 173 34 662
7006F62j47k81K64n66k18l72M9K24L06J36J36j4L71m66q2l78j70P8m4J97K44J74
$$ 662 515 234 498 -68 -286 -658 -609 -385 -79 57 193 179 550 84 2 -376 -546 -468 -512 -315 -71 103
7028A03L71J67l11j70n3n05L7j95K10M49J32K41J13k20n27J15m25p4l3L23M78
$$ 103 474 641 330 160 107 -398 -361 -556 -346 103 235 476 589 369 -158 -43 -468 -542 -575 -252 226
7049B26k77M13J56m5k26l53M5n00J12L70r1J09L08K45n5J55k99o82j47P1R9j6
$$ 226 -51 362 518 473 247 -106 -61 -561 -449 -79 -170 -61 247 492 437 592 293 -389 -536 -465 -366 -382
7071c82M20n8P16M2l12k23k79l29j65K50NL61j4K63N4K2K5n38l5l73J07K48j94
$$ -382 38 -20 696 738 426 203 -76 -405 -570 -320 -315 46 32 295 349 371 396 -142 -177 -550 -443 -195 -389
7094c89L81J57K88J23k27l27k11m29J98k5M03P5K45K32l2j43n13o0k44J95j7P5
$$ -389 -8 149 437 560 333 6 -205 -634 -436 -461 -58 17 262 494 462 319 -194 -254 -498 -303 -320 -245
7116b45L00J83L60l16J31k30n2k74k20j50O6J31P50J89k80J65m32m1k53l70n9
$$ -245 55 238 598 282 413 183 131 -143 -363 -513 -447 -316 434 623 343 508 76 35 -218 -588 -647
7137f47L86O1J27M66J82k69m31Q2l40m1j0p6K19L63L42N2M1R2l92l88k64k78Q6
$$ -647 -261 -200 -73 393 575 306 -125 -43 -383 -424 -434 -510 -291 72 414 466 507 599 207 -181 -445 -723 -637
7160f37O68K41j31J71K83m80j44j48k20n8j40K82M35J36J75K51k57m09m0k79J49
$$ -637 31 272 141 312 595 115 -29 -177 -397 -455 -595 -313 122 258 433 684 427 18 -22 -301 -152
7181a52l00J36L46L53J38k2j71j04l37o6k37l15L88M08J12M13j05q3l82j39j80
$$ -152 -452 -316 30 383 521 499 328 224 -113 -179 -416 -731 -343 65 177 590 485 402 20 -119 -299
7202b99k3o0Q3J80J88J35K80O2j73l44n33J28m2J87n8K62O39m1R0k52p69L05k79
$$ -299 -322 -382 -299 -119 69 204 484 546 373 29 -504 -376 -418 -231 -289 -27 612 571 661 409 -360 -55 -334
7225c34k06K40m6L78J80K79o0j33k18m32J05k77L1L62Q0K03R2K98o6l81M6n41
$$ -334 -540 -300 -346 32 212 491 431 298 80 -352 -247 -524 -493 -131 -51 152 244 542 476 95 141 -400
7247d00j08N1K62J66m6M58J90k49j87J59n62j2Q0j55L35J42P2J29L7ok35m08k66
$$ -400 -508 -457 -195 -29 -75 383 573 324 137 296 -266 -278 -198 -353 -18 124 196 325 362 356 121 -287 -553
7270e53J62k11L20J37M24L8K78j78j34n11J53l40k34L37N58K00n3J2j76l33Nl59
$$ -553 -391 -602 -282 -145 279 317 595 417 283 -228 -75 -415 -649 -312 246 446 393 405 229 -104 -99 -458
7292d58J51k03K06J71N41j10l4J63q0p1m53j02m7N8J55L08o0J38K02n6n84M2l5
$$ -458 -307 -510 -304 -133 408 298 264 427 347 276 -177 -279 -326 -268 -113 195 135 273 475 419 -165 -123 -158
7315a58l29J31J70K55L76J77L3k05l01m6o10j67J94J22K04M89J35j91m2L6m90
$$ -158 -487 -356 -186 69 445 622 655 450 149 103 -507 -674 -480 -358 -154 335 470 279 237 273 -217
7336b17k8j82K6j40L97K95K9N63m75k74R4m66l12K63J04J69L21O0N26j93j22l75
$$ -217 -245 -427 -401 -541 -144 151 180 743 268 -6 88 -378 -690 -427 -323 -154 167 227 753 560 438 63
7358F3n10K99j71Q5Q5L53M1L0K39J0m85k51k71j15k1M91QL95k39L02l50J03r6
$$ 63 -447 -148 -319 -234 -149 204 245 275 514 524 39 -212 -483 -598 -619 -128 -120 275 36 338 -12 91 -5
7381ek40j16k14N64N0K15K14o9j75k55J5l06J9k05J87L66j37N52k96Q1J55j89
$$ -5 -245 -361 -575 -11 39 254 468 399 224 -31 -16 -322 -303 -508 -321 45 -92 460 164 245 400 211
7403B11k57j62j71L9MM38J31K02j69N4n76K16m93J02J48K17j43M24J03K33l11
$$ 211 -46 -208 -379 -340 -336 102 233 435 266 320 -256 -40 -533 -431 -283 -66 -209 215 318 551 240
7424B40l22j11p8n3l94L99L10J88L34k17M0j21m58K03k89j05K18K17J5M34R0n7
$$ 240 -82 -193 -271 -324 -718 -319 -9 179 513 296 336 215 -243 -40 -329 -434 -216 1 16 450 540 483
7446D83m73k2j98j72j5K68k58M64J96K65l50Q1k77j63k45j68J56J00N39m6L33
$$ 483 10 -12 -210 -382 -397 -129 -387 77 273 538 188 269 -8 -171 -416 -584 -428 -328 211 165 498
7467D98n8K7k43l33k07q7p0K52K08L75Ln4J69n24L4k41n2l06K64N83O4O9l7rk18
$$ 498 440 467 224 -109 -316 -403 -473 -221 -13 362 365 311 480 -44 -10 -251 -303 -609 -345 238 302 371 334 325 107
7492A07n1r9n03j37Q9M50K34r1M83N9m10j79k78M0J7k45M29N04j81P7J99j46l53
$$ 107 56 -43 -546 -683 -594 -144 90 -1 482 541 131 -48 -326 -286 -269 -514 -85 419 238 315 514 368 15
7515A5j07k41J72l24J62N67R6J73j00l1k66k3o38N5K86rJ90J75J76L8j46j03l00
$$ 15 -92 -333 -161 -485 -323 244 340 513 413 382 116 93 -545 -490 -204 -213 -23 152 328 366 220 117 -183
7538a83L5Q2o3o1k65L19M64j9n0N9l92Mm36J72K5K14j5N46P5l09K45k35n06Q3
$$ -183 -148 -66 -129 -190 -455 -136 328 309 259 318 -74 -70 -506 -334 -309 -95 -110 436 511 202 447 212 -294 -211
7562b11j27J71mL14m3M48M8l09j96k5k90k15J59M02Q6J42j29N8J82j15j87m42
$$ -211 -338 -167 -171 143 100 548 596 287 91 66 -224 -439 -280 122 208 350 221 279 461 346 159 -283
7584b83J32k11K66L29J35O8p2j4m42j7j34N6l77L46K19r2K83l2q8K13l24j51j07
$$ -283 -151 -362 -96 233 368 436 364 350 -92 -109 -243 -187 -564 -218 1 -91 192 160 72 285 -39 -190 -297
7607b97o4p1K09L10J35L15l19j65j67J63o07L74k91L54L1L86o9L04j23m64j1j10
$$ -297 -361 -432 -223 87 222 537 218 53 -114 49 -558 -184 -475 -121 -90 296 227 531 408 -56 -67 -177
7629a77j9j3J41j16M25K52q1K4k76j96n9l49P5J48j9J52L62K9N0k0m87Q2p2l45
$$ -177 -196 -209 -68 -184 241 493 412 436 160 -36 -95 -444 -369 -221 -240 -88 274 303 353 333 -154 -72 -144 -489
7653d89L86O1J21M6Q8J43j36l1o21J04J8j77l1O13lL97j95m0l62K23m38K36m50
$$ -489 -103 -42 79 125 213 356 220 189 -432 -328 -310 -487 -518 95 92 489 294 254 -108 115 -323 -87 -537
7676e37N45K2j71L58L2j1k35n6J4k29R9p5J49L90L0nj54k77J54l32K60m38L24
$$ -537 8 30 -141 217 249 238 3 -53 -39 -268 -169 -244 -95 295 325 320 166 -111 43 -289 -29 -467 -143
7699a43J63M4r5M35Ol32j15n2j56k25K89Q8K98m7M8k6J84o01q8K6J19j27L04l4
$$ -143 20 64 -31 404 410 78 -37 -89 -245 -470 -181 -93 205 158 206 180 364 -237 -325 -299 -180 -307 -3 -37
7723c7L35j41J87j86k92L17o49K82Pr0L5M25K24Om75J58j18N7j27j61l7m6N22
$$ -37 298 157 344 158 -134 183 -466 -184 -177 -267 -232 193 417 423 -52 106 -12 45 -82 -243 -280 -326 196
7746A96R2m6j33j05N2m81J84J55j53J38J37q9L10N1j55j76k05l36L68J47j15n7
$$ 196 288 242 109 4 56 -425 -241 -86 -239 -101 36 -53 257 308 153 -23 -228 -564 -196 -49 -164 -221
7768b21L67J59Jj04k48q6k27L00j18J74j92K73M15j56l2j55j04j92j44j15J78
$$ -221 146 305 306 202 -46 -132 -359 -59 -177 -3 -195 78 493 337 305 150 46 -146 -290 -405 -227
7789b27J52K87k4m3K24m37j12P5M1k32Q5K19k7K69j02j42N2K45n18K02j46R1R3
$$ -227 -75 212 188 145 369 -68 -180 -105 -64 -296 -211 8 -19 250 148 6 58 303 -215 -13 -159 -68 25
7812B5PL91k82J82l0n06J19j45J64k07jM10J37j96K12k90Nm0j83J01k11k9N32
$$ 25 32 423 141 323 293 -213 -94 -239 -75 -282 -283 127 264 68 280 -10 -5 -45 -228 -127 -338 -367 165
7835A65mK02p2O8j02m20J10k23K66R2j21n9J71N4J11j67K39m11o0j28Q0L43r5
$$ 165 161 363 291 359 257 -163 -53 -276 -10 82 -39 -98 73 127 238 71 310 -101 -161 -289 -209 134 39
7858C9lM64m22k24J84l53K2J84j25L3nN89r3j98K8j38o1j61J3N5Q9K89N7j34J87
$$ 39 36 500 78 -146 38 -315 -293 -109 -234 -201 -206 383 290 92 120 -18 -79 -240 -227 -172 -83 206 263 129 316
7883C16j65O9l67L52l54j23J94M5K64j05q9K75j16l02j94J84k74L54J36o8J22
$$ 316 151 220 -147 205 -149 -272 -78 -33 231 126 37 312 196 -106 -300 -116 -390 -36 100 32 154
7904A54OJ70j33j73l04K75k04K01J05k39M06j71J02M5k82k31P0n2p8L46J17J58
$$ 154 160 330 197 24 -280 -5 -209 -8 97 -142 264 93 195 240 -42 -273 -203 -255 -333 13 130 288
7926B88m8pj25m5k79J4L89m24L54m64M16J56M5j37k46k00M84m91m2J26L56j01
$$ 288 240 233 108 63 -216 -202 187 -237 117 -347 69 225 270 133 -113 -313 171 -320 -362 -236 120 19
7948A9J33k03K50k89j97K74k83J87j65L89J84k68k3L58k73m29J05N6J98O5j81
$$ 19 152 -51 199 -90 -287 -13 -296 -109 -274 115 299 31 8 366 93 -336 -231 -175 23 88 -93
7969i3Q4R5K88j01J00l59j59j99L73Kj79K73r8J99J03k47k62R8m3O0jq9J03R5
$$ -93 -9 86 374 273 373 14 -145 -344 29 31 -148 125 27 226 329 82 -180 -82 -125 -65 -66 -155 -52 43
7993D3M41l90K31j01m71J19m2j32J48J82l9J70J42j98k5k05J21j77K10j06L8K90
$$ 43 484 94 325 224 -247 -128 -170 -302 -154 28 -11 159 301 103 78 -127 -6 -183 27 -79 -41 249
8015B49K54l88Rjj10j36p6J10l29M48J19M01k84j32r8J45m47J8Q4L64l48K25O3
$$ 249 503 115 124 123 13 -123 -199 -89 -418 30 149 550 266 134 36 181 -266 -248 -164 200 -148 77 140
8038A40N6rj6k19J5J33j18k27L36k5J73j55j78L01k72o3K00l26J62R0J21p3L80
$$ 140 196 187 171 -48 -33 100 -18 -245 91 66 239 84 -94 207 -65 -128 72 -254 -92 -2 119 46 426
8061D26n39L12j64L5m08K3mJ96L21L1n4j89L07l4m55J01k06j6J97j98L76PK48
$$ 426 -113 199 35 70 -338 -315 -319 -123 198 229 175 -14 293 259 -196 -95 -301 -317 -120 -318 58 65 313
8084C13k33L8m42K05j41k7K01J3Q8L32j37m9N0k16J8n61J06K61j9J29J73o6K86
$$ 313 80 118 -324 -119 -260 -287 -86 -73 15 347 210 161 211 -5 13 -548 -442 -181 -200 -71 102 36 322
8107C22p7k91k1Q1j54r2K16M5N0J60k25J58j7j43P3m22J73J18m8R7M00l16J96
$$ 322 245 -46 -67 14 -140 -232 -16 29 79 239 14 172 155 12 85 -337 -164 -46 -94 3 403 87 283
8130B83q8j00m47Q6J09j24K04R4K06j34J4J40r2n36L87m29J97N1J05J18P6k8J67
$$ 283 195 95 -352 -266 -157 -281 -77 17 223 89 103 243 151 -385 2 -427 -230 -179 -74 44 120 92 259
8153B59k75J43m03o5o2L28J48k58M17j76K58m58J71j21R9q7O2K9J17%mJ92K0l76
$$ 259 -16 127 -276 -341 -403 -75 73 -185 232 56 314 -144 27 -94 5 -82 -20 9 126 126 122 314 334 -42
8177d2k95N0j0R6J79O0J05P6k01L10o8k53l09j63
$$ -42 -337 -287 -297 -201 -22 38 143 219 18 328 260 7 -302 -465
8191d65
$$ Imaginary data points
##PAGE= N=2
##DATA TABLE= (X++(I..I)), XYDATA
0@%%%%%%%%%%%pPqJ6j6J8k6L2l5M4n6O5p6R1j07J24j42J63j87K15k45K79l15L53
$$ 0 0 0 0 0 0 0 0 0 0 0 0 -7 0 -8 8 -8 10 -16 16 -19 25 -31 34 -42 49 -58 66 -76 87 -100 115 -130 149 -166 187
35A87m00M50n05N65o28P01p80Q65r58J061j174J295j426J571j732J909k103K317
$$ 187 -213 237 -268 297 -331 370 -410 455 -503 558 -616 679 -747 824 -908 1001 -1102 1215
53A215k557K826l128L469l862M319m854N495o279P263q540J0276j2784J6744k3977
$$ 1215 -1342 1484 -1644 1825 -2037 2282 -2572 2923 -3356 3907 -4633 5643 -7141 9603 -14374
68a4374M1491j65815k41724J34520P3534O9804J67877K36924N2201n7300n7829
$$ -14374 27117 -138698 -380422 -245902 -172368 -102564 65313 302237 354438 297138 239309
79B39309r3818j97333j40573k7061K5881O4743J61153J56923O8338J2881k2087
$$ 239309 145491 -51842 -192415 -219476 -193595 -128852 32301 189224 257562 270443 248356
90B48356j29435j79170j08153l7516k4637N5306J57877J45587N9949K9676j1622
$$ 248356 118921 -60249 -168402 -205918 -230555 -175249 -17372 128215 188164 217840 206218
101B06218j14727j64926j09962o1072k5654O4969J46013J25731Q1347O6434m712
$$ 206218 91491 -73435 -183397 -244469 -270123 -205154 -59141 66590 147937 214371 209659
112B09659j24915j52319r7246q0057o3518M8138J56558J44048R3434Q8499M6264
$$ 209659 84744 -67575 -164821 -244878 -308396 -260258 -103700 40348 133782 222281 268545
123B68545o6623j34000j07325p3860n1275J3801R5217J23234J01220O4615P848
$$ 268545 201922 67922 -39403 -113263 -164538 -150737 -55520 67714 168934 233549 241397
134B41397o2467j11698j26109j10340n6676J9194P7935J08276J19264R4172K5914
$$ 241397 178930 67232 -58877 -169217 -225893 -206699 -128764 -20488 98776 192948 218862
145B18862m8019r3963j17758j15517p0776r9O1279J02919J21886R9112M0977k1151
$$ 218862 170843 76880 -40878 -156395 -227171 -227270 -165991 -63072 58814 157926 198903 177752
157A77752p1862j11413j18334p5578j1762M0701Q4554J15307J05368N0709j1101
$$ 177752 105890 -5523 -123857 -199435 -211197 -170496 -85942 29365 134733 185442 174341
168A74341n8564r3812j08085q1140k2654M0063Q6958J09793J04732O7407O293
$$ 174341 115777 21965 -86120 -167260 -189914 -149851 -62893 46900 151632 219039 225332
179B25332n7255r9462j11303r3372n1176Q186O6615J00223J00390P1168K2417
$$ 225332 168077 68615 -42688 -136060 -187236 -179050 -112435 -12212 88178 159346 181763
190A81763l5166q4428j06284r2494n2254J254N5693R6207J04677P9402L3381k0962
$$ 181763 146597 62169 -44115 -136609 -188863 -187609 -131916 -35709 68968 148370 181751 160789
202A60789p0073j00584r5586o0900j2468M1129Q5591J01386Q1721M1699o919n9893
$$ 160789 90716 -9868 -105454 -166354 -178822 -137693 -52102 49284 131005 172704 165785 105892
214A05892r6544r7100o7368k4709K6377P7186J00960Q7638N3692Q297m6432q7350
$$ 105892 9348 -87752 -155120 -179829 -153452 -76266 24694 112332 166024 174321 127889 40539
226D0539r3382p2960l6752J2394O5474R1531Q4299N9643J9592l6014q0752r1882
$$ 40539 -52843 -125803 -162555 -150161 -84687 6844 91143 150786 170378 134364 53612 -38270
238c8270p7605m8657K05N5785Q6179Q5684O7573L1233k2573o8653q5164p8628
$$ -38270 -115875 -164532 -164327 -108542 -22363 63321 130894 162127 139554 70901 -14263 -92891
250i2891n4342r140M4049P7658Q4418P2391L8605j3641n9593q1498q1929o3388
$$ -92891 -147233 -156373 -112324 -34666 49752 122143 160748 147107 87514 6016 -75913 -139301
262a39301k0321L1734O7489Q1632P6505M7926o07m5327p2672q1431o7437k8400
$$ -139301 -159622 -127888 -60399 21233 97738 145664 145057 99730 27058 -54373 -121810 -150210
274a50210J9063N7045P8018P8481N3363R564l4392o5876q0018p0267l5889Q409
$$ -150210 -131147 -74102 3916 82397 135760 145324 110932 45056 -34962 -105229 -141118 -132709
286a32709M6828P2810P9266N8811J8913k4261n8846p7665p3157m5258l321L8210
$$ -132709 -85881 -13071 66195 125006 143919 119658 60812 -16853 -90010 -135268 -138589 -100379
298a00379O7793P7386O3370K9132j2287m9390p3015p3370n0780j3066K7395N9925
$$ -100379 -32586 44800 108170 137302 125015 75625 2610 -70760 -121540 -134606 -107211 -47286
310d7286P4340O6207L6544l377m1101o7196p2193n5229k1826J7857N2253P0621
$$ -47286 27054 93261 129805 126428 85327 18131 -54062 -109291 -131117 -113260 -61007 9614
322I614O7720M4160O458l2076o1073p0887n9800l0596Q573M4335O5990O7721M8616
$$ 9614 77334 121494 127952 95876 34803 -36084 -95884 -126480 -117907 -73572 -7582 60139 108755
335A08755J5349k2117n3505o9249o1882l6850j49L5950O1193O7772N3903K3525
$$ 108755 124104 101987 48482 -20767 -82649 -119499 -119648 -83698 -22505 45267 99170 122695
347A22695j4466m6749o4580o3491m3287r232K6649N4790O5563N6744L0151m818
$$ 122695 108229 61480 -3100 -66591 -109878 -119110 -92461 -37671 27892 84636 114787 109969
359A09969l7747n9484o3476m7006j6259J8689M7700O2631N7686L4952K696l0629
$$ 109969 72222 12738 -50738 -97744 -114003 -95314 -47614 15017 72703 107655 110351 79722
371G9722n5709o3494n0428k3145J0395M0853O0980O0869M1350J0482k2100m9444
$$ 79722 24013 -39481 -89909 -113054 -102659 -61806 -826 60043 101393 111875 89775 40331
383D0331o1715n4415l0457L63L2275N5108O0031M4945J8301j2549m1082n7181
$$ 40331 -21384 -75799 -106256 -105893 -73618 -18510 41521 86466 104767 92218 51136 -6045
395f045n4349l4008m589K6290M9440N6899M7379K3099q881l7610n5549n6279m0527
$$ -6045 -60394 -94402 -98991 -72701 -23261 33638 81017 104116 95235 57625 2076 -54203 -94730
408i4730j3007J9134M4808N7146N1916L0921N41k8518m9035n5350m4708j9551
$$ -94730 -107737 -88603 -43795 13351 65267 96188 96729 68211 19176 -36174 -80882 -100433
420a00433J1292L7280N2455N1775L6142Q769k0934m3563n2649m4391k3897L921
$$ -100433 -89141 -51861 594 52369 88511 97280 76346 32783 -19866 -64257 -88154 -84233
432h4233L1643M9751N0244L5653J2710j5476m2005n3719m6507k8425m572K5408
$$ -84233 -52590 -2839 47405 83058 95768 80292 38287 -15432 -61939 -90364 -94936 -69528
444f9528M9802N2976L9645K1120m021l5288n2727m7307l2455j3807J4418M1440
$$ -69528 -19726 33250 72895 94015 89994 54706 1979 -45328 -77783 -91590 -77172 -35732
456c5732M8772L9065K4238J503k9229m6663m4375l3425j6697J2660M0537M8034
$$ -35732 13040 52105 76343 77846 48617 1954 -42421 -75846 -92543 -79883 -39346 8688
468H688M2510L0286Q152k3353m2503m4436l8479k2132O877L3532M3644M4062L6559
$$ 8688 51198 81484 89636 66283 23780 -20656 -59135 -81267 -74390 -40858 2786 46848 83407
481H3407J0856j9154l7539m3803m4553k9847M87K4557L5451M2588L9873J6259
$$ 83407 94263 75109 37570 -6233 -50786 -80633 -80146 -55589 -20138 22450 62323 78582
493G8582j3683k9828l7681m3234l1702k227K1865L4051M2171M0233J9651p181
$$ 78582 64899 35071 -2610 -45844 -77546 -79773 -57908 -23857 18314 58547 78198 71017
505G1017k6718l9862m5827l3922r738J2534L0476M3741M3046K4597K338j6923
$$ 71017 44299 4437 -41390 -75312 -85050 -72516 -42040 1701 44747 69344 71682 54759
517E4759l5390m2434l2696j3450O370K7345M1774M1454K6899P736j3558l4280
$$ 54759 19369 -23065 -55761 -69211 -62841 -35496 6278 47732 74631 82367 68809 34529
529C4529m3081l5696k1838j942K1766L7571L6792K8226J3508j0236l2382l9188
$$ 34529 -8552 -44248 -66086 -68028 -46262 -8691 28101 56327 69835 59599 27217 -11971
541a1971l4643k5129n899K1280L5924L6792L3821K1490n267k8412l3540l4490
$$ -11971 -46614 -71743 -77642 -56362 -20438 16354 50175 71665 66398 37986 4446 -30044
553c0044l1314j1280J7214L0730L2291L4018K5425j920k5321l0636l4043l3933
$$ -30044 -61358 -72638 -55424 -24694 7597 41615 67040 65120 39799 9163 -24880 -58813
565e8813j4707J3572K7273L2484L7492K8464L950j6882k6584l4728l4025j6059
$$ -58813 -73520 -59948 -32675 -191 37301 65765 69715 52833 26249 -8479 -42504 -58563
577e8563N660J8886L1061L7094K5156M043j1369k5358l9179l6118j6878Q69J3054
$$ -58563 -52903 -34017 -2956 34138 59294 63337 51968 26610 -12569 -48687 -65565 -64696 -51642
590e1642L1163M1547K9081Q786k864j7231l5777l7181j9024k944P861K5721L8494
$$ -51642 -20479 21068 50149 58935 56071 38840 3063 -34118 -53142 -56086 -48225 -22504 15990
603A5990L0568J1798j203j5142l1969l6954k4462p887O018K1794L2799L2325J8548
$$ 15990 46558 58356 57153 42011 10042 -26912 -51374 -59261 -53243 -31449 1350 33675 52223
616E2223J373j4252k6973l2613k7947j2653O435K1943L0613L2852K5540P580j2635
$$ 52223 53596 39344 12371 -20242 -48189 -60842 -54407 -32464 -1851 31001 56541 64121 51486
629E1486k4562l0184l1603k0927k25J7362K4680K9080K7473J2509p808k1089k6806
$$ 51486 26924 -3260 -34863 -55790 -56015 -38653 -13973 15107 42580 55089 47281 26192 -614
642f14k7601k0648l484J4459K5543K9558K6325J4588l264j9427k9514l0982k2083
$$ -614 -28215 -48863 -52347 -37888 -12345 17213 43538 58126 54862 35435 5921 -25061 -47144
655d7144q908O958K2938L1286K6574J5265L692j2339k8568l1886k1875j0830L68
$$ -47144 -56052 -49094 -26156 5130 31704 46969 50661 38322 9754 -22132 -44007 -54837 -54469
668e4469J8613L1761K8489J6715P360n338k3407l0380k1284j1265j314J4450K8703
$$ -54469 -35856 -4095 24394 41109 48469 43131 19724 -10656 -31940 -43205 -44519 -30069 -1366
681a366K8116J8159P526n600k1578l0139k6118j6103l365J2070K5222K8479K3818
$$ -1366 26750 44909 52435 46835 25257 -4882 -31000 -47103 -50468 -38398 -13176 15303 39121
694C9121J2875k320j7222k5685k6726k0767p151Q052J8951K5268K4071J5105r21
$$ 39121 51996 49676 32454 6769 -19957 -40724 -47875 -39823 -20872 4396 28467 43572 42651
707D2651j3860k2102k5601k2327q500O316J7700K4101K5481J8134K968j1573k0408
$$ 42651 28791 6689 -18912 -41239 -49739 -43423 -25723 -1622 23859 41993 44961 33388 12980
720A2980k5162k2918j1958K916J5711K4243K6264J9839P713o136j8899k5119k3735
$$ 12980 -12182 -35100 -47058 -44142 -28431 -4188 22076 41915 49628 43492 24593 -526 -24261
733b4261j5267k972J0434K1771K4337J9138R426j931j6077k4273k2574j5732n592
$$ -24261 -39528 -42500 -32066 -10295 14042 33180 42606 40675 24598 325 -22249 -37981 -43573
746d3573Q226K0205K4188K0188J2066K63j3603k3143k3367j8209q383M547J8057
$$ -43573 -35347 -15142 9046 29234 41300 41563 27960 4817 -18550 -36759 -45142 -40595 -22538
759b2538K3703K1840J5180L712r706k0183k2326j9635j1356J927J4754K1519K1601
$$ -22538 1165 23005 38185 41897 32191 12008 -10318 -29953 -41309 -39382 -24628 -3109 18492
772A8492J7019O276p615j7419k1412k0318j2782p15J1661J9711K1655J8389Q183
$$ 18492 35511 41787 34172 16753 -4659 -24977 -37759 -38474 -26813 -7102 14553 32942 41125
785D1125m590j5627k1085k1573j5139l810R212J7525K1486J9460J0819j157j2135
$$ 41125 36535 20908 -177 -21750 -36889 -40699 -31487 -13962 7524 26984 37803 36646 24511
798B4511j9446k1088j6813n876N681J5148K0728J9898J3178J556r473j7583k0968
$$ 24511 5065 -16023 -32836 -38712 -33031 -17883 2845 22743 35921 37477 28004 10421 -10547
811a0547j7534q070K547J2561J9774K0292J4176M053o575j6146k0486j8733j0989
$$ -10547 -28081 -36151 -33604 -21043 -1269 19023 33199 37252 30677 14531 -5955 -24688 -35677
824c5677J05J0105J8008K0154J5827O953l637j3770j9408j8924j2525k868P868
$$ -35677 -35572 -25467 -7459 12695 28522 35475 31838 18068 -1340 -20264 -32789 -35657 -27789
837b7789J6482J9255J6908R288j019j1449j7844j8779j4202n764N347J4415J8931
$$ -27789 -11307 7948 24856 34144 33125 21676 3832 -14947 -29149 -34913 -29566 -15151 3780
850C780J7455J1257J476q922j5981j8488j5852p372K786J2118J7411J7946J2911
$$ 3780 21235 32492 33968 25046 9065 -9423 -25275 -32647 -29861 -17743 -332 17614 30525
863C0525L420o499j4768j8209j6671r435J04R794J6170J7689J4122N598m315j2657
$$ 30525 33945 27446 12678 -5531 -22202 -31637 -31533 -21739 -5569 12120 26242 31840 27525 14868
877A4868j7498j6851j0959j757P298J4919J7704J5193P657j939j0190j6433j6809
$$ 14868 -2630 -19481 -30440 -32197 -24899 -9980 7724 22917 30574 28635 18445 2012 -14797
890a4797j2391m148N579J2957J7218J5441R742N01q287j4659j7181j3388n905
$$ -14797 -27188 -31336 -25757 -12800 4418 19859 29601 30102 21815 7156 -10025 -23413 -29318
903b9318K891J0955J6160J5923J0800K770o106j3711j6289j4250p594M02R095
$$ -29318 -26427 -15472 688 16611 27411 30181 24075 10364 -5925 -20175 -27769 -27367 -18272
916a8272J5023J5874J1890M430l811j1898j6503j4227r570j924P085J3398J5817
$$ -18272 -3249 12625 24515 28945 25134 13236 -3267 -17494 -27064 -28988 -21903 -8505 7312
929G312J3008O415j316r435j5003j5047j0435l652M892J1481J5638J3863P730
$$ 7312 20320 26735 25419 15984 981 -14066 -24501 -28153 -23261 -11780 3858 17721 25451
942B5451L29p053j3908j4965j1348m855K917J0562J4687J3767R746K313n956j2799
$$ 25451 25780 18727 4819 -10146 -21494 -26349 -23432 -12870 1817 15584 25330 27643 21687 8888
956H888j4905j2243p316K68Q790J4220J3215J0480M419l264j1312j3493j2236
$$ 8888 -6017 -18260 -25576 -25308 -16518 -2298 10917 21397 25816 22552 11240 -2253 -14489
969a4489q938j535P320J2395J2454J1393O805k839j0394j2732j1930j0281l621
$$ -14489 -23427 -24962 -17642 -5247 7207 18600 25405 22566 12172 -560 -12490 -22771 -26392
982b6392O368J1769J2396J1800Q361j44r042j2056j2483j0799m881L787R804J2679
$$ -26392 -20024 -8255 4141 15941 24302 24158 15116 3060 -9423 -20222 -25103 -21316 -11512 1167
996A167J2822Q575J046n212j0185j3326j1842n164J950O730J1582J3446R076J443
$$ 1167 13989 22564 23610 18398 8213 -5113 -16955 -22119 -20169 -13439 -1857 11589 20665 22108
1010B2108m087r212j2912j2483n896P60N698J1178J3789R780L370j171p823j3337
$$ 22108 18021 8809 -4103 -16586 -22482 -21722 -16024 -4846 8943 18723 22093 20922 13099 -238
1024b38j2836o514k029K865J0424J3753J0117M874k27n376j2002j2421q165l079
$$ -238 -13074 -19588 -21617 -18752 -8328 5425 15542 20416 20189 14813 2811 -9610 -17775 -20854
1038b0854K741Q680J1843R838P871J486o382j1182j0352q612o373J288R792J1090
$$ -20854 -18113 -9433 2410 12248 20119 21605 15223 4041 -6311 -14923 -21296 -20008 -10216 874
1052H74Q965Q422M435n352j1052j0123r096q107p06P788J0356R273R714N376l743
$$ 874 9839 18261 22696 17344 6292 -3831 -12927 -21034 -21740 -13952 -3596 5677 15391 20767 17024
1067A7024q294r159r628q737p51O553Q518Q994J0609O205l266p908p864r792r847
$$ 17024 8730 -429 -10057 -18794 -19545 -12992 -4474 4520 15129 21334 18068 10160 2296 -7496 -17343
1082a7343k452M764P938R685J0256O246o31n269q612j1109r649k635K818N368
$$ -17343 -19795 -15031 -7093 2592 12848 19094 18463 13194 4582 -6527 -16176 -18811 -15993 -10625
1096a0625R684J1879O833l92l534o817j0850j0651l833K094M415Q174J1296P674
$$ -10625 -941 10938 17771 17379 13845 7028 -3822 -14473 -18306 -16212 -11797 -3623 7673 15347
1110A5347K047l197o349j0023j0043m952r0M367Q453J0897Q069L090j015n339
$$ 15347 17394 14197 7848 -2175 -12218 -17170 -17260 -12893 -4440 6457 14526 17616 16601 11262
1124A1262r903j0384n653j367K013P564J0205Q576M377m06m401r105r698p000
$$ 11262 1359 -9025 -14678 -16045 -14032 -6468 3737 12313 16690 16284 11883 2778 -6920 -13920
1138a3920k444J195O595R403Q788N576Q12l098q120r779p664l401K05N141R190
$$ -13920 -16364 -15169 -8574 829 9617 15193 16005 12907 4787 -4992 -12656 -16057 -15852 -10711 -1521
1153a521R327N628K259k107o904r386q104m504o84L578Q329R796O683L209j056
$$ -1521 7806 13434 15693 13586 6682 -2704 -10808 -15312 -15996 -12418 -4089 5707 12390 15599 14543
1168A4543n748q730q228n373j817L295P231Q795P254M308j56n295q101q094o068
$$ 14543 8795 65 -8163 -13536 -15353 -12058 -4827 3968 11222 15530 15374 10079 1978 -6116 -12184
1183a2184l197J958O970Q034P116N578R42m575p545p596o801m249J018O666P639
$$ -12184 -15381 -13423 -6453 1581 8697 14275 15217 10642 3097 -4499 -11300 -15549 -14531 -7865 -226
1198b26P110N780K620l756p008p346p090m491j2M732P353P629O470K745j892n563
$$ -226 6884 12664 15284 11528 4520 -2826 -9916 -14407 -14419 -9687 -2334 5295 11765 14510 12618 7055
1214G055p606p852m699j028L741O067Q233P083L006j024m324p028q201n593j369
$$ 7055 -551 -8403 -13102 -14130 -10389 -4322 3911 10994 14000 12976 8652 1624 -6577 -12170 -13539
1229a3539K017N795P841P306L685j21l070o591q659n453k313J058M472P587P318
$$ -13539 -11522 -5727 2114 9420 13105 12984 9914 3323 -5336 -10789 -13102 -12044 -7572 15 7333
1244G333M788J093k649n754q038o278l125j01L689P539P344M818K369j440n571
$$ 7333 12121 13214 10565 4811 -3227 -9505 -12630 -12731 -9042 -1503 5841 10659 13028 11588 6017
1259F017p239o456l922j311L221O846O901N486L452j166m612p058o290m857k153
$$ 6017 -1222 -7678 -11600 -12911 -9690 -2844 4057 9543 12995 11829 7217 159 -6131 -10988 -13141
1274a3141K830N967O678N603M019M14m248o174o340n427k811J854M988O458N986
$$ -13141 -10311 -4344 2334 7937 11956 12370 8122 1948 -4392 -9819 -12630 -10776 -5788 670 6656
1289F656M488R95l296n547o131n784l549P77M116O154O613M942J803k100n160
$$ 6656 11144 12139 8843 3296 -2835 -8619 -12168 -11391 -7275 -1121 5492 10434 12237 10137 4977
1304D977o452n866l730j47L361N564O023N162K747j092m249o134o104m520j284
$$ 4977 -1475 -7341 -11071 -11218 -7857 -2293 3730 8892 11639 10547 6298 164 -5940 -10460 -11744
1319a1744K497N015O516N323L409m49l772n396n759n378j372J454M368O220N429
$$ -11744 -9247 -4232 2284 7607 11016 10567 6795 1399 -4360 -9738 -11110 -9656 -5288 932 6361
1334F361L819L98k507n288n896n422k352R27L817N339O101M233J375k020m230
$$ 6361 10180 10578 8071 2783 -3113 -8535 -10887 -9960 -6143 -804 5297 9530 10905 8885 4655
1349D655o270n267l245N2L244N222N726M360J988j175l963n440n257m007q95K358
$$ 4655 -1615 -6882 -10127 -10075 -6831 -1609 4117 8477 10465 9290 5327 -113 -5370 -9377 -10272 -7914
1365g914M797N649M759K877p30l281n250n653m142j352J566M193N209N151L133
$$ -7914 -3117 2532 7291 10168 9438 6157 907 -4746 -8888 -10240 -8674 -4481 728 5879 9012
1380I012J98k318m910n152m683k001Q66L210N785N172L617Q56j842m130n517m796
$$ 9012 9210 6892 1982 -3170 -7853 -9854 -8988 -5778 7 5179 8796 9652 7810 3680 -1837 -6633
1396f633k380K01K620N045N106M222J683j267m023n065m685l322m92K388M188
$$ -6633 -9013 -8812 -6192 -1147 3959 8181 9864 8597 4574 -491 -5176 -8498 -8990 -6602 -2414
1411b414M902M518K388q71l402m619n071l632j212J596M003M823M910K525r8k296
$$ -2414 2488 7006 9394 8523 5121 502 -4569 -8201 -9413 -7817 -3814 1009 5919 8444 8346 6050
1427F050m454n002m047j637J087L333M688M702L044Q97k090l781n002l795k556
$$ 6050 1596 -3406 -7453 -9090 -8003 -4670 18 4720 7764 8661 6571 2790 -2212 -6007 -8563
1442h563M78K808M369M817L704J010j086l428m829m332k627m16K262M056M498
$$ -8563 -8085 -5277 -908 3909 7613 8623 7537 4109 -720 -5052 -7679 -8095 -5833 -1777 2721
1457B721L822J737n76k933m499m466l115r71J323L766M792L797K156J72k391m581
$$ 2721 6543 8280 7704 4771 272 -4194 -7309 -8280 -6957 -3191 1601 5398 7554 7726 5335 754
1473G54m306l185j331N27L476M307M195K351J195k080l580m492l502k080J63K951
$$ 754 -3552 -6737 -8068 -7541 -4065 242 4437 6788 7983 5903 2323 -2169 -5671 -7751 -7588 -4637
1489d637M212L999K956J331j436l407m105l468k818j3K219L914M026L589J591
$$ -4637 -425 3574 6530 7861 6425 3018 -1087 -4555 -7373 -7386 -5167 -1253 2773 6362 7953
1504G953r33l068l788l943k886q52J917L207L926L626K239n20k586l521l921k928
$$ 7953 7020 3952 164 -3779 -6665 -7517 -5600 -2393 1533 5159 7398 6878 4292 771 -3150 -6078
1520f078j638J423K619M126L575K963M0k209l250l777l373j614Q35K261L805L673
$$ -6078 -7716 -6293 -3674 452 4027 6990 7030 4821 1571 -2206 -5579 -7193 -6358 -4097 -292 3381
1536C381K803P81j459k712l899l481j898p9K047L372L974K533J495p20k923l308
$$ 3381 6184 6965 5506 2794 -1105 -4586 -6484 -6563 -4516 -1144 2830 5363 6858 6138 3215 -93
1552i3l761k187n50J768K853L854K729K170j15k611l323l648k608j024P91K898
$$ -93 -3854 -6041 -6591 -4823 -1970 1884 4613 6783 6668 4057 734 -2914 -5522 -6546 -5755 -2857
1568b857L589L086K101o3j572k862l711k867j546J110K452K929L520K472P40j595
$$ -2857 732 3818 5919 5856 4284 1422 -2289 -5156 -6702 -5592 -3140 -211 3309 5781 6521 4926
1584D926k619l061l536j689M63J533K953L642K523R36p70k607k948l359k356K46
$$ 4926 2307 -754 -4290 -5979 -5516 -3983 -1030 2612 5135 6071 5301 2694 -254 -3613 -5969 -5723
1600e723J532K545L481K744J285m39j937l213l120k325r04J328K518L328K769
$$ -5723 -4191 -1646 1835 4579 5864 5425 3488 275 -2845 -5170 -6074 -4746 -2228 1100 3869
1615C869J848J99j819l261k980k382j394O36K348L087K784J927P88j254k510k857
$$ 3869 5717 5916 4097 836 -2144 -4526 -5920 -5284 -2936 151 2935 4862 5650 4396 1886 -971
1631i71k907j489L59J360L434K931J988Q91r44k395l315k420j798J51J203K899
$$ -971 -3878 -5367 -5008 -3648 -214 2717 4705 5596 4652 2257 -1058 -3478 -5276 -5125 -3922 -1023
1647a023K816K319J194l78k077k838k875k258k89R20K295K931L153J352m45j334
$$ -1023 1793 4112 5306 4928 2851 13 -2862 -5120 -5409 -4489 -2194 737 3890 5242 4797 3463
1663C463k257l217k117j125Q19K051K735L217J000L60j100k375l022k674n90K08
$$ 3463 1206 -2011 -4128 -5253 -4434 -2383 352 3569 4569 4929 3829 1454 -1568 -4242 -4832 -4624
1679d624J505K699K928J868Q59r69j950l035k245j670J19P75K588K987J742J255
$$ -4624 -3119 -420 2508 4376 5235 4266 2316 -719 -2964 -4634 -4515 -3740 -1152 1835 3577 4832
1695D832l09k060k883k434j333m56N73K507K888J991J008M96j837k964k338j622
$$ 4832 4523 2463 -420 -2854 -4187 -4643 -4070 -1563 1325 3316 4324 4820 2983 19 -2319 -3941
1711c941q40P70K037K448K313J914N8j467k042k621k130r54OJ841K372K340J910
$$ -3941 -4781 -4011 -1974 474 2787 4701 4759 3292 1250 -1371 -3501 -4455 -4449 -2608 -236 2104 4014
1728D014O11q00k300k246k564j311J55J670J902K624J801P33o97j506k516k509
$$ 4014 4625 3825 1525 -721 -3285 -4596 -4441 -2771 -869 1755 3556 4289 3592 2086 -430 -2939
1744b939j125k71Q85K062L001J904R17m13j318k568k039k021m45R85J839K263
$$ -2939 -4064 -4335 -3450 -1388 1613 3517 4434 4021 2703 135 -1904 -3925 -4370 -3385 -1546 717
1760G17K333J047j27q92k054k554j937o88M00J492K515K354J237K73q61j994k271
$$ 717 3050 4097 3970 3078 1024 -1530 -3467 -4155 -3755 -2263 252 2606 3843 4116 3255 1261 -1010
1777a010k001j097K00J017K251K240J934N73o69j602k100k447j085m07J287K164
$$ -1010 -3011 -4108 -3908 -2891 -640 1600 3534 4107 3438 1836 -264 -2711 -3796 -4203 -2916 -752
1793g52K122J772J143n45j651k015k244j480n44R62J727K317K067J217l00j282
$$ -752 1370 3142 4285 3740 2089 74 -2170 -3650 -4194 -3232 -1505 812 2879 4096 3796 2514
1809B514k149k005j782p45P81J539K174K108J200L27j116j790k009j886r66M45
$$ 2514 365 -1640 -3422 -4167 -3386 -1847 327 2435 3635 3962 2846 1056 -953 -2839 -3805 -3360
1825c360J225K011K218J298M76o48j936j991k016q71j75J071J702K446J699P16
$$ -3360 -2135 -124 2094 3392 3868 3220 1284 -707 -2723 -3594 -3769 -2698 -996 1450 3149 3865
1841C865o29j453j577k337j191l61R92J575K109J907P64p3j314j935k152j416
$$ 3865 3236 1783 206 -2131 -3322 -3683 -2691 -1116 993 2900 3664 3591 2277 342 -1810 -3226
1857c226p05J073J171K084J763J215K62j057j594k206j589q41M18J242J973J790
$$ -3226 -3931 -2858 -1687 397 2160 3375 3637 2580 986 -1220 -2809 -3650 -3232 -1990 -17 1773
1873A773J607L99r18j640j839k019p12J1Q62J664K505J231M92p01j200j853k044
$$ 1773 3380 3779 2861 1221 -618 -2637 -3349 -3338 -2476 -812 1693 2924 3416 2715 1515 -338 -2382
1890b382o99k67Q90J292K387J545Q31j70j252j937j762j715l1N59J293J736J899
$$ -2382 -3081 -3348 -2458 -1166 1221 2766 3597 3427 2175 238 -1524 -3239 -3270 -2711 -1418 318 2217
1907B217Q27L96j346j448k000j486o82L38J239J904J966J185M41q03j669j865
$$ 2217 3044 3440 2094 646 -1354 -2840 -3522 -3184 -1945 -41 1925 3110 3551 2748 1079 -786
1923g86j642p81j01J202J632J957J238Q59o47j506j858j376j043l68P66J693J713
$$ -786 -2428 -3209 -3310 -2108 -476 1481 2719 3578 2931 1425 -433 -1809 -2852 -3220 -2454 -761 952
1940I52J520R78m47j113j708j871j231l18M69J727J663J735R31J42j349j440j661
$$ 952 2472 3450 3003 1890 182 -1689 -2920 -3238 -2769 -1042 621 2356 3287 3429 2080 640 -1021
1957a021j838m22J61J314J651J863J279Q0n90j600k035j225o07j11J120J862J625
$$ -1021 -2859 -3281 -3120 -1806 -155 1708 2987 3067 2477 877 -1158 -2383 -2990 -3101 -1981 -119 1506
1974A506J092M42l11j317j682j715j208J5Q48J604J713J264R11n17j103j504j502
$$ 1506 2598 3040 2729 1412 -270 -1985 -3193 -3178 -2330 -726 987 2251 3162 2645 1542 38 -1464
1991a464j169o03N93J576J665J565Q48p4j037j499j666j470k02N95R61J629J594
$$ -1464 -2633 -3236 -2643 -1067 598 2163 3011 2937 1900 401 -1265 -2735 -2937 -2342 -1381 248 1842
2008A842R35M07q63j408j802j219r67Q2Q90J883J481J372M33n41j279j758j355
$$ 1842 2777 3184 2321 913 -889 -2108 -3075 -2993 -2103 -220 1261 2633 3066 2525 1246 -512 -1867
2025a867j059k9Q62J482J418J560M37m5j446j252j661j066l66O38J659J393J411
$$ -1867 -2926 -2955 -2093 -611 807 2367 2804 2759 1313 61 -1600 -2666 -3032 -2394 -735 658 2069
2042B069R27k82q17j271j734j265p83M36J308J421J891O08P24q54j366j856j320
$$ 2069 2996 2714 1897 626 -1108 -2373 -3156 -2720 -1412 9 1900 2508 3232 2378 1012 -844 -2164
2059b164o83K35O53J676J664J152jq6j500j475j576q38L54Q12J277J711R68J034
$$ -2164 -2847 -2612 -1959 -283 1381 2533 2532 2446 946 -529 -2105 -2943 -2589 -1777 -500 1211 2179 3213
2077C213o43j066j533j591q37n29R83R45J530J665O65M4r01j683j498j330k20
$$ 3213 2570 1504 -29 -1620 -2457 -2986 -2003 -1058 472 2137 2802 2846 1945 262 -1236 -2566 -2786
2094b786N54J123J451J148J094K32j133q76j763j316o99P43P76J193J653J003
$$ -2786 -2232 -1109 342 1490 2584 2816 1683 807 -956 -2272 -2971 -2228 -1452 -259 1394 2397
2110B397M12n43j381j322j106q96k67J006J169J277J291O77k36j178j103j703
$$ 2397 2809 2266 885 -437 -1543 -2439 -2706 -1700 -531 746 2037 2714 2478 1300 197 -1506
2126a506q89j00P13R53J547J230Q32k73r52j326j452r59o52M28J136J456J213
$$ -1506 -2395 -2495 -1782 -829 718 1948 2780 2507 1555 229 -1223 -2182 -2834 -2406 -1270 186 1399
2143A399J098k3p54j123j389j395m69M15P05J689J123Q41N47o00r41j494j385
$$ 1399 2497 2474 1720 597 -792 -2187 -2656 -2241 -1536 153 1276 2117 2664 2064 1123 -371 -1756
2160a756p89J05O38J335J384R72N60j68j025j250j372q17k15M82J012J734R01
$$ -1756 -2545 -2440 -1802 -467 917 1889 2449 2281 1256 6 -1366 -2183 -2398 -1916 -904 830 1731
2177A731P19j4j150p05j901q47j03PJ279J536Q74O08K10m21j025j643r65o58K98
$$ 1731 2450 2436 1286 581 -1320 -2167 -2270 -2263 -984 552 1426 2034 2244 1823 798 -845 -1810 -2468 -2170
2196b170P60J277J266Q05M34k47j286j520r97n68K12M56J142J464R16L72k71r96
$$ -2170 -1410 -133 1133 1938 2372 2125 839 -681 -1678 -2246 -2034 -1578 -436 1028 1944 2316 2045 1049
2214A049j202r10r21k87O50P15J598P77Q57l87q14j070j363p47k39L11R75J231
$$ 1049 -153 -1063 -1984 -2271 -1621 -906 692 1469 2326 1939 1125 55 -1308 -2055 -2294 -1983 -1008 223
2232B23J027P01K84n14j222j199j072l36r6Q28J273J274Q77K2k85r28r11j362
$$ 223 1250 1951 2235 1721 499 -700 -1772 -2108 -2204 -1376 -103 1171 2048 2070 1785 857 -54 -1416
2250a416n28o1O69R46J166Q70P88o17p17j211q93r90j06L00J097J261J242J67
$$ -1416 -1944 -2005 -1336 -390 776 1646 2434 1817 1100 -111 -1004 -1994 -2100 -1800 -703 558 1800 1967
2268A967J3l82j404j046j036k22K23J241O23J163O14K46p14r84j118q76k13J82
$$ 1967 1980 1598 194 -852 -1888 -2110 -1887 -646 -23 1140 1754 2000 1286 302 -816 -1692 -1905 -1723
2286a723P55J079R62O39J89l28j071p28j210m59Q3K76J081J202J025j65K25j050
$$ -1723 -968 111 1073 1712 1901 1573 502 -226 -1436 -1895 -1812 -1536 -455 747 1772 1607 1832 782
2304G82q35j112o69j31L71J096P01R72P04jp91q12r11j034j60M76M53J060R78
$$ 782 -53 -1165 -1834 -1965 -1594 -498 203 1175 1879 1878 1087 275 -636 -1670 -1830 -1354 -901 159 1137
2323A137O77k59r2j426r19m27m37j71N86J377R51O79L59m80r46r95p50m99n4N98
$$ 1137 1814 1555 1463 37 -882 -1309 -1746 -1917 -1331 46 997 1676 2035 1555 609 -386 -1136 -1635 -1689 -1091
2343a091Q16R25N01P09m72n29q40j237o10R5L87Q98Q24Q01L61J9p80p23q04r68
$$ -1091 -275 650 1151 1860 1388 859 19 -1218 -1828 -1733 -1346 -448 376 1177 1538 1557 777 54 -750 -1718
2363a718LO7P96J383P35M06p1m53o14r91q70p27R94O7R10R99L65L31n29n05j010
$$ -1718 -1715 -1648 -852 531 1266 1672 1601 1148 534 -457 -1327 -2054 -1060 -993 -83 916 1281 1612 1083 578 -432
2384d32n86n75j09R54N77O40J175q6rm85r24r00n80l64P55O41M17J043L62j2m31
$$ -432 -1018 -1593 -1702 -748 -171 469 1644 1558 1549 1064 140 -760 -1340 -1704 -949 -308 109 1152 1514 1502 1071
2405A071r21p44q99j01k5J025N31Q84N82J74m54p36o89j136J7R7O30N93Q43O02
$$ 1071 150 -594 -1493 -1594 -1619 -594 -63 821 1403 1577 1123 387 -302 -1438 -1421 -1324 -694 -101 742 1344
2425A344j8O5p74j144k51r77L02M10O90R19O18J26P2n47q68r86n19K71L26O26
$$ 1344 1326 1391 617 -527 -778 -1755 -1453 -1043 -353 566 1184 1310 1382 835 -33 -1019 -1538 -1267 -941 -315
2445c15P26N51M23j56p5j001p95m27m72M46L34J026M98M36K08k08q82r97l87k47
$$ -315 411 962 1385 1229 1154 153 -642 -1069 -1541 -1095 -761 265 763 1199 1407 1199 317 -680 -1067 -1314
2465a314m9O69Q27O92N46J0j15p24p27o61l72j85L35O93Q10O76J37p2o25n11p84
$$ -1314 -1363 -694 133 825 1371 1381 1266 542 -185 -846 -1218 -1403 -1068 -375 435 1111 1248 1176 551 40 -744
2486g44l19k10N06K09Q62O76J69L5l66l78j100l81k32OP00N51M84L90K09j23n18
$$ -744 -1063 -1273 -767 -558 304 980 1149 1184 818 440 -660 -1041 -1273 -1267 -567 -16 468 858 1067 944 426
2507D26o27l84p09o0O02R19L03M21K33l05m46o07l98k57k50L24O35M17N68M97
$$ 426 -201 -585 -1294 -1354 -752 167 470 891 1124 819 373 -234 -632 -889 -1139 -815 -180 237 805 1302
2527A302k83o62l78k66l94l10q8M83Q86M58K18J11k54o85m00m52j89k88L37Q94
$$ 1302 1019 357 -21 -287 -681 -991 -1079 -596 290 748 966 1077 823 138 -262 -714 -903 -1191 -854 40
2547D0N23L31k73L98p87l08o17l29QN37J55P66M75k4K14m44p32m95j90m79O14
$$ 40 563 894 621 1019 232 -76 -693 -1022 -1014 -477 -322 444 919 895 1109 665 -67 -562 -752 -1231 -617
2568f17M07K60N20N05r8j78n54o65m71k86L77K67M46P86J79J62l52m37o76m97
$$ -617 -210 50 570 1075 977 799 245 -420 -891 -1177 -800 -533 -87 699 878 1040 688 251 -425 -922
2588i22QP2L17L18N75N28j40j25l37n51l96k54J61J54M63M92L56L51l98l06k35
$$ -922 -914 -842 -525 -207 368 896 756 631 294 -257 -653 -907 -746 -592 -129 363 719 1070 672 366 131
2609A31o89k22Qp4O30P58K18k6K68n94k84n00j23k11O4K77L10N50L73p1o2n21
$$ 131 -558 -780 -772 -846 -216 542 760 734 1002 408 124 -376 -499 -710 -646 -369 -59 491 864 793 731 210
2631B10l63l10m22J31K82K72K68M19M80l07m36k13j47k53k08M20j00L61K27M12
$$ 210 -153 -463 -885 -754 -472 -200 68 487 967 660 224 11 -136 -389 -597 -177 -277 84 311 723
2651G23J31j94o49k90m29j77L96K82L05N72M0l2l83l5o32k84l74L95L31K98K19
$$ 723 854 660 11 -279 -708 -885 -489 -207 98 670 710 678 295 260 -372 -656 -1030 -635 -304 -6 213
2672B13K54R4L7l03j89n51j70O5J87L2P91j07N9R4l16k68k79j20K5N0J13N54J61
$$ 213 467 561 598 295 106 -445 -615 -550 -363 -331 460 353 412 506 190 -78 -357 -477 -452 -402 -289 265 426
2695D26M2qm9l07n70j08m8L37J11L57m4L62L18m29j57l44j64k41Nm6N43L86J14
$$ 426 468 460 411 104 -466 -574 -622 -285 -174 183 139 501 819 390 233 -111 -275 -516 -511 -557 -14 372 486
2718D86n0j54k13j97k24m61Q5K98M54K48L73j10R4j43l35r6m34j20PK83N56L3
$$ 486 436 282 69 -128 -352 -813 -728 -430 24 272 645 535 629 486 151 55 -379 -499 -492 -209 347 380
2740C80j56K72j11k14j85k11k05J11N4R3K83J0K71p6j28k01j95k20q0J12L14K17
$$ 380 224 496 385 171 -14 -225 -430 -319 -265 -172 111 121 392 316 188 -13 -208 -428 -508 -396 -82 135
2762A35J46J0k1J99l44k75l69K88K21k38J51M31j7r3k5j29k13n0q2n2J94L26M9
$$ 135 281 291 270 469 125 -150 -519 -231 -10 -248 -97 334 317 224 199 70 -143 -193 -275 -327 -133 193 242
2785B42J39n7J07J4o02j62J14l73M45j34m8P16k81J48Q1l04m09J20J23J25k71
$$ 242 381 324 431 445 -157 -319 -205 -578 -133 -267 -315 401 120 268 349 45 -364 -244 -121 4 -267
2806b67K26PJ85Q7k46P2l11jj60j5Q9lM06L34l10K20j92o7j2m75p9K03m4K13J42
$$ -267 -41 -34 151 238 -8 64 -247 -248 -408 -423 -334 -337 69 403 93 313 121 54 42 -433 -512 -309 -353 -140 2
2831BK64K04m23Q8l5k26O7k8l10N41j42L77k22J79j1k90J00l56j98K01K05PM10
$$ 2 266 470 47 135 100 -126 -59 -87 -397 144 2 379 157 336 325 35 135 -221 -419 -218 -13 -6 404
2854D04nj27p3j37j10J1n5k01M7K87L8q0p9M05o9j32j19n13K42J99j97L44j28
$$ 404 399 272 199 62 -48 -37 -92 -293 -246 41 79 -1 -80 325 256 124 5 -508 -266 -67 -264 80 -48
2877d8L11J8K3k98j05O1L7j27K9K28k26K51q0R8Kj04k99Q6P6l6P2k89M44P5r1
$$ -48 263 281 304 6 -99 -38 -1 -128 -99 129 -97 154 74 172 174 70 -229 -143 -67 -103 -31 -320 124 199 108
2902A08l9Q4o7l99j2P9J31K55L7J20k01R7j49j66K17k59j40j42K47K41J20J2K83
$$ 108 69 153 86 -313 -325 -246 -115 140 177 297 96 193 44 -122 95 -164 -304 -446 -199 42 162 174 457
2925D57l46m26J29J36j65K4O9k4J81K29q7R0n7m00L82k67j61J5M26j61k4K69p1
$$ 457 111 -315 -186 -50 -215 -191 -122 -146 35 264 177 267 210 -190 192 -75 -236 -221 205 44 20 289 218
2948B18J96k89j19l59P9j88M60K20pQ2K02l26j15l54p6K31j50L01l06N65l80M00
$$ 218 414 125 6 -353 -274 -462 -2 218 211 293 495 169 54 -300 -376 -145 -295 6 -300 265 -115 285
2970B85J02k53J80o00R1k3j91M36k47M39k08L61j40k0m98J55j99r8M79J55j31
$$ 285 387 134 314 -286 -195 -218 -409 27 -220 219 11 372 232 212 -286 -131 -330 -428 51 206 75
2991G5L56k75Oj08j21o4Jl35M10j95M81J69l0l23P6p7k01k05j48K53K04k48P51
$$ 75 431 156 162 54 -67 -131 -130 -465 -55 -250 231 400 370 47 123 46 -155 -360 -508 -255 -51 -299 452
3014D52k21K6p0l7k45k09M4l44L91K12L43q9J42k13j79r0J57l38j56L96J36k63
$$ 452 231 257 187 150 -95 -304 -260 -604 -213 -1 342 253 395 182 3 -87 70 -268 -424 -28 108 -155
3036a55K08L80l6l76L4o0L7k44k79J74J94L37J29J02rl32j69l31J02k79M44J49
$$ -155 53 433 397 21 55 -5 32 -212 -491 -317 -123 214 343 445 436 104 -65 -396 -294 -573 -129 20
3058B0l8M23j56K11l78j14j15J38m57L00j86M71K23R2p3l90m8j92nj27L3J26N4
$$ 20 -18 405 249 460 82 -32 -147 -9 -466 -166 -352 119 342 434 361 -29 -77 -269 -274 -401 -368 -242 -188
3081a88L29O03k39m42N9k36j31k16N3M01j17M07L1K05j37k02l54J45m97J44o6
$$ -188 141 744 505 63 122 -114 -245 -461 -408 -7 -124 283 314 519 382 180 -174 -29 -526 -382 -448
3102d48L17M11J76J08j54J5n88P1k60J45o0N0O23m82L21K62k17j88j40l91k63
$$ -448 -131 280 456 564 410 425 -163 -92 -352 -207 -267 -217 406 -76 245 507 290 102 -38 -429 -692
3123f92L70J10L34K01j56L29j86j88j90l82K21m3J32jK62J53K25m1l05P7l43m31
$$ -692 -322 -212 122 323 167 496 310 122 -68 -450 -229 -272 -140 -141 121 274 499 458 153 230 -113 -544
3145e44q4K65L20j14O92j0l4l59k60J7l64N6Q9J09J49L28K09K0k46j77m05k05
$$ -544 -628 -363 -43 -157 535 525 491 132 -128 -111 -475 -419 -330 -221 -72 256 465 485 239 62 -343 -548
3167e48K1J29o1K41L97J31J95N6l56n71M35o37J78J08L54J73N2L17l02J40m28
$$ -548 -527 -398 -459 -218 179 310 505 561 205 -366 69 -568 -390 -282 72 245 297 614 312 452 24
3188B4j78k17q3j80K54M71J92L33o3jl20n61k43j15K0N15j22O72K55Q9j90j75
$$ 24 -154 -371 -454 -634 -380 91 283 616 553 552 232 -329 -572 -687 -667 -152 -274 398 653 742 552 377
3210C77m28o04K90k7k27N88M49k19M99n4j93m11l02k14r8K58J74L93L31j58M9
$$ 377 -51 -655 -365 -392 -619 -31 418 199 698 644 451 40 -262 -476 -574 -316 -142 251 582 424 473
3231D73M2o74k03l63L0L12Q6L89L05J46J11k98pp47n3N2k54L17L35M04M33l03
$$ 473 515 -159 -362 -725 -695 -383 -297 92 397 543 654 356 349 -398 -451 -399 -653 -336 -1 403 836 533
3253E33j01j34l12n41k34K06K90L31K21M85l71M9k58M7o53l10K26N5L06M37p6
$$ 533 432 298 -14 -555 -789 -583 -293 38 259 744 373 422 164 211 -442 -752 -526 -471 -165 272 196
3274A96O64m93L0m29k47m14ML55L06L92j2K36K8k50m51m93P7k62K47p3P09M12
$$ 196 860 367 397 -32 -279 -693 -689 -334 -28 364 352 588 616 366 -85 -578 -501 -763 -516 -589 120 532
3296E32K21l3k80m2l99p79q9K15J87J71P19J04j37M75n88l12m98n2k9L1L50M85
$$ 532 753 720 440 398 -1 -780 -869 -654 -467 -296 423 527 390 865 277 -35 -533 -585 -614 -583 -233 252
3318B52J76N30n42J2n37k52m61k0R9K08Q83K10P9l39L1k20k00q30K01j40P08J90
$$ 252 428 958 416 428 -109 -361 -822 -842 -743 -535 348 558 637 298 329 109 -91 -921 -720 -860 -152 38
3340C8O1N66P0j52m14l71n28o3j13M10N79J31K47J78rl58l30m47k97q2L45K88
$$ 38 99 665 735 583 169 -202 -730 -793 -906 -496 83 214 461 639 630 272 -58 -505 -802 -884 -539 -251
3362b51L31N31n1J49n26l51m39q1l24L08L09N07K44M88j29m27j78n59k08l16L25
$$ -251 80 611 560 709 183 -168 -607 -688 -1012 -704 -395 112 356 844 715 288 110 -449 -657 -973 -648
3383f48L46M33M37J00J10l39k12o06N8m02L6L24L04N66M6k7k20n5m55k98k0l02
$$ -648 -302 131 568 668 778 439 227 -379 -321 -723 -687 -363 -59 507 553 526 306 251 -204 -502 -522 -824
3405h24K45M75P7Q58m6j54o9m97n92j73l21M47N11K6O40K23k98n1n50m69j23r4
$$ -824 -579 -104 -27 831 785 631 562 65 -527 -700 -1021 -574 -63 -37 603 826 528 477 -73 -542 -665 -759
3427g59J56J19N42M50K30j09J25n86l01o01m1LL29N81N27o0M7O1l32n18k62l06
$$ -759 -603 -484 58 508 738 629 754 168 -133 -734 -775 -772 -443 138 665 605 652 713 381 -137 -399 -705
3449g05J50P0L94O94p3L53j92j73n20m10l97j21N79L68L75L89J97m63j31m44n79
$$ -705 -555 -485 -91 603 530 883 691 518 -2 -412 -809 -930 -351 17 392 781 978 515 384 -60 -639
3470f39k6l12M96L29L76K67R8j2O3m62l58l48n37L36K57P08J88K35J24j00l65
$$ -639 -665 -977 -481 -152 224 491 589 577 640 178 -180 -528 -1065 -729 -472 236 424 659 783 683 318
3491C18l70p17p8J49J81N26M01J18j6K92l26q08j00k09J12r3M14P82l2M37n05
$$ 318 -52 -769 -847 -698 -517 9 410 528 512 804 478 -330 -430 -639 -527 -620 -206 576 544 981 476
3512D76j53l97m90j62M3J80N4P53K24O3L47l25n32m32n32J00J20M03K01O57K27
$$ 476 323 -74 -564 -726 -683 -503 -449 304 528 591 938 613 81 -351 -883 -783 -663 -260 -59 598 825
3533H25j08j37k61n72l14j46j79L84L20P90L51o9l98j34o78m27l2Lj03Q30J92
$$ 825 717 580 319 -253 -567 -713 -892 -508 -188 602 953 884 486 352 -326 -753 -785 -782 -885 -55 137
3554A37L65N16l62k40o03k84k73r1M91K57J90N33J07n0m01k28l55o12j25L03L41
$$ 137 502 1018 656 416 -187 -471 -744 -835 -344 -87 103 636 743 693 292 64 -291 -903 -1028 -725 -384
3575c84N41P40J83j72k12n63o30k24j63K31N51K00L24L13J52k78m70m07k19j19
$$ -384 157 897 1080 908 696 133 -497 -721 -884 -653 -102 98 422 735 887 609 139 -268 -487 -606
3595f06m4K06N42M12J55M33n81k98m17k78l48k0j0R20M14r0N70k85k54l31n17
$$ -606 -650 -444 98 510 665 1098 517 219 -198 -476 -824 -844 -854 66 480 390 960 675 421 90 -427
3616d27m19P5M71L2Q24N8L33m2m76l43l11n58k41J66O07L68N67K19p2k96o81k88
$$ -427 -846 -771 -300 -268 556 614 947 905 429 86 -225 -783 -1024 -858 -251 117 684 903 831 535 -146 -434
3638d34l98o7J36J22O69M92L94J50l49k06o84m95k63J35Q5R22K28M98p8k9n23
$$ -434 -832 -899 -763 -641 28 520 914 1064 715 509 -175 -670 -933 -798 -713 209 437 935 857 828 305
3659C05o28j10m79MM13N39L46K60K77K7j98q20m23l64k39M07L64M55M89M77l40
$$ 305 -323 -433 -912 -908 -495 44 390 650 927 954 756 -64 -487 -851 -1090 -683 -319 136 625 1102 762
3680G62j90n66j69o10k19j89P59N02L38L47J95l03l13n63n66k57J80M59M98N16
$$ 762 572 6 -163 -773 -992 -1181 -422 80 418 765 960 657 344 -219 -785 -1042 -862 -403 95 611
3700F11K81p4k45k56o21k99n37K10K41O74M28N14j37j9k72o94l71l64O4L3M46
$$ 611 892 818 573 317 -304 -603 -1140 -930 -689 -15 413 927 790 771 499 -195 -566 -930 -866 -833 -387
3721c87P80N54J11p6m47l77l41p39j17J63O46K94L63M73j31l09k81o30p09J42
$$ -387 393 947 1058 982 535 158 -183 -922 -1039 -876 -230 64 427 900 769 460 179 -451 -1160 -1018
3741a018J22M51N69L36O00l48M1l85m74o75J06j49J22P36M18J61K57J82o26n11
$$ -1018 -896 -445 124 460 1060 712 753 368 -106 -781 -675 -824 -702 34 452 613 870 1052 426 -85
3761h5o52m93j28O47K02Q82L71J94J65p49l72l25l97j37kN12O38N23K96j8k89
$$ -85 -737 -1230 -1358 -711 -509 373 744 938 1103 354 -18 -343 -740 -877 -879 -367 271 794 1090 1072 783
3782G83o14m99m92j31J45K03Q48L09N66r1k26n43l95o15j62JK28P70M26K58J43
$$ 783 169 -330 -822 -953 -808 -605 243 552 1118 1027 801 258 -137 -752 -914 -913 -685 85 511 769 912
3803I12J80n20n20p40k54j82O24K56N41M76J88q0j5j000m20l05j54J98O47J15
$$ 912 1092 572 52 -688 -942 -1124 -500 -244 297 773 961 881 866 -134 -554 -859 -1013 -815 -168 -53
3823e3Q27K20K18q39k55l75m17k51o0M02Q03L09L85J30k17q54j56o15m93L42N24
$$ -53 774 994 1212 373 118 -257 -674 -925 -985 -583 220 529 914 1044 827 -27 -183 -798 -1291 -949 -425
3844d25M43K32O34M23m07m23l75r15j13Q3R0L51R66N2M15k09k22m29p72l24l05
$$ -425 18 250 884 1307 900 477 102 -813 -926 -843 -753 -402 564 616 1031 822 600 171 -601 -925 -1230
3865a230K07N23M97O84K81J34m98l79q31m83K20j02Q31L74N55L28l21j87m70m73
$$ -1230 -1023 -500 -3 681 962 1096 598 219 -612 -1095 -875 -977 -146 228 783 1111 790 603 133 -340
3885c40n90p7K22N95O1N64L19K35K7o17o24m65k23j49L18Q97J29L37O76m97l12
$$ -340 -930 -1007 -785 -190 -129 435 754 989 1016 399 -225 -690 -913 -1062 -744 153 282 619 1295 798 486
3906D86o05m11l22l66O62M22M93M44J93n1n33j89p91j91k99J84L66O75K56P31
$$ 486 -119 -530 -852 -1218 -556 -134 359 803 996 945 412 223 -568 -759 -1058 -874 -508 167 423 1154
3926A154j48L9r80n34m44j67J53L61M88O96J30J4J38l17j052m35L29k24L72K36
$$ 1154 1006 1045 65 -469 -913 -1080 -927 -566 -78 618 748 762 900 583 -469 -904 -575 -799 -427 -191
3946a91N14O75jk18m62k85o89j76l03J91Q53L32R87J77k00m36m75q32k84k01J59
$$ -191 323 998 997 779 317 32 -657 -833 -1136 -945 -92 240 1227 1404 1204 768 293 -539 -823 -1024 -865
3967h65O28L10O36K06l5k48m95l52m79k57j11N85L33O01M14Qk45k74n48o78j10
$$ -865 -237 73 709 915 880 632 137 -215 -694 -951 -1062 -477 -144 457 871 879 634 360 -188 -866 -976
3988i76j00M68J84P23O61J39r2m89p31m42k54r4L43O43L04L20L46J73q51k87m68
$$ -976 -1076 -608 -424 299 960 1099 1007 518 -213 -655 -909 -1003 -660 -17 287 607 953 1126 275 -12 -480
4009d80k40m8j54M55N29O85Q8q1P0m07q75n93M3J78N64J11P17O49k03l22l89m00
$$ -480 -720 -768 -922 -467 62 747 835 754 824 417 -458 -1051 -1008 -830 -266 -155 562 1211 1008 686 297 -103
4031a03o11l07J19L56M07N42L91N1M5m47q23l57l80L41j07P42K59Q66pL4q67k64
$$ -103 -714 -1021 -902 -546 -139 403 794 845 890 443 -380 -737 -1117 -776 -883 -141 118 984 977 1011 144 -120
4053a20k47n72j72K47M61N92N01K15P9m25m87m21m91k80J14O51M48N08L01r2k08
$$ -120 -367 -939 -1111 -864 -403 189 690 905 984 559 72 -349 -840 -1120 -1006 -355 93 601 902 810 602
4074F02m63k00p86l14K51M80L76O37M05Mk51k70o99l48m63K80J78L50M33N98K34
$$ 602 139 -61 -847 -1161 -910 -430 -54 583 988 992 741 471 -228 -576 -1039 -759 -581 -231 202 800 1034
4095A034l65l41k91o34p6o3K31M87L20N63Q3O7l52m19o71k62k79J0M51M62O27
$$ 1034 669 328 37 -597 -673 -736 -505 -18 302 865 948 1015 663 244 -427 -689 -968 -958 -507 -45 582
4116E82K57k2j16m49p00j37l04%L56O41L89J89J82k53l08p19k67j73J24J67K73
$$ 582 839 817 701 252 -448 -585 -889 -889 -533 108 497 686 868 615 307 -412 -679 -852 -728 -561 -288
4137b88N64L87K83k69m27j56o30k72j73O14K21M02O23j84L32l57o45n29j62k84
$$ -288 276 663 946 677 250 94 -536 -808 -981 -367 -146 256 879 695 1027 670 25 -504 -666 -950
4157i50L56L63L59L27L15j46P0m80p87k29j45R8M69M72J49N13L3p6m87m36j73
$$ -950 -594 -231 128 455 770 624 694 214 -573 -802 -947 -849 -380 92 241 754 787 711 224 -212 -385
4178c85m30J56O0L29O02J77M45k99p4q35O4n91n8K97J38P81J17K81K6k10n64n92
$$ -385 -815 -659 -599 -270 332 509 954 655 581 -254 -190 -781 -839 -542 -404 377 494 775 801 591 27 -565
4200e65k32j4J91Q6N94O79J65l05l4o30k94l91j26M73l7P53J17M56n2j12n58l44
$$ -565 -797 -811 -620 -534 60 739 904 599 565 -65 -359 -750 -876 -403 -440 313 430 886 834 722 164 -180
4222a80m15j99J60K05M76K99N11k42o6k18l97m95l00N7L82J81P12K38o8K78m93
$$ -180 -595 -794 -634 -429 47 346 857 615 549 331 -66 -561 -861 -804 -422 -241 471 709 641 919 426
4243D26m80k02o37L19M6K91N94K12K86j92l06j35m43n58K4K06L60N02L78mN5j74
$$ 426 -54 -256 -893 -574 -528 -237 357 569 855 663 357 222 -221 -779 -755 -549 -189 313 691 687 742 568
4265E68k08m71o03l36M09J16M51M60K15J43m2l90n89l8m12J37K6L06O44R6K91
$$ 568 360 -111 -714 -1050 -641 -525 -74 386 601 744 702 312 -277 -315 -727 -590 -564 -258 386 482 773
4286G73m55l1k55l99m74k1M70K28L15O97K75n37l0o40j24o26R6K84K50M87K07
$$ 773 318 287 32 -367 -841 -862 -392 -164 151 848 1123 586 556 -84 -208 -834 -738 -454 -204 283 490
4307D90L51r0m02p0p03j45k17M3M08K71K65M35J9l58j46l06n96K20l00L65L22
$$ 490 841 751 349 279 -424 -569 -786 -743 -335 -64 201 636 655 297 151 -155 -751 -531 -831 -466 -144
4328a44M53J00K70k21q0l23l61l54L8M0M89K28N25j44L35l35o88j23n33k3L67
$$ -144 309 409 679 458 378 55 -306 -660 -622 -582 -93 135 660 516 851 516 -172 -295 -828 -851 -484
4349d84K35K11O20K77k83j39j17n53l13k07J56nO14N35j44L57J00l41q85n57K28
$$ -484 -249 -38 582 859 576 437 320 -233 -546 -753 -597 -602 12 547 403 760 860 519 -366 -923 -695
4370f95k5L42L41O36K31j07m7l72k81k88l04j44K29M03L56J92K90N3m02m15n25
$$ -695 -720 -378 -37 599 830 723 676 304 23 -265 -569 -713 -484 -81 275 467 757 810 408 -7 -532
4391e32j52j7r9N83L94M31LR3j91n03l43j81k72R4L56L28N91j64K79m93m02l02
$$ -532 -684 -701 -800 -217 177 608 611 704 513 10 -333 -514 -786 -692 -336 -8 583 419 698 205 -197 -499
4413d99L6l13K54K03O33R1L55M4k40l40k46m86j49J12K14K18N20j34L11kn58R9
$$ -499 -463 -776 -522 -319 314 405 760 804 564 224 -22 -508 -657 -545 -331 -113 407 273 584 582 24 123
4435A23q27K27j40j11O36K14N16J50l42j46k41k84m10Q9K01J73N41J15K17l7k35
$$ 123 -704 -477 -617 -728 -92 122 638 788 446 300 59 -225 -635 -546 -345 -172 369 484 701 664 429
4456D29n39j31m52l7J90K94K91N18J63P2l43l36m11r9O4j87K59J74N35n1J54N3
$$ 429 -110 -241 -693 -730 -540 -246 45 563 726 798 455 119 -292 -391 -327 -514 -255 -81 454 403 557 610
4478F10m80l62k48p3J29p2K40J68Q90P4l87j12j99n72l86L5J23M62M89K64O7k31
$$ 610 130 -232 -480 -553 -424 -496 -256 -88 802 876 489 377 178 -394 -780 -745 -622 -160 329 593 660 429
4500D29j21k01l50k68r5J85K02N59K13m2qo9J06r39k05k5O5M53Q3L48J48J31j85
$$ 429 308 107 -243 -511 -606 -421 -219 340 553 511 503 434 540 -399 -604 -629 -564 -111 -28 320 468 599 414
4523D14O6n12l61j50l1J57M86J04O53j00J4n43j89m89l47L24j61N08L84K94M81
$$ 414 480 -32 -393 -543 -574 -417 69 173 826 726 740 197 8 -481 -828 -504 -665 -157 227 521 1002
4544A002n00J47n06m72j85j86L85P9M93K86J43J63m08n07M3n48j19n0K56L49N63
$$ 1002 502 649 143 -329 -514 -700 -315 -236 257 543 686 849 441 -66 -23 -571 -690 -740 -484 -135 428
4565D28K4K81j56l89k10m28m7k13K37N41L26J09K12nl54q2p17k75K47Q6L10J48
$$ 428 452 733 577 188 -22 -450 -497 -710 -473 68 394 503 715 710 356 274 -443 -718 -471 -385 -75 73
4587G3L13M70k80m15m9p55J6j45L57J8M57M05J43Q0m57k74k2k63l86L07R4N9Q43
$$ 73 386 856 576 161 112 -643 -627 -772 -415 -397 60 465 608 688 231 -43 -65 -328 -714 -407 -313 -254 589
4610E89K39l68r3l55j74j28k65k7N9O47M69K52j11l1l23n50j73l54J24j24M70
$$ 589 828 460 367 12 -162 -290 -555 -582 -523 124 593 845 734 703 380 -170 -343 -697 -573 -697 -227
4631b27M83O28R6k58m32k80j69m11K6j65O42J82L11K46qj88n64k44l07K13j70
$$ -227 256 884 980 722 290 10 -159 -570 -544 -709 -67 115 426 672 664 476 -88 -332 -639 -426 -596
4652e96K68M70M07j30L64k38l57m06k11k12qK50M78L65K64J07M8p91j80j67n08
$$ -596 -328 142 549 419 783 545 188 -218 -429 -641 -649 -399 79 444 708 815 863 72 -108 -275 -783
4673g83J69K99K50L36K4M93O6o50k13l83k09J05r0K88N80K07J94k89J29m49k91
$$ -783 -614 -315 -65 271 295 788 854 204 -9 -392 -601 -496 -586 -298 282 489 683 394 523 74 -217
4694b17k08l42Q0M20J34N68Q1K5k09k23m74r9j52r5O38J05L40J0K04k38l59qj21
$$ -217 -425 -767 -687 -267 -133 435 516 541 332 109 -365 -464 -616 -711 -73 32 372 382 586 348 -11 -19 -140
4717a40m92o1L46Q0P51Q1K05m03k2m59q5k84j90K33L07K58M42N2k5n8m92l31m50
$$ -140 -632 -693 -347 -267 484 565 770 367 345 -114 -199 -483 -673 -440 -133 125 567 619 594 536 44 -287 -737
4740g37r0J76N91M21k8L53j7l01o1p56m5j59M3N99o4L30O74r9j57m74k85k74q6
$$ -737 -827 -651 -60 361 333 686 669 368 307 -449 -494 -653 -610 -11 -75 255 929 830 673 199 -86 -360 -446
4763d46j54N4L20O44L00l3k0l56m67k36n40K80M55J20K52L67K36l79j25j38o02
$$ -446 -600 -546 -226 418 718 685 665 309 -158 -394 -934 -654 -199 -79 173 540 776 397 272 134 -468
4784d68j29l6K49L05K50K87N2L41k85n84k90k07k35N0J57N83M44K8Q8R7l61m19
$$ -468 -597 -633 -384 -79 171 458 510 851 566 -18 -308 -515 -750 -700 -543 40 484 512 600 697 336 -83
4806h3l57nl96N95K26L78N4J70j08o1m83l81k23J04J11L27M77J37P9l5j4p74j9
$$ -83 -440 -445 -841 -246 -20 358 412 582 474 413 -70 -451 -674 -570 -459 -132 345 482 561 526 512 -262 -281
4829b81j15l08M75J38K65M70rN4n76l6l53m84p5L14J15L56M65J23L2k21j87k96
$$ -281 -396 -704 -229 -91 174 644 635 689 113 77 -276 -760 -835 -521 -406 -50 415 538 570 349 162 -134
4851a34q7m96K61n9L25N72J06Q1j02l32k56j48l30q0L58J79J65M60K23pj76m63
$$ -134 -221 -717 -456 -515 -190 382 488 569 467 135 -121 -269 -599 -679 -321 -142 23 483 706 699 523 60
4873F0m16n60L71j53Q19j23N20K10j97j90l53j83l08p9j95L47L77P47j26m4K90
$$ 60 -356 -916 -545 -698 121 -2 518 728 531 341 -12 -195 -503 -582 -777 -430 -53 694 568 524 814
4894H14l53n29n31l9r3K34N79K18L74j28J24p21Q5n65O9k10K35L98K38N92K3l23
$$ 814 461 -68 -599 -638 -731 -497 82 300 674 546 670 -51 34 -531 -462 -672 -437 -39 199 791 814 491
4916D91j3n79j97l10m73L96O08K26N66r9J15k45m99l12l46M12l15J22L39L88N76
$$ 491 478 -101 -298 -608 -1081 -685 -77 149 715 616 731 486 -13 -325 -671 -259 -574 -452 -113 275 851
4937H51l12n4j76m44l45q8J35R8M38L71r9N88m31j83n11k45k72K30k40N17M87
$$ 851 539 485 309 -135 -480 -568 -433 -335 103 474 375 963 532 349 -162 -407 -679 -449 -689 -172 315
4958C15K53j2k16k76k54j85j08J52l01O31J25K61K47j23l28j06k96k88o6J33K32
$$ 315 568 556 340 64 -190 -375 -483 -331 -632 -1 124 385 632 509 181 75 -221 -509 -575 -442 -210
4979b10M9L45N95j23m9p52M4n05k45M71q4P04M53j60L43k40l11k13p87j08J63
$$ -210 -161 184 779 656 607 -145 -101 -606 -851 -380 -464 240 693 533 876 636 325 112 -675 -783 -620
5000f20L48O0L46K00L69r6l36m67j6k39k48j2L63O30J36K93l9k13m78l31k28q8
$$ -620 -272 -212 134 334 703 607 271 -196 -212 -451 -699 -711 -348 282 418 711 672 459 -19 -350 -578 -666
$$ [...]
8191i8
##END NTUPLES=NMR FID
##END=
