##TITLE=1H_ANY-156B-21
 CDCl3, 8 sc, 
 12.3.2019
##JCAMPDX= 6.0         $$ Bruker NMR JCAMP-DX V2.0
##DATA TYPE= NMR FID
##DATA CLASS= NTUPLES
##ORIGIN= UXNMR, Bruker Analytische Messtechnik GmbH
##OWNER= root
$$ XWIN-NMR		Version 3.5
$$ Tue Mar 12 15:39:14 2019 Russian Standard Time (UT+4h)  she@DPX200
##.OBSERVE FREQUENCY= 200.1316
##.OBSERVE NUCLEUS= ^1H
##.DELAY= (6, 6)
##.ACQUISITION MODE= SIMULTANEOUS
##.ACQUISITION SCHEME= undefined
##.AVERAGES= 8
##.DIGITISER RES= 18
##SPECTROMETER/DATA SYSTEM= spect
##.PULSE SEQUENCE= zg30
##.SOLVENT NAME= CDCl3
##.SHIFT REFERENCE= (INTERNAL, CDCl3, 0, 15.7039)
##AUDIT TRAIL= $$ (NUMBER, WHEN, WHO, WHERE, WHAT)
$$ ##TITLE= Audit trail, XWIN-NMR		Version 3.5
$$ ##JCAMPDX= 5.01
$$ ##ORIGIN= Bruker BioSpin GmbH
$$ ##OWNER= she
$$ F:/spectra/data/she/nmr/H-F/1/audita.txt
$$ ##AUDIT TRAIL=  $$ (NUMBER, WHEN, WHO, WHERE, WHAT)
(   1,<2019-03-12 15:36:51.59 +0400>,<she>,<DPX200>,
      <created by zg, POWCHK disabled, PULCHK disabled
       configuration hash MD5:
       00 E9 B6 7A A2 85 ED C7 34 08 36 98 17 FE 4E 26
       data hash MD5: 16K
       0C DB 18 C1 D2 07 B7 B2 74 A3 17 BB D2 8F 89 17>)
$$ ##END=
$$ 
$$ hash MD5
$$ DB 0D 54 A3 8C C6 79 9C 7D DE BA 49 D7 C5 55 38
##$RELAX= 
##$RELAX= 
##$RELAX= 
##$RELAX= 
##$RELAX= 
##$RELAX= 
$$ Bruker specific parameters
$$ --------------------------
##$DU= <F:/spectra>
##$EXPNO= 1
##$NAME= <H-F>
##$PROCNO= 1
##$TYPE= <nmr>
##$USER= <she>
##$AMP= (0..31)
100 100 100 100 100 100 100 100 100 100 100 100 100 100 100 100 100 100 
100 100 100 100 100 100 100 100 100 100 100 100 100 100 
##$AQSEQ= 0
##$AQ_mod= 1
##$AUNM= <au_zg>
##$AUTOPOS= <>
##$BF1= 200.13
##$BF2= 200.13
##$BF3= 200.13
##$BF4= 200.13
##$BF5= 200.13
##$BF6= 200.13
##$BF7= 200.13
##$BF8= 200.13
##$BYTORDA= 1
##$CFDGTYP= 0
##$CFRGTYP= 5
##$CHEMSTR= <none>
##$CNST= (0..31)
1 1 145 1 1 1 1 1 1 1 1 1 1 1 1 1 1 1 1 1 1 1 1 1 1 1 1 1 1 1 1 1 
##$CPDPRG= <>
##$CPDPRG1= <>
##$CPDPRG2= <>
##$CPDPRG3= <>
##$CPDPRG4= <mlev>
##$CPDPRG5= <mlev>
##$CPDPRG6= <mlev>
##$CPDPRG7= <mlev>
##$CPDPRG8= <mlev>
##$CPDPRGB= <>
##$CPDPRGT= <>
##$D= (0..31)
0 1.2 0 0 0 0 0 0 0 0 0 0.03 0 0 0 0 0 0 0 0 0 0 0 0 0 0 0 0 0 0 0 0 
##$DATE= 1552390610
##$DBL= (0..7)
120 120 120 120 120 120 120 120 
##$DBP= (0..7)
150 150 150 150 150 150 150 150 
##$DBP07= 0
##$DBPNAM0= <>
##$DBPNAM1= <>
##$DBPNAM2= <>
##$DBPNAM3= <>
##$DBPNAM4= <>
##$DBPNAM5= <>
##$DBPNAM6= <>
##$DBPNAM7= <>
##$DBPOAL= (0..7)
0.5 0.5 0.5 0.5 0.5 0.5 0.5 0.5 
##$DBPOFFS= (0..7)
0 0 0 0 0 0 0 0 
##$DE= 6
##$DECBNUC= <off>
##$DECIM= 24
##$DECNUC= <off>
##$DECSTAT= 4
##$DIGMOD= 1
##$DIGTYP= 9
##$DL= (0..7)
0 120 120 120 120 120 120 120 
##$DP= (0..7)
150 150 150 150 150 150 150 150 
##$DP07= 0
##$DPNAME0= <>
##$DPNAME1= <>
##$DPNAME2= <>
##$DPNAME3= <>
##$DPNAME4= <>
##$DPNAME5= <>
##$DPNAME6= <>
##$DPNAME7= <>
##$DPOAL= (0..7)
0.5 0.5 0.5 0.5 0.5 0.5 0.5 0.5 
##$DPOFFS= (0..7)
0 0 0 0 0 0 0 0 
##$DQDMODE= 0
##$DR= 18
##$DS= 0
##$DSLIST= <SSSSSSSSSSSSSSS>
##$DSPFIRM= 0
$$ [...]
##$SUBNAM2= <"">
##$SUBNAM3= <"">
##$SUBNAM4= <"">
##$SUBNAM5= <"">
##$SUBNAM6= <"">
##$SUBNAM7= <"">
##$SUBNAM8= <"">
##$SUBNAM9= <"">
##$SW= 24.9336934301222
##$SWIBOX= (0..15)
0 0 2 0 0 0 0 0 0 0 0 0 0 0 0 0 
##$SW_h= 4990.01996007984
##$TD= 16384
##$TD0= 1
##$TE= 0
##$TE2= 300
##$TE3= 300
##$TEG= 300
##$TL= (0..7)
0 120 120 120 120 120 120 120 
##$TP= (0..7)
150 150 150 150 150 150 150 150 
##$TP07= 0
##$TPNAME0= <>
##$TPNAME1= <>
##$TPNAME2= <>
##$TPNAME3= <>
##$TPNAME4= <>
##$TPNAME5= <>
##$TPNAME6= <>
##$TPNAME7= <>
##$TPOAL= (0..7)
0.5 0.5 0.5 0.5 0.5 0.5 0.5 0.5 
##$TPOFFS= (0..7)
0 0 0 0 0 0 0 0 
##$TUNHIN= 0
##$TUNHOUT= 0
##$TUNXOUT= 0
##$USERA1= <user>
##$USERA2= <user>
##$USERA3= <user>
##$USERA4= <user>
##$USERA5= <user>
##$V9= 5
##$VALIST= <valist>
##$VCLIST= <CCCCCCCCCCCCCCC>
##$VD= 0
##$VDLIST= <DDDDDDDDDDDDDDD>
##$VPLIST= <PPPPPPPPPPPPPPP>
##$VTLIST= <TTTTTTTTTTTTTTT>
##$WBST= 1024
##$WBSW= 4
##$XGAIN= (0..3)
0 0 0 0 
##$XL= 0
##$YL= 0
##$YMAX_a= 35516
##$YMIN_a= -42613
##$ZGOPTNS= <>
##$ZL1= 120
##$ZL2= 120
##$ZL3= 120
##$ZL4= 120
##$ABSF1= 10
##$ABSF2= 0
##$ABSG= 5
##$ABSL= 3
##$ALPHA= 0
##$AQORDER= 0
##$ASSFAC= 0
##$ASSFACI= 0
##$ASSFACX= 0
##$ASSWID= 0
##$AUNMP= <proc_1d>
##$AZFE= 0.1
##$AZFW= 0.1
##$BCFW= 1
##$BC_mod= 2
##$BYTORDP= 1
##$COROFFS= 0
##$CY= 11.3945322036743
##$DATMOD= 1
##$DC= 2
##$DFILT= <>
##$DTYPP= 0
##$F1P= 18.9103706918063
##$F2P= -1.10871071338519
##$FCOR= 0.5
##$FTSIZE= 0
##$FT_mod= 4
##$GAMMA= 1
##$GB= 0.15
##$INTBC= 1
##$INTSCL= 1
##$ISEN= 128
##$LB= 0.24
##$LEV0= 0
##$LPBIN= 0
##$MAXI= 10000
##$MC2= 0
##$MEAN= 0
##$ME_mod= 0
##$MI= 1.114404
##$NCOEF= 0
##$NC_proc= 0
##$NLEV= 6
##$NOISF1= 3.799351
##$NOISF2= 2.8
##$NSP= 1
##$NTH_PI= 0
##$NZP= 0
##$OFFSET= 15.70392
##$PC= 1
##$PHC0= -9014.728
##$PHC1= 14.20025
##$PH_mod= 1
##$PKNL= yes
##$PPARMOD= 0
##$PSCAL= 0
##$PSIGN= 0
##$REVERSE= no
##$SF= 200.130013532006
##$SI= 16384
##$SIGF1= 3
##$SIGF2= 2
##$SINO= 400
##$SIOLD= 16384
##$SREGLST= <1H.CDCl3>
##$SSB= 0
##$STSI= 0
##$STSR= 0
##$SW_p= 3612.71676300578
##$SYMM= 0
##$S_DEV= 0
##$TDeff= 0
##$TDoff= 0
##$TI= <>
##$TILT= no
##$TM1= 0
##$TM2= 0
##$TOPLEV= 0
##$USERP1= <user>
##$USERP2= <user>
##$USERP3= <user>
##$USERP4= <user>
##$USERP5= <user>
##$WDW= 1
##$XDIM= 8192
##$YMAX_p= 0
##$YMIN_p= 0
$$ End of Bruker specific parameters
$$ ---------------------------------
##NTUPLES= NMR FID
##VAR_NAME=  TIME,          FID/REAL,        FID/IMAG
##SYMBOL=    X,             R,               I
##VAR_TYPE=  INDEPENDENT,   DEPENDENT,       DEPENDENT
##VAR_FORM=  AFFN,          ASDF,            ASDF
##VAR_DIM=   8192,          8192,            8192
##UNITS=     SECONDS,       ARBITRARY UNITS, ARBITRARY UNITS
##FACTOR=    0.0002004,     1,               1
##FIRST=     0,             0,               0
##LAST=      1.6414764,     0,               0
##MIN=       0,             -42613,          0
##MAX=       1.6414764,     35516,           0
$$ Real data points
##PAGE= N=1
##DATA TABLE= (X++(R..R)), XYDATA
$$ [...]
$$ plain form
1472 -1625 1099 528 -2522 -1097 911 -232 -878 -756 -839 831 826 -1802 -983 1690 369 -1395 -14
1489 -14 519 322 595 -892 -700 1790 808 -1671 -54 1465 145 -213 -199 -263 1128 836 -1663 -431
1507 -431 1995 248 -1254 128 391 398 456 -1089 -616 1767 346 -1941 -146 1187 -141 -534 -740
1524 -740 -577 1026 281 -2173 -651 1665 -296 -1606 -306 102 312 78 -1557 -764 1777 166 -1904
1541 -1904 -24 1029 -4 -117 -559 -390 1497 694 -1771 -116 1910 100 -855 187 370 825 611
1558 611 -1295 -272 2015 158 -1538 284 1016 -27 -86 -620 -360 1451 387 -1775 89 1670
1574 1670 -183 -726 72 195 811 484 -1252 9 1928 -88 -1324 585 878 -14 65 -695 -231 1500
1592 1500 -1 -1936 115 1184 -693 -1060 -331 -231 404 -264 -1972 -358 1427 -781 -1807 135
$$ packed form
1472a625K724n71l050J425K008j143o46J22q3J670nk628Q19K673j321j764J381
1489a4N33j97K73j487J92K490r82k479J617J519j320l58J4o4J391k92k499J232
1507d31K426j747j502J382K63PN8j545M73K383j421k287J795J333j328l93k06
1524g40J63J603p45k454J522K316j961j310J300M08K10k34j635P93K541j611k070
1541a904J880J053j033j13m42J69J887q03k465J655K026j810r55J042J83M55k14
1558F11j906J023K287j857j696J822P32j043n9n34K60J811j064k162J864J581
1574A670j853n43P98J23O16l27j736J261J919k016j236J909K93q92P9p60M64J731
1592A500j501j935K051J069j877l67P29J00O35o68j708J614J785k208j026J942
$$ plain form
1608 135 478 -82 -134 -885 -109 1737 141 -1397 838 1819 146 25 557 697 1659 873 -831 913
1626 913 2410 192 -565 1067 1016 543 328 -670 64 1525 -383 -1829 302 758 -896 -952 -805 -690
1644 -690 337 -761 -2385 -310 858 -1371 -1619 -134 -202 -385 -466 -1421 -164 1323 -654 -1561 657
1661 657 1025 -428 -171 21 327 1421 112 -1253 926 1787 -476 -552 814 567 476 163 -973 365
1679 365 1614 -659 -1388 749 621 -674 -500 -608 -130 751 -765 -1932 400 896 -1249 -1185 80
1696 80 -120 7 -467 -1505 154 1183 -1029 -1375 705 553 -452 -249 -358 235 1200 -318 -1151 1121
1714 1121 1436 -544 -195 807 671 1027 280 -577 1241 1930 -320 -479 1458 1102 314 354 -112 599
1732 599 1569 -240 -1009 1079 1104 -689 -306 161 -40 367 -476 -1350 378 820 -1301 -1107 543 24
$$ packed form
1608A35L43n60n2p51P76J846j596j538K235R81j673j21N32J40R62p86j704J744
1626I13J497k218p57J632n1m73k15r98P34J461j908j446K131M56j654n6J47J15
1644f90J027j098j624K075J168k229k48J485o8j83q1r55J257J487j977r07K218
1661F57L68j453K57J92L06J094j309j365K179Q61k263p6J366k47r1l13j136J338
1679C65J249k273p29K137j28j295J74j08M78Q81j516j167K332M96k145O4J265
1696H0k00J27m74j038J659J029k212l46K080j52j005K03j09N93R65j518q33K272
1714A121L15j980L49J002j36L56p47q57J818O89k250j59J937l56p88M0m66P11
1732E99R70j809p69K088K5j793L83M67k01M07q43q74J728M42k121J94J650n19
$$ plain form
1750 24 -636 -457 -835 165 937 -1076 -1264 1052 774 -820 -237 229 291 746 -205 -863 1009 1198 -882
1769 -882 -522 974 237 -278 -148 -576 345 657 -1340 -1181 931 98 -1590 -817 -305 -287 -88 -1445 -1648
1788 -1648 652 468 -1791 -1128 492 25 -319 -481 -807 684 1156 -910 -717 1398 865 -274 289
1805 289 495 827 1219 -133 -407 1643 1301 -725 -1 1098 574 314 -198 -705 814 1046 -1143 -1013
1823 -1013 849 185 -666 -375 -684 -70 554 -812 -1185 638 312 -1041 -168 348 -125 251 -11 -454
1841 -454 864 866 -829 20 1509 436 -177 568 438 867 1116 -388 -212 1661 812 -612 395 875
1859 875 272 412 -29 -331 940 501 -1171 -118 1019 -275 -868 -246 -261 28 -167 -1621 -814 906
1877 906 -436 -1919 -743 72 -371 -547 -1443 -1210 590 -76 -2029 -851 568 -354 -781 -551 -566 470
$$ packed form
1750B4o60J79l78J000P72k013j88K316k78j594N83M66O2M55r51o58J872J89k080
1769h82L60J496p37n15J30m28R21L12j997J59K112q33j688P73N12J8J99j357k03
1788a648K300j84k259O63J620m67l44j62l26J491M72k066J93K115n33j139N63
1805B89K06L32L92j352k74K050l42k026P24J099n24k60n12n07J519K32k189J30
1823a013J862o64q51K91l09O14O24j366l73J823l26j353Q73N16m73L76k62m43
1841d54J318Kj695Q49J489j073o13P45j30M29K49j504J76J873q49j424J007M80
1859H75o03J40m41l02J271m39j672J053J137j294n93O22j5K89j95j454Q07J720
1877I06j342j483J176Q15m43j76q96K33J800o66j953J178J419r22m27K30j5J036
$$ plain form
1895 470 478 -1172 -412 1311 329 -766 409 738 655 741 -160 -13 1699 977 -725 381 1455 579 243
1914 243 142 -106 968 757 -923 -356 1061 -5 -851 -191 -260 -282 34 -930 -937 520 -298 -1500 -317
1933 -317 251 -610 -512 -419 -512 483 131 -1122 -65 1242 -16 -505 472 503 604 703 -217 223 1640 542
1953 542 -538 722 1162 298 319 186 166 1096 439 -974 307 1261 -208 -663 177 189 236 145 -958 -256
1973 -256 1080 -212 -1187 101 425 -247 -198 -497 -342 787 35 -1296 60 962 -481 -583 -2 -21
1991 -21 288 38 -1035 -106 997 -364 -1111 236 342 -247 -171 -617 -209 809 -117 -1121 271 875
2009 875 -323 -320 221 136 633 199 -645 375 1438 -20 -578 736 679 342 269 -239 237 1239 86
2028 86 -931 453 931 -278 -317 -58 -206 418 -45 -1261 -180 673 -744 -1050 -76 -199 -461 -431 -1056
$$ packed form
1895D70Qj650P60J723r82j095J175L29q3Q6r01J47J712p22j702J106J074q76l36
1914B43j01k48J074k11j680N67J417j066q46O60o9k2L16r64pJ457q18j202J183
1933c17N68q61R8R3r3R95l52j253J057J307j258m89R77L1J01R9r20M40J417j098
1953E42j080J260M40q64K1j33k0R30o57j413J281R54j469m55Q40J2M7r1j103P02
1973b56J336j292r75J288L24o72M9k99J55J129p52j331J356R02j443j02N81j9
1991b1L09k50j073R29J103j361p47J347J06n89P6m46M08J018r26j004J392O04
2009H75j198LN41q5M97m34q44J020J063j458n58J314n7l37p3n08M76J002j153
2028H6j017J384M78j209l9K59j48O24m63j216J081Q53j417l06R74j23k62L0o25
$$ plain form
2047 -1056 -536 475 -618 -1392 -28 253 -772 -661 -438 -443 296 -269 -1184 -6 748 -575 -639 341 2
2066 2 77 149 -468 45 988 -193 -529 731 720 -253 138 286 323 844 149 -563 844 1202 -364 -270 723
2087 723 435 325 135 -417 382 957 -473 -748 571 304 -539 -268 -362 -186 324 -639 -1118 301 401
2106 401 -1003 -733 154 -21 -55 -259 -741 457 992 -478 -507 966 818 156 442 351 750 1481 509 -21
2126 -21 1370 1513 327 554 1062 880 966 615 -94 903 1224 -284 -260 808 339 -299 -222 -487 -143 268
2146 268 -872 -1264 61 -122 -1212 -949 -544 -664 -346 -921 -1403 -228 79 -1240 -986 81 -286 -560
2164 -560 -370 -599 9 508 -654 -687 692 392 -569 -46 189 75 445 -136 -592 681 694 -636 -393
2183 -393 607 147 -80 -80 -427 177 575 -574 -543 570 205 -590 -85 -12 -114 277 -390 -675 449 342
$$ packed form
2047a056N20J011j093p74J364K81j025J11K23nP39n65r15J178P54j323o4R80l39
2066BP5P2o17N13R43j181l36J260j1r73L91J48L7N21o95p12J407L58j566R4R93
2087G23k88j10j90n52P99N75j430k75J319k67q43K71r4J76N10r63m79J419J00
2106D01j404K70Q87j75l4k04m82J198N35j470k9J473j48o62K86r1L99P31r72n30
2126b1J391J43j186K27N08j82Q6l51p09R97L21j508K4J068m69o38P7k65L44M11
2146B68j140l92J325j83j090K63M05j20L18n75m82J175L07j319K54J067l67k74
2164e60J90k29O08M99j162l3J379l00r61N23K35j14L70n81m56J273J3j330K43
2183c93J000m60k27%l47O04L98j149L1J113l65p95N05P3j02L91o67k85J124j07
$$ plain form
2203 342 -839 -322 350 -142 -234 -212 -452 210 429 -798 -441 684 17 -522 45 55 115 336 -253 -314 921
2224 921 554 -529 100 843 361 168 278 105 885 822 -254 90 1250 519 -34 410 357 477 679 -249
2244 -249 -298 956 483 -625 4 504 124 128 -296 -490 548 464 -839 -391 626 -15 -414 -117 -185 157
2264 157 408 -620 -555 586 149 -707 -152 102 -149 78 -321 -560 310 240 -874 -381 387 -264 -432 -158
2284 -158 -387 -89 95 -798 -483 477 -141 -710 113 196 -81 173 -172 -238 679 392 -566 281 894 148 -11
2305 -11 403 242 619 568 -329 161 1084 237 -438 360 395 147 152 -318 -340 634 -12 -983 -207 344 -381 -511
2327 -511 -422 -514 12 -73 -1099 -476 438 -303 -727 -142 -100 -61 96 -404 -252 686 263 -530 251 634 60
2348 60 240 233 -10 741 509 -304 198 923 119 -88 359 211 231 333 -327 -164 673 -32 -702 148 261
$$ packed form
2203C42j181N17O72m92r2K2k40O62K19j227L57J125o67n39N67J0O0K21n89o1J235
2224I21l67j083O29P43m82j93J10j73P80o3j076L44J160p31n53M44n3J20K02r28
2244b49m9J254m73j108O29N00l80Mm24j94J038q4j303M48J017o41l99K97o8L42
2264A57K51j028O5J141m37q56N55K54k51K27l99k39Q70p0j114M93P68o51j68K74
2284a58k29K98J84q93L15R60o18n69Q23Q3k77K54l45o6R17k87r58Q47O13p46j59
2305a1M14j61L77n1q97M90R23q47o75P98L5k48Nm70k2R74o46r71P76N51p25j30
2327e11Q9r2N26q5j026O23R14p41m24N85M2L9J57n00J52R38m23p93P81L83n74
2348F0J80pk43P51k32q13N02P25q04k07M47j48K0J02o60J63Q37p05o70Q50J13
$$ plain form
2369 261 -289 -165 -162 -320 266 -94 -944 -122 466 -478 -597 -17 -129 -203 -69 -658 -264 484 -374 -908 95
2390 95 281 -280 -208 -259 -165 504 34 -751 220 702 -166 -250 242 198 483 388 -330 209 1040 144 -264 543
2412 543 586 204 301 79 158 757 264 -411 322 665 -93 -163 42 -104 206 65 -696 -245 507 -390 -663
2433 -663 -28 -191 -327 -148 -424 -442 230 -174 -726 148 177 -419 -154 70 -141 234 142 -444 195 638 -293
2454 -293 -307 407 254 38 139 -113 73 647 -109 -500 393 392 -210 -63 131 -38 351 19 -546 289 584
2475 584 -347 -305 439 168 51 87 -226 237 729 -148 -437 541 485 -183 -40 -27 76 513 26 -595 308
2496 308 554 -391 -377 209 -136 -25 -96 -608 -138 448 -413 -611 212 39 -405 -77 -99 -147 410 -69 -474
2517 -474 337 583 -249 0 447 171 408 273 -101 343 700 -90 -162 605 301 -50 165 1 -22 385 -249
$$ packed form
2369B61n50J24Lj58N86l60q50Q22N88r44j19N80j12p4J34n89L94P48q58n34J003
2390I5J86n61P2n1R4O69m70p85R71M82q68q4M92m4K85r5p18N39Q31q96m08Q07
2412E43M3l82R7k22P9N99m93o75P33L43p58p0K05j46L10j41p61M51P52q97k73
2433f63O35j63j36J79k76j8O72m04n52Q74K9n96K65K24k11L75r2n86O39M43r31
2454b93j4P14j53k16J01k52J86N74p56l91Q93jo02J47J94j69L89l32n65Q35K95
2475E84r31M2P44k71j17L6l13M63M92q77k89R78n6o68J43J3J03M37m87o21R03
2496C08K46r45J4N86l45J11p1n12M70N86q61j98Q23j73m44L28k2m8N57m79m05
2517d74Q11K46q32K49M47k76K37j35l74M44L57p90p2P67l04l51K15j64k3M07o34
$$ plain form
2538 -249 -557 196 108 -621 -365 -8 -438 -298 -401 -818 -232 -2 -944 -785 -7 -377 -557 -397 -559 -342
2558 -342 29 -591 -717 141 90 -552 -189 69 -136 108 -73 -414 281 537 -329 -118 582 220 82 247
2578 247 66 352 683 -69 -112 878 554 -17 400 443 381 569 223 -42 679 613 -201 116 649 180 76
2599 76 222 -56 273 453 -288 -284 474 90 -372 59 9 -87 187 -229 -386 365 345 -480 -4 458 45 124
2621 124 212 28 385 572 -106 4 774 393 58 472 370 289 581 142 -65 645 402 -314 127 378 -61
2642 -61 -78 -68 -344 44 113 -685 -454 75 -411 -657 -326 -408 -402 -198 -735 -732 -25 -237 -982 -411 -125 -500 -280
2665 -280 -390 -581 -23 -2 -712 -348 170 -314 -485 -157 -266 -129 81 -430 -382 297 -109 -638 -74 35 -207
2686 -207 -17 -178 -344 295 217 -565 -60 402 -14 -215 146 -57 200 371 -118 -73 668 289 -220 362 417
$$ packed form
2538b49l08P53q8p29K56L57m30J40j03m17N86K30r42J59P78l70j80J60j62K17
2558c42L71o20j26Q58n1o42L63K58k05K44j81l41O95K56q66K11P00l62j38J65
2578B47j81K86L31p52m3R90l24n71M17M3o2J88l46k65P21o6q14L17N33m69j04
2599G6J46k78L29J80p41MP58l84m62M31n0r6K74m16j57P51k0q25M76M62m13P9
2621A24Q8j84L57J87o78J10P70l81l35M14j02q1K92m39k07P10k43p16M41K51m39
2642f1j7J0k76L88O9p98K31N29m86k46L31q2OK04n37LP07k12p45N71K86l75K20
2665b80j10j91N58K1p10L64N18m84j71L28j09J37K10n11M8O79m06n29N64J09k42
2686b07J90j61j66O39p8p82N05M62m16k01L61k03K57J71m89M5P41l79n09N82N5
$$ plain form
2707 417 233 384 138 42 589 424 -285 228 573 71 99 233 -20 276 320 -227 -40 579 39 -191 213
2728 213 185 18 313 -6 -144 523 236 -318 298 519 -20 112 258 65 303 343 -156 200 705 -5 -153
2749 -153 393 194 149 272 -137 -35 544 79 -456 187 342 -72 19 39 -67 330 140 -459 -46 421 -214
2770 -214 -374 -5 -95 -73 41 -453 -260 353 -257 -698 -90 11 -407 -178 -294 -391 43 -154 -733 -267 192
2791 192 -467 -430 -110 -251 -194 12 -382 -214 401 -86 -334 240 289 -63 210 122 22 466 349 -194 327
2812 327 603 -11 97 393 103 201 335 -229 -13 392 -172 -376 162 1 -333 -99 -247 -330 121 -251 -580
2833 -580 -32 113 -500 -320 -9 -282 -106 31 -417 -65 427 -156 -233 285 145 -18 223 -48 78 541
2853 541 98 -181 448 524 -124 49 241 54 293 157 -272 165 468 -202 -203 224 -10 -62 27 -284 -63 331
$$ packed form
2707D17j84J51k46r6N47j65p09N13L45n02K8J34k53K96M4n47J87O19n40k30M04
2728B13k8j67K95l19j38O67k87n54O16K21n39J32J46j93K38M0m99L56N05p10j48
2749a53N46j99m5J23m09J02N79m65n35O43J55m14R1K0j06L97j90n99M13M67o35
2770b14j60L69r0K2J14m94J93O13o10m41O08J01m18K29j16r7M34j97n79M66M59
2791A92o59L7L20j41N7K06l94J68O15m87k48N74M9l52K73q8j00M44j17n43N21
2812C27K76o14J08K96k90R8J34n64K16M05n64k04N38j61l34K34j48q3M51l72l29
2833e80N48J45o13J80L11k73J76J37m48L52M92n83p7N18j40j63K41k71J26M63
2853E41m43k79O29P6o48J73J92j87K39j36m29M37L03o70jM27k34n2Q9l11K21L94
$$ plain form
2875 331 -171 -443 197 236 -289 -91 24 -140 210 56 -409 110 413 -273 -208 212 -67 -72 113 -267 -108
2896 -108 324 -166 -314 192 69 -214 15 68 -161 288 12 -310 221 364 -123 -52 337 55 127 234 -68
2917 -68 114 493 -9 -160 356 184 -57 194 86 -4 336 -15 -300 237 247 -339 -9 188 -211 -81 -13
2938 -13 -306 -26 129 -267 -221 238 -65 -283 37 -129 -113 254 -170 -328 317 236 -329 -28 122 -131 -30
2959 -30 -1 -208 159 275 -324 -208 314 8 -253 1 -157 -70 271 -151 -322 341 185 -324 -17 152 -28
2980 -28 152 98 -240 267 304 -175 -19 332 20 -4 194 -78 168 410 -140 -293 345 156 -386 39 0 -145
3002 -145 86 -141 -432 84 59 -481 -245 20 -313 -220 -118 -381 -103 149 -348 -357 191 -54 -275 107 4
3023 4 -129 186 108 -118 374 332 -209 127 371 46 117 230 -75 229 396 -181 -81 402 98 -197 250 49
$$ packed form
2875C31n02k72O40L9n25J98J15j64L50j54m65N19L03o86O5M20k79nJ85l80J59
2896a08M32m90j48N06j23k83K29N3k29M49k76l22N31J43m87P1L89k82P2J07l02
2917f8J82L79n02j51N16j72k41K51j08r0L40l51k85N37J0n86L30J97l99J30O8
2938a3k93K80J55l96M6M59l03k18L20j66J6L67m24j58O45q1n65L01J50k53J01
2959c0K9k07L67J16n99J16N22l06k61K54j58Q7L41m22j71O63j56n09L07J69j80
2980b8J80n4l38N07L7m79J56L51l12k4J98k72K46K42n50j53O38j89n42M25l9j45
3002a45K31k27k91N16k5n40K36K65l33R3J02k63K78K52m97rN48k45k21L82j03
3023Dj33L15p8k26M92m2n41L36K44l25P1J13l05L04J67n77J00M83l04k95M47k01
$$ plain form
3045 49 -132 137 -88 -267 217 86 -452 -39 97 -110 -53 -11 -280 124 242 -283 -124 345 -3 -165 129
3066 129 67 -2 222 -71 -128 372 180 -158 128 246 -63 192 73 -132 329 266 -185 66 384 -47 -56 191
3088 191 46 74 225 -48 -73 442 89 -252 196 253 1 135 44 -94 278 183 -268 12 238 -117 -115 94
3110 94 -219 -74 143 -310 -236 275 -93 -370 -27 4 -268 -80 -169 -267 102 114 -413 -114 150 -218 -156 1
3132 1 -180 86 132 -225 -150 240 -127 -268 7 -63 -235 114 -112 -319 143 -63 -432 -40 50 -278 -152 -57
3154 -57 -233 -21 25 -356 -160 199 -197 -263 86 -6 -33 169 -37 -148 333 130 -249 197 235 -43 102 137
3176 137 -64 291 184 -198 70 267 -101 -104 225 59 -29 122 -171 -71 313 -7 -353 176 202 -99 67
3197 67 17 -98 267 221 -241 132 443 33 19 318 112 189 297 3 91 475 148 -133 327 182 -68 167
$$ packed form
3045D9j81K69k25j79M84j31n38M13J36k07N7M2k69M04J18n25J59M69l48j62K94
3066A29o2o9K24k93n7N00j92l38K86J18l09K55j19k05M61o3m51K51L18m31rK47
3088A91j45K8J51k73k5N15l53l41M48N7k52J34r1j38L72r5m51K80K26l55KK09
3110I4l13J45K17m53P4N11l68k77L43L1k72J88q9r8L69J2n27K99K64l68O2J57
3132Aj81K66M6l57P5L90l67j41K75p0j72L49k26k07M62k06l69L92R0l28J26R5
3154e7j76K12M6l81J96L59l96o6L49r2k7K02k06j11M81k03l79M46L8k78J45L5
3176A37k01L55j07l82K68J97l68lL29j66q8J51k93J00L84l20l46N29K6l01J66
3197F7n0j15L65m6m62L73L11m10j4K99k06P7J08k94Q8L84l27k81M60j45k50K35
$$ plain form
3219 167 125 -31 234 123 -266 82 154 -172 -111 102 -118 -96 41 -268 -57 194 -128 -281 144 -37 -196
3240 -196 93 13 -97 161 -27 -264 117 164 -186 -41 185 -61 45 121 -139 31 222 -183 -183 175 99 -173
3262 -173 35 -100 -138 174 -109 -330 43 77 -294 -60 19 -158 39 -2 -330 -5 264 -240 -208 161 -25 -112
3284 -112 38 -151 -71 179 -109 -307 128 90 -172 1 16 -109 155 70 -273 92 260 -93 -20 156 -41 51
3306 51 210 -56 -8 276 -35 -100 282 136 -134 202 136 -77 138 -10 -264 140 151 -275 -74 116 -153 -105
3328 -105 55 -209 -66 154 -228 -256 163 -135 -272 3 -16 -103 58 -5 -244 122 178 -197 16 261 26 96
3350 96 180 -144 175 307 -79 -110 254 97 -79 136 -19 3 223 21 -283 154 101 -248 -34 58 -168 -51
3372 -51 -42 -294 -4 150 -280 -80 230 23 -77 65 -65 -57 284 -16 -105 250 178 -74 147 182 17 200 181
$$ packed form
3219A67m2j56K65j11l89L48P2l26O1K13k20K2J37l09K11K51l22j53M25j81j59
3240a96K89q0j10K58j88k37L81M7l50J45K26k46J06P6k60J70J91m05%L58p6k72
3262a73K08j35l8L12k83k21L73L4l71K34P9j77J97m1l28L25K69n04L2L69j86q7
3284a12J50j89Q0K50k88j98M35l8k62J73J5j25K64q5l43L65J68l53P3J76j97R2
3306E1J59k66M8K84l11o5L82j46k70L36o6k13K15j48k54M04J1m26K01J90k69M8
3328a05J60k64J43K20l82k8M19k98j37K75j9q7J61o3k39L66N6l75K13K45k35P0
3350I6Q4l24L19J32l86l1L64j57j76K15j55K2K20k02l04M37n3l49K14R2k26J17
3372e1Rk52K90J54m30K00L10k07j00J42j30QL41l00q9L55p2k52K21L5j65J83j9
$$ plain form
3395 181 -94 232 250 -115 72 264 2 50 130 -96 -18 169 -137 -165 201 -61 -207 67 10 -163 14 -77
3417 -77 -209 57 135 -340 -33 157 -117 -110 54 -135 -20 167 -154 -92 226 13 -186 118 26 -52 126 49 -171
3440 -171 156 119 -231 67 193 -89 -15 119 -118 95 137 -160 -84 220 -6 -106 20 -102 -43 130 -143 -199
3462 -199 127 8 -296 21 4 -226 -21 -13 -271 -151 119 -314 -166 120 -181 -183 1 -97 -135 105 -36 -160
3484 -160 246 81 -207 59 164 -31 55 107 -32 185 179 -73 22 297 27 10 213 46 33 182 -28 -74 241
3507 241 37 -280 27 23 -194 -46 -47 -233 -12 41 -327 22 138 -186 -173 69 -67 -46 99 -173 7 207
3529 207 7 -128 188 176 -100 225 35 -13 235 231 -48 127 248 -51 45 136 18 69 187 -83 -3 228 -40
3552 -40 -186 60 47 -75 80 -49 -110 261 17 -169 0 67 -54 -19 103 -59 57 211 -135 5 261 -108
$$ packed form
3395A81k75L26J8l65J87J92k62M8Q0k26P8J87l06k8L66k62j46K74n7j73J77r1
3417g7j32K66P8m75L07J90k74PJ64j89J15J87l21O2L18k13j99L04r2p8J78p7k20
3440a71L27l7l50K98J26k82P4J34k37K13M2k97P6L04k26j00J26j22N9J73k73n6
3462a99L26j19l04L17j7k30K05Qk58J20K70m33J48K86l01kJ84r8l8K40j41j24
3484a60M06j65k88K66J05j95Q6N2j39K17ok52R5K75k70j7K03j67j3J49k10m6L15
3507B41k04l17L07mk17J48jj86K21N3l68L49J16l24J3K42j36K1J45k72J80K00
3529B07k00j35L16j2k76L25j90m8K48mk79J75J21k99R6R1j18N1J18k70Q0K31k68
3552d0j46K46j3j22J55j29o1L71k44j86J69O7j21L5J22j62J16J54l46J40K56l69
$$ plain form
3574 -108 -57 180 -20 -83 121 -17 -157 152 -9 -165 134 86 -162 -29 16 -87 27 5 -232 -9 127 -91
3596 -91 -123 61 -122 -26 28 -85 -102 204 -82 -159 131 40 -192 34 -13 -97 52 53 -204 -23 151 -179 -133 22
3620 22 -117 -73 13 -182 -116 113 -88 -229 78 25 -145 28 -11 -162 81 26 -184 73 143 -119 -54 65 -23
3643 -23 61 135 -170 -34 126 -105 -150 146 46 -114 80 -10 -111 122 16 -179 127 153 -162 -14 129 15
3665 15 69 120 -107 43 260 -49 17 225 69 4 115 28 7 297 12 -38 88 142 -92 42 103 -79 110
3688 110 -6 -180 -24 140 -145 -174 85 -119 -140 70 -104 -63 161 -80 -189 145 73 -77 84 88 -64 102
3710 102 67 -139 92 202 -69 -10 203 48 44 146 -155 -16 195 -18 -146 158 68 -167 19 32 -96 48
3732 48 -9 -235 9 89 -208 -41 77 -120 13 46 -148 -55 160 -89 -28 107 -25 -143 133 18 -43 70
$$ packed form
3574a08N1K37k00o3K04j38j40L09j61j56K99m8k48J33M5j03J14k2k37K23J36k18
3596i1l2J84j83R6N4j13j7L06k86p7K90r1k32K26m7q4J49Jk57J81J74l30M6J55
3620B2j39M4Q6j95O6K29k01j41L07n3j70J73l9j51K43n5k10K57P0k62O5J19q8
3643b3Q4P4l05J36J60k31m5K96j00j60J94r0j01K33j06j95L06K6l15J48J43j14
3665A5N4N1k27J50K17l09O6K08j56o5J11q7k1K90k85n0J26N4k34J34O1j82J89
3688A10j16j74J56J64k85k9K59k04k1K10j74M1K24k41j09L34p2j50J61Mj52J66
3710A02l5k06K31J10k71N9K13j55mJ02l01J39K11k13j28L04r0k35J86J3j28J44
3732D8n7k26K44Q0k97J67J18j97J33L3j94R3K15k49O1J35j32j18K76j15o1J13
$$ plain form
3754 70 6 -115 85 79 -195 -39 91 -112 -2 99 -133 19 94 -100 -152 164 -65 -107 93 14 -82 121 -69
3777 -69 -196 196 125 -108 85 75 5 81 15 -84 69 147 -101 -58 81 -75 -104 7 -128 -72 27 -92 -182 107
3801 107 -51 -163 11 -5 -141 3 -15 -204 3 97 -211 -69 121 -125 -92 60 -133 -70 179 -69 -33 145
3823 145 6 -63 155 74 -56 104 11 -138 58 133 -161 65 134 -68 -72 112 -118 38 203 -34 -40 221 81
3846 81 -69 184 104 63 165 87 -14 199 181 -85 56 194 5 52 87 -27 114 174 -80 -14 241 -68 -102
3869 -102 99 -31 -90 101 -79 -166 151 14 -185 -26 92 -161 -13 87 -75 27 155 -45 -21 164 -3
3890 -3 -7 97 20 -4 148 34 -63 201 96 -109 112 48 -53 61 7 -148 -57 67 -262 -102 36 -154 -112 47
3914 47 -146 -130 28 -174 -145 14 -112 -206 7 -80 -152 -29 -37 -168 78 29 -151 -23 54 -157 -40 19 -88 -52
$$ packed form
3754G0o4j21K00ok74J56J30k03J10J01k32J52P5j94n2L16k29m2K00p9r6K03j90
3777f9j27L92p1k33J93j0p0P6o6r9J53P8k48M3J39j56k9J11j35N6R9j19r0K89
3801A07j58j12J74j6j36J44j8j89K07R4l08J42J90k46L3J52j93O3K49k48L6J78
3823A45j39o9K18q1j30J60r3j49J96P5k94K26O9k02mJ84k30J56J65k37oK61j40
3846H1j50K53q0m1J02p8j01K13j8k66J41J38j89M7L5j14J41O0k54O6K55l09l4
3869a02K01j30n9J91j80q7L17j37j99J59J18k53J48J00j62J02J28k00K4J85j67
3890cmJ04p7k4J52j14r7K64j05k05K21o4j01J14n4j55R1J24l29J60J38j90M2J59
3914D7j93J6J58k02K9J59j26r4K13q7p2J23qj31K46m9j80J28P7k11J17N9j07L6
$$ plain form
3938 -52 67 -76 -96 146 -85 -124 41 -29 -109 23 56 -63 74 74 -141 40 115 -82 9 79 -48 83 151 -87
3962 -87 -11 281 8 -57 122 43 -54 141 24 -2 162 83 -112 44 98 -64 23 -16 -76 31 69 -152 -26 180
3986 180 -50 -55 127 -50 -47 132 -16 -108 176 67 -84 127 78 -82 77 83 -66 151 66 -105 29 77 -23
4009 -23 -34 52 -15 -63 138 -131 -48 87 -83 -139 57 -38 -146 94 -55 -102 72 -18 -146 49 34 -98 -47 83
4033 83 -36 1 124 -51 -19 130 -49 -130 44 -45 -151 -5 -89 -150 9 30 -191 19 9 -163 -7 48 -88
4056 -88 -80 87 -160 -29 78 -90 -84 68 4 -58 141 32 41 179 4 -96 179 148 -86 23 186 -12 62 55
4080 55 -124 -25 197 -82 -47 110 -44 -44 22 -64 -77 43 -41 -202 5 4 -205 53 -1 -95 64 -25 -164 0 99
4105 99 -57 -51 129 -55 -28 50 -34 9 190 -55 -121 123 118 -94 99 58 -103 115 14 -75 76 138 -51 -29 123
$$ packed form
3938e2J19j43k0K42k31l9J65p0q0J32L3j19J37%k15J81P5j97R1P0j27J31O8k38
3962h7P6K92k73o5J79p9r7J95j17k6J64p9j95J56N4j62Q7l9o0J07L8k21J26K06
3986A80k30nJ82j77LJ79j48r2K84j09j51K11m9j60J59Oj49K17q5j71J34M8j00
4009b3j1Q6o7m8K01k69Q3J35j70n6J96r5j08K40j49m7J74r0j28J95j5j32N1J30
4033H3j19L7J23j75L2J49j79q1J74q9j06J46q4o1J59K1k21K10j0j72J56N5j36
4056h8QJ67k47J31J07j68OJ52o4o2J99j09RJ38j75j00K75l1k34J09J63j98P4p
4080E5j79R9K22k79L5J57j54%O6q6j3J20q4j61K07jk09K58n4r4J59q9j39J64R9
4105I9j56OJ80j84K7P8q4M3J81k45o6K44nk12J93m1j61K18j01q9J51O2j89K2J52
$$ plain form
4130 123 -64 -13 60 -86 -47 132 -66 -23 50 -11 -79 84 87 -95 30 -67 -153 80 61 -121 -9 107 -122 -62
4154 -62 -1 -91 -97 46 -128 -113 86 -32 -196 81 -23 -114 35 38 -101 52 59 -43 26 95 -71 20 142 -35 12
4179 12 175 -85 -14 142 22 2 185 -20 -19 121 -14 -83 116 -15 -231 33 55 -148 18 27 -153 -20 39
4202 39 -96 -36 62 36 -60 71 -100 -84 144 -52 -50 103 84 -46 85 32 -78 78 34 -61 72 152 -53 18 108
4227 108 -26 -12 35 -87 -45 91 -54 -91 43 51 -81 104 41 -78 116 27 -75 50 114 -20 41 121 -10 23
4251 23 128 -21 99 195 -33 42 112 -65 -123 29 70 -95 -14 -86 -167 -1 -7 -145 -49 87 -131 -92 17 -39 -41
4276 -41 66 -99 -65 124 -90 -49 65 8 -115 111 -35 -123 110 48 -81 41 135 -76 22 114 -6 50 100 -104
4300 -104 3 163 -47 11 42 -76 -26 127 -18 -100 116 -38 -97 20 63 -80 -29 69 -68 66 57 -253 14
$$ packed form
4130A23j87N1P3j46L9J79j98M3P3o1o8J63Lj82J25r7q6K33j9j82J12J16k29O0
4154f2O1r0oJ43j74J5J99j18j64K77j04r1J49Lj39J53Pj02O9O9j66R1J22j77M7
4179A2J63k60P1J56j20k0J83k05JJ40j35o9J99j31k16K64K2k03J66Rj80J33N9
4202C9j35O0R8k6r6J31j71J6K28j96KJ53j9j30J31n3j10J56m4r5J33Q0k05P1R0
4227A08j34J4M7j22M2J36j45l7J34Qj32J85o3j19J94q9j02J25O4j34O1Q0j31L3
4251B3J05j49J20R6k28P5P0j77n8J52M1j65Q1p2q1J66oj38R6J36k18L9J09n6k
4276d1J07j65L4J89k14M1J14n7j23K26j46q8K33o2j29J22R4k11R8R2j20N6N0k04
4300a04J07J60k10N8L1j18N0J53j45q2K16j54n9J17M3j43N1R8j37J34rl10K67
$$ plain form
4323 14 54 -80 -18 73 -87 -10 89 -109 1 148 -3 -85 118 95 -55 11 110 -94 93 66 -57 72 193 29
4347 29 1 177 -39 -45 141 42 26 201 39 6 176 94 -32 114 19 -30 98 21 -157 36 49 -146 -82 39
4371 39 -128 -65 60 -155 -58 44 -59 -130 59 -114 -164 76 -39 -180 36 -5 -192 12 85 2 44 26 -75
4394 -75 110 73 -40 40 119 -10 -86 175 11 -16 74 -16 -7 175 -23 -91 84 7 -116 30 53 -106 -24 41 -100
4419 -100 -1 147 -89 -3 116 -19 -54 90 -58 -52 96 -58 -29 41 -29 -61 39 15 -35 50 83 -158 92 49 -84
4444 -84 30 167 -94 -51 114 -42 -44 101 -30 -90 106 26 -77 114 35 44 134 70 -46 95 100 -15 81 138 -80
4469 -80 60 60 -75 43 129 -11 -90 129 -35 -79 106 -43 -60 51 -101 -132 3 -38 -84 -24 -23 -54 -12 18 -182
4494 -182 -41 22 -117 -33 108 -3 -49 48 -36 -53 155 2 -98 117 85 -96 68 -22 -47 28 50 -57 12 51
$$ packed form
4323A4M0j34O2R1j60P7R9j98J10J47j51q2K03k3j50O6R9k04J87k7j23J29J21j64
4347B9k8J76k16oJ86r9j6J75j62l3J70q2j26J46r5m9J28p7j78J93J3j95O4J21
4371C9j67O3J25k15R7J02j03p1J89j73n0K40j15j41K16m1j87K04P3q3M2j8j01
4394g5J85l7j13Q0P9j29p6K61j64k7R0r0RJ82j98o8J75p7j23J46K3j59Q2O5j41
4419a00R9J48k36Q6J19j35l5J44j48OJ48j54K9P0p0l2J00k4n0Q5L3k41K50m3j33
4444h4J14J37k61M3J65j56kJ45j31o0J96q0j03J91p9RR0o4j16J41Nj15R6N7k18
4469h0J40%j35J18Q6j40p9K19j64m4J85j49j7J11j52l1J35m1m6O0Jl1M2L0k00
4494a82J41O3j39Q4J41j11m6R7q4j7K08j53j00K15l2j81J64r0k5P5K2j07O9L9
$$ plain form
4518 51 -108 -40 69 -52 -13 98 -49 -49 164 -6 -27 37 13 -61 112 81 -2 37 48 -63 87 56 -73 -16 150
4543 150 -89 39 69 -55 -41 74 -36 -155 56 -47 -42 39 -34 -129 60 -12 -186 5 87 -79 15 42 -23 45
4567 45 130 -6 -10 141 -40 -51 117 -42 -38 82 51 -68 77 39 -88 109 107 -122 129 10 -124 1 84 -114
4591 -114 -62 88 -113 -66 101 -51 -110 10 -86 -161 63 -73 -141 64 -19 -131 26 32 -122 17 77 -63 -15 143
4615 143 -116 -68 150 -8 -13 127 -27 -50 111 37 -103 98 22 -138 54 7 -90 88 36 -64 -11 123 -89
4638 -89 -3 106 -45 1 140 -44 -6 118 -148 -133 40 -49 -50 25 -7 -62 -9 29 -102 21 20 -111 -24 -12 -108 -34
4664 -34 34 -97 -19 28 -43 -67 160 -22 -63 122 28 -62 35 3 -71 104 43 -86 82 133 -2 -5 81 3 45 103 -88
4691 -88 0 152 -24 -59 65 -37 -116 30 -26 -121 103 -10 -110 1 26 -108 18 18 -53 46 65 -67 2 136
$$ packed form
4518E1j59O8J09j21L9J11j47%K13j70k1O4k4p4J73l1q3L9J1j11J50l1j29N7J66
4543A50k39J28L0j24J4J15j10j19K11j03NQ1p3r5J89p2j74J91Q2j66R4K7o5O8
4567D5Q5j36mJ51j81j1J68j59MJ20l1j19J45l8j27J97kk29K51j19j34J25Q3j98
4591a14N2J50k01M7J67j52n9J20r6p5K24j36o8K05q3j12J57Oj54J39O0j40M8J58
4615A43k59M8K18j58nJ40j54k3J61p4j40K01p6j60J92m7r7J78n2j00N3J34k12
4638h9Q6J09j51M6J39j84L8J24k66J5J73q9jP5l2n5N3L8j31J23jj31Q7J2r6P4
4664c4O8j31P8M7p1k4K27j82m1J85r4r0R7l2p4J75o1j29J68N1j35lQ6p8M2N8j91
4691h8Q8J52j76l5J24j02p9J46n6r5K24j13j00J11K5j34J26%p1R9J9j32O9J34
$$ plain form
4715 136 -66 -35 58 11 -41 103 4 -66 106 16 -87 54 53 -31 36 22 -65 -28 77 -86 1 55 -51 -56 59 -50
4741 -50 51 126 2 -33 99 -37 -111 29 -29 -134 83 86 -137 98 56 -87 30 5 -83 24 54 -48 -71 70
4765 70 -126 -48 94 -50 -93 64 -28 -129 74 20 -99 85 -28 -65 -36 47 26 -13 93 15 57 42 -69 -50 78
4790 78 -60 -35 164 56 -34 104 51 58 77 64 -57 131 108 -25 15 15 -71 32 88 -114 -9 16 7 -91 51 -64
4816 -64 -130 62 -85 -93 105 -54 -90 47 -25 -164 10 26 -78 16 73 -65 30 127 -99 0 69 -8 -26 119 -61
4841 -61 -71 87 -34 -3 148 -32 -131 152 14 -95 119 85 -54 81 120 -113 0 70 -22 -32 63 -73 -42 108
4865 108 5 -69 11 -45 -102 42 -33 -132 28 -16 -89 31 63 -118 3 39 -1 -26 56 -91 -48 109 -122 -55 49
4890 49 -21 -41 131 33 -26 136 92 -94 43 25 -23 17 73 -43 18 94 -57 35 33 -41 -33 108 -102 -79 63 -115
$$ packed form
4715A36k02L1R3m7n2J44r9p0J72r0j03J41jq4O7j4q7L7J05j63Q7N4j06nJ15j09
4741e0J01P5j24l5J32j36p4J40n8j05K17Lk23K35m2j43J17k5q8J07L0j02k3J41
4765G0j96P8J42j44m3J57r2j01K03n4j19J84j13l7K9Q3k1l9J06p8M2j5j11J9J28
4790G8j38K5J99j08r0J38n3PJ9j3j21J88k3j33M0%q6J03N6k02J05K5rr8J42j15
4816f4o6J92j47qJ98j59l6J37p2j39J74J6j04R4N7j38R5R7k26R9O9p7j8J45j80
4841f1j0J58j21L1J51j80r9K83j38j09K14l4j39J35L9k33J13P0r2j0R5j36L1J50
4865A08j03p4Q0n6n7J44p5r9J60m4p3J20L2j81J21L6m0k5Q2j47M3J57k31O7J04
4890D9p0k0J72r8n9J62m4j86J37j8m8M0N6j16O1P6j51R2kp4QJ41k10K3J42j78
$$ plain form
4916 -115 -37 58 -68 -69 21 82 -54 67 -11 -104 -18 26 -69 27 60 -9 -12 71 -45 -9 92 -2 -5 48 -33 -10 54 11 -78
4945 -78 98 12 -98 40 -11 -93 -27 35 -79 -48 57 -50 -35 47 -54 -32 89 -72 -29 108 -26 -62 121 12
4969 12 15 48 31 -54 48 35 -34 -7 18 -41 -25 85 -68 41 64 -28 -26 104 -80 -32 62 -43 -155 123 -1 -128
4995 -128 75 -1 -79 -10 97 -52 -6 11 -54 1 156 -43 -11 92 -45 -10 91 -8 -63 19 -4 -34 120 3 -66
5020 -66 10 42 -49 24 86 -83 -20 106 -33 -12 94 -65 -26 39 -67 -41 79 79 -46 97 18 -37 41 77 -58 -42
5046 -42 13 -68 32 8 -135 -30 52 -120 -8 45 -135 -95 90 -64 -43 76 -56 -102 23 15 -57 44 -69 -106
5070 -106 115 12 -48 35 98 20 35 95 -53 36 69 53 13 98 41 24 156 46 -7 91 -1 -27 35 -15 -94 -4 -15
5097 -15 -96 45 38 -53 33 50 -84 -27 43 -42 -140 63 19 -52 93 -42 -51 10 -32 -136 45 28 -71 -17 42 -70 37
$$ packed form
4916a15P8R5j26jR0O1j36J21p8r3Q6M4r5R6L3o9lQ3j16L6J01r4lN3q1K3O4m3q9
4945g8J76q6j10J38n1q2O6O2j14L1J05j07J5Q2j01K2J21j61M3J37j34l6J83j09
4969A2LL3j7q5J02j3o9K7K5n9J6J10j53J09K3r2KJ30j84M8R4j05j12K78j24j27
4995a28K03p6p8O9J07j49M6J7o5N5J55j99L2J03j37L5J01r9n5Q2k3l0J54j17o9
5020f6P6L2r1P3O2j69O3J26j39K1J06j59L9O5j06K6J20%j25J43p9n5P8L6j35J6
5046d2N5q1J00k4j43J05Q2j72J12N3j80M0J85j54K1J19j32m6J25qp2J01j13l7
5070a06K21j03o0Q3O3p8J5O0j48Q9L3j6m0Q5n7j7J32j10n3R8r2k6O2n0p9R0j1
5097a5q1J41pr1Q6J7j34N7P0q5r8K03m4p1J45j35rO1m2j04J81j7r9N4N9j12J07
$$ plain form
5124 37 -22 -70 -33 120 -88 -68 65 -29 2 48 -26 -19 68 46 -69 59 38 -39 94 45 31 92 64 -131 -5 30 -48
5151 -48 -14 44 -27 -12 58 -70 -18 108 -23 -91 57 -32 -82 -71 -78 -72 -31 22 -164 -12 28 -112 -26 -40 -123 -15 74
5178 74 -108 25 38 15 -27 70 17 -73 48 62 8 98 53 -15 100 58 -15 106 124 -3 19 38 22 25 75 1 -52 125
5206 125 -19 -10 70 25 -15 -11 2 -136 41 -24 -53 -18 24 -65 -24 87 -55 -68 -13 -100 -84 -5 -141 -54 -6 -108 -59
5233 -59 68 -16 -60 -12 -11 -71 49 36 -129 -30 52 -78 -4 97 -91 -70 123 17 -25 77 10 10 63 68 19 128 30
5260 30 -23 33 91 -80 51 62 -31 -12 18 -88 -91 49 -105 -132 16 -85 -119 19 6 -86 -10 -51 -127 23 -23 -116
5286 -116 -24 -14 -128 -47 16 -77 -20 113 -97 -52 62 -43 21 97 -3 -22 35 117 -28 64 48 35 61 57 15 55 75
5313 75 -16 91 104 2 64 78 18 58 69 -10 31 86 42 -41 -12 6 -50 31 -80 -85 84 50 -52 40 30 -145 23
$$ packed form
5124C7n9m8L7J53k08K0J33r4L1M6p4PQ7k2j15J28k1p7J33m9j4O1k8j95J26L5p8
5151d8L4N8p1J5P0j28N2J26j31o8J48q9n0J1pOM1N3j86J52M0j40Q6j4q3J08Q9
5178G4j82J33J3k3m2R7n3r0J21J4n4R0m5o8J15m2p3J21J8j27K2J9j6LN0p4n3J77
5206A25j44RQ0m5m0MJ3j38J77o5k9L5M2q9M1J11j42j3N5q7J6P9j36Q7M8j02M9
5233e9J27q4m4M8Jo0J20j3j65R9Q2j30P4J01j88K1J93j06m2J02o7%N3Nm9J09r8
5260C0n3N6N8j71J31J1r3J9L0j06lJ40j54k7J48j01l4J38j3r2P6m1p6J50m6r3
5286a16R2J0j14Q1O3r3N7J33k10M5J14j05O4P6j00j9N7Q2j45R2j6j3K6mm2M0K0
5313G5r1J07J3j02O2J4o0M0J1p9M1N5m4q3K9J8n6Q1j11nJ69l4j02R2j0j75J68
$$ plain form
5340 23 -45 -51 6 -2 -95 -59 46 -40 -30 8 -62 -6 42 -3 -29 -2 18 -54 41 79 -43 36 90 12 85 110 -26 63 63 -45
5370 -45 -15 66 76 75 64 9 -26 36 -36 -98 46 52 -72 43 -48 -60 -40 1 -81 13 6 -43 5 29 -135 43 101 -50 -31
5399 -31 77 -76 -16 28 -2 -60 15 57 -15 15 16 -80 6 80 -9 36 67 4 89 51 -52 16 78 -20 14 63 4 -15 37
5428 37 49 -58 11 -40 -81 15 15 -47 41 10 -37 -8 70 20 12 103 -91 -70 54 -52 -11 -5 41 -36 -7 -45 6 23 28 -60
5458 -60 44 74 -43 41 124 -87 -53 28 9 -24 116 -62 -27 103 -30 -97 69 50 -112 80 -1 -83 26 -9 -29
5483 -29 86 -31 -124 -27 102 -70 51 36 -66 -20 43 15 -50 38 -77 -69 35 88 -52 8 5 -52 19 42 -75 51
5509 51 91 -40 15 40 -31 -12 100 -5 -52 39 -82 -48 40 -75 -72 43 -64 -21 57 36 -3 39 86 -54 60 49
5535 49 33 68 68 -50 6 71 38 -53 141 -19 -41 113 11 4 87 -57 -77 21 30 -93 4 -27 -93 47 -19 -92 -55 62
$$ packed form
5340B3o8oN7qr3L6J05q6J0L8p0N6M8m5k6K7K0p2R5L8j22P9N4p8P3K5j36Q9%j08
5370d5L0Q1J0jj1n5l5O2p2o2J44Oj24J15r1j2K0M1q2R4pm9M8K4j64J78N8j51J9
5399c1J08j53O0M4l0n8P5M2p2L0Jr6Q6P4q9M5L1o3Q5l8j03O8O2r8L4M9n9j9N2
5428C7J2j07O9n1m1R6%o2Q8l1m7K9P8n0qR1j94K1J24j06M1OM6p7K9l8N1J7Nq8
5458f0J04L0j17Q4Q3k11L4Q1j9l3J40j78L5J30j33o7J66j9j62J92q1q2J09l5k0
5483b9J15j17r3R7J29j72J21j5j02M6O3k8o5Q8j15QJ04N3j40O0ln7P1K3j17J26
5509E1M0j31N5K5p1J9J12j05m7R1j21L4Q8j15LJ15j07M3P8k1l9M2M7j40J14j1
5535D9j6L5%j18N6O5l3r1J94j60k2J54j02pQ3j44k0R8Rj23R7l1o6J40o6p3L7J17
$$ plain form
5563 62 -46 -64 -9 -45 11 24 -11 -10 69 25 -43 19 -40 -2 35 65 -68 34 61 -59 71 -19 3 46 24 28 10 59 -32
5592 -32 -52 76 -62 -76 97 74 -76 25 35 -45 47 5 -30 -1 23 -70 -14 21 -45 31 46 -125 -19 38 -38 -73 95
5619 95 -59 -76 2 -8 -43 22 -44 -48 -45 -43 -69 33 62 -78 -45 24 -73 17 109 -11 -29 51 -46 -23 57 -18 -16 92 -32
5648 -32 -64 3 7 -64 12 27 -79 27 90 -111 74 47 -36 -35 111 -6 -52 13 15 3 45 -96 5 0 6 22 100 0
5676 0 -5 92 33 -54 6 37 -81 52 49 -9 23 31 -68 -25 112 -42 -50 132 43 -17 40 -55 -69 93 52 -33 77 23 -86
5705 -86 -52 40 -106 -21 55 44 -49 53 -39 -22 19 -76 -49 76 11 -93 59 -19 -111 69 35 -56 61 23 -4 -19 21
5732 21 -30 37 24 -13 -39 15 -74 -24 42 -25 -77 73 6 -84 53 -49 -47 56 -11 -28 9 111 -57 10 17 -80 15 80
5760 80 -70 -4 44 17 -13 152 37 -25 77 -28 -67 14 19 -73 -79 21 -77 2 59 -97 -47 23 -89 -54 72 -58
$$ packed form
5563F2j08j8N5l6N6J3l5JP9m4o8O2n9L8L7L0j33J02K7j20J30r0K2M3k2Mj8M9r1
5592c2k0J28j38j4J73k3j50J01J0q0R2m2l5K9K4r3N6L5o6P6J5j71J06N7p6l5J68
5619I5j54j7P8j0l5O5o6mLKk6J02K9j40L3O9r7R0R2j20j8Q0r7K3Q0p5KJ08j24
5648c2l2O7Mp1P6J5j06J06O3k01J85k7q3JJ46j17m6O5Kj2M2j41J01nOJ6P8j00
5676@nR7n9q7O0L1j18J33ln8L2Qr9M3J37j54qJ82q9o0N7r5j4J62m1q5J10n4j09
5705h6L4R2j46Q5P6j1r3J02r2J7M1r5K7J25o5j04J52p8r2J80l4r1J17l8k7j5M0
5732B1n1O7j3l7k6N4q9N0O6o7n2J50o7r0J37j02KJ03o7j7L7J02j68O7Pr7R5O5
5760H0j50O6M8k7l0J65j15o2J02j05l9Q1Nr2oJ00r8P9N7j56N0P0j12L5J26j30
$$ plain form
5786 -58 -58 -15 -40 -63 88 -2 -51 27 9 -57 35 80 -7 41 55 -9 59 31 -58 -27 75 -52 -12 53 -98 -34 99 40
5814 40 23 18 -6 -69 52 -16 42 94 -16 -82 -1 1 -37 12 -4 -18 1 75 -75 41 21 -40 -23 116 26 -78 29 -3
5842 -3 -67 73 53 -58 36 36 -38 11 22 -83 -75 -1 -42 -18 33 5 -32 106 10 -23 128 7 -46 107 43 -24 41 -11
5870 -11 -46 112 55 -44 32 44 -69 -40 75 -44 -16 -3 -8 55 105 -18 10 60 -13 -85 66 -18 -90 30 -43 -47 -13 -4
5898 -4 -19 60 86 -60 -17 47 -74 17 21 29 -14 80 -68 -55 49 -26 -33 73 48 -60 17 11 -88 50 62 -11 42 93 -106
5927 -106 41 99 -3 23 49 -51 -26 83 -8 -20 110 -65 -69 27 15 -57 50 25 -69 38 -14 -110 -18 37 -90 10
5953 10 15 -123 56 38 -71 -30 12 -118 -75 18 -21 -12 -8 -81 -67 -22 -3 -104 35 37 -59 15 53 -13 56 128 -29 -39 80
5982 80 -77 4 85 10 -41 23 26 -64 55 -10 -115 -14 71 -17 -13 33 -75 74 36 -38 -8 49 -10 -22 110 -19 -16 51
$$ packed form
5786e8%M3k5k3J51r0m9P8j8o6R2M5q7M8J4o4O8k8q9L1J02j27M0O5j51O4J33n9
5814D0j7nk4o3J21o8N8N2j10o6Q1Kl8M9j6j4J9P4j50J16k0o1J7J39r0j04J07l2
5842co4J40k0j11R4%p4M9J1j05QP4m1K4N1k8l7J38r6l3J51j21n3J53o4o7O5n2
5870a1l5J58n7r9P6J2j13K9J15j19K8J3nO3N0j23K8N0p3p2J51q4p2J20p3mL4R
5898dj5P9K6j46M3O4j21R1MQm3R4j48J3J04p5pJ06k5j08P7or9J38J2p3N3N1j99
5927a06J47N8j02K6K6j00K5J09r1j2J30j75mR6j2p2J07k5r4J07n2r6R2N5j27J00
5953A0Nj38J79j8j09M1M2j30M3R3l9RMp3J4M5J9j01J39Kr6P4L8o6O9P2j57j0J19
5982H0j57Q1Q1p5n1O4Lr0J19o5j05J01Q5q8MM6j08J49l8p4L0N7n9j2J32j29LO7
$$ plain form
6010 51 -19 -65 85 16 -52 41 7 -63 72 76 -20 1 6 -92 24 31 -8 5 54 -7 -89 13 -65 -57 47 10 -5 113 27
6039 27 -29 -8 25 -60 23 64 -65 3 11 -4 -32 114 -71 -60 19 6 -8 52 -20 -4 43 -58 -82 4 59 -113 22 46
6067 46 -16 23 11 -43 30 79 -85 -36 89 -27 -29 74 26 -48 54 -75 -71 79 3 -80 66 -19 -15 -33 13 -121 87
6094 87 73 -73 13 29 -90 -67 24 -98 -61 19 -33 -89 68 -79 -35 76 -1 -106 -23 42 -61 74 -12 -33 -1 12
6120 12 -4 26 83 -9 76 30 -60 -70 72 -36 76 39 17 -27 73 7 -136 57 15 -68 60 65 -81 22 57 -95
6146 -95 44 71 4 -22 77 -6 -28 33 -50 -49 17 -6 -43 61 32 -5 97 30 -56 86 39 -45 22 39 -70 21 23 -31 4
6175 4 63 3 -64 68 -27 34 79 73 -106 79 19 -95 63 67 36 98 -54 -1 -48 20 -40 -7 45 -101 -23 7 -69 -36
6203 -36 28 -108 -68 64 46 -34 -40 10 -16 5 3 12 -48 19 -110 -76 105 -56 -32 31 -57 -56 18 -19 -49 6 21 -89 47
$$ packed form
6010E1p0m6J50o9o8R3l4p0J35Mr6K1Nr8J16Pl9J3M9o1q2J02p8QJ04l7j5J18q6
6039B7n6K1L3q5Q3M1j29O8Qj5k8J46j85J1P9j3j4O0p2J6M7j01k4Q6N5j72J35K4
6067D6o2L9j2n4P3M9j64M9J25j16kJ03m8p4J02j29MJ50p6q3J46q5Mj8M6j34K08
6094H7j4j46Q6J6j19K3R1j22L7Q0n2n6J57j47M4J11p7j05Q3O5j03J35q6k1L2J3
6120A2j6L0N7r2Q5m6r0j0J42j08J12l7k2m4J00o6j43J93m2q3J28Nj46J03L5j52
6146i5J39K7o7k6R9q3k2O1q3JO6k3l7J04k9l7J02o7q6J42m7q4O7J7j09R1Kn4L5
6175DN9o0o7J32r5O1M5oj79J85o0j14J58Ml1O2j52N3m7O8o0L3N2j46P8L0p6L3
6203c6O4j36M0J32j8q0oN0k6K1kRo0O7j29L4J81j61K4O3q8JP4l7l0N5J5j10J36
$$ plain form
6232 47 21 -92 80 -19 -72 29 20 -22 50 48 -35 -5 79 -61 -36 32 -16 -33 -98 -29 -26 31 23 18 18 20 -32 38 64 -38 17
6263 17 75 -42 60 78 -31 2 11 -55 17 64 -64 21 62 -40 -55 74 31 -105 -42 3 -25 -28 21 -43 67 79 -49
6290 -49 -30 65 -40 -16 73 -9 24 38 -5 -49 41 37 -25 102 -2 -67 54 -4 24 29 36 -29 -26 11 -74 -43 55 -26 -104 -1
6320 -1 -58 -49 65 51 -47 13 22 -64 89 -5 -2 41 -22 -69 24 -6 -41 22 36 -27 -30 44 -96 -8 18 -89 -45 73 16 -40
6350 -40 30 -19 -42 56 -12 -65 -25 -41 -103 44 31 -89 27 3 -4 -17 103 -58 11 74 -17 26 16 -7 -21 97 14 -77
6378 -77 119 -1 6 -33 -69 -81 -1 57 -64 2 75 -59 10 116 -48 -38 106 -52 -61 79 -19 -51 21 5 -69 49
6404 49 60 -69 57 19 -71 -14 27 -69 62 33 -57 7 49 -25 -52 96 -52 -45 77 15 -89 33 8 -10 37 30 -125
6431 -125 14 -3 -59 23 45 -42 18 81 4 -33 72 -60 32 84 10 49 87 -13 -16 -4 -86 -64 48 32 -74 -43 31
$$ packed form
6232D7k6j13J72r9n3J01rm2P2kq3L0Q4j40K5O8m8j7o5O9LN7qn%Kn2P0K6j02N5
6263A7N8j17J02J8j09L3Ro6P2M7j28Q5M1j02j5J29m3j36O3M5k8lM9o4J10J2j28
6290d9J9R5j05K4Q9q2L3J4m3m4R0mo2J27j04o5J21n8K8NPo5LL7q5L1R8q1p8J03
6320an7RJ14j4r8O0Rq6J53r4LM3o3m7R3l0l5O3J4o3lP4j40Q8K6j07M4J18n7n6
6350d0P0m9k3R8o8n3M0j6o2J47j3j20J16k4pj3J20j61O9O3r1M3j0k3j4J18q3r1
6378g7J96j20Pl9l6j2Q0N8j21O6P3j34O9J06j64J0J44j58rJ40r8l2P2j6p4J18
6404D9J1j29J26l8r0N7M1r6J31k9r0O4M2p4k7J48j48PJ22o2j04J22k5j8M7pj55
6431a25J39j7n6Q2K2q7O0O3p7l7J05j32R2N2p4L9L8j00lJ2q2K2J12j6j06L1P4
$$ plain form
6458 31 -28 31 35 -77 -19 78 -14 -7 65 -62 -53 64 17 -14 18 19 -30 94 -30 20 -30 45 -60 59 45 -94 83 -5
6486 -5 -56 77 99 -66 15 30 -26 92 98 -43 -23 103 -20 -9 101 24 -44 30 -6 -108 4 53 -29 60 100 -87
6512 -87 -97 6 -14 39 65 -8 -3 18 9 -11 49 -27 -68 88 -87 -96 41 -25 6 14 29 -106 -12 45 -104 28 148 -62
6540 -62 -107 102 14 -32 63 12 -66 89 -67 -80 44 -13 -44 55 27 -25 6 50 -85 4 27 -62 -1 41 -57 -25 45 -92
6568 -92 -19 7 11 -18 58 33 -21 42 32 -55 37 -28 -73 2 -8 -129 1 14 29 -22 72 -25 -32 20 38 -9 32 60 -73 74
6598 74 29 8 32 72 -46 56 72 -22 15 89 -3 17 32 29 -47 69 -28 -30 135 -87 -37 28 16 -33 76 55 -76 89
6626 89 -55 -48 10 22 19 63 24 30 21 30 -48 -22 86 8 -6 35 36 -130 3 -45 -50 32 28 -51 57 57 -66 52 43 15 43 -20
6658 -20 -36 -27 29 -14 -13 32 21 -106 89 -54 -23 81 -62 -66 25 43 -42 3 -6 -33 -52 -33 -105 -27 17 -31 -86 63 -43
$$ packed form
6458C1n9N9Mj12N8R7r2PP2j27RJ17m7l1L2Jm9J24j24N0n0P5j05J19j4j39J77q8
6486en1J33K2j65Q1J5n6J18Oj41K0J26j23J1J10p7o8P4l6j02J12M9q2Q9M0j87
6512h7j0J03k0N3K6p3NK1rk0O0p6m1J56j75rJ37o6L1QJ5j35R4N7j49J32J20k10
6540f2m5K09q8m6R5n1p8J55j56j3J24n7l1R9k8n2L1M4j35Q9K3q9O1M2r8L2P0j37
6568i2P3K6Mk9P6k5n4O3j0q7R2o5m5P5j0j21J30J3J5n1R4r7pN2J8m7M1K8j33J47
6598G4m5k1K4M0j18J02J6r4L7P4r2K0J5lp6J16r7kJ65k22N0O5j2m9J09k1j31J65
6626H9j44PN8J2lM4l9OrRp8K6J08p8j4M1Jj66J33m8nQ2mp9J08%j23J18rk8K8o3
6658b0j6RN6m3JM5j1j27J95j43L1J04j43mR1J8q5M5rk7j9J9p2P8M4m8n5J49j06
$$ plain form
6687 -43 -38 47 -66 -2 5 -26 -98 62 -2 -29 87 40 -76 56 77 -101 -4 74 19 -48 61 -82 -44 27 20 -17 46 -45
6715 -45 -35 46 -46 1 71 10 -39 80 7 -31 10 63 -84 -16 77 -10 36 28 9 51 23 -45 -42 19 -30 -22 57 -74 -85 39
6745 39 29 -54 78 29 -100 -10 83 -62 30 84 27 -28 55 1 -3 110 14 33 116 44 -16 56 53 0 63 49 -57 20 4
6774 4 -2 72 73 -113 -6 91 -71 52 73 -52 47 31 -2 -57 -21 53 -45 84 21 -12 29 58 -67 33 59 -35 45 144
6802 144 -73 47 55 5 79 41 -18 21 73 -11 -14 59 24 25 29 8 -25 2 0 -17 8 29 -64 42 -1 -55 12 -29 -33 7 39
6833 39 -30 -16 30 -70 -27 -6 24 18 62 2 -96 156 55 -30 -11 43 -37 12 39 -30 12 54 -16 -5 40 -31 -23 83 26
6862 26 -3 0 -38 -50 16 22 -91 44 -8 -106 52 55 -6 51 -8 -57 -32 33 12 6 13 -90 -52 87 -38 -99 -51 12 -59 108
6892 108 5 -81 10 24 -50 41 1 -78 -15 51 1 69 95 33 20 96 -11 7 134 22 -3 84 -36 -59 82 15 -46
$$ packed form
6687d3NQ5j13O4Pl1p2J60o4k7J16m7j16J32K1j78R7P8n5o7J09j43L8P1pl7O3r1
6715d5J0Q1r2M7P0o1m9J19p3l8M1N3j47O8R3q7M6qj9M2k8o8LO1m9QP9j31j1J24
6745C9j0q3J32m9j29R0R3j45R2N4n7n5Q3n4mJ13r6J9Q3p2o0P2ln3O3j4j06P7j6
6774DoP4Jj86J07R7j62J23K1j25R9j6l3n5L6P4r8J29o3l3M1K9j25J00K6r4Q0R9
6802A44k17J20Qn0P4l8n9L9N2q4lP3l5JMk1l3K7kj7K5K1r3J06m3n4O7m1mM0L2
6833C9o9J4M6j00M3K1L0oM4o0r8K52j01q5J9N4q0M9K7o9M2M2p0J1M5p1QJ06n7
6862B6k9Ll8j2O6Oj13J35n2r8J58Lo1N7n9m9K5O5k1oPj03L8J39j25o1M8O3p1J67
6892A08j03q6R1J4p4R1m0p9O3O6n0O8K6o2j3P6j07J8J27j12k5Q7j20k3J41o7o1
$$ plain form
6919 -46 59 35 -83 38 64 -9 12 70 -63 -13 19 -41 -39 85 -51 -95 119 -25 -73 -48 -15 -85 105 2 -44 90
6945 90 36 -16 -20 25 -129 14 62 -47 -13 83 -41 -65 55 -23 -69 66 34 -67 91 45 -63 39 10 -21 51 -10
6971 -10 -63 5 35 -86 1 -11 -39 12 69 -8 -14 53 -46 -65 83 -9 -15 82 9 -11 2 0 -75 7 -55 -57 -1 90 -58 17 41
7002 41 -14 -29 64 -44 -84 61 9 -19 4 21 -49 38 58 72 -12 58 -47 26 72 11 -31 34 2 15 9 -33 -6 19 -19
7031 -19 23 37 15 -69 59 -3 -62 51 -38 -3 -6 27 25 51 77 -33 -68 88 -64 -1 54 11 -35 32 -37 23 71 20 -45
7060 -45 101 10 -77 52 -23 4 63 65 -22 76 5 -20 -29 18 -40 35 10 -40 -72 20 -63 30 64 12 -9 34 3 -27 -33 41 -54
7091 -54 37 116 -41 16 48 -14 29 88 2 1 76 -30 -13 18 37 -57 83 82 -67 25 10 -75 61 55 -27 22 37 -41 32
7120 32 38 30 -36 3 -25 24 102 -55 20 71 -29 -57 -34 -57 -72 11 15 -133 -12 88 -79 107 53 -16 -6 -12 -103 -19 53
$$ packed form
6919d6J05k4j18J21K6p3K1N8j33N0L2o0KJ24j36m4K14j44m8K5L3p0J90j03m6J34
6945I0n4n2mM5j54J43M8j09L4R6j24k4J20p8m6J35l2j01J58m6j08J02k9l1P2o1
6971a0n3O8L0j21Q7j2k8N1N7p7oO7r9j9J48r2oR7p3k0J3kp5Q2o2kN6R1j48P5K4
7002D1n5j5R3j08m0J45n2k8K3J7p0Q7K0J4q4P0j05P3M6o1m2O5l2J3om2K7K5l8
7031a9M2J4k2q4J28o2n9J13q9L5lL3kK6K6j10l5J56j52O3N5m3m6O7o9O0M8n1o5
7060d5J46r1q7J29p5K7N9Kq7R8p1k5rM7n8P5k5n0l2R2q3R3L4n2k1M3l1l0oP4r5
7091e4R1P9j57N7L2o2M3N9q6jP5j06J7L1J9r4J40jj49R2j5q5J36oq2M9J5p8P3
7120C2Oqo6L9k8M9P8j57P5N1j00k8K3k3j5Q3Mj48J21J00j67J86n4o9J0or1Q4P2
$$ plain form
7149 53 -4 -11 40 -33 -39 26 12 -93 15 21 -24 -15 -12 -52 11 68 -3 6 64 -23 34 81 14 -54 26 31 13 2 -18 30 51 22 -115
7182 -115 18 32 -56 44 -15 -65 -15 21 -90 13 53 -42 -24 16 -50 -86 20 -92 -58 50 -51 -22 33 -19 -64 -43
7208 -43 24 -29 63 31 -21 9 36 -29 38 32 -55 -35 87 -72 -1 22 -95 -12 82 -28 9 -1 6 -97 42 75 -9 15
7236 15 58 -7 -11 86 -130 -32 -15 -40 10 26 -113 -101 48 -72 -30 52 -68 -112 4 -33 -66 -14 13 -70 -10 1 -18 15
7264 15 12 0 36 69 -46 37 37 -14 -8 88 -32 31 38 10 -54 39 75 10 20 36 -44 65 91 -83 37 50 -51 -22 48
7293 48 -51 -13 91 -28 19 48 -24 -5 96 10 -105 29 -51 -118 -54 -2 -71 7 -1 -90 1 72 -5 -44 53 13 -6 14
7321 14 6 -42 107 16 -9 65 21 -8 92 -37 -63 3 65 -39 -17 114 -41 -19 70 -87 25 55 -1 -42 94 7
7347 7 -79 16 -17 2 14 -27 -84 12 18 6 26 -73 -86 -13 -51 -84 -54 4 -61 -50 86 -59 -16 97 -15 -35 45 -52 -35
$$ packed form
7149E3n7pN1p3oO5j4j05J08Om5RLm0O3N7p1RN8q7N7M7o7o8Q0Nj8j1k0M8K1k9j37
7182a15J33J4q8J00n9n0N0L6j11J03M0r5J8M0o6l6J06j12L4J08j01K9N5n2m5K1
7208d3O7n3R2l2n2L0K7o5O7oq7K0J22j59P1K3j17Q3R4j10L7j0Pj03J39L3q4K4
7236A5M3o5mR7k16R8J7k5N0J6j39J2J49j20M2Q2j20m4J16l7l3N2K7q3O0J1j9L3
7264A5lj2L6L3j15Q3%n1OR6j20O3Pk8o4R3L6o5J0J6q0J09K6j74J20J3j01K9P0
7293D8r9L8J04j19M7K9p2J9J01q6j15J34q0o7O4N2o9P8qq9R1P1p7l9R7m0j9K0
7321A4qm8J49r1k5P4m4k9J00j29k6O6O2j04K2J31j55K2Q9j57J12L0n6m1J36q7
7347Gq6R5l3J9J2m1n7R6Oj2K0r9j3P3l8l3L0N8o5J1J36j45M3J13j12k0Q0r7J7
$$ plain form
7376 -35 70 -34 -33 37 28 -107 -37 43 -99 67 71 -29 18 75 -116 -14 30 -75 -33 8 -9 -29 23 16 -69 66 37
7403 37 -52 33 6 -2 118 105 -83 -24 30 -58 70 40 -80 -21 76 -17 17 40 -14 -92 84 11 -36 44 0 -40 26 -10
7431 -10 -68 13 120 -31 -21 52 1 78 54 -78 -42 92 -12 -54 47 14 18 77 -18 -8 82 16 -28 1 2 -27 76 -6
7459 -6 -26 6 26 -36 4 15 -47 -63 84 -92 -52 38 -2 -9 34 17 -121 27 -85 -67 -20 48 -28 32 53 -71 -11 62
7487 62 -59 -76 0 -15 41 28 -55 -60 46 39 -44 28 -12 -44 17 7 -47 85 13 -47 36 62 -22 18 26 -21 16 79 -4 23
7517 23 73 -11 -27 65 -44 -28 87 44 -45 38 11 -77 30 62 -11 -38 37 -41 -18 25 -62 -20 42 -52 -35 87 -24 -27
7545 -27 67 5 -74 71 -22 -98 4 -14 -7 -48 16 -95 -16 67 -15 84 67 -63 -26 50 -7 11 19 -70 -37 22 54 -11 73
7574 73 2 -54 -11 48 -21 15 23 -12 53 78 -109 -27 93 -62 -60 50 -34 -18 38 -29 -41 8 -9 -52 26 -46 -108 33 22
$$ packed form
7376c5J05j04JP0rj35P0Q0j42J66Mj00M7N7j91J02M4j05M2M1j7k0N2pq5J35k9
7403C7q9Q5k7qJ20j3j88N9N4q8J28l0j20N9R7r3L4K3n4p8J76p3m7Q0m4m0O6l6
7431a0n8Q1J07j51J0P3n1P7k4j32L6J34j04m2J01l3MN9r5J0R0o6m4K9Jk9J03q2
7459fk0L2K0o2M0J1o2j6J47j76M0R0m0pM3j7j38J48j12J8M7O8p6O0K1j24O0P3
7487F2j21j7P6j5N6j3q3nJ06pq3P2m0l2O1j0n4J32p2o0Q3K6q4M0Qm7L7O3q3K7
7517B3N0q4j6R2j09J6J15m3q9Q3k7q8J07L2p3k7P5p8K3M3q7M2O2r4J7J22j11l
7545b7R4o2p9J45r3p6J02j8Pm1O4j11P9Q3q2R9j7j30L7P6n7J8Qq9L3N9L2o5Q4
7574G3p1n6M3N9o9L6Ql5O5K5j87Q2J20j55KJ10q4J6N6o7j2M9j7m3P8p2o2J41j1
$$ plain form
7603 22 -79 5 27 -69 27 3 -31 -21 11 -73 -1 31 -40 -13 6 8 -18 32 -36 -77 24 -7 -10 47 55 -93 -30 86 -29
7632 -29 -34 93 29 -14 26 -90 -8 70 -39 7 79 -33 -31 62 -35 -42 40 -23 -23 -11 24 -79 53 18 8 17 100 -5 -29
7661 -29 59 -67 -8 92 -22 -26 38 -6 -74 80 72 -46 0 63 -42 83 14 -60 -35 18 -38 -38 32 -34 45 11 12 -14 71
7690 71 -22 -37 34 2 -3 85 10 -35 32 -11 -33 63 44 -59 19 17 6 -39 22 -54 -21 82 -28 -11 66 -5 -56 60 74
7719 74 -61 44 33 -106 10 9 -12 20 36 -28 -7 28 -14 -57 59 -23 -53 3 -75 -42 6 -61 -37 43 17 26 -25 7 -33
7748 -33 -10 23 -85 24 44 6 -34 8 -4 56 38 -58 -34 7 -56 -14 49 -17 -85 12 22 -96 23 83 -49 67 73 -66
7776 -66 25 50 -18 17 100 -91 -46 42 -10 9 39 -16 -35 19 30 -113 63 7 -17 102 34 -13 36 18 -51 10 97 -13
7804 -13 28 50 -23 -61 65 18 -9 15 -19 -39 88 -15 -53 83 -3 -60 19 -13 -44 22 85 -57 -43 -8 -38 -34 73 -31
$$ packed form
7603B2j01Q4K2r6R6k4l4J0L2q4P2L2p1K7J9Kk6N0o8m1J01l1lN7Qj48O3J16j15
7632b9nJ27o4m3M0j16Q2P8j09M6P2j12KR3r7pQ2o3%J2L5j03J32l5j0RQ3j05k4
7661b9Q8j26N9J00j14mO4m4o8J54qj18M6O3j05J25o9p4K5N3n6%P0o6P9l4Jk6Q5
7690G1r3j5P1l2nQ8p5m5O7m3k2R6j9j03P8kj1m5O1p6L3J03j10J7P7p1n1J16J4
7719G4j35J05j1j39J16jk1L2J6o4K1L5m2m3J16q2l0N6p8L3M8o7K4Q0k6Rn1L2m0
7748c3K3L3j08J09K0l8m0M2j2O0j8r6K4M1o3M2O3o6o8R7J0j18J19O0j32J16Oj39
7776f6R1K5o8L5Q3j91M5Q8n2J9L0n5j9N4J1j43J76n6k4J19o8m7M9j8o9O1Q7j10
7804a3M1K2p3l8J26m7k7K4l4k0J27j03l8J36q6n7P9l2l1O6O3j42J4L5l0MJ07j04
$$ plain form
7832 -31 -8 48 -23 33 96 -71 -60 -13 -40 -10 70 44 -49 95 67 -20 -46 11 -59 -38 8 -84 -8 9 -2 8 143 -10
7860 -10 -47 104 -16 -43 68 34 -7 29 -25 27 47 36 -75 -2 35 -16 6 87 38 18 84 -35 -63 31 31 -33 -11 34
7888 34 -87 36 20 -67 66 16 -94 1 10 -7 -42 26 -75 -34 82 15 22 40 -34 -54 99 -102 2 53 -16 -37 29
7915 29 2 20 -4 54 -68 -10 66 -112 -88 46 -54 -34 62 -68 -26 24 -59 -63 -17 -69 -44 31 -22 -24 54 -12 -46 24 1
7944 1 -78 38 22 -39 -1 23 -76 -48 19 -25 -46 64 2 -68 125 35 28 53 -23 -83 12 3 -98 35 38 -49 -1 -10 -80 15
7974 15 105 -30 -19 18 -45 -3 45 -19 -22 33 -4 -8 55 -24 -6 40 7 -34 -39 15 -82 -16 35 -74 -30 89 -83 -63 -9 -26
8004 -26 -11 82 -45 -61 38 43 -40 -19 27 -56 30 40 -53 10 15 16 -13 46 -17 -6 146 -14 8 70 -11 -41 65 -27 -26 -11
8034 -11 -9 -97 48 -27 -15 -3 16 -103 -53 91 18 24 20 -37 36 22 -46 -51 108 -39 -12 -17 62 -13 60 -29 -28 105 2 -2
$$ packed form
7832c1K3N6p1N6O3j67J1M7k7L0Q0k6r3J44k8q7k6N7p0K1M6r2P6J7j1J0J35j53
7860a0l7J51j20k7J11l4m1L6n4N2K0j1j11P3L7n1K2Q1m9k0O6j19k8R4%o4K2M5
7888C4j21J23j6q7J33n0j10R5Rj7l5O8j01M1J16o7PJ8p4k0J53k01J04N1o9k1O6
7915B9k7J8k4N8j22N8P6j78K4J34j00K0R6j30M2N0q3mM6n2K5P5n3kP8o6l4P0k3
7944Ap9J16j6o1L8K4r9K8O7m4k1J10o2p0J93r0pK5p6o0R5rj01J33Lq7M8rp0R5
7974A5R0j35J1L7o3M2M8o4lN5l7mO3p9J8M6l3m1nN4r7O6N1j09M4J19j72K0N4j7
8004b6J5R3j27j6R9Nq3K1M6q3Q6J0r3O3NJk9N9o3J1J52j60K2O2q1l0J06r2JJ5
8034a1Kq8J45p5J2J2J9j19N0J44p3Omn7P3j4o8nJ59j47K7nP9p5P3q9JJ33j03m
$$ plain form
8064 -2 -8 111 -98 21 31 -25 -26 59 -38 -30 16 -55 -39 20 -54 -37 100 21 -64 -21 -2 -4 6 -27 -44 -18 3 -29 117 99
8094 99 -40 -11 64 -10 20 -47 -54 19 87 16 -70 25 -21 -60 31 5 -81 5 14 -105 36 14 -101 1 84 -76 -7 83
8122 83 -29 -38 35 -34 -21 25 -19 -31 14 -29 -29 15 21 -25 73 13 -24 20 66 -34 -25 35 -9 -4 -11 -54 -24 -30 -37 -16 58 6 15 11
8156 11 -20 -33 16 -15 6 38 54 -86 19 28 -5 27 8 -12 -5 82 -12 38 32 -29 -30 -48 23 -23 61 -36 -17 58 17 -24 -17 13
8188 13 -13 -15 37
$$ packed form
8064boJ19k09J19J0n6jQ5r7QM6p1J6N9p4J7J37p9q5M3J9kJ0l3j7K6K1l2J46j8
8094I9j39K9P5p4L0o7pP3O8p1q6R5m6l9R1k6q6Q6Rj19J41k2j15J02Q3j60O9R0
8122H3j12rP3o9J3M6m4j2M5m3%M4Om6R8o0l7M4M6j00RO0m4Npm3L0opK1P4n2Rm
8156A1l1j3M9l1K1L2J6j40J05Rl3L2j9k0PQ7r4N0oo1jj8P1m6Q4r7J9P5m1m1PL0
8188A3k6kN2
8191C7
$$ Imaginary data points
##PAGE= N=2
##DATA TABLE= (X++(I..I)), XYDATA
$$ plain form
0 0 0 0 0 0 0 0 0 0 0 0 0 0 0 0 0 0 0 0 0 0 0 0 0 0 0 0 0 0 2 -5 5 -5 5 -6 6 -6 7 -7 8 -10 13 -13 13 -14 16 -19 21
47 21 -22 27 -29 36 -41 49 -59 74 -98 135 -205 359 -850 4741 30680 13362 -9767 -654 19537
66 19537 29663 19181 1042 11246 35516 28981 10978 16598 26943 26947 23914 16887 17602 28850
80 28850 22953 8524 17822 27818 14331 5253 10875 15328 16600 8214 -5870 1860 17879 6792
94 6792 -9682 -4949 2231 3225 1031 -9701 -12473 1109 1961 -9595 -7760 -4156 -8194 -3557 970
109 970 -5788 -7085 -3440 -2877 4016 5569 -7847 -6515 11625 11792 -207 -1202 3867 12273 17328
124 17328 3993 -4394 12469 21293 7838 2055 7432 11202 13379 6852 -1334 7675 13411 -1273
138 -1273 -5676 6297 5099 -5195 -8515 -7836 -1670 -41 -16673 -23885 -5851 -942 -18967 -26990
$$ packed form
0@%%%%%%%%%%%%%%%%%%%%%%%%%%%%KpJ0j0J0j1J2j2J3j4J5j8K3k6K6k7L0l5M0
47B1m3M9n6O5p7R0j08J33j72K33l40N64j209N591K5939j7318k3129R113K0191
66A9537J0126j0482j8139J0204K4270o535j8003N620J0345Ml033p027P15J1248
80B8850n897j4429R298R996j3487r078N622M453J272q386j4084P730J6019j1087
94F792j6474M733P180R94k194j0732k772J3582Q52j1556J835L604m038M637M527
109I70o758j297L645N63O893J553j3416J332J8140J67j1999r95N069Q406N055
124A7328j3335q387J6863Q824j3455n783N377L770K177o527q186R009N736j4684
138a273m403J1973j198j0294l320O79O166J629j6632p212J8034M909j8025q023
$$ plain form
152 -26990 -19326 -10251 -8219 -22357 -33181 -16552 -3014 -17556 -27762 -18046 -9978 -8748 -12482
165 -12482 -18807 -10921 1515 -5622 -12427 -1127 4271 -837 353 3441 6265 11169 6276 1192
179 1192 13479 19693 6768 3934 14246 16661 13569 9009 4456 11944 18923 7102 -240 9207
193 9207 11089 4096 2782 1430 1362 5101 -649 -6934 1227 2780 -8570 -7830 76 -2352 -6275 -7946
209 -7946 -8622 -955 1280 -11217 -12101 2139 2427 -6924 -7189 -3248 2148 5321 -3925 -7843 5784
224 5784 9966 -1471 -2063 5795 7303 6582 2999 446 9488 13013 900 -151 11611 10700 3022
239 3022 2706 4171 7879 9667 -454 -3706 8608 9092 -3438 -4144 2339 3233 1415 -4971 -8220
254 -8220 1612 3979 -8933 -10084 116 -804 -6655 -7362 -6940 -2200 124 -9104 -10543 1457 1412 -8290
$$ packed form
152b6990P664R075K032j4138j0824J6629J3538j4542j0206R716Q068J230l734
165a2482o325P886J2436p137o805J1300N398n108J190L088K824M904m893n084
179A192J2287O214j2925k834J0312K415l092m560m553P488O979j1821p342R447
193I207J882o993j314j352o8L739n750o285Q161J553j1350P40P906k428l923j671
209g946o76P667K235j2497q84J4240K88r351k65L941N396L173r246l918J3627
224E784M182j1437n92P858J508p21l583k553R042L525j2113j051J1762r11p678
239C022l16J465L708J788j0121l252J2314M84j2530p06O483Q94j818o386l249
254h220R832K367j2912j151J0200r20n851p07M22M740K324r228j439J2000m5r702
$$ plain form
270 -8290 -6419 -531 612 232 -4465 -5233 5130 6103 -5362 -3560 6896 5433 164 -337 836
285 836 6495 7684 -2385 -2599 8954 7078 -2328 -620 3867 4482 3783 -2396 -3669 6368 5894 -5908
301 -5908 -3956 4652 2343 -2004 -2982 -2781 2949 3365 -6499 -5385 5220 2111 -5869 -3168 416 1285
317 1285 913 -5256 -5410 4614 2946 -7734 -4594 3053 454 -3104 -4519 -4104 2306 1789 -8418
332 -8418 -6289 3921 344 -6635 -4387 -1398 450 204 -6336 -5407 4709 2277 -7192 -3056 4090
347 4090 2202 -515 -2276 -1051 6345 5310 -4326 -846 8756 4879 -1185 1165 3690 5930 5160
362 5160 -1938 -556 8892 5249 -3720 204 5291 2904 532 -2190 -1616 4975 2482 -6986 -2955
377 -2955 4754 -287 -5196 -2868 -1264 727 -454 -6942 -4102 4378 -420 -7557 -2191 2325 -185
$$ packed form
270h290J871N888J143l80m697p68J0363R73j1465J802J0456j463n269n01J173
285H36N659J189j0069k14J1553j876r406J708M487O15o99o179j273J0037m74j1802
301e908J952Q608k309m347r78K01N730M16r864J114J0605l109p980K701L584Q69
317A285l72o169j54J0024j668j0680L140P647k599l558j415M15O410n17j0207
332h418K129J0210l577o979K248K989J848k46o540R29J0116k432r469M136P146
347D090j888k717j761J225P396j035r636L480R602l877o064K350K525K240p70
362E160p098J382R448l643q969L924N087k387k372k722N74O591k493r468M031
377b955P709n041m909K328J604J991j181o488K840Q480m798p137N366M516k510
$$ plain form
392 -185 -1797 -3644 -1663 5105 1724 -6362 -299 7024 1509 -2512 351 2734 5209 3076 -3568
407 -3568 834 9168 3192 -3635 1753 5653 3692 1504 -1732 521 7395 2777 -5668 56 6362
422 6362 807 -3321 -2030 24 2981 -258 -7674 -3077 4760 -1628 -8006 -3389 13 -1016 -3237
437 -3237 -7222 -4304 3210 -1547 -9157 -3213 2731 -1328 -3957 -3112 -1117 3273 961 -5467 -116
452 -116 7009 1293 -2729 2298 4635 4068 2814 -480 2863 9096 3506 -2576 4108 8070 2915 636
468 636 1391 3230 6326 1973 -4333 1747 7059 -311 -4281 340 1896 977 -1452 -5243 -1249 4386
484 4386 -2269 -7597 -652 2578 -2075 -3798 -3448 -880 2991 -1663 -7074 -113 4984 -1973 -4674
499 -4674 -258 1638 1690 -941 -4729 227 5731 -1168 -5803 681 3307 -361 -2090 -3042 -737 3585
$$ packed form
392a85j612j847J981O768l381q086O063P323n515m021K863K383K475k133o644
407c568M402Q334n976o827N388L900j961k188l236K253O874m618q445N724O306
422F362n555m128J291K054K957l239p416M597P837o388o378M617L402j029k221
437c237l985K918P514m757p610N944N944m059k629Q45J995M390k312o428N351
452a16P125n716m022N027K337n67j254l294L343O233n590o082O684L962n155k279
468F36P55J839L096m353o306O080N312p370l970M621J556r19k429l791L994N635
484D386o655n328O945L230m653j723L50K568L871m654n411O961N097o957k701
499d674M416J896N2k631l788M956N504o899m635O484K626l668j729r52K305M322
$$ plain form
515 3585 -1243 -6643 -427 3456 -2556 -4237 -1187 -566 225 -1654 -5028 -578 3339 -3019 -5205 1253
531 1253 1895 -1713 -2067 -1806 805 3582 -2035 -5143 2627 4972 -2145 -3167 851 2244 2378 -1098
547 -1098 -4100 2056 5338 -2305 -4247 2324 2836 -591 -1501 -1693 1645 4061 -2344 -4744 3592 4830
563 4830 -2438 -2882 1346 3433 3356 -1537 -3799 4407 7594 -1326 -3624 3519 5574 3072 149 -1492
579 -1492 3659 7820 949 -3055 3936 6220 1521 468 1502 2778 4655 1006 -2201 3702 5432
594 5432 -1517 -1991 3090 2559 333 -1288 -2555 1656 3781 -3230 -5475 1358 1925 -2952 -3581 -2989
610 -2989 -1342 720 -3363 -6265 -748 626 -4817 -4045 -603 -2151 -2865 -2494 -3104 -7 617 -4908
626 -4908 -3383 3646 1522 -3625 -1870 1248 2971 2573 -2564 -2558 5722 5339 -2498 -1785 3534 3751 2088
$$ packed form
515C585m828n400O216L883o012j681L050O21P91j879l374M450L917o358k186O458
531A253O42l608l54K61K611K777n617l108P770K345p117j022M018J393J34l476
547a098l002O156L282p643j942O571N12l427r10j92L338K416o405k400Q336J238
563D830p268m44M228K087p7m893k262Q206L187q920k298P143K055k502k923j641
579a492N151M161o871m004O991K284m699j053J034J276J877l649l207N903J730
594E432o949m74N081n31k226j621j267M211K125p011k245O833N67m877o29N92
610b989J647K062m083k902N517J374n443P72L442j548p14L71o10L097O24n525
626d908J525P029k124n147J755L118J723l98n137OQ280l83p837P13N319K17j663
$$ plain form
643 2088 -823 -1899 3428 4408 -2862 -2924 3024 1455 -2775 -2301 -1347 250 18 -5486 -5196 2151 564
660 564 -7035 -5408 -101 125 -2092 -5618 -5130 2151 2786 -5407 -5110 2235 2660 -500 -1464 -1067 2954
677 2954 4946 -464 -1381 5122 4857 231 1771 4168 3634 3370 1233 1053 5745 4507 -2015 86
693 86 5422 2946 -781 -977 -173 2752 2386 -3914 -3779 2717 1106 -4039 -2999 -1106 -775 -762 -3737
710 -3737 -4235 700 -90 -5252 -2717 1244 -1438 -3132 -2009 -1212 1264 480 -4356 -1840 4360 1367
726 1367 -3351 -821 2132 2632 1661 -2081 -958 5370 3604 -2569 -78 4334 2636 891 366 569
742 569 3898 3210 -1984 27 5036 1752 -1962 454 2068 2100 1022 -2539 -947 4440 1438 -4404
758 -4404 -1138 2893 666 -1524 -2387 -1230 2633 1032 -4595 -1804 3240 209 -2880 -905 365
$$ packed form
643B088k911j076N327R80p270o2N948j569m230M74R54J597k32n504K90P347j587
660E64p599J627N307K26k217l526M88P281O35q193K97P345M25l160r64L97M021
677B954J992n410r17O503k65m626J540K397n34k64k137j80M692j238o522K101
693H6N336k476l727j96Q04K925l66o300J35O496j611n145J040J893L31J3k975
710c737m98M935p90n162K535L961k682j694J123P97K476p84m836K516O200k993
726A367m718K530K953N00r71l742J123O328j766o173K491M412j698j745n25K03
742E69L329o88n194K011N009l284l714K416J614L2j078l561J592N387l002n842
758d404L266M031k227k190q63J157L863j601n627K791N044l031l089J975J270
$$ plain form
773 365 1226 692 -2859 -1100 4123 1025 -3566 53 3154 1018 -481 -1210 93 3766 1313 -3740
789 -3740 -282 4151 408 -2339 -605 446 1395 149 -3649 -1443 3237 -460 -4651 -1039 1351
804 1351 -467 -1803 -2846 -1503 2298 -513 -4999 -981 2762 -893 -2962 -1171 -39 1374 65
819 65 -3713 -964 3596 -279 -3659 -179 1586 51 -1085 -2455 -739 2853 -690 -4980 -507 2661
835 2661 -1246 -3281 -1733 -406 1268 -972 -4803 -1058 3348 -835 -3921 -537 1349 888 -138
850 -138 -2125 75 4287 1054 -2661 1661 4298 1240 310 1312 2374 4145 2164 -1158 2506 5673
866 5673 1408 -802 2303 3178 2401 1166 -1076 914 4303 501 -2906 904 2520 -420 -1138 -732
882 -732 -371 1344 -706 -3506 56 2209 -2176 -2827 505 432 -610 -1162 -2220 427 2631 -1845 -3507
$$ packed form
773C65Q61n34l551J759N223l098m591L619L101k136j499p29J303L673k453n053
789c740L458M433l743k747J734J051R49j246l798K206M680l697m191L612K390
804A351j818j336j043J343L801k811m486M018L743l655k069J791J132J413j309
819F5l778K749M560l875l380L480J765j535j136j370J716L592l543m290M473L168
835B661l907k035J548J327J674k240l831L745M406m183l086L384J886m61j026
850a38j987K200M212l233l715M322K637l058r30J002J062J771j981l322L664L167
866E673m265k210L105Q75p77j235k242J990L389l802l407L810J616k940p18M06
882g32L61J715k050k800L562K153m385o51L332p3j042n52j058K647K204m476j662
$$ plain form
899 -3507 1682 2614 -1005 -1396 -243 1298 2602 -771 -3076 1949 3792 -1208 -2134 1274 1717 1020
915 1020 -637 -2087 1342 3498 -1705 -3403 1675 2440 -1064 -1986 -1393 798 2173 -2089 -4440 900
931 900 2818 -2257 -3527 -838 467 476 -1933 -4256 -215 2632 -2139 -4130 -136 1001 -635 -1510
947 -1510 -2264 -184 2414 -1033 -3310 1136 2611 -953 -1077 594 1044 1886 367 -1689 1760 3572
963 3572 -524 -1179 2175 1908 456 374 -307 1086 2560 -775 -2014 2037 1788 -1895 -1011 645 142
980 142 261 -1298 -2265 1283 1602 -2978 -2107 1800 708 -1346 -1181 -801 1419 2052 -2156 -1990 3102
997 3102 2398 -1629 -760 1490 2019 1760 -1027 -1381 3228 3243 -2045 -1483 2438 1911 -129 -1263 -1406 1649
1015 1649 2350 -2689 -3205 1799 1452 -2107 -2137 -913 338 800 -2417 -3365 1267 1731 -2671 -2137 874
$$ packed form
899c507N189R32l619l91J153J541J304l373k305N025J843n000r26L408M43o97
915A020j657j450L429K156n203j698N078P65l504r22N93K191J375m262k351N340
931I00J918n075j270K689J305Rk409k323M041K847m771j991L994J137j636q75
947a510p54K080K598l447k277M446J475l564j24J671M50Q42j519k056L449J812
963C572m096o55L354k67j452q2o81J393J474l335j239M051k49l683Q84J656n03
980A42J19j559r67L548L19m580Q71L907j092k054J65L80K220O33m208J66N092
997C102p04m027Q69K250N29k59k787l54M609J5n288N62L921n27k040j134j43L055
1015A649P01n039n16N004l47l559l0J224J251M62l217r48M632M64m402N34L011
$$ plain form
1032 874 677 28 -964 -1508 1700 2567 -1667 -1514 2726 2058 -469 46 672 1711 2375 -601 -1279 2898
1050 2898 2448 -1592 -455 1756 877 337 -668 -1194 1554 1506 -2611 -1731 2037 310 -2080 -1060 -354
1067 -354 510 449 -2641 -2101 2249 815 -3124 -1221 1260 442 -334 -1535 -1322 2241 1648 -2845 -1230
1084 -1230 2739 1071 -1152 -579 49 1738 1677 -1931 -1230 3092 1582 -1913 -245 1430 1048 659 -984
1101 -984 -964 2419 1606 -2387 -753 2209 366 -1082 -695 -452 1081 812 -2556 -1683 2195 305 -2615
1118 -2615 -922 244 -16 -187 -1889 -1695 1590 468 -2923 -825 1573 -240 -1121 -454 -337 1267
1134 1267 884 -2033 -262 3101 454 -1794 642 1834 1145 469 -1155 98 3390 1024 -2685 78
1150 78 2755 572 -838 -972 -331 1825 615 -3124 -1119 2278 -211 -2545 -835 -2 80 -348 -2415
$$ packed form
1032H74j97o49r92n44L208Q67m234J53M240o68k527N15O26J039O64k976o78M177
1050B898m50m040J137K211q79n40j005n26K748m8m117Q80L768j727k390J020P06
1067c54Q64o1l090N40M350j434l939J903K481q18p76j201K13L563n93m493J615
1084a230L969j668k223N73O28J689o1l608P01M322j510l495J668J675l82l89j643
1101i84K0L383q13l993J634K962j843j448L87K43J533k69l368Q73L878j890k920
1118b615J693J166k60j71j702J94L285j122l391K098K398j813q81O67J17J604
1134A267l83k917J771L363k647k248K436J192o89o76j624J253L292k366l709K763
1150G8K677k183j410j34O41K156j210l739K005L397k489k334J710Q33Q2m28k067
$$ plain form
1167 -2415 -1143 2065 -205 -3121 -132 1916 -111 -1007 -786 203 2518 919 -2562 122 3523 924
1183 924 -1122 154 1009 1858 1358 -1457 -443 2901 851 -1844 199 1189 -279 -335 -756 -844 935
1200 935 -429 -2844 -188 1637 -1497 -2437 -391 281 312 -670 -2682 -318 2808 -147 -2664 168
1216 168 1788 774 299 -744 92 2724 1249 -1489 926 2727 380 50 1198 841 1364 829 -1024
1233 -1024 978 2924 -537 -1923 1161 1741 -125 -927 -1492 4 2245 -631 -3488 -232 1788 -785
1249 -785 -1722 -1168 -725 661 -132 -2582 -745 1412 -1029 -1896 474 199 -772 -496 -775 294 1601
1266 1601 -1083 -2259 1674 2270 -1050 -1308 506 1256 1871 -249 -2132 1201 3348 -306 -1615 848
1282 848 1396 925 212 -1141 298 2281 -473 -2008 970 1274 -1233 -1093 -222 27 474 -1536 -2806
$$ packed form
1167b415J272L208k270k916K989K048k027q96K21R89K315j599l481K684L401k599
1183I24k046J276Q55Q49n00k815J014L344k050k695K043R90j468n6m21q8J779
1200I35j364k415K656J825l134r40K046O72L1r82k012K364L126k955k517K832
1216A68J620j014m75j043Q36K632j475k738K415J801k347l30J148l57N23n35j853
1233a024K002J946l461j386L084N80j866q02n65J496K241k876k857L256K020k573
1249g85r37N54M43J386p93k450J837K157k441q67K370k75r71K76k79J069J307
1266A601k684j176L933N96l320k58J814P50O15k120j883L333K147l654j309K463
1282H48N48m71p13j353J439J983k754j535K978L04k507J40Q71K49M47k010j270
$$ plain form
1299 -2806 633 1655 -2311 -2967 -83 549 -250 -1590 -2883 -110 2347 -1079 -2964 232 1503 -40
1315 -40 -241 -583 116 2196 733 -1124 1281 2399 47 356 1803 1115 1130 981 -121 1623 2636
1332 2636 -506 -1029 2004 1659 -399 -348 -350 402 1428 -902 -2387 573 1072 -1668 -1401 -93 -739 -396
1350 -396 -621 -1668 20 752 -1967 -1465 1499 313 -1519 -536 188 858 1124 -1424 -1273 2499 1951
1367 1951 -1722 -935 1319 1445 880 -799 -1451 1737 2314 -1506 -1656 1367 1046 -456 -663 -814 625
1384 625 1396 -1609 -1993 1515 1080 -1748 -989 424 484 521 -1156 -1668 1471 1881 -1829 -1507 1298 976
1402 976 51 -508 -1007 856 2031 -1019 -1640 1397 1198 -855 -273 -3 117 983 -464 -1387 978 1045
1420 1045 -1546 -580 1136 0 -447 -247 -623 787 1200 -1540 -1012 1876 674 -1186 -125 493 591
$$ packed form
1299b806L439J022l966o56K884O32p99j340j293K773K457l426j885L196J271j543
1315d0k01l42O99K080j463j857K405J118k352L09J447o88J5j49j102J744J013
1332B636l142n23L033l45k058N1kP52J026k330j485K960M99k740K67J308o46L43
1350c96k25j047J688P32k719N02K964j186j832R83P24O70K66k548J51L772n48
1367A951l673P87K254J26n65j679o52L188N77l820j50L023l21j502k07j51J439
1384F25P71l005l84L508m35k828P59J413O0L7j677n12L139M10l710L22K805l22
1402I76r25n59m99J863J175l050o21L037j99k053N82K70J20Q66j447r23K365O7
1420A045k591R66J716j136m47K00l76J410M13k740N28K888j202j860J061O18R8
$$ plain form
1437 591 874 -776 -962 1898 1273 -1472 -199 1548 425 -8 -213 -408 1363 1238 -1631 -718 2086
1454 2086 629 -1224 -211 333 684 667 -1343 -1103 1928 797 -2206 -697 1080 148 -419 -1111 -1201
1471 -1201 1013 731 -2318 -1314 1338 -70 -1566 -837 -666 13 344 -1902 -1505 1391 247 -2023
1487 -2023 -476 745 -31 -83 -592 -539 1569 1024 -1506 -50 2153 659 -282 578 669 1379 1376 -739 2
1506 2 2539 949 -1092 504 1329 378 206 -627 -653 1319 289 -2214 -664 1081 -700 -1517 -945 -920
1524 -920 -34 -315 -2540 -1340 1191 -579 -2376 -510 386 -94 -164 -1146 -496 1901 715 -1564 314
1541 314 2214 721 90 503 718 2020 1551 -787 471 2795 906 -611 865 1231 857 723 -630
1558 -630 -265 1872 301 -1904 -77 1015 -511 -941 -748 -823 431 -267 -2340 -832 1154 -881 -1927
$$ packed form
1437E91K83j650j86K860o25k745J273J747j123m33k05j95J771j25k869R13K804
1454B086j457j853J013N44L51j7k010K40L031j131l003J509J777r32n67o92r0
1471a201K214k82l049J004K652j408j496P29J71O79L31k246L97K896j144k270
1487b023J547J221p76n2n09N3K108n45k530J456K203j494r41Q60R1P10lk115P41
1506BK537j590k041J596Q25r51j72q33k6J972j030k503J550J745j781q17N72K5
1524i20Q86k81k225J200K531j770j797J866Q96m80p0r82O50K397j186k279J878
1541C14J900j493o31M13K15J302m69k338J258K324j889j517J476L66l74j34j353
1558f30L65K137j571k205J827J092j526m30J93p5J254o98k073J508J986k035j046
$$ plain form
1575 -1927 -415 -94 -257 -269 -1480 -670 1354 -250 -1876 373 1158 -234 -220 -45 138 1397 558 -1318
1593 -1318 592 2164 74 -655 813 975 911 574 -704 389 2213 172 -1338 869 1433 6
1609 6 -101 -293 -18 1394 30 -1821 179 1436 -746 -1373 -139 -160 33 -402 -1787 -574 1166 -981
1627 -981 -2116 21 303 -770 -689 -1010 -482 962 -446 -1922 280 1315 -679 -799 254 245 758 230
1645 230 -1159 416 1980 -194 -1085 954 986 67 115 -393 215 1451 -246 -1584 610 1221 -842
1662 -842 -862 -63 -159 402 -415 -1817 42 1288 -1069 -1578 417 405 -322 -254 -807 160 1453 -440 -1344
1681 -1344 965 1432 -422 -255 585 537 1148 235 -959 1029 1899 -501 -718 1078 856 222 57 -592
1699 -592 399 1387 -634 -1399 852 901 -779 -462 -69 13 682 -391 -1372 671 1305 -971 -818 852
$$ packed form
1575a927J512L21j63j2j211Q10K024j604j626K249P85j392J4J75J83J259q39j876
1593a318J910J572k090p29J468J62o4l37j278J093J824k041j510K207N64j427
1609Fj07j92K75J412j364j851K000J257k182o27J234k1J93m35j385J213J740k147
1627i81j135K137K82j073Q1l21N28J444j408j476K202J035j994j20J053rN13n28
1645B30j389J575J564k174q91K039L2r19M8n08O08J236j697j338K194O11k063
1662h42k0P99r6N61q17j402J859J246k357n09J995j2p27O8n53R67J293j893r04
1681a344K309M67j854J67Q40m8O11r13j194J988Q70k400k17J796k22o34j65o49
1699e92R91R88k021p65K251M9j680L17L93Q2O69j073r81K043O34k276J53J670
$$ plain form
1717 852 518 193 78 -517 702 1716 -436 -887 1321 1114 -268 16 152 369 1203 -257 -1246 830
1735 830 1107 -999 -721 382 -87 -142 -395 -1248 14 719 -1401 -1498 497 -86 -1267 -720 -671 -301 292
1754 292 -1061 -1609 592 611 -1398 -876 324 -37 73 -410 -1002 529 1091 -1032 -804 1087 460 -571
1772 -571 -7 -19 429 919 -645 -790 1413 938 -999 -190 964 511 385 -253 -543 1256 1385 -1018
1790 -1018 -570 1469 744 -237 -105 -172 648 1152 -807 -964 1234 777 -972 -314 345 113 199 -573 -947
1809 -947 860 842 -1311 -815 977 268 -305 -285 -469 739 1152 -818 -782 1340 938 -495 89 380 451
1828 451 1025 -37 -646 1043 1097 -636 -65 901 103 -59 171 -412 320 474 -1078 -704 851 -236
1846 -236 -1252 -358 -40 -277 -46 -1015 -1056 629 67 -1460 -540 427 -400 -422 -264 -610 349 353 -1221 -431
$$ packed form
1717H52l34l25j15n95J219J014k152m51K208k07j382K84J36K17Q34j460r89K076
1735H30K77k106K78J103m69n5k53q53J262P05k120r7J995n83j181N47M9L70N93
1754B92j353n48K201J9k009N22J200l61J10m83n92J531N62k123K28J891o27j031
1772e71N64j2M48M90j564j45K203m75j937Q09J154m53j26o38k90J799J29k403
1790a018M48K039p25r81J32o7Q20N04j959j57K198m57j749O58O59k32Q6p72l74
1809i47J807j8k153M96J792p09n73K0j84J208M13j970L6K122m02j433N84K91P1
1828D51N74j062o09J689N4j733N71R66p98j62K30n83P32J54j552L74J555j087
1846b36j016Q94L18k37K31r69m1J685n62j527R20R67q27k2J58l46R59Mj574P90
$$ plain form
1866 -431 1193 -183 -1030 38 316 30 7 -916 -492 1213 120 -1569 -295 859 -79 -530 -702 -610
1884 -610 889 387 -1531 -589 1191 163 -786 -50 159 640 691 -673 -232 1645 730 -731 482 1209
1902 1209 617 635 125 83 1556 994 -908 110 1559 394 -349 70 55 577 541 -973 -686 1044 122
1921 122 -1214 -316 1 -432 -166 -734 -866 429 -42 -1351 -233 663 -506 -559 24 -93 392 324 -798
1940 -798 -4 1407 178 -655 507 728 333 548 -40 137 1345 621 -746 443 1207 108 -109 289
1958 289 130 655 311 -972 -18 1194 -258 -1046 164 273 -208 -198 -876 -579 691 -441 -1651 -249
1976 -249 371 -729 -749 -637 -553 70 -346 -1593 -394 734 -616 -1110 -34 23 -97 -122 -692 -82 1187
1995 1187 16 -882 658 1101 133 159 351 393 1275 684 -474 765 1592 221 -206 738 632 460 357
$$ packed form
1866d31J624j376q47J068K78k86k3r23M24J705j093j689J274J154r38m51j72R2
1884f10J499n02j918R42J780j028r49P36K09M81N1j364M41J877r15j461J213P27
1902A209n92J8n10m2J473n62j902J018J449j165p43M19j5N22l6j514K87J730r22
1921A22j336Q98L17m33K66n68j32J295m71j309J118Q96j169n3N83j17M85o8j122
1940g98P94J411j229q33J162K21l95K15n88J77J208p24j367J189P64j099k17L98
1958B89j59N25l44j283R54J212j452p88J210J09m81J0o78K97J270j132j210J402
1976b49O20j100k0J12Q4O23m16j247J199J128j350m94J076N7j20k5n70O10J269
1995A187j171q98J540M43r68K6J92M2Q82n91j158J239Q27j371m27R44j06j72j03
$$ plain form
2014 357 -467 115 1114 -346 -1109 162 314 -632 -708 -820 -696 140 -680 -1859 -544 226 -1133 -1296 -612
2033 -612 -603 -318 -428 -1321 -442 658 -607 -1028 327 386 -110 139 -34 321 1142 365 -532 820 1386 190
2053 190 137 735 575 917 527 -382 571 1326 19 -469 681 457 -30 176 -151 -43 697 -209 -834 377
2073 377 569 -666 -337 160 -78 275 -128 -754 387 897 -607 -658 612 368 -196 20 -237 266 875
2092 875 -194 -763 690 798 -423 -45 304 182 501 46 -589 660 999 -405 -406 873 474 77 112
2111 112 -223 469 1045 -300 -656 812 784 -264 -48 105 148 593 -158 -884 367 691 -707 -676 127
2130 127 -141 -259 -378 -880 -269 282 -1049 -1224 104 -162 -1067 -660 -581 -459 -77 -796 -1241 62 237
2149 237 -1078 -748 -20 -266 -257 -372 -789 114 571 -713 -759 566 216 -488 -65 -25 99 581 -275 -603
$$ packed form
2014C57q24N82R99j460p63J271J52r46p6j12J24Q36q20j179J315P70j359j63O84
2033f12RK85j10q93Q79J100j265m21J355N9m96K49j73L55Q21p77q97J352N66j196
2053A90n3N98j60L42l90r09R53P55j307m88J150k24m87K06l27J08P40r06o25J211
2073C77J92j235L29M97k38L53m03o26J141N10j504n1J270k44n64K16k57N03O09
2092H75j069n69J453J08j221L78L49j22L19m55o35J249L39j404jJ279l99l97L5
2111A12l35O92N76j345l56J468k8j048K16J53M3M45p51p26J251L24j398L1Q03
2130A27k68j18j19n02O11N51j331j75J328k66r05M07P9J22L82p19m45J303J75
2149B37j315L30P28k46Rj15m17R03M57j284m6J325l50p04M23M0J24M82q56l28
$$ plain form
2169 -603 706 663 -586 -84 624 249 359 158 -243 726 1033 -334 -173 1039 603 11 235 231 426 821
2189 821 -147 -411 786 600 -512 9 373 -41 210 -179 -580 309 393 -820 -565 438 -138 -539 -135
2208 -135 -310 -3 327 -466 -531 693 355 -548 186 584 204 473 149 -69 998 999 -200 359 1209 592
2228 592 273 539 383 751 964 -240 -85 1105 343 -534 -21 208 -20 81 -583 -747 255 3 -1352
2247 -1352 -777 36 -490 -813 -747 -900 -167 -75 -1200 -903 356 -265 -930 -340 -165 -83 101 -524 -604 528
2267 528 381 -650 -98 570 142 168 136 -172 543 619 -373 -75 884 314 -239 311 198 188 403 -168 -159 802
2289 802 311 -515 188 557 -84 -3 9 -217 409 235 -682 -122 668 -132 -463 61 14 -45 8 -579 -366 600
2311 600 -19 -841 -13 265 -232 -146 -325 -307 440 215 -795 -69 734 -77 -405 62 72 360 366 -519 -98
$$ packed form
2169f03J309m3j249N02P08l75J10k01m01R69L07j367J61J212m36n92K24mJ95L95
2189H21r68k64J197j86j112N21L64m14K51l89m01Q89Q4j213K55J003n76m01M04
2208a35j75L07L30p93o5J224l38r03P34L98l80K69l24k18J067Jj199N59Q50o17
2228E92l19K66j56L68K13j204J55J190p62q77N13K29k28J01o64j64J002k52j355
2247a352N75Q13n26l23O6j53P33R2j125K97J259o21o65N90J75Q2J84o25q0J132
2267E28j47j031N52O68m28K6l2l08P15P6r92K98R59n70n53N50j13j0K15n71RR61
2289H02m91q26P03L69o41Q1J2k26O26j74r17N60P90q00l31N24m7n9N3n87K13R66
2311F00o19q22Q28K78m97Q6j79J8P47k25j010P26Q03q11l28M67J0K88Oq85M21
$$ plain form
2332 -98 905 222 -507 250 433 125 183 -92 -218 619 271 -704 -66 624 -147 -289 -23 -178 92 157 -576
2353 -576 -288 591 -183 -678 148 167 -165 54 -231 -229 440 115 -623 194 528 -199 -154 187 -85 222 213 -560
2375 -560 7 645 -221 -613 197 151 -189 -22 -353 -217 465 -132 -805 161 443 -300 -296 34 -79 455 140
2396 140 -596 243 936 22 -261 430 440 412 418 -31 231 1093 232 -383 486 729 8 139 84 13 420 59
2418 59 -733 -54 472 -445 -584 -110 -325 -274 -204 -778 -546 193 -435 -998 -167 -155 -471 -212 -306 -398 206 -42
2440 -42 -631 111 497 -303 -67 408 142 279 401 -92 271 797 96 -202 755 613 -3 301 211 222 685
2461 685 105 -368 430 639 -282 -203 327 54 131 -33 -455 71 422 -473 -578 217 87 -400 -192 -340 -168
2482 -168 262 -403 -820 173 273 -605 -479 -39 -138 88 -149 -672 66 591 -334 -473 376 110 18 176 -155
$$ packed form
2332i8J003o83p29P57J83l08N8k75j26Q37l48r75O38O90p71j42K66j55K70O5p33
2353e76K88Q79p74m95Q26J9l32K19k85KO69l25p38Q17L34p27M5L41k72L07rp73
2375e60N67O38q66l92Q10m6l40J67l31J36O82n97o73R66K82p43ML30j13N34l15
2396A40p36Q39O93r14k83O91J0k8Om49K62Q62q61o15Q69K43p21J31n5p1M07l61
2418E9p92O79N26r17j39M74k15N1P0n74K32P39o28n63Q31J2l16K59r4r2O04k48
2440d2n89P42L86q00K36M75k66J37J22m93L63N26p01k98R57j42o16L04r0J1M63
2461F85n80m73P98K09r21P9N30k73P7j64m22N26L51q95j05P95j30m87K08j48J72
2482a68M30o65m17R93J00q78J26M40r9K26k37n23P38N25r25j39Q49k66r2J58l31
$$ plain form
2503 -155 127 696 37 -334 527 551 -151 177 396 200 368 129 -360 370 517 -324 -335 246 -64 -304 -73
2524 -73 -515 -240 186 -578 -802 -116 -117 -721 -444 -335 -516 -162 -507 -827 -128 50 -644 -416 141 -157 -175
2545 -175 32 -230 190 582 -246 -243 607 487 -108 334 376 288 603 203 -188 676 739 -117 130 587 286 267
2567 267 294 -60 396 642 -180 -105 625 339 -124 283 157 203 518 23 -179 627 553 -218 105 460 146
2588 146 218 152 -189 385 556 -290 -210 583 80 -219 -7 -175 -43 240 -351 -551 276 63 -679 -194 69
2609 69 -293 -140 -247 -533 141 174 -593 -289 360 -110 -289 -9 -174 17 282 -343 -393 474 87 -539 -87
2630 -87 110 -197 -5 -190 -572 135 61 -720 -392 101 -340 -483 -262 -515 -284 -102 -753 -669 110 -351 -822
2651 -822 -296 -272 -405 -142 -373 -613 70 30 -683 -188 273 -168 -252 2 -157 184 340 -303 -162 624 109
$$ packed form
2503a55K82N69o59l71Q61K4p02L28K19j96J68k39m89P30J47q41j1N81l10k40K31
2524g3m42K75M26p64k24O86jo04K77J09j81L54l45l20O99J78o94K28N57k98j8
2545a75K07k62M20L92q28LQ50j20n95M42M2q8L15m00l91Q64O3q56K47M57l01j9
2567B67K7l54M56K46q22P5P30k86m63M07j26M6L15m95k02Q06p4p71L23L55l14
2588A46P2o6l41N74J71q46Q0P93n03k99K12j68J32K83n91k00Q27k13p42M85K63
2609F9l62J53j07k86O74L3p67L04O49m70j79K80j65J91K65o25n0Q67l87o26M52
2630h7J97l07J92j85l82P07p4p81L28M93m41j43K21k53K31J82o51Q4P79m61m71
2651h22N26K4j33K63k31k40O83m0p13M95M61m41q4K54j59L41J56o43J41P86n15
$$ plain form
2672 109 -153 291 312 166 405 45 91 709 493 -119 414 737 358 375 475 253 674 725 -35 273 932
2693 932 334 76 470 336 334 505 30 -76 548 264 -341 98 323 -129 -25 -78 -289 164 184 -568 -123
2714 -123 343 -220 -350 102 -84 -41 203 -218 -97 471 164 -309 282 344 31 233 183 -41 385 308 -288
2735 -288 204 538 -63 -174 176 -32 12 113 -368 -272 293 -322 -598 -111 -74 -414 -236 -359 -484 -5 -252
2756 -252 -836 -325 151 -492 -447 -182 -293 -52 -59 -568 -271 359 -175 -462 113 16 -144 13 -234 -189 340 37
2778 37 -524 108 332 -233 -113 42 -98 224 219 -329 -116 469 -31 -261 204 88 30 167 -147 -74 440 111
2800 111 -271 332 437 -73 94 204 -27 286 228 -247 161 510 -134 -217 246 -21 -115 178 -156 -106 326
2821 326 -158 -493 148 75 -263 8 -4 -243 154 77 -385 135 388 -274 -134 270 69 -14 156 -145 -23
$$ packed form
2672A09k62M44K1j46K39l60M6O18k16o12N33L23l79J7J00k22M21N1p60L08O59
2693I32n98k58L94j34kJ71m75j06O24k84o05M39K25m52J04n3k11M53K0p52M45
2714a23M66n63j30M52j86M3K44m21J21N68l07m73N91O2l13K02n0k24M26p7n96
2735b88M92L34o01j11L50k08M4J01m81R6N65o15k76M87L7l40J78j23j25M79k47
2756b52n84N11M76o43M5K65j11K41pn09K97O30n34k87N75r7j60J57k47M5N29l03
2778C7n61O32K24n65J20J55j40L22nn48K13N85n00k30M65j16n8J37l14P3N14l29
2800A11l82O03J05n10J67J10k31L13n8m75M08L49o44q3M63k67r4K93l34N0M32
2821C26m84l35O41p3l38K71j2k39L97p7m62N20K53o62J40M04k01q3J70l01J22
$$ plain form
2842 -23 461 -40 -322 355 258 -138 123 -5 -2 423 84 -314 214 408 -225 -79 260 28 80 171 -176 18
2864 18 426 -126 -350 311 200 -129 34 -46 -124 273 -6 -480 176 335 -297 -227 57 -125 6 -80 -431 -106
2886 -106 360 -377 -435 136 -40 -221 27 -229 -177 283 -41 -367 248 342 -226 35 270 64 247 248 -121 356
2908 356 620 -26 1 427 194 112 291 67 30 415 -16 -232 232 194 -332 -56 -61 -293 -33 -155 -555 -151
2930 -151 103 -623 -448 -5 -271 -391 -101 -404 -266 70 -327 -413 203 64 -345 69 88 4 253 34 -229
2951 -229 273 446 -141 13 383 91 4 174 -53 92 373 -117 -212 404 191 -172 79 38 -78 191 -114
2972 -114 -378 231 219 -319 -116 204 -84 -26 18 -285 33 226 -336 -295 298 14 -259 0 -70 -187 219 -124
2994 -124 -379 158 94 -398 -43 115 -102 95 23 -258 124 295 -242 -159 357 35 -127 139 3 58 317
$$ packed form
2842b3M84n01k82O77r7l96K61j28LM25l39l98N28J94o33J46L39k32N2R1l47J94
2864A8M08n52k24O61j11l29J63q0p8L97k79m74O56J59o32P0K84j82J31q6l51L25
2886a06M66p37n8N71j76j81K48k56N2M60l24l26O15R4n68K61K35k06J83Jl69M77
2908C56K64o46K7M26k33q2J79k24l7L85m31k16M64l8n26K76nk32K60j22m00M04
2930a51K54p26J75M43k66j20K90l03J38L36l97q6O16j39m09M14J9q4K49k19k63
2951b29N02J73n87J54L70k92q7J70k27J45K81m90r5O16k13l63K51m1j16K69l05
2972a14k64O09j2n38K03L20k88N8M4l03L18J93n62M1N93k84k73K59p0j17M06l43
2994a24k55N37o4m92L55J58k17J97p2k81L82J71n37Q3N16l22j62K66j36N5K59
$$ plain form
3015 317 42 -130 491 250 -175 201 273 -53 206 110 -138 237 254 -237 -66 350 -63 -127 102 -92 -56 213
3037 213 -166 -185 277 77 -248 8 102 -90 103 -51 -179 230 231 -246 20 302 -5 -4 213 -32 110 287
3059 287 -161 -98 377 63 -216 103 62 -139 71 -108 -255 159 75 -388 -65 197 -113 -123 79 -204 60
3080 60 291 -221 -122 313 22 -216 131 45 -1 232 -12 -116 299 160 -308 67 252 -202 -24 61 -198 18
3102 18 40 -430 -238 98 -237 -352 -41 -221 -339 -81 -292 -350 93 -80 -534 -110 22 -272 -154 -50 -258
3123 -258 81 140 -257 -79 337 17 -104 196 -2 43 228 -108 -117 398 127 -204 161 216 -88 145 51 -179
3145 -179 175 184 -208 51 283 -139 -77 154 -73 56 191 -78 -36 363 79 -188 197 141 -78 111 63 12
3167 12 272 132 -192 171 416 -91 37 306 36 99 237 -110 36 381 20 -51 315 163 -13 219 3
$$ packed form
3015C17k75j72O21k41m25L76P2l26K59r6k48L75J7m91J71M16m13o4K29j94L6K69
3037B13l79j9M62k00l25K56R4j92J93j54j28M09Jm77K66K82l07JK17k45J42J77
3059B87m48O3M75l14k79L19m1k01K10j79j47M14q4m63L23K62l10j0K02k83K64
3080F0K31n12R9M35k91k38L47q6m6K33k44j04M15j39m68L75J85m54J78Q5k59K16
3102A8K2m70J92L36l35j15L11j80j18K58k11n8M43j73m54M24J32k94J18J04k08
3123b58L39N9l97J78M16l20j21L00j98M5J85l36rN15k71l31L65N5l04K33r4k30
3145a79L54Rl92K59K32m22O2K31k27J29J35k69M2L99k84k67L85n6k19J89m8n1
3167A2K60j40l24L63K45n07J28K69k70O3J38l47J46L45l61p1L66j52j76K32k16
$$ plain form
3188 3 -41 388 174 -206 232 377 -86 45 191 -29 142 201 -205 -36 364 -141 -238 118 -21 -177 44 -201
3210 -201 -237 199 -86 -432 -32 8 -305 -102 -52 -232 -3 -16 -389 -54 213 -186 -220 163 5 -126 182 -92
3232 -92 -98 247 -16 -174 256 99 -175 72 46 -123 148 57 -289 21 158 -320 -186 94 -139 -162 -26 -257
3254 -257 -111 119 -243 -391 96 -53 -259 -35 -20 -169 143 39 -319 99 307 -100 15 216 97 77 125
3275 125 -81 132 377 -12 -130 231 172 -69 166 -76 -120 106 15 -273 99 166 -232 -41 50 -99 -9 45
3297 45 -270 -10 286 -140 -213 171 31 -34 147 -45 -10 269 55 -166 218 171 -133 78 178 9 68 113
3319 113 -151 72 210 -167 -144 294 36 -144 101 -110 -59 210 -109 -196 203 105 -242 -6 129 -29 41 68
3341 68 -147 63 216 -187 -55 273 -25 -138 96 -178 -28 218 -58 -187 143 114 -226 5 1 -134 117
$$ packed form
3188Cm4M29k14l80M38J45m63J31J46k20J71N9m06J69M00n05r7L56j39j56K21k45
3210b01l6M36k85l46M00M0l13K03N0j80K29j3l73L35K67l99l4L83j58j31L08k74
3232i2oL45k63j58M30j57k74K47k6j69K71r1l46L10J37m78J34K80k33k3J36k31
3254b57J46K30l62j48M87j49k06K24J5j49L12j04l58M18K08m07J15K01j19k0M8
3275A25k06K13K45l89j18L61n9k41K35k42m4K26r1k88L72O7l98J91R1j49R0N4
3297D5l15K60K96m26p3L84j40o5J81j92L5K79k14k21L84m7l04K11J00j69N9M5
3319A13k64K23J38l77K3M38k58j80K45k11N1K69l19q7L99r8l47K36J35j58P0K7
3341F8k15K10J53m03J32L28k98j13K34k74J50K46k76j29L30k9l40K31mj35K51
$$ plain form
3362 117 -60 -238 164 218 -157 -29 208 3 52 139 -131 31 249 -41 -47 251 83 -83 158 91 30 256
3384 256 36 -233 141 92 -254 17 117 -145 -43 51 -171 -65 78 -222 -223 89 -87 -218 52 -38 -140 134
3406 134 26 -118 159 103 -108 42 212 -166 91 90 -74 135 87 -140 -74 204 -85 -123 77 -79 -49 110
3428 110 -138 -255 73 -30 -343 -3 49 -158 -28 -1 -239 14 98 -259 -93 165 -95 -135 57 -46 -10 182
3450 182 -87 -182 225 114 -123 98 118 -45 103 -37 -175 118 89 -234 -113 93 -79 -70 93 -135 -25 91
3472 91 -151 -166 182 7 -196 134 112 -7 120 100 -127 181 195 -112 129 276 -22 144 169 44 107 222
3494 222 -85 -13 274 33 -115 168 45 -46 112 -58 -127 165 9 -293 1 74 -141 -50 44 -123 48 71
3516 71 -137 -59 255 -114 -67 147 54 -41 165 -29 -34 246 42 -189 131 180 -82 116 50 -28 133 126 -252 -45
$$ packed form
3362A17j77j78M02N4l75J28K37k05M9Q7k70J62K18k90oK98j68j66K41o7o1K26
3384B56k20k69L74m9l46K71J00k62J02R4k22J06J43l00jL12j76j31K70r0j02K74
3406A34j08j44K77n6k11J50J70l78K57jj64K09m8k27O6K78k89l8K00j56L0J59
3428A10k48j17L28j03l13L40N2k07J30K7k38K53Q4l57J66K58k60m0J92j03L6J92
3450A82k69r5M07j11k37K21K0j63J48j40j38K93k9l23J21K06j72RJ63k28J10J16
3472I1k42j5L48j75k03L30k2j19J27k0k27L08J4l07K41J47k98J66K5j25O3J15
3494B22l07P2K87k41j48K83j23r1J58j70o9K92j56l02K94P3k15R1R4j67J71K3
3516G1k08P8L14l69M7K14r3r5K06j94nK80k04k31L20M9k62J98o6p8J61pl78K07
$$ plain form
3540 -45 226 -79 -121 153 -110 -63 129 -90 -180 254 -19 -189 83 136 -74 24 -24 -151 95 28 -205 12 120
3563 120 -159 -131 5 -108 -33 50 -191 -197 182 -107 -237 -10 -39 -215 -15 -49 -207 82 40 -154 35 185 -187
3586 -187 -35 41 -63 78 205 -165 0 213 -14 -60 164 118 -121 136 -63 -133 96 42 -228 18 73 -179
3608 -179 -44 -17 -156 -98 8 -205 -72 84 -239 -172 72 -42 -72 74 -33 -109 197 17 -89 174 177 -56
3630 -56 116 150 23 185 124 -102 198 268 -29 -16 199 30 62 186 39 -28 200 32 -167 134 108 -166 64
3653 64 47 -32 78 51 -203 36 136 -72 -69 133 34 -31 140 -81 -38 194 1 -125 145 96 -88 46 22 -57
3677 -57 118 31 -79 45 119 -128 -43 175 -119 -85 61 -117 -67 198 -47 -217 145 6 -134 8 0 -111 129
3700 129 23 -208 125 53 -138 36 95 -80 -21 87 -96 -39 144 -71 -100 156 -28 -97 54 -6 -62 172 -50
$$ packed form
3540d5K71l05m2K74k63M7J92k19r0M34k73j70K72N3k10R8m8j27K46o7k33K17J08
3563A20k79K8J36j13P5Q3k41oL79k89j30K27k9j76K00l4j58K89m2j94J89J50l72
3586a87J52P6j04J41J27l70J65K13k27m6K24m6k39K57j99p0K29n4k70K46N5k52
3608a79J35K7j39N8J06k13J33J56l23O7K44j14l0J46j07p6L06j80j06K63Lk33
3630e6J72L4j27J62o1k26L00P0k97J3K15j69L2J24j47o7K28j68j99L01k6k74K30
3653F4j7p9J10k7k54K39J00k08LK02r9o5J71k21M3K32j93j26K70m9j84J34k4p9
3677e7J75q7j10J24P4k47Q5K18k94L4J46j78N0K65k45j70L62j39j40J42qj11K40
3700A29j06k31L33p2j91J74N9j75N9J08j83N7J83k15k9K56j84o9J51o0n6K34k22
$$ plain form
3723 -50 -169 88 45 -140 -67 36 -101 0 77 -100 16 111 -73 -35 148 -27 -29 15 -47 -85 79 -55 -134 52
3747 52 23 -169 34 84 -139 -28 -7 -141 19 19 -189 -64 121 -16 -105 111 -31 -21 121 -14 -36 197 93
3770 93 -86 108 59 -7 117 54 -52 123 155 -155 32 82 -58 -33 38 -127 -37 77 -138 -137 84 -78 -220 -61
3794 -61 -63 -177 -35 -73 -183 57 28 -206 -62 44 -61 22 139 -49 87 149 -1 36 222 127 30 159 36
3817 36 -4 210 74 -1 234 167 -128 65 168 -73 21 125 -107 56 193 -188 -12 163 -103 -76 97 35
3839 35 7 133 2 -105 163 74 -155 71 44 -90 15 63 -86 85 149 -177 6 129 -90 -82 46 -63 -21
3862 -21 129 -105 -99 113 -25 -180 47 73 -119 9 0 -147 18 110 -171 -61 136 -104 -74 68 -60 -27 88
3885 88 -104 -77 162 -1 -162 79 -74 -128 74 -99 -194 -14 -45 -241 -67 19 -221 -63 -31 -96 -26 18 -143
$$ packed form
3723e0j19K57m3j85P3J03j37J01P7j77J16R5j84L8J83j75kM4o2l8J64j34p9J86
3747E2k9j92K03N0k23J11K1j34J60%k08J25J85j37q9K16j42J0J42j35k2K33j04
3770I3j79J94m9o6J24o3j06J75L2l10J87N0j40K5P1j65R0J14k15JK21j62j42J59
3794f1kj14J42l8j10K40k9k34J44J06j05Q3J17j88J36O2j50L7J86r5r7J29j23
3817C6m0K14j36p5K35o7k95J93J03k41R4J04k32J63J37l81J76J75k66K7J73o2
3839C5k8J26j31j07K68q9k29K26k7j34J05M8j49J71O4l26J83J23k19QJ28j09M2
3862b1J50k34OK12j38j55K27K6j92J28rj47J65R2k81J10J97k40L0J42j28L3J15
3885H8j92K7K39j63j61K41j53n4K02j73r5J80l1j96J74Q6k40J58L2o5P0M4j61
$$ plain form
3908 -143 -86 111 -111 -114 165 -4 -88 85 -19 -56 65 109 -125 52 116 -104 -20 53 -37 58 91 -90 -1 170
3932 170 -59 -109 108 -12 -2 108 -40 -48 148 111 -145 102 195 -45 125 147 -7 86 174 23 129 203 45
3955 45 -10 155 28 36 150 -1 26 193 -26 -85 138 74 -95 11 26 -132 23 11 -207 58 77 -95 -77 99
3979 99 -85 10 27 -90 -45 143 -82 -165 71 109 -22 95 96 -67 134 37 -156 94 116 -45 43 156 -107 26
4003 26 29 -138 -74 127 -120 -149 79 -96 -105 -25 -19 -163 28 -43 -140 25 29 -139 -64 9 -107 -42 61 -206 -95 115
4029 115 -123 -106 102 -96 -165 53 -62 -113 130 -56 -162 108 60 -162 17 11 -31 63 66 -123 52 133 -32 -48
4053 -48 149 34 8 148 22 53 162 57 -82 145 157 -92 92 61 -80 42 112 -99 -35 70 -116 -91 72
4076 72 -116 -70 44 -78 -50 59 -43 -135 122 -13 -104 12 57 -47 60 30 -91 77 79 -58 6 136 -63
$$ packed form
3908a43N7J97k22lK79j69q4J73j04l7J21M4k34J77O4k20Q4P3r0R5L3j81Q9J71
3932A70k29n0K17j20J0J10j48qJ96l7k56K47R3k40J70K2j54R3Q8j51J06P4j58
3955D5n5J65j27QJ14j51K7J67k19n9K23o4j69J06J5j58J55j2k18K65J9j72J8J76
3979I9j84R5J7j17M5J88k25q3K36L8j31J17Jj63K01r7j93K50K2j61Q8J13k63J33
4003B6Lj67O4K01k47k9K28j75rQ0Oj44J91p1r7J65Mj68P5P3j16O5J03k67J11K10
4029A15k38J7K08j98o9K18j15n1K43j86j06K70m8k22J79om2R4Lj89J75Q1j65j6
4053d8J97j15k6J40j26L1J09j05j39K27J2k49J84l1j41J22P0k11O4J05j86K5J63
4076G2j88M6J14j22K8J09j02r2K57j35r1J16M5j04J07l0j21J68Kj37O4J30j99
$$ plain form
4099 -63 58 130 -94 52 137 -73 -87 164 14 -52 111 45 -99 65 -40 -168 124 51 -143 6 65 -104 -55
4122 -55 102 -148 24 141 -119 -43 175 -45 -69 158 29 -70 201 -32 -136 94 73 -75 28 37 -154 40
4144 40 15 -79 -50 81 -94 -106 -8 -99 -86 49 -77 -92 80 -45 -138 68 30 -84 81 91 -97 104 53 -37 63
4169 63 147 -73 39 193 -22 -17 145 60 11 206 -25 -45 152 44 -93 61 25 -66 20 -23 -161 55 111 -117
4193 -117 -7 75 -80 -105 69 -98 -105 124 -106 -98 154 29 -135 18 -12 -73 62 -53 -67 89 150 -193 36
4216 36 168 -37 43 97 -97 24 156 -119 27 96 26 -49 139 13 -71 170 -11 -163 105 53 -111 92 24
4239 24 -122 27 -8 -53 18 126 -138 -72 101 -103 -80 43 -63 -201 25 -21 -126 89 -25 -156 -15 30 -155
4262 -155 -34 -39 -107 10 105 -144 -3 109 -79 -45 52 -27 8 122 -37 0 183 126 0 96 137 -8 65 49 -154
$$ packed form
4099f3J21P2k24J46Q5k10j4K51j50o6J63o6j44J64j05j28K92p3j94J49N9j69M9
4122e5J57k50J72J17k60P6K18k20k4K27j29r9K71k33j04K30k1j48J03Rj91J94
4144D0k5r4K9J31j75j2R8r1J3J35j26j5J72j25r3K06l8j14J65J0j88K01n1r0J00
4169F3Q4k20J12J54k15NJ62q5m9J95k31k0J97j08j37J54l6r1Q6m3j38K16N6k28
4193a17J10Q2j55k5J74j67pK29k30QK52j25j64J53l0o1J35j15j4J56O1l43K29
4216C6J32k05Q0N4j94J21J32k75J46O9p0p5J88j26q4K41j81j52K68n2j64K03o8
4239B4j46J49l5m5P1J08k64O6J73k04K3J23j06j38K26m6j05K15j14j31J41M5j85
4262a55J21no8J17R5k49J41J12j88L4R7p9L5J14j59L7J83n7j26R6M1j45P3j6k03
$$ plain form
4287 -154 84 66 -146 19 66 -99 -5 80 -73 -61 100 -82 -110 75 -108 -112 42 -1 -54 91 17 -73 90 17
4311 17 -114 101 109 -40 40 115 -48 71 166 -5 -31 140 -10 -32 163 -26 -57 116 -21 -97 111 -7 -101 50
4335 50 101 -64 -34 43 -103 -41 85 -61 8 102 -53 -69 76 -27 -123 51 -9 -54 95 -59 -91 36 -11 -107 50
4360 50 37 -95 25 -1 -159 3 -28 -164 -123 105 -117 -97 37 -72 -123 75 26 -110 68 47 -55 36 28 -166
4384 -166 132 37 -68 82 111 32 -22 156 52 43 65 -7 -66 159 26 -58 97 -32 -57 90 -5 -60 72 56 -123
4409 -123 46 49 -63 -3 46 -87 -56 100 -105 53 133 -35 -101 70 -50 -95 85 24 -112 11 -28 -88 6 42
4433 42 -159 6 -14 -108 2 3 -103 -116 196 -70 12 88 37 -11 94 3 -67 100 56 -26 130 199 -137 45 130
4458 130 -89 62 126 -77 63 112 -67 -21 68 -58 -8 20 -138 -89 59 -65 -105 49 -27 -84 -32 -125 -154 -15
$$ packed form
4287a54K38j8k12J65M7j65R4Q5j53J2J61j82k8J85j83mJ54m3n3J45p4r0J63p3
4311A7j31K15Qj49Q0P5j63J19R5j71k6J71j50k2J95j89l1J73j37p6K08j18r4J51
4335E0N1j65L0P7j46O2J26j46O9R4j55j6J45j03r6J74o0m5J49j54l2J27m7r6J57
4360E0j3j32J20k6j58J62l1j36M1K28k22K0J34j09n1J98m9j36J78k1j02R1qj94
4384a66K98r5j05J50K9p9n4J78j04rK2p2n9K25j33q4J55j29k5J47r5n5J32j6j79
4409a23J69Lj12O0M9j33L1J56k05J58Q0j68o6J71j20m5J80o1j36J23l9o0R4L6
4433D2k01J65k0r4J10Jj06j3L12k66Q2P6n1m8J05r1p0J67m4q2J56O9l36J82Q5
4458A30k19J51O4k03J40M9j79M6Q9j26N0K8j58M9J48j24m0J54p6n7N2r3k9J39
$$ plain form
4482 -15 -59 -147 -52 14 -99 -22 42 -40 12 89 -81 41 185 -11 -24 72 127 -30 94 52 -70 109 60 -113 105
4507 105 70 -81 -28 121 -78 -69 60 -86 -79 127 -90 -33 126 13 -54 47 22 -99 51 17 -102 120 74 -104
4531 -104 48 132 -53 14 98 -104 3 68 -58 -48 163 8 -108 57 -3 -75 57 -40 -100 95 11 -129 10
4554 10 3 -87 -31 60 -64 58 89 -76 -54 123 -30 -68 118 -3 -18 141 -29 -93 30 -44 -138 69 59 -109 8
4579 8 13 -76 19 18 -146 -61 97 -65 -5 87 -101 -85 98 -80 -122 87 -64 -99 130 29 -51 91 17 -69 44 92
4605 92 -84 29 85 -102 -29 23 -117 14 153 -74 -36 77 14 -59 93 26 -111 86 12 -150 64 33 -111
4628 -111 44 76 -64 -6 76 -74 9 138 -52 -24 104 -26 -25 84 33 -71 59 61 -92 56 -14 -95 -5 48 -110
4653 -110 -3 73 -58 36 71 -148 -73 30 -22 -61 91 14 -45 62 -23 -88 107 47 -96 124 93 -44 43 70 -13
$$ packed form
4482a5m4q8R5O6j13P7O4q2N2P7j70J22J44j96j3R6N5j57J24m2j22J79m9j73K18
4507A05l5j51N3J49j99RJ29j46PK06k17N7J59j13o7J01k5j21J50l4j19K22m6j78
4531a04J52Q4j85O7Q4k02J07O5j26J0K11j55j16J65o0p2J32r7o0J95q4j40J39
4554A0pr0N6R1j24J22L1j65K2J77j53l8J86j21j5J59j70o4J23p4r4K07j0j68J17
4579HNq9R5jj64Q5J58j62O0R2j88J6J83j78m2K09j51l5K29j01q0J42p4q6J13M8
4605I2j76J13N6j87P3N2j40J31J39k27L8J13o3p3J52o7j37J97p4j62K14l1j44
4628a11J55L2j40N8Q2j50Q3J29j90K8J28j30JJ09n1j04J30Kj53J48p0q1R0N3j58
4653a10J07P6j31R4L5k19P5J03n2l9J52p7n9J07q5o5J95o0j43K20l1j37Q7K7q3
$$ plain form
4678 -13 90 66 -84 14 90 -98 -36 110 -37 -18 100 -104 -63 59 35 -132 30 57 -147 -66 -51 -71 34 -60
4702 -60 -170 33 64 -118 -66 -22 -62 2 136 8 -30 128 -55 -47 95 7 -66 116 23 -104 49 60 -26 27 47
4727 47 -53 22 63 -108 36 51 -46 -19 162 -100 -34 98 -67 -68 37 19 -79 65 -20 -74 46 14 -60 -31 35 -87
4753 -87 -46 21 -154 -125 19 -62 -88 27 -72 -53 49 -41 -87 99 31 -77 98 42 -37 98 77 -74 45 65 -109
4778 -109 78 189 8 36 123 32 1 123 -15 22 154 -9 -21 57 78 -37 44 -79 -56 11 23 -74 14 55 -100
4803 -100 -6 37 -80 -41 73 -70 -40 135 22 -88 126 -28 -45 81 14 -36 77 38 -75 53 132 -98 47
4826 47 27 -68 105 134 -30 -59 54 27 -68 55 -56 -62 75 -30 -54 37 21 -85 -3 20 -98 62 60 -63 28 76
4852 76 -96 7 58 -59 -59 97 -58 -67 43 -50 -117 49 -52 -169 70 -6 -61 8 -6 -59 -43 -1 -106 22 -11
$$ packed form
4678a3J03k4j50R8P6j88O2J46j47J9J18k04M1J22k4j67J62K7k04Q1J5k0J05r4
4702f0j10K03L1j82N2M4m0O4J34j28l8J58j83QJ42q8p3J82r3j27J53J1q6N3K0
4727D7j00P5M1j71J44J5r7K7J81k62O6J32j65jJ05j8r8J44q5n4J20l2p4K9O6j22
4753h7M1O7j75K9J44q1k6J15r9J9J02r0m6J86o8j08J75n6p9J35k1j51J19K0j74
4778a09J87J11j81K8Q7r1l1J22j38L7J32j63j2P8K1j15Q1j23K3O7J2r7Q8M1j55
4803a00R4M3j17L9J14j43L0J75j13j10K14j54j7J26o7n0J13l9j13J28P9k30J45
4826D7k0r5J73K9j64k9J13k7r5J23j11oJ37j05k4R1j6j06Q2K3j18J60kj23R1M8
4852G6j72J03N1j17%J56j55rJ10r3o7J66j01j17K39p6n5O9j4n3J6M2j05J28l3
$$ plain form
4877 -11 -109 -30 99 -25 -31 66 -7 -59 92 1 -55 102 5 34 92 45 -79 137 68 -70 152 76 -38 -14 102 -11
4903 -11 6 110 -1 -18 98 -55 -101 31 -25 -126 66 15 -91 52 42 -47 43 28 -101 -28 36 -100 -33 18 -99
4928 -99 1 178 -3 -17 149 19 -58 32 -20 -109 99 29 -96 53 20 -58 52 29 -74 -25 12 -63 -36 70 -27
4953 -27 -19 97 -4 16 98 32 -25 121 -36 -39 48 9 -65 74 66 -57 47 91 -150 11 90 -98 -37 28 -38 -83 22
4980 22 -107 -70 -13 -24 -127 114 -46 -169 79 -8 -52 59 29 -153 61 69 -89 56 134 -61 10 41 0 8 122
5005 122 -50 -89 103 31 -73 40 71 -58 96 -21 -78 36 71 -89 -21 54 -30 23 1 -69 -94 118 -72 -37
5029 -37 127 -56 -96 40 20 -87 115 -8 -68 59 30 -70 21 19 -89 30 51 -103 23 50 -79 -23 26 -75
5053 -75 -86 72 -65 -74 35 -1 -74 101 27 -60 65 43 -105 67 75 -48 22 88 -46 53 80 -42 10 85 32 -26
$$ packed form
4877a1r8P9J29j24oR7p3n2J51r1n6J57r7K9N8m7j24K16o9j38K22p6j14K4J16j13
4903a1J7J04j11j7J16j53m6J32n6j01J92n1j06J43j0q9R0j5j29P3O4j36O7N1j17
4928i9J00J77j81j4J66j30p7R0n2q9K08p0j25J49l3p8J10k3j03M9L7p5K7J06r7
4953b7QJ16j01K0Q2o6n7J46j57lQ7l9p4J39qj23J04M4k41J61P9j88O1O5o6m5J05
4980B2j29L7N7j1j03K41j60j23K48q7m4J11l0j82K14Qj58J45P8j95P1L1m1QJ14
5005A22j72l9J92p2j04J13L1j29J54j17n7J14L5j60O8P5q4N3k2p0k5K12j90L5
5029c7J64j83m0J36k0j07K02j23o0J27k9j00R1kj08J19K1j54J26K7j29N6M9j01
5053g5j1J58j37rJ09l6p3J75p4q7J25k2j48J72Qj23P0O6j34R9K7j22N2P5n3n8
$$ plain form
5079 -26 103 48 -78 48 17 -101 20 62 -87 -33 19 -124 33 27 -108 -31 34 -85 -81 -23 -30 -60 69 -94 -64 19
5105 19 -36 -83 -11 -46 -62 90 34 -25 107 16 -65 18 80 -62 -14 12 -38 52 117 -27 -105 114 -49 -25 91 64 -21
5132 -21 95 83 -105 45 -64 -52 58 50 -8 76 13 -5 40 80 5 -41 47 -62 -45 -13 -14 -85 -20 -37 -102 22 9 -43
5160 -43 -47 -34 -63 1 -24 -72 88 -51 -73 20 113 -61 3 105 73 -28 119 0 -14 82 91 36 138 119 41 120 138
5187 138 -10 -7 102 -53 -13 110 -34 -16 94 -12 -4 43 -33 -74 18 -8 -59 46 17 -87 42 -85 -108 -3 13
5212 13 -115 -50 92 -78 -40 15 -46 -45 5 -132 -117 57 -77 -42 12 25 -61 40 -12 -93 38 -48 -30 91 68 -59
5238 -59 12 41 27 86 122 -44 73 130 6 17 101 -14 -41 104 1 -69 78 101 -47 -15 8 -127 -28 54 -113
5263 -113 -7 47 -101 -18 26 -65 -103 20 -35 -89 12 -37 -64 159 6 -77 89 13 -60 33 72 -49 74 66 -21 79
$$ packed form
5079b6J29n5j26J26l1j18J21M2j49N4N2j43J57oj35P7O5j19MN8pl0J29j63L0Q3
5105A9n5m7P2l5j6J52n6n9J32r1q1Q3O2j42M8K6n0R0O5j44p8K19j63K4J16k7q5
5132b1J16j2j88J50j09J2J10qn8Q4o3j8M5M0p5m6Q8j09J7L2jp1O5j7o5J24j3n2
5160d3mJ3k9O4k5m8J60j39k2R3R3j74O4J02l2j01J47j19j4R6Rn5J02j9p8P9J8
5187A38j48LJ09j55M0J23j44J8J10j06QM7p6m1R2k6n1J05k9j04J29j27k3J05J6
5212A3j28O5J42j70L8N5o1JN0j37J5J74j34L5N4J3q6J01n2q1J31q6J8J21k3j27
5238e9P1K9j4N9L6j66J17N7j24J1Q4j15k7J45j03p0J47K3j48L2K3j35R9Q2j67
5263a13J06N4j48Q3M4r1l8J23n5n4J01m9k7K23j53q3J66p6p3R3L9j21J23qq7J00
$$ plain form
5289 79 98 11 37 124 -15 41 99 31 -14 114 12 -124 52 5 -18 15 20 -52 75 36 -54 -1 17 -45 -19 101 -7
5316 -7 -30 24 -39 -35 -56 -63 -105 0 -70 -49 68 -8 11 16 -2 -179 -36 37 -90 -8 53 -56 -2 27 -105 1 109 -32
5344 -32 -11 66 -3 -73 104 51 7 94 63 -29 129 70 -7 72 94 -20 87 58 -62 63 73 -77 72 56 -87 -65
5370 -65 -14 -52 -71 61 -44 -65 38 -66 -148 -21 13 -90 68 26 -44 -33 -1 -108 8 63 -9 -98 110 33 12
5395 12 87 11 -17 54 48 -40 125 51 -11 52 88 -37 41 63 5 16 67 8 17 61 -48 6 78 18 -72 59 -26 -75 41
5424 41 27 -30 15 58 -21 -12 7 -41 22 25 -77 -54 23 -17 -41 42 -26 -66 72 -4 -57 85 -1 -1 -18 48 -68 123 18
5453 18 -10 50 78 -7 47 63 -32 19 88 -21 13 144 16 10 1 -74 -73 81 -23 -79 116 16 -95 31 -10 -115 3
5480 3 33 -60 27 37 -79 -9 -2 -81 -94 36 -51 -24 61 -9 -71 2 -10 -41 41 50 -83 -10 32 -63 -4 65 -74 47 55 -62
$$ packed form
5289G9J9q7K6Q7j39N6N8o8m5J28j02j36J76m7k3L3Np2J27l9r0N3J8o2K6J20j08
5316gk3N4o3Mk1pm2J05p0K1J17p6J9Nj8j77J43P3j27Q2O1j09N4K9j32J06J08j41
5344c2K1P7o9p0J77n3m4Q7l1r2J58n9p7P9K2j14J07k9j20J25J0j50J49j6j43K2
5370f5N1l8j9J32j05k1J03j04q2J27L4j03J58m2p0J1L2j07J16N5p2q9K08p7k1
5395A2P5p6k8P1oq8J65p4o2O3L6j25P8K2n8J1N1n9RM4j09N4P2o0r0J31q5m9J16
5424D1j4n7M5M3p9RJ9m8O3Lj02K3P7m0k4Q3o8m0J38p6n3J42q6%j7O6j16J91j05
5453A8k8O0K8q5N4J6r5N1O9j09L4J31j28orp5JJ54j04n6J95j00j11J26m1j05J18
5480CL0r3Q7J0j16P0Pp9j3J30q7K7Q5p0o2P3j2l1Q2Rj33P3M2r5N9O9j39J21Qj17
$$ plain form
5510 -62 -19 31 -19 -32 41 -79 7 96 34 -83 57 2 -75 -25 -24 -62 41 57 -41 31 -3 -98 -48 85 10 20 80 -19
5538 -19 8 54 -32 -137 116 -2 -93 62 -22 -51 26 18 -64 -30 -19 30 -33 -22 -29 50 73 -72 17 77 -26 -32 60 -42
5566 -42 -15 84 5 -6 58 -6 -64 96 73 21 -43 17 7 -39 37 -34 5 57 -42 -75 21 -59 -43 50 -127 -61 84 -47
5594 -47 -62 59 41 -97 -38 -30 -91 -18 17 -47 6 35 -46 -51 69 -68 -55 2 -70 -15 79 -34 -64 10 9 -102 -56 47
5622 47 -68 59 7 -24 32 23 -68 36 144 -4 -56 124 23 32 90 -43 -16 59 6 -41 54 26 -56 78 -22 -62
5648 -62 0 35 -42 6 31 -41 -11 55 -65 -101 45 -24 -43 14 -23 -56 48 -30 -73 57 -21 -75 35 58 -38 43 83 -64
5676 -64 -27 38 -14 -9 98 -71 -47 82 -11 -11 59 31 -21 65 -80 -25 9 -10 -110 33 52 -51 -22 10 -35 -25 47 -98
5704 -98 -27 51 -114 -125 72 -18 -72 10 -72 -82 70 24 -88 26 12 -68 -9 -15 -88 -5 75 -1 30 66 -19 -14 -7 -63 14
$$ packed form
5510f2M3N0n0j3P3j20Q6Q9o2j17J40n5p7N0Jl8J03J6r8P2l4r5N0J33p5J0O0r9
5538a9K7M6q6j05K53j18r1J55q4k9P7qq2L4J1M9o3J1pP9K3j45Q9O0j03oR2j02
5566d2K7R9p9j1O4o4n8J60k3n2o4O0j0m6P6p1L9N2r9l3R6q0J6R3j77O6J45j31
5594d7j5J21j8j38N9Qo1P3L5o4N3K9q1nJ20j37J3N7p2N5R4j13l0P4jj11M6J03
5622D7j15J27n2l1N6rr1J04J08j48n2J80j01RN8j33K7P5n3m7R5k8q2J34j00m0
5648f2O2L5p7M8K5p2L0O6j20l6J46o9j9N7l7l3J04p8m3J30p8n4J10K3r6Q1M0j47
5676f4L7O5n2NJ07j69K4J29r3%P0k8n2Q6j45N5L4j9j00J43J9j03K9L2m5J0P2j45
5704i8P1P8j65j1J97r0n4Q2q2j0J52m6j12J14j4q0N9op3Q3Q0p6L1L6q5NPn6P7
$$ plain form
5733 14 30 -42 -26 11 -20 -42 -31 -38 -49 45 -35 -45 75 60 -63 -75 31 -88 12 54 -41 -25 2 7 -14 38 -45 -58 62
5762 62 5 -68 55 -5 -64 68 43 -67 53 101 -81 77 48 -54 28 61 -20 -38 89 -58 -22 110 22 -22 43
5787 43 0 -30 24 35 -46 15 -21 2 82 56 19 10 52 -2 9 97 -65 -90 11 -17 24 130 -29 -57 14 -48 -23 22 7
5816 7 -85 2 -17 -18 -19 29 -67 10 62 -56 36 58 -98 36 48 -72 -52 103 -30 -34 73 -39 -28 50 1 -22 80 4
5844 4 -72 22 -15 -79 -80 54 -23 -49 76 -6 39 101 62 -20 44 -33 -67 55 29 -51 56 36 -86 16 -4 -31 -13 59
5872 59 -44 -8 66 -62 9 67 -38 -133 19 -47 -42 37 -34 -18 -20 -46 -88 -9 15 -63 33 41 -31 38 61 -130 6 17 -48
5901 -48 29 63 29 -74 19 -10 23 86 -9 -19 127 35 7 68 69 -39 51 35 -59 10 30 -17 69 55 -38 -9 27 -57 9
5930 9 128 -12 -29 103 -21 -29 66 21 -60 28 -10 -35 -15 61 -67 -13 31 -119 1 96 -118 -38 126 -11 -95 15
$$ packed form
5733A4J6p2J6L7l1k2J1pj1R4q0j0J20j5j23j2J06j19J00M2r5J6K7Nk1N2q3j3J20
5762F2n7p3J23o0n9J32k5j10J20M8j82J58k9j02Q2L3q1j8J27j47L6J32q8m4O5
5787D3m3l0N4J1q1O1l6K3Q0k6l7rM2n4J1Q8j62k5J01k8M1J06j59k8P1o2K5M5j5
5816Gr2Q7j9jjM8r6P7N2j18R2K2j56J34J2j20K0J55j33mJ07j12J1P8m9k3J02p6
5844Dp6R4l7o4jJ34p7k6J25q2M5O2l9q2O4p7l4J22k6q0J07k0j22J02k0k7J8P2
5872E9j03L6P4j28P1N8j05r5J52o6NP9p1J6kk6m2P9K4p8R6Qp2O9K3j91J36J1o5
5901d8P7L4l4j03R3k9L3O3r5j0J46r2k8O1Jj08R0j6r4O9K0m7Q6j4r3K9L6q4O6
5930IJ19j40j7J32j24qR5m5q1Q8l8k5K0P6j28N4M4j50J20R5k14Q0J64j37q4J10
$$ [...]
8191b5
##END NTUPLES=NMR FID
##END=
