##TITLE=1H_ANY-156-p
 CDCl3, 8 sc, 
 8.4.2019
##JCAMPDX= 6.0         $$ Bruker NMR JCAMP-DX V2.0
##DATA TYPE= NMR FID
##DATA CLASS= NTUPLES
##ORIGIN= UXNMR, Bruker Analytische Messtechnik GmbH
##OWNER= root
$$ XWIN-NMR		Version 3.5
$$ Mon Apr  8 14:36:32 2019 Russian Standard Time (UT+4h)  she@DPX200
##.OBSERVE FREQUENCY= 200.1315
##.OBSERVE NUCLEUS= ^1H
##.DELAY= (6, 6)
##.ACQUISITION MODE= SIMULTANEOUS
##.ACQUISITION SCHEME= undefined
##.AVERAGES= 8
##.DIGITISER RES= 18
##SPECTROMETER/DATA SYSTEM= spect
##.PULSE SEQUENCE= zg30
##.SOLVENT NAME= CDCl3
##.SHIFT REFERENCE= (INTERNAL, CDCl3, 0, 15.7039)
##AUDIT TRAIL= $$ (NUMBER, WHEN, WHO, WHERE, WHAT)
$$ ##TITLE= Audit trail, XWIN-NMR		Version 3.5
$$ ##JCAMPDX= 5.01
$$ ##ORIGIN= Bruker BioSpin GmbH
$$ ##OWNER= she
$$ F:/spectra/data/she/nmr/H-F/1/audita.txt
$$ ##AUDIT TRAIL=  $$ (NUMBER, WHEN, WHO, WHERE, WHAT)
(   1,<2019-04-08 14:34:56.48 +0400>,<she>,<DPX200>,
      <created by zg, POWCHK disabled, PULCHK disabled
       configuration hash MD5:
       00 E9 B6 7A A2 85 ED C7 34 08 36 98 17 FE 4E 26
       data hash MD5: 16K
       1A F1 D5 1C 57 86 87 33 B7 40 21 EB EC D6 7E 7E>)
$$ ##END=
$$ 
$$ hash MD5
$$ 70 8D AB F0 FF 2D 1E F8 96 60 D8 00 B4 52 6B 47
##$RELAX= 
##$RELAX= 
##$RELAX= 
##$RELAX= 
##$RELAX= 
##$RELAX= 
$$ Bruker specific parameters
$$ --------------------------
##$DU= <F:/spectra>
##$EXPNO= 1
##$NAME= <H-F>
##$PROCNO= 1
##$TYPE= <nmr>
##$USER= <she>
##$AMP= (0..31)
100 100 100 100 100 100 100 100 100 100 100 100 100 100 100 100 100 100 
100 100 100 100 100 100 100 100 100 100 100 100 100 100 
##$AQSEQ= 0
##$AQ_mod= 1
##$AUNM= <au_zg>
##$AUTOPOS= <>
##$BF1= 200.13
##$BF2= 200.13
##$BF3= 200.13
##$BF4= 200.13
##$BF5= 200.13
##$BF6= 200.13
##$BF7= 200.13
##$BF8= 200.13
##$BYTORDA= 1
##$CFDGTYP= 0
##$CFRGTYP= 5
##$CHEMSTR= <none>
##$CNST= (0..31)
1 1 145 1 1 1 1 1 1 1 1 1 1 1 1 1 1 1 1 1 1 1 1 1 1 1 1 1 1 1 1 1 
##$CPDPRG= <>
##$CPDPRG1= <>
##$CPDPRG2= <>
##$CPDPRG3= <>
##$CPDPRG4= <mlev>
##$CPDPRG5= <mlev>
##$CPDPRG6= <mlev>
##$CPDPRG7= <mlev>
##$CPDPRG8= <mlev>
##$CPDPRGB= <>
##$CPDPRGT= <>
##$D= (0..31)
0 1.2 0 0 0 0 0 0 0 0 0 0.03 0 0 0 0 0 0 0 0 0 0 0 0 0 0 0 0 0 0 0 0 
##$DATE= 1554719695
##$DBL= (0..7)
120 120 120 120 120 120 120 120 
##$DBP= (0..7)
150 150 150 150 150 150 150 150 
##$DBP07= 0
##$DBPNAM0= <>
##$DBPNAM1= <>
##$DBPNAM2= <>
##$DBPNAM3= <>
##$DBPNAM4= <>
##$DBPNAM5= <>
##$DBPNAM6= <>
##$DBPNAM7= <>
##$DBPOAL= (0..7)
0.5 0.5 0.5 0.5 0.5 0.5 0.5 0.5 
##$DBPOFFS= (0..7)
0 0 0 0 0 0 0 0 
##$DE= 6
##$DECBNUC= <off>
##$DECIM= 24
##$DECNUC= <off>
##$DECSTAT= 4
##$DIGMOD= 1
##$DIGTYP= 9
##$DL= (0..7)
0 120 120 120 120 120 120 120 
##$DP= (0..7)
150 150 150 150 150 150 150 150 
##$DP07= 0
##$DPNAME0= <>
##$DPNAME1= <>
##$DPNAME2= <>
##$DPNAME3= <>
##$DPNAME4= <>
##$DPNAME5= <>
##$DPNAME6= <>
##$DPNAME7= <>
##$DPOAL= (0..7)
0.5 0.5 0.5 0.5 0.5 0.5 0.5 0.5 
##$DPOFFS= (0..7)
0 0 0 0 0 0 0 0 
##$DQDMODE= 0
##$DR= 18
##$DS= 0
##$DSLIST= <SSSSSSSSSSSSSSS>
##$DSPFIRM= 0
$$ [...]
##$SUBNAM2= <"">
##$SUBNAM3= <"">
##$SUBNAM4= <"">
##$SUBNAM5= <"">
##$SUBNAM6= <"">
##$SUBNAM7= <"">
##$SUBNAM8= <"">
##$SUBNAM9= <"">
##$SW= 24.9337058887773
##$SWIBOX= (0..15)
0 0 2 0 0 0 0 0 0 0 0 0 0 0 0 0 
##$SW_h= 4990.01996007984
##$TD= 16384
##$TD0= 1
##$TE= 0
##$TE2= 300
##$TE3= 300
##$TEG= 300
##$TL= (0..7)
0 120 120 120 120 120 120 120 
##$TP= (0..7)
150 150 150 150 150 150 150 150 
##$TP07= 0
##$TPNAME0= <>
##$TPNAME1= <>
##$TPNAME2= <>
##$TPNAME3= <>
##$TPNAME4= <>
##$TPNAME5= <>
##$TPNAME6= <>
##$TPNAME7= <>
##$TPOAL= (0..7)
0.5 0.5 0.5 0.5 0.5 0.5 0.5 0.5 
##$TPOFFS= (0..7)
0 0 0 0 0 0 0 0 
##$TUNHIN= 0
##$TUNHOUT= 0
##$TUNXOUT= 0
##$USERA1= <user>
##$USERA2= <user>
##$USERA3= <user>
##$USERA4= <user>
##$USERA5= <user>
##$V9= 5
##$VALIST= <valist>
##$VCLIST= <CCCCCCCCCCCCCCC>
##$VD= 0
##$VDLIST= <DDDDDDDDDDDDDDD>
##$VPLIST= <PPPPPPPPPPPPPPP>
##$VTLIST= <TTTTTTTTTTTTTTT>
##$WBST= 1024
##$WBSW= 4
##$XGAIN= (0..3)
0 0 0 0 
##$XL= 0
##$YL= 0
##$YMAX_a= 128211
##$YMIN_a= -118767
##$ZGOPTNS= <>
##$ZL1= 120
##$ZL2= 120
##$ZL3= 120
##$ZL4= 120
##$ABSF1= 10
##$ABSF2= 0
##$ABSG= 5
##$ABSL= 3
##$ALPHA= 0
##$AQORDER= 0
##$ASSFAC= 0
##$ASSFACI= 0
##$ASSFACX= 0
##$ASSWID= 0
##$AUNMP= <proc_1d>
##$AZFE= 0.1
##$AZFW= 0.1
##$BCFW= 1
##$BC_mod= 2
##$BYTORDP= 1
##$COROFFS= 0
##$CY= 11.3945322036743
##$DATMOD= 1
##$DC= 2
##$DFILT= <>
##$DTYPP= 0
##$F1P= 18.9103706918063
##$F2P= -1.10871071338519
##$FCOR= 0.5
##$FTSIZE= 0
##$FT_mod= 4
##$GAMMA= 1
##$GB= 0.15
##$INTBC= 1
##$INTSCL= 1
##$ISEN= 128
##$LB= 0.24
##$LEV0= 0
##$LPBIN= 0
##$MAXI= 10000
##$MC2= 0
##$MEAN= 0
##$ME_mod= 0
##$MI= 1.114404
##$NCOEF= 0
##$NC_proc= 0
##$NLEV= 6
##$NOISF1= 3.799351
##$NOISF2= 2.8
##$NSP= 1
##$NTH_PI= 0
##$NZP= 0
##$OFFSET= 15.70392
##$PC= 1
##$PHC0= -8848.354
##$PHC1= 3.400259
##$PH_mod= 1
##$PKNL= yes
##$PPARMOD= 0
##$PSCAL= 0
##$PSIGN= 0
##$REVERSE= no
##$SF= 200.130013532006
##$SI= 16384
##$SIGF1= 3
##$SIGF2= 2
##$SINO= 400
##$SIOLD= 16384
##$SREGLST= <1H.CDCl3>
##$SSB= 0
##$STSI= 0
##$STSR= 0
##$SW_p= 3612.71676300578
##$SYMM= 0
##$S_DEV= 0
##$TDeff= 0
##$TDoff= 0
##$TI= <>
##$TILT= no
##$TM1= 0
##$TM2= 0
##$TOPLEV= 0
##$USERP1= <user>
##$USERP2= <user>
##$USERP3= <user>
##$USERP4= <user>
##$USERP5= <user>
##$WDW= 1
##$XDIM= 8192
##$YMAX_p= 0
##$YMIN_p= 0
$$ End of Bruker specific parameters
$$ ---------------------------------
##NTUPLES= NMR FID
##VAR_NAME=  TIME,          FID/REAL,        FID/IMAG
##SYMBOL=    X,             R,               I
##VAR_TYPE=  INDEPENDENT,   DEPENDENT,       DEPENDENT
##VAR_FORM=  AFFN,          ASDF,            ASDF
##VAR_DIM=   8192,          8192,            8192
##UNITS=     SECONDS,       ARBITRARY UNITS, ARBITRARY UNITS
##FACTOR=    0.0002004,     1,               1
##FIRST=     0,             0,               0
##LAST=      1.6414764,     0,               0
##MIN=       0,             -118767,         0
##MAX=       1.6414764,     128211,          0
$$ Real data points
##PAGE= N=1
##DATA TABLE= (X++(R..R)), XYDATA
$$ plain form
0 0 0 0 0 0 0 0 0 0 8 -8 8 -8 16 -16 18 -24 29 -32 40 -48 56 -65 73 -87 97 -113 129 -145 167 -187 211
31 211 -239 266 -298 333 -371 413 -458 509 -564 623 -693 767 -848 939 -1041 1158 -1288 1438
49 1438 -1616 1822 -2068 2370 -2754 3253 -3931 4919 -6493 9418 -16731 76406 94407 4760
63 4760 77821 101151 104854 96898 58940 16420 85510 128211 64986 23758 70381 74735 59385
76 59385 75436 62120 28566 71878 97423 37880 24234 86704 80520 33069 37842 41114 24937
89 24937 58600 65472 -7373 -20968 47702 51375 7306 10047 7805 -9602 31530 57788 -88
102 -88 -19815 32491 32497 3087 27531 30778 -10267 3151 32784 4387 -93 31767 995 -33472
116 -33472 16956 46313 2527 -5991 16650 5017 21355 63168 27020 -20533 27919 69493
$$ packed form
0@%%%%%%%%Qj6J6j6K4l2L4m2N3o1P2q8J04j21J38j60J84k10K42k74L12l54L98
31B11m50N05n64O31p04P84q71R67j073J187j316J460j615J787j980K199k446K726
49A438l054L438l890M438n124O007p184Q850j1412J5911k6149R3137J8001q9647
63D760P3061K3330L703p956l7958m2520O9090M2701o3225m1228M6623M354j5350
76E9385J6051j3316l3554M3312K5545n9543j3646O2470o184m7451M773L272j6177
89B4937L3663O872p2845j3595O8670L673m4069K741k242j7407M1132K6258n7876
102h8j9727N2306Ok9410K4444L247m1045J3418K9633k8397m480L1860l0772l4467
116c3472N0428K9357m3786q518K2641j1633J6338M1813l6148m7553M8452M1574
$$ plain form
128 69493 34820 22336 36427 17494 26542 64434 33437 -6807 38139 63850 15981 10631
140 10631 47734 39276 33811 54842 28479 7923 66602 88843 23292 6074 51652 58962 51144
153 51144 53134 12068 -9600 55572 80445 10772 -15402 25576 33462 29423 40557 9299 -14879
166 -14879 37792 62358 7009 -5761 34984 28936 10823 24997 8785 -11182 25645 32193
178 32193 -25509 -25204 26341 13685 -19812 -7986 -8683 -16112 19258 22291 -32729 -27423 28207
191 28207 19375 -13307 -1153 -1970 -14852 14537 18677 -30562 -26499 18959 -317 -32553 -7435
204 -7435 1814 -19215 -3956 4082 -26134 -10607 30538 1400 -31961 4336 23822 -1390 1869
217 1869 4716 -21197 -3024 34000 -3414 -42870 -5004 17484 -10303 -11110 -3716 -23342 -6322
$$ packed form
128F9493l4673j2484J4091j8933R048L7892l0997m0244M4946K5711m7869n350
140A0631L7103q458n465K1031k6363k0556N8679K2241o5551j7218M5578P310p818
153E1144J990m1066k1668O5172K4873o9673k6174M0978P886m039J1134l1258k4178
166a4879N2671K4566n5349j2770M0745o048j8113J4174j6212j9967L6827O548
178C2193n7702L05N1545j2656l3497J1826o97p429L5370L033n5020N306N5630
191B8207q832l2682J2154q17j2882K9389M140m9239M063M5458j9276l2236K5118
204g435R249k1029J5259Q038l0216J5527M1145k9138l3361L6297J9486k5212L259
217A869K847k5913J8173L7024l7414l9456L7866K2488k7787q07P394j9626J7020
$$ plain form
230 -6322 26320 -6579 -35957 7813 26452 -9838 -10984 6367 -8600 -1127 20479 -14877 -39411
243 -39411 5413 19316 -25826 -30548 -6098 -13755 -10083 5147 -25213 -39991 9606 21906 -24786
256 -24786 -25987 5125 -2689 -6123 6726 -18519 -32352 9620 14052 -34362 -32234 2697 -8121
269 -8121 -20132 -8205 -22687 -29112 10063 9913 -35007 -23742 17521 3305 -15114 -1181 -8176
282 -8176 -14698 15609 9339 -35276 -21470 18699 -1785 -26973 -10862 -10794 -17214 7626 1204 -36701
296 -36701 -15048 25656 1484 -24794 -1936 4800 -5309 10760 3391 -29697 -8592 25635
308 25635 -5813 -34291 -7331 1389 -14492 -4133 -7909 -32518 -8523 22394 -10835 -34166
320 -34166 1498 13284 -8217 -2565 -729 -19535 450 23231 -13489 -34161 2828 11760 -17663
$$ packed form
230f322L2642l2899k9378M3770J8639l6290j146J7351j4967P473K1606l5356k4534
243c9411M4824J3903m5142m722K4450p657L672J5230l0360j4778M9597J2300m6692
256b4786j201L1112p814l434J2849k5245j3833M1972M432m8414K128L4931j0818
269h121j2011J1927j4482o425L9175j50m4920J1265M1263j4216j8419J3933o995
282h176o522L0307o270m4615J3806M0169k0484k5188J6111O8o420K4840o422l7905
296c6701K1653M0704k4172k6278K2858O736j0109J6069p369l3088K1105L4227
308B5635l1448k8478K6960Q720j5881J0359l776k4609K3995L0917l3229k3331
320c4166L5664J1786k1501N652J836j8806J9985K2781l6720k0672L6989Q932k9423
$$ plain form
333 -17663 -15254 -8010 -20865 -4087 14119 -19404 -33001 9914 17969 -14808 -10871 5333 -4402
346 -4402 5191 17236 -13833 -23283 17456 17975 -21165 -16913 3873 -6044 -3738 5827 -19449 -22932
360 -22932 18131 16433 -22757 -12627 16050 5760 1766 9648 -9091 -10538 24993 16532 -24526
373 -24526 -11702 17443 1562 -9603 -277 -13780 -13785 17395 7934 -29156 -9917 22736 4355
386 4355 -9136 5068 -1149 -2838 21868 9675 -23756 -2627 25615 -641 -17228 944 -1371
399 -1371 -8233 9890 -447 -26929 -1903 25205 -3437 -18731 7293 10197 702 13217 5249
412 5249 -15129 8958 29884 -3786 -19370 9832 11456 -4999 2355 -1138 -16608 5845 22483
425 22483 -10367 -19917 15475 18333 -3160 3886 7595 -2318 16051 26386 -7857 -14542 22594
$$ packed form
333a7663K409P244j2855J6778J8206l3523j3597M2915Q055l2777L937J6204r735
346d402R593J2045l1069r450M0739N19l9140M252K0786r917K306R565k5276l483
360b2932M1063j698l9190J0130K8677j0290l994P882j8739j447L5531q461m1058
373b4526J2824K9145j5881j1165R326j3503nL1180r461l7090J9239L2653j8381
386D355j3491J4204o217j689K4706j2193l3431K1129K8242k6256j6587J8172k315
399a371o862J8123j0337k6482K5026K7108k8642j5294K6024K904r495J2515p968
412E249k0378K4087K0926l3670j5584K9202J624j6455P354l493j5470K2453J6638
425B2483l2850r550L5392K858k1493P046L709r913J8369J0335l4243o685L7136
$$ plain form
438 22594 21154 -8597 -3935 4926 -3387 9091 15446 -15590 -16818 22172 19776 -10977 -2113 12778
452 12778 5246 13997 19550 -7118 -6174 29524 21362 -12743 -1526 15774 3279 4251 9611 -11334
466 -11334 -7998 23924 12733 -18571 -990 21153 6849 4504 13247 -1345 2327 30039 15226
479 15226 -15887 4065 26092 5218 -3221 6869 -3492 -2187 19471 3752 -22366 2010
491 2010 23622 -24 -8689 8650 3923 3136 19920 5001 -16367 9258 26883 -3173 -14430
504 -14430 6150 3761 -3431 5730 -7408 -23027 4295 18903 -14288 -22919 5079 7099 -3086
517 -3086 3690 -5299 -16599 10976 22026 -12932 -21313 7742 7836 -7762 -2768 -9165 -18840 3537
531 3537 11587 -20778 -23620 8470 5920 -12406 -3348 -258 -8008 9821 15271 -14045 -12035 20153
$$ packed form
438B2594j440k9751M662Q861q313J2478O355l1036j228L8990k396l0753Q864J4891
452A2778p532Q751N553k6668R44L5698q162l4105J1217J7300j2495R72N360k0945
466a1334L336L1922j1191l1304J7581K2143j4304k345Q743j4592L672K7712j4813
479A5226l1113J9952K2027k0874q439J0090j0361J305K1658j5719k6118K4376
491B010K1612k3646q665J7339m727p87J6784j4919k1368K5625J7625l0056j1257
504a4430K0580k389p192R161j3138j5619K7322J4608l3191q631K7998K020j0185
517c086O776q989j1300K7575J1050l4958q381K9055R4j5598M994o397r675K2377
531C537Q050l2365k842L2090k550j8326R058L090p750J7829N450k9316K010L2188
$$ plain form
545 20153 13372 -11587 -2764 3297 -4627 7260 9829 -17627 -13995 18659 10232 -13337 -921
558 -921 9068 -559 9437 15862 -5323 -1786 24852 13186 -9141 8180 18131 245 1559 9389
572 9389 -5154 -1620 18845 862 -20036 4119 19546 -838 -4491 5036 -2126 4820 22530
585 22530 2662 -18445 6961 21993 -1819 -7943 2337 -5847 -3841 10116 -8056 -25135 731
598 731 11896 -15100 -18564 773 -1839 -4923 3371 -11139 -19780 9394 16527 -16823 -22092 1882
612 1882 1347 -5607 -2887 -18988 -26075 3836 10866 -23287 -28184 -2234 -2180 -8928 -2144 -11905 -19240
627 -19240 5975 12087 -16494 -15681 8818 1746 -11655 -2812 -5866 -13752 3422 3577 -24295 -17960
641 -17960 10557 663 -17630 -7446 -3846 -7419 8455 7401 -18848 -10824 17789 7257 -11799
$$ packed form
545B0153o781k4959Q823O061p924J1887K569k7456L632L2654q427k3569J2416
558i21R989r627R996O425k1185L537K6638j1666k2327J7321R951j7886J314P830
572I389j4543L534K0465j7983k0898K4155J5427k0384l653R527p162O946J7710
585B2530j9868k1107K5406J5032k3812o124J0280q184K006J3957j8172j7079K5866
598G31J1165k6996l464J9337k612l084Q294j4510q641K9174P133l3350n269K3974
612A882n35o954K720j6101p087K9911P030l4153m897K5950N4o748O784r761p335
627a9240K5215O112k8581Q13K4499p072j3401Q843l054p886J7174J55k7872O335
641a7960K8517r894j8293J0184L600l573J5874j054k6249Q024K8613j0532j9056
$$ plain form
654 -11799 -980 766 -7800 4181 5416 -16985 -11696 10086 -3833 -19333 -1646 4323 -9649
667 -9649 -3835 1471 -11087 -951 16666 -3462 -19721 3997 14387 -3919 -5403 -2019 -12396
680 -12396 -2097 13441 -8753 -26358 -2074 9131 -9039 -9057 -1977 -9874 -1869 12011 -5516
693 -5516 -17090 7841 14325 -9244 -8360 5399 -1697 -1289 5526 -11748 -18752 8422 11282 -17426
707 -17426 -16933 2039 -818 -1622 4155 -10825 -15245 12739 16240 -12206 -10968 8576 2882 -2551
721 -2551 4283 -7789 -14130 7357 6771 -19334 -13178 7594 -2989 -12273 -2321 -6486 -9530 9082
735 9082 5315 -19435 -8223 16085 3000 -11222 -1988 -3431 -6318 7778 1586 -22573 -11444
748 -11444 11235 -3020 -17394 -5055 -3607 -8432 3903 1199 -17092 -3947 17043 -546 -14245
$$ packed form
654a1799J0819J746q566J1981J235k2401N289K1782j3919j5500J7687N969j3972
667i649N814N306j2558J0136J7617k0128j6259K3718J0390j8306j484L384j0377
680a2396J0299J5538k2194j7605K4284J1205j8170j8P080p897Q005J3880j7527
693e516j1574K4931O484k3569Q84J3759p096M08O815j7274p004K7174K860k8708
707a7426M93J8972k857q04N777j4980m420K7984L501k8446J238J9544n694n433
721b551O834j2072o341K1487n86k6105O156K0772j0583r284R952m165l044J8612
735I082l767k4750J1212K4308j3085j4222R234j443k887J4096o192k4159J1129
748a1444K2679j4255j4374J2339J448m825J2335k704j8291J3145K0990j7589j3699
$$ plain form
761 -14245 2874 7210 -2117 3461 338 -13810 -658 15596 -5698 -19804 872 7661 -4716
774 -4716 -722 -105 -10580 3209 18519 -1645 -13413 9681 15676 -386 2177 5529 -3371 5915
788 5915 15744 -5670 -14735 9708 12187 -8148 -5346 3385 -3242 3504 12121 -6352 -11199 14699
802 14699 16634 -5900 -2104 9761 2604 4572 10144 -6974 -10483 12891 9881 -14466 -8458 7119
816 7119 -721 -2737 3434 -8242 -8408 14151 10339 -13258 -3815 13881 4668 -826 5621 -4016
830 -4016 -4631 13955 7458 -16225 -5360 12333 -43 -7756 1383 -2943 -4182 11432 5491 -13585
844 -13585 709 19020 3622 -4729 7405 5686 2159 13432 6019 -11748 2740 18784 -94
857 -94 -10472 4245 4309 -1218 7624 3022 -10021 5408 19777 349 -7710 10758 11666 1668 8153
$$ packed form
761a4245J7119M336r327N578l123j4148J3152J6254k1294j4106K0676O789j2377
774d716L994O17j0475J3789J5310k0164j1768K3094N995j6062K563L352q900R286
788E915R829k1414r065K4443K479k0335K802Q731o627O746Q617j8473m847K5898
802A4699J935k2534L796J1865p157J968N572j7118l509K3374l010k4347O008J5577
816G119p840k016O171j1676j66K2559l812k3597R443J7696r213n494O447r637
830d016o15J8586o497k3683J0865J7693j2376p713R139m326j239J5614n941j9076
844a3585J4294J8311j5398q351J2134j719l527J1273p413j7767J4488J6044j8878
857i4j0378J4717O4n527Q842m602j3043J5429J4369j9428q059J8468R08r998O485
$$ plain form
872 8153 5789 -4919 7497 17046 -5732 -12459 9179 8638 -6625 -2254 -43 -6938 4989 11520
886 11520 -9601 -12561 12281 11311 -6107 -1666 3454 -2844 5815 9868 -11614 -13509 10593 6870
900 6870 -14273 -8932 -394 -6243 -1057 2356 -14858 -12971 12226 6884 -14871 -5934 6551 50
914 50 1682 4249 -10850 -8545 13530 5455 -17140 -8049 5395 -2821 -3998 -14 -11970 -8492
928 -8492 12205 4129 -15526 -2733 11982 1428 -853 5617 -2999 -1766 14639 5459 -13504
941 -13504 -118 12613 -1747 -5888 2493 -3230 -3913 9277 1695 -12969 2688 14848 -1372
954 -1372 -4820 8654 4750 256 10464 3535 -8157 6651 14516 -5720 -9050 6805 2985 -5491
968 -5491 2315 -1578 -10343 4909 11309 -9405 -9919 10978 7138 -3998 2297 1907 -4503 8033
$$ packed form
872H153k364j0708J2416R549k2778o727K1638n41j5263M371K211o895J1927O531
886A1520k1121k960K4842r70j7418M441N120o298Q659M053k1482j895K4102l723
900F870k1143N341Q538n849N186L413j7214J887K5197n342k1755Q937J2485o501
914E0J632K567j5099K305K2075q075k2595R091J3444q216j177L984j1956L478
928h492K0697q076j9655J2793J4715j0554k281O470q616J233J6405r180j8963
941a3504J3386J2731j4360m141Q381n723o83J3190p582j4664J5657J2160j6220
954a372l448J3474l904m494J0208o929j1692J4808P865k0236l330J5855l820q476
968e491P806l893q765J5252O400k0714n14K0897l840j1136O295l90o410J2536
$$ plain form
982 8033 10846 -10959 -10062 11231 5306 -10782 -4564 -1883 -6694 4002 4377 -15667 -11165 13085
996 13085 6411 -11093 -3402 3033 -1109 6784 6236 -12990 -8358 14089 5168 -13834 -5814 1333
1010 1333 -4993 190 1205 -15384 -9245 11578 2214 -15212 -3271 6465 -1544 1330 3076 -8894
1024 -8894 -3139 14177 2073 -15276 -2083 7849 -3718 -4309 -598 -10801 -5742 9969 -2030
1037 -2030 -16869 -841 9135 -3487 -3552 3704 -3338 -728 11556 37 -11845 4617 11522 -6458
1051 -6458 -7119 4070 -2042 -3230 5459 -4632 -12937 5416 11295 -8354 -7882 7556 3624 220
1065 220 7172 -607 -7045 10542 13832 -7615 -6957 9528 3775 -3634 2966 -2577 -8227 7666
1079 7666 8850 -11141 -7018 11614 5838 -3925 3952 2257 -1928 11465 10627 -9175 -3823 14662
$$ packed form
982H033K813k1805Q97K1293n925j6088O218K681m811J0696L75k0044M502K4250
996A3085o674j7504P691O435m142P893n48j9226M632K2447q921j9002Q020P147
1010A333o326N183J015j6589O139K0823r364j7426J1941R736q009K874J746j1970
1024h894N755J7316j2104j7349J3193R932j1567n91L711j0203N059J5711j1999
1037b030j4839J6028R976j2622o5P256p042K610J2284j1519j1882J6462O905j7980
1051f458o61J1189o112j188Q689j0091q305J8353N879j9649M72J5438l932l404
1065B20O952p779o438J7587L290k1447O58J6485n753p409O600n543n650J5893
1079G666J184j9991M123J8632n776r763P877j695m185J3393q38j9802N352J8485
$$ plain form
1093 14662 5876 -6665 450 1432 -3708 6276 5346 -12971 -6121 12818 3398 -9105 1192 4304
1107 4304 -1324 7187 6989 -8335 -1500 15225 3436 -9460 1744 5243 -3703 1109 1865 -10299
1121 -10299 -3424 10698 -2621 -13340 2209 7118 -4046 -774 3227 -5194 1363 13054 -1782
1134 -1782 -12480 5269 9897 -4585 -4117 676 -6487 -1636 7855 -6805 -15140 3575 7715 -8046
1148 -8046 -5736 2868 -2702 139 8067 -4191 -9854 8893 9769 -9316 -6549 5396 -1121 -2801
1162 -2801 2378 -8524 -11562 7329 6708 -13522 -9156 5960 733 -1857 3385 -5003 -7355 10395
1176 10395 9705 -10210 -5749 8674 1253 -3872 2580 -4021 -7950 6182 4116 -13186 -5370 8957
1190 8957 -1226 -7710 2333 682 -2451 8017 4775 -10443 -510 15227 2245 -7691 1610
$$ packed form
1093A4662q786j2541P115R82n140R984r30j8317O850J8939r420j2503J0297L112
1107D304n628Q511j98j5324O835J6725j1789j2896J1204L499q946M812P56j2164
1121a0299O875J4122j3319j0719J5549M909j1164L272M001q421O557J1691j4836
1134a782j0698J7749M628j4482M68M793p163M851R491j4660q335J8715M140j5761
1148h046K310Q604n570K841P928j2258n663J8747Q76j9085K767J1945o517j680
1162b801N179j0902l038J8891o21k0230M366J5116n227k590N242q388k352J7750
1176A0395o90j9915M461J4423p421n125O452o601l929J4132k066j7302P816J4327
1190H957j0183o484J0043j651l133J0468l242j5218R933J5737j2982r936R301
$$ plain form
1203 1610 1633 -2048 6576 2241 -13189 -3279 11734 -830 -9882 2013 2661 -2913 5535 4304 -7464
1218 -7464 1702 13546 -854 -7909 7059 7351 -3961 464 769 -7341 1840 10400 -7550 -14406
1232 -14406 4739 6949 -4988 -1856 147 -6331 3258 12042 -4604 -11061 6501 8139 -4759
1245 -4759 -968 1832 -6713 -1435 6161 -7503 -11958 4797 2326 -12432 -5147 3483 -3899 -2172
1259 -2172 3355 -7478 -7645 9908 5904 -11735 -4971 5699 -1442 -1980 1806 -9068 -10057 6579
1273 6579 2676 -14008 -6585 4154 -4222 -4938 2412 -4794 -6277 7314 2869 -11028 -1 10563
1287 10563 -2841 -6861 1991 -1296 -3426 5767 -1746 -15353 -1857 10684 -3303 -10008 -759
1300 -759 -1415 -1972 7309 499 -12432 1185 13557 -651 -7486 3142 1369 -2268 5393 -264
$$ packed form
1203A610K3l681Q624m335j5430R910J5013j2564r052J1895O48n574Q448j231j1768
1218g464R166J1844j4400p055J4968K92j1312M425L05q110R181Q560j7950o856
1232a4406J9145K210j1937L132K003o478R589Q784j6646o457J7562J638j2898
1245d759L791K800q545N278P596j3664m455J6755k471j4758P285Q630p382J727
1259b172N527j0833j67J7553m004j7639O764J0670p141n38L786j0874r89J6636
1273F579l903j6684P423J0739q376p16P350p206j483J3591m445j3897J1027J0564
1287A0563j3404m020Q852l287k130R193p513j3607J3496J2541j3987o705R249
1300g59o56n57R281o810j2931J3617J2372j4208o835J0628j773l637P661n657
$$ plain form
1314 -264 -11150 499 9643 -6296 -10699 3546 2651 -4182 1554 -1175 -8160 4948 12890 -5273
1328 -5273 -9463 7009 7092 -1605 2167 -236 -7616 3619 10557 -6591 -10639 4853 3533 -5430
1342 -5430 604 1014 -6187 2391 8954 -4761 -5695 9718 5597 -5792 2026 6092 -2376 1839 5940
1357 5940 -6600 -5616 9477 3186 -10444 -1905 4578 -3138 163 4840 -5961 -4205 10531 4296
1371 4296 -8384 1843 9010 -1423 -278 5006 -3288 -2875 8874 151 -11224 902 8114 -4025
1385 -4025 -5845 2069 -2706 -1151 8575 -112 -11125 3482 12027 -1208 -4408 3345 -411 354
1399 354 8477 -1264 -12164 2285 9876 -5213 -7604 1709 -1116 -1965 5699 -1714 -9787 4889
1413 4889 11175 -4529 -5858 6148 3585 -829 5268 -1165 -7984 5090 9374 -7172 -8208 5181
$$ packed form
1314b64j0886J1649R144j5939m403J4245q95o833N736k729o985J3108P942j8163
1328e273m190J6472Q3q697L772k403p380J1235O938j7148m048J5492j320q963
1342e430O034M10p201Q578O563j3715r34J5413m121j1389P818M066q468M215M101
1357E940j2540R84J5093o291j3630Q539O483p716L301M677j0801J756J4736o235
1371D296j2680J0227P167j0433J145N284q294M13J1749q723j1375J2126P212j2139
1385d025j820P914m775J555R726q687j1013J4607Q545j3235l200P753l756P65
1399C54Q123r741j0900J4449P591j5089k391R313k825q49P664p413q073J4676
1413D889O286j5704j329J2006k563m414O097o433o819J3074M284j6546j036J3389
$$ plain form
1427 5181 2216 -4134 2065 -1505 -7367 5356 9587 -6338 -5488 8756 4945 -2962 3719 2379
1441 2379 -3577 5425 7610 -6944 -5661 8732 2444 -6514 930 2475 -3649 3008 5679 -6589
1455 -6589 -2373 11385 4218 -5709 3544 7078 -258 4040 6229 -4981 -1326 11566 1969 -8579
1469 -8579 2067 6275 -2021 982 3871 -4588 65 11897 2517 -7261 5017 10355 355 1872
1483 1872 6238 -1177 2063 11903 989 -8261 4592 9464 -2527 -2109 3287 -2174 473 9444
1497 9444 -461 -7816 6428 11202 -1910 -854 6543 1194 2163 9112 63 -7313 6349 9333
1511 9333 -5338 -4676 4694 -118 -1598 4694 -2468 -7672 6067 8301 -6288 -3868 7728 2268
1525 2268 -1307 4716 -335 -4841 6688 7098 -8195 -5025 6789 330 -5416 1063 -1932 -5524
$$ packed form
1427E181k965o350O199l570n862J2723M231j5925Q50J4244l811p907O681j340
1441B379n956R002K185j4554J283J4393o288q958P444J545o124O657K671j2268
1455f589M216J3758p167r927R253L534p336M298K189j1210L655J2892r597j0548
1469h579J0646M208q296L003K889q459M653J1832r380r778J2278N338j0000J517
1483A872M366p415L240R840j0914r250J2853M872j1991M18N396n461K647Q971
1497I444r905p355J4244M774j3112J056P397n349R69O949r049p376J3662K984
1511I333j4671O62R370m812j480O292p162n204J3739K234j4589K420J1596n460
1525B268l575O023n051m506J1529M10j5293L170J1814o459n746O479k995l592
$$ plain form
1539 -5524 4256 4383 -8769 -3668 9159 1585 -4953 2840 2083 -2570 5458 4539 -7753 -2196 9612
1554 9612 272 -8020 978 1584 -4062 2458 2054 -8680 -1495 9934 230 -7485 3532 5483 -1138
1569 -1138 3737 3787 -5306 830 10792 -623 -8137 2962 4954 -3139 216 1639 -5989 -278 9059
1584 9059 -2326 -8493 4801 7187 -2262 870 4213 -2014 2412 9452 -1621 -7327 6125 6701
1598 6701 -4949 -2379 2783 -2851 -125 5954 -4307 -7458 6324 6925 -5505 -1915 5805 414
1612 414 1210 6664 -2146 -4822 8156 6760 -6419 -2635 5527 -549 -2458 3019 -3506 -5624 6388
1627 6388 4643 -8252 -2371 7516 565 -2060 3685 -314 -3043 7284 4732 -7864 -1779 7714
1641 7714 -677 -5132 1456 -1798 -4738 4214 1526 -9584 -2626 7995 -1618 -6337 2271 796
$$ packed form
1539e524R780J27j3152N101J2827p574o538P793p57m653Q028r19j2292N557J1808
1554I612r340q292Q998O06n646O520m04j0734P185J1429r704p715J1017J951o621
1569a138M875N0r093O136R962j1415p514J1099J992q093L355J423p628N711R337
1584I059j1385o167J3294K386r449L132L343o227M426P040j1073n706J3452N76
1598F701j1650K570N162n634K726O079j0261l151J3782O01j2430L590P720n391
1612D14P96N454q810k676J2978j396j3179L784Q162o076j909N477o525k118J2012
1627F388j745j2895N881R887o951k625N745l999k729J0327k552j2596O085R493
1641G714q391m455O588l254k940Q952k688j1110O958J0621r613m719Q608j475
$$ plain form
1655 796 -3001 4523 1899 -7949 -660 8404 -2753 -8386 1371 101 -5284 791 -987 -10127 -2178
1670 -2178 6123 -4809 -9438 1628 1746 -4334 695 655 -6890 406 7139 -4367 -8599 3110 2736
1685 2736 -5870 -2117 -656 -6536 -1056 4526 -6528 -9081 4198 3493 -5939 -1677 2019 -3169 1334
1700 1334 6282 -4001 -6223 6515 4724 -6003 -1232 3210 -2716 -237 4211 -4409 -5724 6266
1714 6266 3842 -6891 -1009 5837 14 846 5018 -2006 -2091 9424 5328 -6378 468 7563 165
1729 165 -1038 3604 -2644 -3224 7125 2511 -8113 -166 7398 -820 -1789 4099 81 -1048 7395
1744 7395 3170 -6283 2000 8887 -1333 -4144 3299 -176 -2371 4060 -531 -8931 438 7436 -3201
1759 -3201 -6345 2138 604 -1516 4543 250 -7153 2048 8266 -2879 -5822 3256 1395 -3280 1696
$$ packed form
1655G96l797P524k624r848P289R064j1157n633R757j270n385O075j778r140P949
1670b178Q301j0932m629J1066J18o080N029m0p545P296O733j1506m232J1709l74
1685B736q606L753J461n880N480N582j1054k553J3279p05r432M262L696n188M503
1700A334M948j0283k222J2738j791j0727M771M442n926K479M448q620j315J1990
1714F266k424j0733N882O846n823Q32M172p024q5J1515m096j1706O846P095p398
1729A65j203M642o248n80J0349m614j0624P947P564q218r69N888m018j129Q443
1744G395m225r453Q283O887j0220k811P443l475k195O431m591q400R369O998j0637
1759c201l144Q483j534k120O059m293p403R201O218j1145k943R078j861m675M976
$$ plain form
1774 1696 -1068 -7932 459 5552 -5962 -7558 3219 2012 -4057 771 186 -4437 2933 6882 -4780
1789 -4780 -6016 5925 3742 -4030 373 575 -5040 1374 5165 -5514 -6454 5054 2430 -5110 993
1804 993 2681 -3015 1480 5558 -2813 -2363 8141 3087 -4780 1759 5160 -1784 168 3549 -4050
1819 -4050 -2475 7359 1559 -7210 629 5726 -1339 394 4496 -1946 -376 8605 2979 -5388 3324
1834 3324 7461 -1138 -536 3976 -1366 -1360 5957 -120 -7504 2515 6985 -3365 -3471 3000 337 -21
1850 -21 6329 251 -6365 4366 9199 -1701 -3792 3170 742 -291 4813 -1142 -7967 2523 6975
1865 6975 -4188 -4599 3074 458 -1326 3986 162 -5096 4573 7698 -3465 -3737 5701 2883 -1484
1880 -1484 2828 -261 -4728 3651 6050 -5767 -5313 4809 1742 -2520 1893 235 -4244 3892 6577
$$ packed form
1774A696k764o864Q391N093j1514j596J0777j207o069M828n85m623P370L949j1662
1789d780j236J1941k183p772M403K02n615O414L791j0679r40J1508k624p540O103
1804I93J688n696M495M078q371M50J0504n054p867O539L401o944J952L381p599
1819d050J575R834n800q769P839N097p065J733M102o442J570Q981n626q367Q712
1834C324M137q599O02M512n342OP317o077p384J0019M470j0350j06O471k663l58
1850b1O350o078o616J0731M833j0900k091O962k428j033N104n955o825J0490M452
1865F975j1163m11P673k616j784N312l824n258R669L125j1163k72R438k818m367
1880a484M312l089m467Q379K399j1817M54J0122l067m262M413j658m479Q136K685
$$ plain form
1895 6577 -3815 -2873 6665 2753 -3282 3089 2215 -3497 1993 4103 -5022 -3381 6080 7 -6326
1910 -6326 1046 2288 -3196 1110 3103 -4598 -1759 7129 843 -6088 1459 3719 -3067 -36 2358
1925 2358 -5184 -2696 5039 -1725 -8247 239 3052 -4795 -2473 1074 -4251 -1973 5028 -1890 -7455
1940 -7455 2368 5200 -4216 -2792 1536 -2656 -1716 3574 -3415 -8779 1222 3802 -5509 -5069 755
1955 755 -2721 -2115 3487 -2583 -7072 3149 5677 -4689 -3121 3131 -810 -1346 2858 -2281 -6309
1970 -6309 3000 4054 -6843 -4606 3271 -642 -3068 1945 -1882 -4773 4331 4581 -5414 -3010 5511
1985 5511 668 -2475 2074 -732 -4242 3042 3089 -6580 -3764 4656 -771 -5294 409 -759 -4231
2000 -4231 2491 2576 -6422 -2139 6467 123 -4924 1171 1035 -3092 1718 1660 -6434 -2546 4842 -2326
$$ packed form
1895F577j0392R42R538l912o035O371q74n712N490K110r125J641R461o073o333
1910f326P372J242n484M306J993p701K839Q888o286o931P547K260o786L031K394
1925B358p542K488P735o764o522Q486K813p847K322L547n325K278P001o918n565
1940g455R823K832r416J424M328m192R40N290o989n364J0001K580r311M40N824
1955G55l476O06N602o070m489J0221K528j0366J568O252l941n36M204n139m028
1970f309R309J054j0897K237P877l913k426N013l827k891R104K50r995K404Q521
1985E511m843l143M549k806l510P284M7r669K816Q420n427m523N703j168l472
2000d231O722Q5q998M283Q606o344n047O095j36m127M810n8q094L888P388p168
$$ plain form
2016 -2326 -7281 116 559 -4112 -121 489 -6175 -1651 5605 -1573 -6651 1476 2470 -3199 -225 892
2032 892 -5171 -1151 4847 -3066 -7741 857 2017 -4896 -2121 194 -4525 -1414 4105 -2914 -6499
2047 -6499 2567 3657 -4024 -1728 2079 -2915 -1110 3525 -3489 -6585 2255 2176 -6786 -3713 970
2062 970 -3382 -2892 1388 -3800 -6420 2517 2374 -6077 -2954 3122 -2130 -2499 1645 -3343 -5285 2597
2078 2597 953 -7725 -3658 2241 -2956 -4830 -274 -3023 -4940 2121 1111 -7635 -2021 4771 -1096
2093 -1096 -3354 1254 -905 -3001 3434 1586 -6794 -1527 5329 -1708 -5091 928 -599 -2769 2865
2108 2865 1075 -5374 494 6785 -337 -3362 3745 3084 -703 4037 2825 -3803 1722 7614 -280
2123 -280 -3721 3447 2928 -1260 2546 2092 -2964 2103 7202 -498 -3001 5422 4558 -411 2922 3554
$$ packed form
2016b326m955P397M43m671L991O10o664M524P256p178n078Q127R94n669K974J117
2032H92o063M020N998p913m675Q598J160o913K775K315m719L111N519p019l585
2047f499R066J090p681K296L807m994J805M635p014l096Q840p9q962L073M683
2062I70m352M90M280n188k620Q937j43q451L123O076n252l69M144m988j942P882
2078B597j644q678M067N899n197j874M556k749j917P061j010q746N614O792n867
2093a096k258M608k159k096O435j848q380N267O856p037l383O019j527k170N634
2108B865j790o449N868O291p122l025P107o61l787M740j212o628N525N892p894
2123b80l441P168n19m188L806m54n056N067N099p700k503Q423q64m969L333O32
$$ plain form
2139 3554 -1337 2438 6743 -1342 -3751 4876 3667 -3161 -72 1732 -2464 762 4371 -2976 -4153
2154 -4153 4926 3329 -4027 76 3127 -1293 599 3844 -2555 -3909 4579 1971 -5661 -1479 2305
2169 2305 -2664 -1679 1781 -3919 -3957 4400 1345 -6096 -724 3918 -1440 -835 3160 -1953 -2431 4735
2185 4735 2208 -5532 -571 4035 -2093 -2156 1931 -1716 -2404 3946 1404 -4964 1060 5792 -640 -1321
2201 -1321 3876 1308 -124 5446 2371 -3863 2037 6648 -405 -1960 3394 1051 -906 4038 1875
2216 1875 -3862 2214 6410 -1471 -1673 4854 3027 -216 3897 2780 -2168 3373 6632 -1751 -2336
2231 -2336 4951 2902 -1914 1920 1281 -3028 2283 4945 -2693 -2996 5428 3283 -1776 2131 2596 -1238
2247 -1238 3191 5198 -2824 -2478 5372 2684 -3712 814 1804 -2129 1288 3299 -3554 -2905 5116 1835
$$ packed form
2139C554m891L775M305q085k409Q627j209o828L089J804m196L226L609p347j177
2154d153R079j597p356M103L051m420J892L245o399j354Q488k608p632M182L784
2169B305m969R85L460n700l8Q357l055p441N372M642n358O05L995n113m78P166
2185D735k527p740M961M606o128o3M087l647o88O350k542o368O024M732o432o81
2201a321N197k568j432N570l075o234N900M611p053j555N354k343j957M944k163
2216A875n737O076M196p881k02O527j827l243M113j117m948N541L259q383n85
2231b336P287k049m816L834o39m309N311K662p638l03Q424k145n059L907M65l834
2247a238M429K007q022L46P850k688o396M526R90l933L417K011o853O49Q021l281
$$ plain form
2263 1835 -4112 848 2886 -1093 1769 4025 -2639 -1944 5967 2186 -4441 284 2841 -1941 -73
2278 -73 2073 -3412 -2393 4491 810 -5029 477 3655 -1788 -200 3018 -1663 -1022 4571 963 -4736
2294 -4736 1064 4189 -2383 -2292 2130 -1971 -2537 2833 -1007 -5639 787 3748 -3125 -2486 2752 -402
2310 -402 -2158 3204 -232 -4671 1740 3884 -3428 -3130 2479 -815 -3168 1297 -1755 -5073 1384
2325 1384 2784 -4906 -3662 2800 -137 -2631 1175 -208 -3559 2640 3464 -4427 -3463 3406 106
2340 106 -3537 195 -1081 -4235 941 2349 -5567 -3843 3369 159 -3922 596 375 -2631 1623
2355 1623 2938 -3702 -2432 4392 422 -4224 439 806 -3152 262 1578 -4852 -2847 3705 -410
2370 -410 -4954 436 1413 -2723 466 2167 -3134 -1318 4506 -36 -4366 1179 2555 -2994 -715
$$ packed form
2263A835n947M960K038l979K862K256o664O95P911l781o627M725K557m782J868
2278g3K146n485J019O884l681n839N506L178n443J588L218m681O41N593l608n699
2294d736N800L125o572R1M422m101n66N370l840m632O426K961o873O39N238l154
2310d02j756N362l436m439O411K144p312K98N609l294k353M465l052l318O457
2325A384J400p690J244O462k937k494L806j383l351O199Q24p891R64O869l300
2340A06l643L732j276l154N176J408p916J724P212l210m081M518k21l006M254
2355A623J315o640J270O824l970m646M663L67l958L414J316o430K005O552m115
2370d10m544N390R77m136L189J701n301J816N824m542m330N545J376n549K279
$$ plain form
2385 -715 1247 -3093 -2107 2959 -1627 -5376 1220 2516 -3324 -1318 1939 -1399 -933 3928 -1091 -4343
2401 -4343 2649 3695 -2794 -1904 1857 -1552 -1642 2433 -2209 -5132 1898 2926 -4267 -2570 2432 -978
2417 -978 -1286 2492 -1377 -4048 3134 3286 -4131 -2186 2958 -848 -2096 1234 -1969 -4383 1964 2035
2433 2035 -5567 -2952 2596 -778 -2768 816 -1265 -3441 2358 2415 -4311 -1828 3381 -300 -2816
2448 -2816 1095 -791 -3649 1300 1664 -5039 -2601 3282 -1226 -4240 1060 53 -2675 1499 1697
2463 1697 -3488 -726 4646 -276 -3461 1984 1352 -2298 861 1529 -3869 -967 3765 -1390 -4329
2478 -4329 1655 1612 -2486 1022 2052 -2617 199 4702 -776 -3264 3245 2873 -2047 454 2030 -2085
2494 -2085 166 3853 -1687 -4325 2848 2700 -3022 -274 2529 -1315 145 4056 -1003 -2928 4326
$$ packed form
2385g15J962m340R86N066m586l749O596J296n840K006L257l338M66M861n019l252
2401d343O992J046o489Q90L761l409r0M075m642k923P030J028p193J697N002l410
2417i78l08L778l869k671P182J52p417J945N144l806j248L330l203k414O347P1
2433B035p602K615N548l374j990L584k081k176N799N7o726K483N209l681k516
2448b816L911j886k858M949L64o703K438N883m508l014N300j007k728M174J98
2463A697n185K762N372m922l185N445o32l650L159O68n398K902M732n155k939
2478d329N984m3m098L508J030m669K816M503n478k488O509l72m920K501J576m115
2494b085K251L687n540k638P173j48n722K748K803l844J460L911n059j925P254
$$ plain form
2509 4326 3691 -2510 108 3435 -479 232 3723 -1018 -2655 4118 2893 -3259 -126 3465 -167
2524 -167 194 3429 -83 -1059 4997 4239 -2405 1135 5229 830 57 3881 558 -894 4620 3179
2540 3179 -2869 539 4952 590 -702 3555 1063 -521 4471 3828 -2347 1179 5728 481 -774
2555 -774 3525 1424 -1188 3134 2259 -3381 471 4671 -1332 -2619 2429 583 -1977 2229 1566 -3617
2571 -3617 584 4318 -1191 -2976 2296 974 -2735 1094 354 -3944 -58 2987 -2661 -4436 1670
2586 1670 646 -3317 -72 801 -3503 -148 3077 -2494 -3035 2988 1712 -2877 431 1588 -2182
2601 -2182 555 3156 -2027 -3322 3706 1947 -3187 327 2289 -1225 910 3919 -1174 -1448 4909
2616 4909 3491 -1827 1805 4424 246 1763 4063 312 -507 5051 2867 -2614 1499 4390 -105
$$ packed form
2509D326o35o201K618L327l914P11L491m741j637O773j225o152L133L591l632
2524a67L61L235l512r76O056p58o644L540M094m399p73L824l323j452N514j441
2540C179o048L408M413m362j292M257k492j584M992o43o175L526M549n247j255
2555g74M299k101k612M322q75n640L852M200o003j287N048j846k560M206o63n183
2571c617M201L734n509j785N272j322l709L829p40m298L886L045n648j775O106
2586A670j024l963L245Q73m304L355L225n571n41O023j276m589L308J157l770
2601b182K737K601n183j295P028j759n134L514J962l514K135L009n093k74O357
2616D909j418n318L632K619m178J517K300l751q19N558k184n481M113K891m495
$$ plain form
2631 -105 495 3619 260 -310 5242 2978 -2264 1952 4889 -88 78 3388 -61 -925 4008 1341
2647 1341 -3939 132 3576 -1608 -2127 1863 -1316 -2108 2348 418 -4105 -138 2909 -2171 -2609 1715
2663 1715 -836 -2876 1422 -265 -4843 -357 2041 -4017 -4063 782 -1561 -3620 -124 -1138 -4861
2678 -4861 -536 2523 -3783 -3596 2071 -161 -2915 698 -276 -3865 346 2196 -3628 -3462 2134 -339
2694 -339 -3614 101 355 -3157 318 2455 -2892 -2623 3472 1129 -3043 1046 1838 -2003 929 3146
2710 3146 -2709 -2487 3423 855 -3807 404 1638 -2513 -233 1871 -2657 -2143 3664 273 -3688
2725 -3688 572 2114 -1833 -518 2005 -2649 -2291 3119 -334 -4809 -227 1435 -3395 -1616 815
2740 815 -2983 -3092 1941 -676 -4940 102 1919 -3011 -1621 1294 -2137 -2189 1972 -851 -4765 196
$$ packed form
2631a05O00L124l359n70N552k264n242M216K937m977J66L310l449q64M933k667
2647A341n280M071L444n184n19L990l179p92M456j930m523L967L047n080m38M324
2663A715k551k040M298j687m578M486K398o058m6M845k343k059L496j014l723
2678d861M325L059o306J87N667k232k754L613r74l589M211J850n824J66N596k473
2694c39l275L715K54l512L475K137n347K69O095k343m172M089P92l841K932K217
2710C146n855K22N910k568m662M211J234m151K280K104m528N14N807l391l961
2725c688M260J542l947J315K523m654L58N410l453m475M582J662m830J779K431
2740H15l798j09N033k617m264N042J817m930J390K915l431n2M161k823l914M961
$$ plain form
2756 196 1699 -3328 -2471 1245 -2042 -2639 1377 -888 -4663 1020 2693 -3150 -1715 2613 -579 -1717
2772 -1717 2235 313 -3000 1544 2868 -2807 -1699 3120 -16 -2218 1662 389 -2788 2089 2650
2787 2650 -2615 -1437 4182 576 -1818 1980 800 -1948 2103 2812 -2791 -1380 3402 138 -2725
2802 -2725 844 374 -2516 1077 2003 -3451 -1598 3441 -317 -2908 1484 1301 -2062 825 1814 -3049
2818 -3049 -1722 3308 -374 -3871 479 1130 -2909 -384 1141 -3875 -1702 3191 -1039 -4290 1050
2833 1050 1393 -2561 139 1893 -2018 -852 3350 -686 -3495 1484 1698 -2442 -654 1462 -2662
2848 -2662 -1366 2938 -777 -3682 1684 2567 -2407 -522 2538 -1005 -434 3306 -350 -2893 2035
2863 2035 2835 -2447 -183 2516 -1116 -1081 2633 -754 -2570 2342 2784 -2481 -444 3425 126 -644
$$ packed form
2756A96J503n027Q57L716l287n97M016k265l775N683J673n843J435M328l192j138
2772a717L952j922l313M544J324n675J108M819l136k202L880j273l177M877N61
2787B650n265J178N619l606k394L798j180k748M051P09n603J411M782l264k863
2802b725L569m70k890L593R26n454J853N039l758k591M392j83l363K887R89m863
2818c049J327N030l682l497M350O51m039K525J525n016K173M893m230l251N340
2833A050L43l954K700J754l911J166M202m036k809M979K14m140J788K116m124
2848b662J296M304l715k905N366Q83m974J885L060l543N71L740l656k543M928
2863B035Q00n282K264K699l632L5L714l387j816M912M42n265K037L869l299p70
$$ plain form
2879 -644 2876 588 -1804 2882 3059 -2364 -286 3739 -258 -1312 2342 361 -2194 2389 2516 -2365
2895 -2365 -85 3915 214 -1158 2827 1321 -1147 2970 3061 -2083 554 4447 237 -1481 2692
2910 2692 1586 -1266 2035 2339 -2142 278 4123 180 -1570 2626 1780 -844 2200 2788 -1553 660
2926 660 4602 182 -2362 2935 2339 -1348 1186 2189 -1803 -141 3445 -685 -2301 2550 2163 -1881
2942 -1881 1028 2078 -1599 306 3475 -763 -2613 2655 1978 -2416 -52 1686 -2135 -670 2632
2957 2632 -1706 -3226 2177 1532 -2889 -642 1961 -1403 -518 2727 -1285 -2578 2726 2289 -3141 -392
2973 -392 2207 -1586 -715 2126 -1274 -3085 2350 1437 -3235 -219 2812 -1198 -1076 2383 -153 -1991
2989 -1991 2469 2006 -3124 313 3344 -826 -1395 2094 -365 -2146 2348 1018 -3440 -420 3093
$$ packed form
2879f44L520k288k392M686J77n423K078M025l997j054L654j981k555M583J27m881
2895b365K280M000l701j372L985j506k468M117R1n144K637L893m210j718M173
2910B692j106k852L301L04m481K420L845l943j750M196q46k624L044N88m341K213
2926F60L942m420k544N297n96l687K534J003l992J662L586m130j616M851l87m044
2942a881K909J050l677J905L169m238j850N268o77m394K364J738l821J465L302
2957B632m338j520N403o45m421K247K603l364Q85L245m012j293N304m37n430K749
2973c92K599l793Q71K841l400j811N435r13m672L016L031m010J22L459k536j838
2989a991M460m63n130L437L031m170n69L489k459j781M494j330m458L020L513
$$ plain form
3004 3093 -1500 -1714 2134 -86 -1568 2443 1341 -2602 559 3292 -1038 -1774 2470 320 -2124
3019 -2124 1329 940 -3012 -40 2567 -1573 -2560 2173 593 -2135 1613 1131 -2800 522 3395 -1560
3035 -1560 -2165 2357 787 -2125 875 1138 -1982 35 2670 -1701 -2358 2585 964 -2271 760 1904
3051 1904 -1570 822 2817 -1789 -2057 3267 1344 -2347 685 2036 -2033 33 2312 -2168 -2446
3066 -2446 2578 653 -3184 143 1633 -1656 -317 2085 -1498 -2219 2678 745 -3421 210 1909
3081 1909 -2235 -915 1536 -2250 -2614 1747 -585 -4526 -375 1458 -2374 -1829 1291 -2136 -2446 1770
3097 1770 -47 -3716 -18 1618 -2493 -2070 1271 -1676 -2383 1265 -563 -3932 -254 1662 -2324
3112 -2324 -2476 1396 -655 -2513 1917 363 -3243 588 2713 -1761 -1332 2139 -230 -1614 1712
$$ packed form
3004C093m593k14L848k220j482M011j102l943L161K733m330p36M244k150k444
3019b124L453l89l952K972K607m140r87M733j580k728L748m82l931L322K873m955
3035a560o05M522j570k912L000K63l120K017K635m371o57M943j621l235L031J144
3051A904l474K392J995m606k68N324j923l691L032J351m069K066K279m480k78
3066b446N024j925l837L327J490l289J339K402l583p21M897j933m166L631J699
3081A909m144J320K451l786l64M361k332l941M151J833l832N45L120l427l10M216
3097A770j817l669L698J636m111M23L341k947p07L648j828l369L678J916l986
3112b324j52L872k051j858M430j554l606L831K125m474M29L471k369j384L326
$$ plain form
3127 1712 827 -2695 901 2917 -2114 -1382 2583 508 -1408 1779 1462 -1886 1460 3216 -1428 -819
3143 -819 3288 1194 -1312 2063 1561 -1350 1365 2778 -1822 -1581 2944 588 -2393 1396 1529 -1577
3159 -1577 607 2479 -1665 -1415 3234 432 -2478 1094 1205 -1896 -52 1870 -2052 -1823 2521 -464
3175 -464 -3356 204 1099 -2462 -184 1351 -1888 -1722 2490 46 -3043 952 1679 -1618 -497 1574
3191 1574 -1508 -1661 2254 -578 -3109 318 1417 -1896 -1034 1348 -1516 -1244 2368 405 -2805 1215
3207 1215 2176 -1514 -830 1978 -660 -1148 1949 17 -2644 1074 1782 -1760 -1528 1749 -918 -1441
3223 -1441 2037 53 -2691 1069 2493 -2386 -1023 2198 -218 -1494 1585 82 -2417 725 1658
3238 1658 -2647 -1250 1938 -555 -2108 1112 23 -2354 350 1636 -2195 -1033 2689 -412 -2028
$$ packed form
3127A712q85l522L596K016n031P32L965k075j916L187l17l348L346J756m644O09
3143h19M107k094k506L375n02k911K715J413m600K41M525k356k981L789J33l106
3159a577K184J872m144K50M649k802k910L572J11l101J844J922l922K29M344k985
3175d64k892L560Q95l561K278J535l239J66M212k444l089L995P27l297J121K071
3191A574l082j53L915k832k531L427J099l313Q62K382k864K72L612j963l210M020
3207A215R61l690O84K808k638m88L097j932k661L718P08l542K32L277k667n23
3223a441L478j984k744L760J424m879J363L221k416j276L079j503k499L142R33
3238A658m305J397L188k493j553L220j089k377K704J286l831J162L722l101j616
$$ plain form
3253 -2028 1262 656 -1854 889 1557 -2472 -1112 2393 -717 -2652 1011 972 -2594 321 1436 -2252
3269 -2252 -944 2776 -321 -2134 1778 1523 -1634 649 1774 -1505 -365 2914 -310 -1957 1535
3284 1535 1460 -1599 448 1610 -1431 -347 3024 117 -2084 1914 1814 -991 352 2099 -1435 -110
3300 -110 2730 -25 -2620 1445 1790 -1963 -67 1606 -1331 -495 2369 -185 -2203 1587 1971 -1911
3316 -1911 -177 2301 -875 -835 1696 -418 -2198 1600 1554 -2226 -473 1594 -1101 -1649 1440 -216
3332 -216 -2401 1293 1177 -2366 -419 2136 -1034 -1196 1505 -196 -2143 1262 1331 -2536 -501 2142
3348 2142 -1035 -2115 858 -549 -2005 797 966 -2361 -535 2028 -946 -1943 1029 207 -1735 1121
3364 1121 964 -2721 -886 1894 -1335 -2694 855 -217 -2208 301 630 -2636 -594 1937 -1140
$$ packed form
3253b028L290o06k510K743O68m029J360L505l110j935L663l9l566K915J115l688
3269b252J308L720l097j813L912k55l157K283J125l279J140L279l224j647L492
3284A535p5l059K047J162l041J084L371k907k201L998j00k805J343J747l534J325
3300a10K840k755k595M065L45l753J896J673k937Q36K864k554k018L790L84l882
3316a911J734K478l176M0K531k114j780L798m6l780J753K067k695n48L089j656
3332b16k185L694j16l543J947K555l170j62K701j701j947L405O9l867K035K643
3348B142l177j080K973j407j456K802J69l327J826K563k974r97K972q22j942K856
3364A121j57l685J835K780l229j359L549j072j991K509L29l266K042K531l077
$$ plain form
3379 -1140 -2194 1063 264 -1925 613 852 -2385 -1051 2135 -1003 -2419 1047 421 -2136 -54 958
3395 958 -2402 -780 1969 -1153 -2301 1462 956 -1894 610 1351 -1595 -183 2325 -996 -1858 1596
3411 1596 1275 -2048 -162 1383 -1471 -662 2175 -802 -1646 1906 1346 -2087 385 2212 -1105 -495
3427 -495 2061 -468 -1353 1884 1260 -2325 143 1813 -1129 -1151 1483 -897 -1707 1483 689 -2469 88
3444 88 1839 -1108 -1155 1535 -605 -1617 1065 157 -2368 -366 1897 -1496 -1852 971 -773 -1975
3460 -1975 870 123 -2917 -636 1499 -1624 -2169 916 -537 -2188 783 389 -2382 62 1572 -1598
3476 -1598 -2113 1058 -571 -2226 114 169 -2497 -667 1388 -1644 -2036 1249 300 -1647 666 398
3492 398 -1964 -138 1832 -1325 -1645 1681 304 -1790 637 619 -1960 -152 2054 -1496 -1836 1496
$$ packed form
3379a140j054L257p99k189K538K39l237J334L186l138j416L466o26k557K082J012
3395I58l360J622K749l122j148L763n06k850K504P41k946J412K508l321q62L454
3411A596l21l323J886J545k854Q09K837k977q44L552n60l433K472J827l317O10
3427d95K556k529q85L237o24l585K468J670k942k2K634k380q10L190p94l158K557
3444H8J751k947m7K690k140j012K682r08k525K002K263l393l56K823j744j202
3460a975K845p47l040K281K135l123n45L085j453j651K971l94k771K444J510l170
3476a598n15L171j629j655K340N5k666J830K055l032l92L285r49j947K313k68
3492C98k362J826J970l157l20L326j377k094K427j8k579J808K206l550l40L332
$$ plain form
3508 1496 182 -2009 493 960 -1605 -225 2113 -990 -1308 2020 127 -2383 250 992 -1163 -313
3524 -313 1341 -1459 -1747 1807 219 -2085 506 1561 -1068 -85 1651 -991 -1217 1747 610 -1835
3540 -1835 751 1704 -1245 -709 1530 -713 -1177 1881 384 -2084 590 2047 -774 -387 1935 -426
3556 -426 -514 1934 1155 -1341 842 2363 -922 -364 1892 -58 -723 1454 723 -1667 858 2049 -753
3573 -753 -730 1829 194 -1034 1789 740 -1520 1063 2169 -988 -622 1943 154 -1567 1161 460
3589 460 -1915 56 1568 -1597 -1195 1416 -349 -1560 742 414 -2116 177 1461 -1749 -1357 1320
3605 1320 -542 -1873 536 -16 -1790 -109 1087 -1967 -1363 1660 -295 -1901 454 564 -1670 64
3621 64 1137 -1572 -1190 1571 -138 -2021 982 767 -1439 -29 1130 -1336 -868 1665 -182 -2062
$$ packed form
3508A496j314k191K502M67k565J380K338l103l18L328j893k510K633P42k155Q50
3524c13J654k800k88L554j588k304K591J055k629R83J736k642k26K964j137k445
3540a835K586R53k949N36K239k243m64L058j497k468K674J457k821L87K322k361
3556d26q8K448p79k496K183J521l285N58K256j950o65K177p31k390K525J191k802
3573g53K3K559j635j228K823j049k260K583J106l157L66K565j789j721K728p01
3589D60k375J971J512l165M02K611j765j211K302l28k530K293J284l210L92K677
3605A320j862j331K409n52j774J681J196l054O04L023j955j606K355J10k234J734
3621F4J073k709L82K761j709j883L003k15k206J410J159k466M68K533j847j880
$$ plain form
3637 -2062 1110 1474 -1168 139 1746 -816 -674 2174 258 -1657 1247 1781 -1086 151 1469 -658
3653 -658 -620 1767 58 -1547 935 1873 -952 -73 1789 -439 -494 2048 315 -1312 1150 1877 -1001
3670 -1001 -224 1328 -435 -539 1330 47 -1817 990 1262 -1634 -747 1366 -241 -814 1092 104
3686 104 -1444 938 1365 -1390 -715 1663 -111 -1076 1253 359 -1548 924 944 -1498 -841 1296 -551
3703 -551 -1682 939 149 -1647 499 1146 -1379 -402 1384 -164 -1388 1108 404 -1560 395 1097
3719 1097 -1372 -815 1505 -480 -1782 870 225 -1786 50 786 -1596 -907 1590 -673 -1588 724
3735 724 599 -1530 -83 697 -1531 -1087 1272 -971 -2460 271 74 -2141 -358 636 -1298 -841 1464
3752 1464 -725 -1876 811 646 -1674 -360 711 -1301 -950 1071 -938 -2261 670 757 -1950 -538
$$ packed form
3637b062L172L64k642J307J607k562J42K848j916j915K904N34k867J237J318k127
3653f58L8K387j709j605K482R38k825Q79J862k228n5K542j733j627K462P27k878
3670a001P77J552j763j04J869j283j864K807K72k896Q87K113j607n73J906r88
3686A04j548K382M27k755O75K378j774r65K329q94j907K472K0k442O57K137j847
3703e51j131K621p90j796K146O47k525R77J786j548j224K496p04j964J955P02
3719A097k469N57K320j985j302K652o45k011J836P36k382O89K497k263r15K312
3735G24j25k129J447P80k228M44K359k243j489K731j97k215J783R94j934M57K305
3752A464k189j151K687j65k320J314J071k012L51K021k009j323K931Q7k707J412
$$ plain form
3768 -538 791 -1052 -524 1391 -648 -1418 1103 1088 -1438 -123 1314 -787 -904 1249 -280 -1559
3784 -1559 1085 756 -1691 -378 1496 -737 -1008 1408 56 -1077 1273 1269 -1655 108 1715 -649
3800 -649 -941 1220 329 -1185 1033 1007 -1555 -249 1724 -577 -1046 1041 114 -1445 731 1098 -1361
3817 -1361 -22 1718 -667 -1006 1345 294 -1448 450 829 -1596 -530 1429 -705 -1380 1142 171
3833 171 -1270 276 810 -1451 -250 1746 -54 -1168 1171 476 -1353 526 792 -1101 69 1670
3849 1670 -488 -1388 1269 573 -1650 316 959 -1043 -427 1580 -588 -1251 1474 637 -1387 491
3865 491 1482 -603 -92 1586 -266 -1299 1161 453 -1575 176 1227 -692 -559 1263 -443 -1038
3881 -1038 982 905 -1400 145 1077 -1076 -448 1241 -490 -1502 1105 296 -1777 70 936 -1458
$$ packed form
3768e38J329j843N28J915k039p70K521j5k526J315J437k101j17K153j529j279
3784a559K644l29k447J313J874k233k71K416j352j133K350mk924J763J607k364
3800f49k92K161q91j514K218k6k562J306J973k301m69K087r27j559K176L67k459
3817a361J339J740k385l39K351j051j742J898L79k425J066J959k134o75K522r71
3833A71j441J546N34k261J201J996j800j114K339o95j829J879K66j893J170J601
3849A670k158r00K657o96k223J966O43k002O16K007k168o63K725q37k024J878
3865D91R91k085N11J678j852j033K460p08k028J751J051j919J33J822j706n95
3881a038K020p7k305J545R32k153O28J689j731j012K607q09k073J847Q66k394
$$ plain form
3897 -1458 -882 954 -674 -1726 1142 346 -1527 175 1419 -754 -836 1076 -130 -1139 960 590
3913 590 -1688 415 1708 -821 -678 1349 -132 -771 1251 908 -1361 769 1781 -556 -667 1816
3929 1816 758 -510 1417 884 -861 765 1754 -408 -593 1752 651 -930 1036 836 -882 265
3945 265 1799 -394 -650 1682 718 -811 1217 1068 -785 343 1382 -601 -548 1403 -148 -1327
3961 -1327 504 487 -1233 -21 988 -1161 -1004 1607 180 -1448 489 791 -1410 -56 1388 -765
3977 -765 -1157 952 128 -1629 75 786 -1541 -574 837 -997 -934 1163 -565 -1531 308 675 -1365
3994 -1365 -797 923 -808 -1317 912 13 -1828 336 1006 -1501 -499 1034 -458 -1007 861 184
4010 184 -1744 260 1047 -1142 -708 1028 -272 -663 1114 333 -1337 619 1291 -1011 -545 942 -227
$$ packed form
3897a458N76J836j628j052K868p96j873J702J244k173q2J912j206j009K099l70
3913E90k278K103J293k529J43K027j481o39K022l43k269K130J012k337j11K483
3929A816j058j268J927n33j745J626R89k162j85K345j101j581J966k00j718J147
3945B65J534k193k56K332r64j529K028j49j853J128J039j983N3J951j551j179
3961a327J831j7j720J212J009k149J57K611j427j628J937L02k201J354J444k153
3977g65l92K109q24j757J704P11k327R67J411j834O3K097j728r66J839L67k040
3994a365N68J720j731n09K229q99j841K164O70k507J002J533j492n49J868o77
4010A84j928K004P87k189M34J736j300l91J777p81j670J956O72k302M66J487j169
$$ plain form
4027 -227 -1083 719 298 -1380 505 1187 -1244 -691 1501 -129 -886 1055 391 -880 379 959 -1097
4044 -1097 -621 1531 -464 -846 1005 416 -968 607 1203 -956 -594 1524 100 -893 1104 554 -1191
4061 -1191 327 1256 -1037 -474 1600 308 -1235 777 524 -1263 145 1190 -1087 -483 1420 -200
4077 -200 -1382 723 828 -1249 179 1042 -890 -473 1207 235 -1370 572 660 -1225 276 1143 -698
4094 -698 -669 1428 -39 -1311 698 733 -1212 -446 1221 -554 -700 1148 -48 -1568 614 650 -1148
4111 -1148 -291 653 -880 -1031 1015 -73 -1550 516 801 -1460 -552 979 -600 -691 1159 -183 -1410
4128 -1410 603 704 -1274 -417 917 -628 -1135 884 -202 -1422 448 477 -1655 -322 637 -673
4144 -673 -787 976 -26 -1343 296 547 -1092 -164 1209 -595 -838 844 102 -1150 291 674 -1465
$$ packed form
4027b27q56J802m21j678J885O82k431N53K192j630p57J941o64j271J259N80k056
4044a097M76K152j995l82J851n89j384J575N96k159L62K118j424r93J997n50j745
4061a191J518R29k293N63K074j292j543K012k53j787J408J045k277O04J903j620
4077b00j182K105J05k077J428Q63j932M17J680r72j605J942Q8j885J501Q67j841
4094f98K9K097j467j272K009L5j945P66J667j775j46J848j196j520K182L6j798
4111a148Q57R44j533j51K046j088j477K066K85k261R08J531j579r1J850j342j227
4128a410K013J01j978Q57J334j545n07K019j086j220J870K9k132J333R59j310
4144f73j14J763j002j317J639K51j639R28J373j804k43J682p42j252J441L83k139
$$ plain form
4161 -1465 -416 1310 -315 -929 871 247 -871 400 804 -959 -157 1419 -178 -1024 1180 487
4177 487 -1163 399 916 -903 -224 1340 -271 -1221 1042 495 -858 780 1243 -675 226 1514 -279
4194 -279 -869 1058 659 -903 236 837 -587 -305 1357 -554 -766 909 650 -991 276 1073 -607
4211 -607 -355 1439 -36 -874 933 549 -972 343 1313 -863 -375 986 -549 -919 650 550 -1582
4228 -1582 93 1143 -828 -536 1130 -159 -1324 917 570 -1160 13 823 -554 -522 1190 81
4244 81 -1269 798 406 -1469 14 798 -1038 -478 748 -108 -1210 731 559 -733 135 1196 -657
4261 -657 -1065 818 110 -1163 736 815 -1253 255 784 -781 -873 1273 294 -1207 398 628 -951
4278 -951 180 1295 -592 -672 1448 335 -484 641 736 -986 -151 1311 -557 -877 1258 530 -995
$$ packed form
4161a465J049J726j625o14J800o24j118J271M04j763Q02J576j597q46K204o93
4177D87j650J562N17j819O79J564j611r50K263n47j353J638M63j918R01J288j793
4194b79n90J927l99j562J139O01j424K82J662j911k12J675k59j641J267P97j680
4211f07K52J794j475q38J807l84j521J315R70k176M88J361j535l70J569j00k132
4228a582J675J050j971K92J666j289j165K241l47j730J173Q10j377L2J712j109
4244H1j350K067l92j875J483P84j836N60J226q56j102J941j72j292Q68J061j853
4261f57m08J883p08j273J899P9k068J508N29j565r2K146r79j501J605K30j579
4278i51J131J115j887q0K120j113q19J125R5j722Q35J462j868l20K135p28j525
$$ plain form
4295 -995 815 1140 -484 -167 1430 -293 -627 945 353 -768 449 820 -482 -30 1049 -229 -983
4312 -983 1160 240 -1130 431 902 -819 -92 1225 -333 -643 994 583 -808 530 1082 -830 267
4329 267 1038 -256 -673 1043 197 -1036 191 1006 -469 -208 1318 -77 -731 1238 495 -991 527
4346 527 1048 -508 -301 1124 -205 -574 786 441 -1209 339 908 -814 -224 1153 -493 -468 984
4363 984 447 -1155 223 1213 -879 -449 1081 -166 -600 991 533 -1105 -115 918 -842 -272 1136
4380 1136 -337 -999 577 575 -1268 -78 953 -910 -593 647 -20 -1232 539 194 -1042 173 804
4397 804 -1016 -716 858 -480 -1434 249 78 -1111 241 716 -1132 -997 687 -110 -1383 403 438
4414 438 -1109 -153 1308 -477 -806 908 -191 -1124 394 186 -1189 26 1039 -411 -445 926 134
$$ packed form
4295i95J810L25j624L17J597j723l34J572n92j121J217L71j302M52J079j278p54
4312i83K143r20j370J561M71j721P27J317j558l10J637m11j391J338N52j912J097
4329B67P71j294m17J716q46j233J227Q15j475K61J526j395o54J969p43j486J518
4346E27N21j556K07J425j329l69J360l45j650J548N69j722N90J377j646K5J452
4363I84n37j602J378R90k092M30J530j247m34J591m58j638R90J033j760N70J408
4380A136j473o62J576kj843J190J031j863L17J240o67j212J771l45j236J215O31
4397H04j820L00J574j338r54J683j71j189J352M75j848J35J684p97j273J786L5
4414D38j547R56J461j785l29J714j099r33J518k08j375J215J013j450l4J371p92
$$ plain form
4431 134 -773 576 650 -763 -200 1180 -856 -441 1143 29 -1136 414 1110 -842 13 971 -516
4448 -516 -474 1111 172 -836 655 996 -609 -395 1281 -192 -373 1054 383 -1164 612 796 -873
4465 -873 -143 874 -551 -742 1205 350 -967 630 1038 -916 7 1179 -291 -105 901 389 -1167
4482 -1167 655 711 -880 -314 920 -554 -799 842 -115 -840 243 785 -1046 -661 984 -136 -1065
4499 -1065 535 13 -1244 7 487 -1281 -587 496 -480 -966 551 120 -1320 70 269 -1167 -1021
4516 -1021 824 -392 -719 641 425 -1091 -319 670 -1106 -545 573 -284 -1021 597 56 -972 10
4533 10 737 -650 -404 1009 -251 -1006 413 502 -985 168 791 -632 -214 1010 101 -1020 890
4550 890 657 -561 10 829 -489 -421 1406 -81 -966 428 932 -911 72 1328 -240 -329 959 39
$$ packed form
4431A34r07J349P4j413N63J380k036M15J584j114j165J550O96j952Q55R58j487
4448e16M2J585r39j008J491L41j605K14J676j473j81J427o71j547J776J84j669
4465h73P30J017j425j91J947q55j317J597M08j954R23J172j470J86J006n12j556
4482a167J822N6j591N66J234j474k45J641r57p25J083N42j831L85J645j120r29
4499a065J600n22j257J251M80j768O94J083r76m86J517m31j440J390J99j436J46
4516a021J845j216l27J360k16j516P72R89j776N61J118q57p37J618n41j028R82
4533A0P27j387K46J413j260p55J419Q9j487J153O23j423M18J224r09j121J910
4550H90k33j218N71Q19j318O8J827j487q85J394N04j843R83J256j568q9J288r20
$$ plain form
4568 39 -775 958 620 -873 232 965 -244 -388 935 83 -1105 976 756 -679 -85 1061 -473
4585 -473 -161 1084 -84 -737 780 550 -603 232 835 -100 -453 1054 -1 -939 625 913 -674
4602 -674 30 870 -247 -418 1045 155 -674 469 401 -1074 -302 1284 -356 -383 1001 529 -875 329
4620 329 700 -940 94 931 -329 -582 863 312 -1112 673 795 -658 63 713 -81 -636 793
4637 793 555 -732 199 456 -636 -589 1241 -369 -890 669 -27 -996 178 741 -603 -581 758 -376
4655 -376 -800 613 102 -911 205 840 -915 -229 932 -314 -544 822 506 -1062 92 776 -342
4672 -342 45 805 -223 -877 863 414 -785 154 801 -446 -186 988 87 -645 503 555 -764 170
4690 170 953 -317 -33 998 -86 -249 643 607 -483 328 1101 -349 -222 843 71 -433 779 421
$$ packed form
4568C9q14J733l38j493J105P33j209j44J323q52j188K081k20j435N94J146j534
4585d73L12J245j168o53J517k30j153Q35O03r35l53J507j055r38J564K88j587
4602f74P04Q40j117j71J463q90q29J143o8j475P72J586j640k7J384m72j404J204
4620C29L71j640J034Q37j260k53J445n51j424J785J22j453P21O50p94n55J429
4637G93k38j287R31K57j092M7J830j610n21J559o96r69J174N63j344K2J339j134
4655c76m24J413n11j013J116O35j755O86J161j246k30J366l16j568J154O84j118
4672c42L87P60j028o54J740m49j199R39O47j247K60J174r01p32J148N2j319R34
4690A70P83j270K84J031j084j63Q92l6j090Q11P73j450J27J065p72n04J212l58
$$ plain form
4708 421 -821 303 1162 -421 -299 678 272 -259 431 476 -471 168 1009 -229 -289 1052 -291 -428 485
4727 485 381 -816 6 876 -447 -431 813 -8 -616 329 342 -697 274 877 -11 -299 466 66 -418
4746 -418 332 377 -893 -32 447 -629 -654 675 105 -931 130 273 -821 -26 545 -580 -806 641
4764 641 -74 -779 0 349 -525 -146 744 -595 -816 550 -30 -708 119 627 -609 -67 923 -395 -523
4783 -523 616 185 -964 432 377 -694 -188 534 -320 -602 811 270 -732 139 421 -530 -100 1032
4801 1032 -179 -695 476 328 -789 481 765 -534 64 779 -371 -557 463 375 -575 -119 485 -450
4819 -450 -209 698 -175 -727 552 238 -907 -71 502 -626 -189 831 -44 -385 302 325 -686 210 666
4838 666 -560 -99 985 -45 -485 638 27 -645 158 485 -761 -354 774 -276 -828 424 409 -669
$$ packed form
4708D21j242J124Q59j583J22R77m06n31O90M5r47O39Q41j238o0J341j343j37R13
4727D85j04j197Q22Q70j323J6J244q21o08R45J3j039R71O03q88k88P65m00m84
4746d18P50M5j270Q61M79j076k5J329n70j036J061J43j094P95N71j125k26J447
4764F41p15p05P79L49q74L79Q90j339k21J366n80o78Q27N08j236N42R90j318j28
4783e23J139m31j149J396n5j071N06P22q54k82J413n41j002Q71K82r51M30J132
4801A032j211n16J171j48j117J270K84j299N98P15j150j86J020q8r50M56O04r35
4819d50K41R07q73n52J279l14j145Q36N73j128M37J020q75l41O87K3j011Q96M56
4838F66j226M61J084j030m40J123o11o72Q03L27j246M07J128j050n52J252j5j078
$$ plain form
4856 -669 14 651 -653 -66 632 -55 -704 480 437 -377 313 777 -394 -291 769 -438 -712 335
4874 335 202 -478 -98 294 -549 -470 429 -172 -654 128 422 -716 -52 650 -558 -379 730 -293 -384
4893 -384 170 254 -798 -127 579 -338 -97 550 -409 -897 320 164 -802 -318 347 -412 -563 759 -248
4912 -248 -968 300 357 -819 -148 607 -576 -420 474 7 -628 131 245 -433 -189 733 -537 -366 781
4931 781 -33 -511 318 344 -123 -66 901 -237 -313 838 2 -369 426 803 -330 151 711 -213 -589 615
4951 615 137 -481 -27 451 -686 -5 884 189 -429 816 229 -753 239 722 -578 -46 1048 160 -558
4970 -558 797 -62 -775 371 587 -410 85 746 47 -367 591 167 -621 347 603 -308 31 462 21
4989 21 -329 712 271 -538 308 596 -389 -287 1039 104 -525 524 515 -288 221 542 -369 -122 654 -98
$$ packed form
4856f69O83O37j304N87O98o87o49J184m3q14O90M64j171J03J060j207k74J047
4874C35j33o80L80L92q43P9Q99o01m82P82K94j138O64P02j208J79J109j023r1
4893c84N54Q4j052O71P06r17K41O47r59m88J217j56r66M84O65p59j51J322j007
4912b48p20J268N7j176O71P55j183J56Q94m67o35P59J14o78K44R22j270J71J147
4931G81q14m78Q29K6m67N7R67j138p6J151q36l71P95L77j133M81N60r24l76J204
4951F15m78o18M54M78j137O81Q89o95o18J245n87r82R92M83j300N32J094q88p18
4970e58J355q59p13J146K16r97M95O61o99m14R58m24p88R68K56r11L39M31m41
4989B1l50J041m41q09Q46K88r85J02J326r35o29J049rq03N09L21r11K47P76p52
$$ plain form
5009 -98 -325 607 459 -638 211 605 -445 -273 542 -120 -251 418 276 -353 293 457 -445 -472 692 -86
5029 -86 -634 351 127 -888 25 520 -319 -161 577 -230 -455 392 458 -468 -192 709 -332 -100 699 56
5049 56 -345 608 311 -600 92 564 -103 -105 418 -109 -398 312 137 -704 19 664 -47 -339 758 338 -495
5070 -495 574 502 -359 262 777 -173 -112 490 19 -422 602 621 -374 162 686 85 -111 737 276 -374
5090 -374 658 419 -370 -154 665 -79 -567 610 69 -528 372 79 -444 -14 734 -109 -693 282 292 -404
5110 -404 -19 252 -127 14 636 -429 -185 318 193 -787 526 453 -616 88 537 -177 -440 335 319 -641
5130 -641 -83 408 -371 -258 487 -278 -297 141 268 -326 103 323 -354 -241 121 -442 -573 357 -16 -800
5150 -800 -100 391 -389 -80 287 -109 -694 -185 -99 -1007 -275 391 -710 -457 125 -377 -708 -66 274 -635
$$ packed form
5009i8k27R32j48j097Q49L94j050J72Q15o62j31O69j42o29O46J64r02k7J164p78
5029h6n48R85k24j015R13M95q39J58P38q07k25Q47O6r26K76R01j041K32P99o43
5049E6m01R53k97r11O92M72o67kN23n27k89P10j75q41P23O45p11k92J097m20q33
5070d95J069p2q61O21N15r50O1O02m71m41J024J9r95N36N24o01j96Q48m61o50
5090c74J032k39p89K16Q19p44m88J177n41n97R00k93n23M30P48q43n84R75J0o96
5110d04L85K71l79J41O22j065K44N03j25r80J313p3j069P04M49p14k63P75j6r60
5130f41N58M91p79J13P45p65j9M38J27n94M29K20o77J13L62n63j31R30l73p84
5150h00P00M91p80L09L67l96n85N09Q6r08P32O66j101K53N82n02l31O42L40r09
$$ plain form
5170 -635 -523 118 -638 -175 18 -349 -421 144 222 -720 -99 485 -820 -377 560 -325 -615 425 47 -494
5190 -494 -141 305 -498 -364 253 -95 -476 237 134 -517 47 243 -455 -323 493 200 -647 136 15 -453
5210 -453 -163 593 -456 -532 474 -94 -257 224 203 -893 207 140 -69 -294 347 -296 -591 417 199
5229 199 -319 -268 463 -510 -467 593 -82 -609 279 394 -406 78 322 -299 -339 301 -202 -558 168 433 -544
5250 -544 -178 249 -414 -278 352 105 -321 -9 256 -263 -197 477 -332 -112 259 -43 -446 82 16 -481 133
5271 133 233 -182 -536 343 -6 -296 66 496 -423 -117 321 -201 -142 163 -65 -492 -71 419 -424 -32
5291 -32 471 -15 -582 251 179 -491 189 95 -216 -261 557 -183 -408 278 99 -233 23 487 -533 -363 485
5312 485 -113 -385 326 13 -94 157 160 -317 -121 418 -31 -316 295 369 -249 276 283 -327 -261 590 -106 -322
$$ packed form
5170f35J12O41p56M63J93l67p2N65P8r42O21N84j305M43R37q85k90J040l78n41
5190d94L53M46q03J34O17l48l81P13j03o51N64J96o98J32Q16k93q47P83j21m68
5210d53K90P56j049p6J006n68j63M81k1j096J100o7k09k25O41o43k95J008k18
5229A99n18N1P31r73M3J060o75n27Q88J15q00M84K44o21m0O40n03l56P26K65r77
5250e44L66M27o63J36O30k47m26L12K65n19O6O74q09K20L71l02m03N28o6m97O14
5271A33J00m15l54Q79l49k90L62M30r19L06M38n22N9L05k28m27M21M90q43L92
5291c2N03m86n67Q33p2o70O80r4l11m5Q18p40k25O86j79l32K56M64j020J70Q48
5312D85n98k72P11l13j07K51Lm77J96N39m49k85O11P4o18N25Po10O6Q51o96k16
$$ plain form
5334 -322 478 -28 -519 31 569 -63 -33 419 -321 -251 211 248 -398 -31 389 -162 -188 398 65 -365 125
5355 125 414 -573 35 355 -284 4 497 -19 -111 702 160 -220 145 244 -211 -104 545 213 -318 333 159
5376 159 -358 -124 534 68 -126 330 80 -268 203 13 -496 49 156 -209 -365 199 279 -605 241 140
5396 140 -348 413 605 67 -262 201 45 -255 362 72 -355 40 118 36 -243 153 -92 -446 -116 118 -314
5417 -314 -250 74 -3 -433 64 -90 84 296 -138 -336 -11 463 18 35 343 170 -318 147 533 -435 74
5438 74 150 -344 -202 543 73 -484 257 310 -287 -41 56 -186 -166 71 124 -75 459 496 -377 -419 503 -75 -307
5461 -307 760 76 -208 -44 -20 -198 -211 441 -150 -217 205 407 -392 145 372 32 133 603 -160 -496 214
5482 214 25 -274 94 397 -120 -233 362 -372 -369 61 338 -229 187 265 -68 -76 426 125 56 -35 305 -231
$$ packed form
5334c22Q00n06m91N50N38o32L0M52p40P0M62L7o46L67M20n51k6N86l33m30M90
5355A25K89r87O08L20o39K88M93n16r2Q13n42l80L65R9m55J07O49l32n31O51j74
5376A59n17K34O58m66j94M56k50l48M71j90n09N45J07l65j56N64Q0q84Q46j01
5396A40m88P61J92n38l29M63j56l00O17k90m27L95P8q2k79L96k45l54L30K34m32
5417c14O4L24p7m30M97j54J74K12m34j98L25M74m45J7L08j73m88M65L86r68N09
5438G4P6m94J42P45m70n57P41N3n97K46R7k42K0K37N3j99N34L7q73m2R22n78k32
5461c07J067o84k84J64K4j78j3O52n91o7M22K02p99N37K27l40J01M70p63l36P10
5482B14j89k99L68L03n17j13N95p34LM30K77n67M16P8l33qN02l01o9r1L40n36
$$ plain form
5504 -231 -129 482 -570 -59 486 -115 -123 164 128 -437 -146 299 -157 -145 538 -26 -411 88 -57 -406 -200
5525 -200 215 -300 -331 264 110 -437 166 -45 -753 175 105 -336 -131 155 -396 -114 -58 375 -459 247 274
5546 274 -230 -10 136 -8 -382 6 288 -605 84 45 -384 -405 278 -131 -251 240 256 -510 112 326 -372
5567 -372 -131 105 -87 -830 89 456 -625 -35 423 -64 -217 39 47 -350 -32 301 -262 -82 179 156 -289
5588 -289 -46 -38 -175 111 124 -60 -68 241 -92 -79 634 85 -505 -154 550 -172 -151 183 -317 86 337 -122
5610 -122 -254 122 377 -71 -316 402 -55 -309 116 97 384 496 425 -421 -50 382 -25 -226 373 112 -512
5631 -512 -37 197 23 -34 437 -305 -406 65 -15 2 60 267 -468 -220 76 -258 -207 89 117 -425 60 250
5653 250 -269 -313 52 41 -323 -60 111 -176 -77 435 -256 -549 -26 80 -422 170 -210 -518 31 349 -65
$$ packed form
5504b31J02O11j052N11N45o01qK87l6n65K91M45m56J2O83n64l85M99j45l49K06
5525b00M15n15l1N95j54n47O03k11p08R28p0m41K05K86n51K82N6M33q34P06K7
5546B74n04K20J46j44l74L88K82q93O89l9m29k1O83m09j20M91J6p66O22K14o98
5567c72K41K36j92p43R19L67j081N90M58m87j53K56Ql97L18L33n63J80K61k3m45
5588b89K43Qj37K86J3j84qL09l33J3P13n49n90L51P04p22K1L34n00M03K51m59
5610a22j32L76K55m48k45P18m57k54M25j9K87J12p1q46L71M32m07k01N99k61o24
5631e12M75K34j74n7M71p42j01M71q0J7N8K07p35K48K96l34N1K96K8n42M85J90
5653B50n19m4L65j1l64K63J71k87R9N12o91k93N23J06n02N92l80l08N49L18m14
$$ plain form
5674 -65 -104 137 -86 -495 173 296 -117 -83 503 -314 -14 386 7 -13 -136 24 -313 56 323 -133 -239
5695 -239 342 -140 143 103 41 -205 -43 263 217 -390 292 71 -134 7 183 -161 4 -84 -326 -205 92
5716 92 -50 -483 354 351 -136 78 257 6 -88 297 -342 -486 172 77 -97 -291 317 -162 -146 341 87 -121
5738 -121 213 159 -287 -252 209 -70 -321 49 -70 -88 342 114 -248 3 507 1 -116 137 1 -58 -168
5759 -168 105 -191 -333 71 -130 -301 339 88 -373 -27 524 -80 37 354 95 -173 397 -18 -245 -44
5779 -44 428 -21 116 201 -287 -106 453 384 -182 -77 114 -134 31 330 -324 -45 -65 -251 -300 -43 116 -297
5801 -297 -149 48 114 -259 282 113 -235 -62 177 -6 -240 -18 -159 -228 111 -93 -292 -115 66 -280 -144
5822 -144 285 -322 -369 367 459 11 -40 608 -316 24 -41 -327 -326 497 326 25 85 170 -171 -39 210 35 181
$$ packed form
5674f5l9K41k23m09O68J23m13L4N86q17L00M00l79k0j23J60l37L69K67m56j06
5695b39N81m82K83m0o2k46J62L06m6o07O82k21k05J41J76l44J65q8k42J21K97
5716I2j42m33Q37lm87K14J79k51r4L85o39j44O58r5j74j94O08m79J6M87k54k08
5738a21L34n4m46L5M61k79k51L70j19j8M30k28l62K51N04n06j17K53j36n9j10
5759a68K73k96j42M04k01j71O40k51m61L46N51o04J17L17k59k68N70m15k27K01
5779d4M72m49J37Q5m88J81N59o9n66J05J91k48J65K99o54K79k0j86m9K57J59m13
5801b97J48J97O6l73N41j69l48J73K39j83k34K22j41o9L39k04j99J77J81l46J36
5822a44M29o07m7P36R2m48n1O48r24L40o5k86JQ23j71l01O0Q5l41J32K49j75J46
$$ plain form
5845 181 292 251 -291 114 121 -167 -193 118 21 -365 -178 411 -138 79 558 -20 -79 139 -42 -129 122 68 -336
5868 -336 158 80 -90 55 267 143 -406 1 350 -140 -23 196 -267 -294 377 70 -294 341 270 -250 4
5889 4 271 -161 -53 328 -68 -378 355 78 -139 -51 135 -112 -231 159 -182 -134 85 -41 -153 92 -35
5910 -35 -387 -102 160 -198 -94 280 141 -123 -6 14 -74 -294 27 284 149 150 242 -181 189 238 -158 -93 172
5933 172 123 -91 27 38 -196 51 -60 -81 -102 169 117 -222 45 26 -51 -160 157 -333 -176 167 158 -316 265
5956 265 216 -150 8 24 192 43 93 -42 -455 215 311 -73 -36 313 43 -218 404 400 -347 63 331 -213
5978 -213 -290 194 -64 -508 84 -57 -141 330 204 -215 -296 188 -24 -48 12 386 -228 127 106 -77 69 128
6000 128 -38 -433 181 144 -23 1 576 150 -153 205 -25 -104 260 93 84 406 112 28 -330 201 -124 -131 160
$$ packed form
5845A81J11m1n42M05Pk88k6L11r7l86J87N89n49K17M79n78n9K18j81q7K51n4m04
5868c36M94p8j70J45K12j24n49M07L49m90J17K19m63k7O71l07l64O35p1n20K54
5889DK67m32J08L81l96l10P33k77k17Q8J86k47j19L90l41M8K19j26j12K45j27
5910c5l52K85K62l58J04L74j39k64J17K0q8k20L21K57j35JR2m23L70M9l96O5K65
5933A72m9k14J18J1k34K47j11k1k1K71n2l39K67j9p7j09L17m90J57L43rm74N81
5956B65m9l66J58J6J68j49N0j35m13O70R6l84L7L49k70k61O22mp47M10K68n44
5978b13p7M84k58m44N92j41q4M71j26m19q1M84k12k4O0L74o14L55k1j83J46N9
6000A28j66l95O14l7j67K4N75m26l03L58k30p9L64j67rL22k94q4l58N31l25pK91
$$ plain form
6023 160 308 -238 -201 114 -414 78 274 -175 -158 126 59 -90 75 -85 -84 -304 609 156 -154 126 68 -279
6045 -279 -314 26 -31 -55 237 -173 -229 79 95 203 51 675 118 -228 181 92 -136 110 -124 -188 102 -44
6067 -44 -287 180 424 -242 -18 179 198 -267 -102 -90 -140 -237 -106 56 -252 136 141 -113 -269 -124 199 -220
6089 -220 -30 -136 -12 193 64 -133 -66 47 -73 -223 -37 12 -133 219 -266 -166 -36 259 93 -97 49
6110 49 19 -562 -89 -34 -127 151 438 59 -114 81 70 -321 70 77 -191 82 257 85 -49 167 194 199 281 226
6134 226 -190 -79 72 193 117 247 202 -238 -66 139 -225 -23 270 -50 -246 73 10 55 -63 40 -44 -65
6156 -65 438 280 -177 101 -22 -276 12 107 -164 -246 -84 -151 -126 1 -247 -177 154 -27 -195 -142 2 -517
6178 -517 -329 -111 240 -51 263 136 157 -183 133 -42 -273 -111 192 -171 -451 343 -327 106 -152 -130 -144
$$ packed form
6023A60J48n46L7L15n28M92J96m49J7K84o7j49J65j60Jk20R13m53l10K80n8l47
6045b79l5L40n7k4K92m10n6L08J6J08j52O24n57l46M09q9k28K46k34o4K90j46
6067d4k43M67K44o66K24J97J9m65J65J2n0r7J31J62l08L88Nk54j56J45L23m19
6089b20J90j06J24K05j29j97O7J13j20j50J86M9j45L52m85J00J30K95j66j90J46
6110D9l0n81M73N5r3K78K87l79j73J95j1l91L91Pk68K73J75j72j34K16K7NQ2n5
6134B26m16J11J51J21p6J30m5m40J72K05l64K02K93l20j96L19o3M5j18J03q4k1
6156f5N03j58m57K78j23k54K88R5k71q2J62o7K5J27k48P0L31j81j68N3J44n19
6178e17J88K18L51k91L14j27K1l40L16j75k31J62L03l63k80P94o70M33k58K2j4
$$ plain form
6199 -144 -70 37 -172 20 36 -26 -145 -28 -180 -92 25 265 -40 -39 138 -396 -92 140 -13 -35 57 107 152
6222 152 155 118 62 76 26 26 -138 71 23 -58 120 -31 -21 41 70 -232 -266 3 -95 -8 83 -23 147 -252 105 -83
6248 -83 158 90 189 10 -239 -100 54 -158 -178 -131 76 -152 -68 -87 -99 -100 -59 -96 71 241 -131 -109 120 -404
6272 -404 -89 68 -109 -196 84 60 -74 -151 13 297 24 265 13 -432 155 82 5 -207 304 -74 140 0
6294 0 139 35 293 -20 76 -146 44 -282 -269 57 -328 24 245 -30 -74 -216 -9 -161 134 -25 147 170
6316 170 -147 -50 -118 -184 195 -55 -154 -118 -345 -130 -50 419 114 279 -35 -59 -5 235 300 -240 159 24 76
6339 76 -111 315 -42 -46 7 205 -125 -284 -44 -402 -31 -123 91 -25 255 84 91 -67 187 83 -30 147
6361 147 -24 146 14 3 -181 290 56 223 -280 282 72 -37 58 367 -403 23 66 -65 -13 38 -155 23
$$ packed form
6199a44P4J07k09J92J6o2j19J17j52Q8J17K40l05JJ77n34L04K32j53k2R2N0M5
6222A52Ll7n6J4n0%j64K09m8q1J78j51J0O2K9l02l4K69r8Q7R1j06J70l99L57j88
6248h3K41o8R9j79k49J39J54k12k0M7K07k28Q4j9j2jM1l7J67J70l72K2K29n24
6272d04L15J57j77q7K80k4j34p7J64K84k73K41k52m45N87p3p7k12N11l78K14j40
6294@J39j04K58l13R6k22J90l26J3L26l85L52K21k75m4j42K07j52K95j59J72K3
6316A70l17R7o8o6L79k50r9L6k27K15Q0M69l05J65l14k4N4K40O5n40L99j35N2
6339G6j87M26l57mN3J98l30j59K40l58L71r2K14j16K80j71Pj58K54j04j13J77
6361A47j71J70j32j1j84M71k34J67n03N62k10j09R5L09p70M26M3j31N2N1j93J78
$$ plain form
6383 23 396 8 -46 -103 349 -60 -8 121 124 -280 172 150 88 -131 156 77 -73 -155 -248 -96 60 -163 -296 174
6407 174 -653 -124 190 257 -30 -68 14 163 3 -86 -229 -61 176 101 -337 -259 -132 184 117 -156 -4 -160
6429 -160 301 114 59 293 -75 -95 -96 261 -148 -14 33 -134 158 -20 -69 -20 -160 240 -95 -217 78 169 -122
6452 -122 38 25 138 -220 247 -131 62 289 55 -85 59 -58 -199 -124 -276 -21 -76 108 -79 203 -206
6473 -206 22 -231 85 -135 -291 -124 9 -11 193 79 -68 126 96 16 117 28 94 288 -76 -33 196 76
6495 76 179 -120 90 -97 -222 221 -14 47 98 62 44 242 -144 21 -180 112 -122 297 -48 11 -91 -92 -25
6518 -25 20 231 -72 124 161 -96 -43 -120 -15 -199 -331 71 -12 -91 102 229 239 -109 251 -178 -15 28 195
6541 195 -313 16 190 -220 -80 -261 200 134 6 -224 7 82 80 -9 112 113 -44 -293 -26 -89 268 3 114
$$ packed form
6383B3L73l88n4n7M52m09N2J29Lm04M52k2o2k19K87p9j50q2r3J52J56k23j33M70
6407A74q27N29L14O7k87l8Q2J49j60q9j43J68K37p5m38P8J27L16o7k73J52j56
6429a60M61j87n5K34l68k0jL57m09J34M7j67K92j78m9M9j40M00l35j22K95R1k91
6452a22J60j3J13l58M67l78J93K27k34j40J44j17j41P5j52K55n5J84j87K82m09
6473b06K28k53L16k20j56J67J33k0K04j14j47J94l0q0J01q9O6J94l64M3K29j20
6495G6J03k99K10j87j25M43k35O1N1l6j8J98l86J65k01K92k34M19l45N9j02jO7
6518b5M5K11l03J96L7k57N3p7J05j84j32M02q3p9J93J27J0l48L60m29J63M3J67
6541A95n08L29J74m10J40j81M61o6j28k30K31P5kq9J21Jj57k49K67o3L57k65J11
$$ plain form
6564 114 48 30 -177 -80 -19 -145 50 -25 88 116 234 18 71 -29 -20 -105 72 209 1 -36 -237 97 -73 -205
6588 -205 276 -40 89 -244 163 -129 -129 18 226 -58 206 -142 -305 1 -98 -210 170 69 -75 -20 -62 -48
6610 -48 -85 -146 -156 -109 92 -70 -17 -53 68 -169 149 -14 52 -236 -78 48 84 35 146 -186 -283 300 -332 -244
6634 -244 -14 -243 -363 -97 -78 69 162 -65 -134 -110 -47 90 -223 216 278 295 -189 147 181 -26 -134 -27 -122
6657 -122 133 76 -350 -255 -364 -248 98 -3 -19 -225 -179 267 -342 -255 344 -165 121 -171 -7 230 -171 126
6679 126 115 256 197 167 -21 55 -101 189 165 43 -405 149 -361 -94 -68 102 -46 -325 -87 169 -223 77
6701 77 266 -412 -139 87 -182 -226 260 149 87 -72 189 -247 -396 40 32 97 57 -131 154 -119 -51 154 81
6724 81 87 -49 -422 83 141 89 -54 94 29 39 -240 -387 -139 -197 -89 -180 82 -188 129 334 -6 332 46
$$ packed form
6564A14o6j8k07R7O1j26J95p5J13K8J18k16N3j00Rq5J77J37k08l7k01L34j70j32
6588b05M81l16J29l33M07k92%J47K08k84K64l48j63L06r9j12L80j01j44N5m2J4
6610d8l7o1j0M7K01j62N3l6J21k37L18j63O6k88J58J26L6m9J11l32r7N83o32Q8
6634b44K30k29j20K66J9J47R3k27o9K4O3J37l13M39O2J7m84L36L4k07j08J07r5
6657a22K55n7m26R5j09J16L46j01j6k06M6M46o09Q7N99n09K86k92J64K37m01K97
6679A26j1J41n9l0j88P6j56K90k4j22m48N54n10K67K6J70j48k79K38K56l92L00
6701G7J89o78K73K26k69m4M86j11o2j59K61m36j49M36qO5m0j88K85k73O8K05p3
6724H1Oj36l73N05N8n2j43J48o5J0k79j47K48n8J08r1K62k70L17K05l40L38k86
$$ plain form
6747 46 -52 130 29 -105 143 159 126 114 -194 217 108 260 -209 50 118 49 -103 25 88 -19 55 169 228
6770 228 -106 93 147 -125 279 -5 170 -54 -208 77 -502 17 -98 -195 154 -147 267 144 -9 -152 -98
6791 -98 263 -32 198 31 -157 -91 -59 -173 -81 -43 -27 76 -147 263 85 -128 -79 -214 140 59 -146 81 269
6814 269 -266 -45 132 -216 -32 -132 119 -8 200 -199 -359 247 10 -102 15 40 -14 -173 -148 -56 -42 26
6836 26 73 117 -140 -16 -34 -8 -233 318 101 75 128 105 -59 4 -298 260 240 -188 -179 -80 83 -154 -4 43 187
6861 187 160 -40 87 -31 208 -85 -99 183 -154 -120 -255 -173 9 -2 -26 -135 390 -103 -289 77 113 94 -275
6884 -275 162 158 207 -74 -299 106 411 2 421 -104 48 -367 -184 -5 -60 118 -63 -427 -265 -307 -71 4
6906 4 68 393 59 -321 6 -75 -166 -205 307 3 -72 -254 30 242 -28 35 54 -121 -297 -50 104 19 54 38
$$ packed form
6747D6r8J82j01j34K48J6l3j2l08M11j09J52m69K59O8o9j52J28O3j07P4J14N9
6770B28l34J99N4k72M04k84J75k24j54K85n79N19j15r7L49l01M14j23j53j43N4
6791i8L61k95K30j67j88O6L2j14R2L8J6J03k23M10j78k13M9j35L54q1k05K27J88
6814B69n35K21J77l48J84j00K51j27K08l99j60O06k37j12J17K5n4j59K5R2J4O8
6836B6M7M4k57J24j8K6k25N51k17k6N3k3j64O3l02N58k0m28RR9J63k37J50M7J44
6861A87k7k00J27j18K39k93j4K82l37L4j35Q2J82j1k4j09N25m93j86L66L6j9l69
6884b75M37mM9k81k25M05L05m09M19n25J52m15J83J79n5J78j81l64J62m2K36P5
6906DO4L25l34l80L27q1r1l9N12l04p5j82K84K12k70O3J9j75j76K47J54q5L5j6
$$ plain form
6930 38 -86 76 -232 -275 114 -126 -222 171 -152 64 -187 -24 136 -15 -250 -191 275 -44 -206 -216 224 32
6952 32 -157 80 -398 -72 -90 -106 29 123 156 242 -340 59 218 -166 -275 -262 148 41 161 -335 -195 164
6974 164 52 -50 44 121 -167 270 -121 13 224 234 166 189 128 -178 -154 -101 159 -128 -143 255 122 17 50
6997 50 -62 184 36 48 158 76 -107 -85 -89 163 38 201 58 51 24 58 -15 175 -370 -243 -60 103 -140 223
7021 223 202 -29 -247 280 45 -92 298 -144 448 103 -225 -148 -432 -1 -164 -74 319 114 -40 58 198
7042 198 -24 395 7 -8 -381 -52 -47 -102 -128 231 38 23 17 175 139 121 -4 101 74 226 -181 -133 176 -60
7066 -60 -78 320 -73 -366 -214 310 -2 -173 153 117 257 81 28 -28 -20 -65 -196 -180 -123 47 -155 11 100 -126
7090 -126 -12 -180 -53 27 -151 38 -135 75 80 -23 88 287 -263 68 188 113 59 -396 102 -134 -57 64
$$ packed form
6930C8j24J62l08m3L89k40r6L93l23K16k51J63J60j51k35N9M66l19j62j0M40j92
6952C2j89K37m78L26j8j6J35R4L3Q6n82L99J59l84j09J3M10j07J20m96J40L59
6974A64j12j02R4P7k88M37l91J34K11J0o8K3o1l06K4N3K60k87j5L98j33j05L3
6997E0j12K46j48J2J10q2j83K2mK52j25J63j43pk7L4p3J90n45J27J83J63k43L63
7021B23k1k31k18N27k35j37L90m42N92l45l28P7k84M31j63R0L93k05j54R8J40
7042A98k22M19l88j5l73L29Nn5k6L59j93j5oJ58l6j8j25J05k7J52m07M8L09k36
7066f0j8L98l93k93J52N24l12j71L26l6J40j76n3n6Qm5j31J6N7J70k02J66Q9k26
7090a26J14j68J27Q0j78J89j73K10Nj03J11J99n50L31J20p5n4m55M98k36P7J21
$$ plain form
7112 64 173 23 169 45 50 -358 36 -128 -140 36 128 18 225 192 38 140 88 -194 182 73 -35 114
7134 114 -95 169 130 175 43 131 104 153 20 4 15 -154 186 -108 -8 149 116 -63 -54 -41 70 37 42 -72 -1
7159 -1 4 199 34 206 -200 107 99 -122 109 -202 155 44 -165 104 -341 313 228 -12 351 -137 -237 -333 163
7182 163 -160 -227 155 331 20 313 250 204 76 54 74 137 184 -74 53 119 98 33 158 -57 67 -66 151
7205 151 -92 101 181 -302 104 -108 -64 -436 156 -15 -1 -53 -110 -87 382 246 371 -38 -229 169 -110 203
7227 203 410 113 -401 -131 22 174 30 269 -220 -113 219 75 -2 115 -114 -184 -32 -138 -230 -206 -90
7248 -90 77 77 -57 270 21 65 -3 159 -297 144 32 -237 -124 64 -377 103 -92 -220 -312 71 40 74 267
7271 267 -36 103 157 26 -107 -284 220 11 111 122 173 -139 202 89 -85 133 31 173 -92 -316 -31
$$ packed form
7112F4J09j50J46j24Nm08L94j64j2J76R2j10K07l3j54J02n2k82L76j09j08J49
7134A14k09K64l9M5j32Q8k7M9j33j6J1j69L40k94J00J57l3j79RJ3J11l3Nj14P1
7159aNJ95j65J72m06L07qk21K31l11L57j11k09K69m45O54q5k40L63m88j00r6M96
7182A63l23o7L82J76l11K93o3m6j28k2K0O3M7k58J27O6k1o5J25k15J24j33K17
7205A51k43J93Q0m83M06k12M4l72N92j71J4n2n7K3M69j36J25m09j91L98k79L13
7227B03K07k97n14K70J53J52j44K39m89J07L32j44p7J17k29p0J52j06r2K4J16
7248i0J67%j34L27k49M4o8J62m56M41j12k69J13J88m41M80j95j28r2L83l1L4J93
7271B67l03J39N4j31j33j77N04k09J00J1N1l12L41j13j74K18j02J42k65k24K85
$$ plain form
7292 -31 -84 -126 88 -82 -67 200 101 66 316 54 -120 -210 12 13 140 -21 297 -324 -10 31 26 225 157 -2
7316 -2 29 348 -87 29 -255 77 -282 274 309 281 182 2 -231 -282 -137 121 -46 84 1 79 -37 -8 3 1
7340 1 143 -19 -386 -178 -125 45 -219 101 47 59 -180 -85 -14 -304 7 70 96 -310 -21 -222 39 8 -30 -102
7364 -102 321 -150 -215 -149 19 -142 87 10 -86 -151 -54 -143 49 -168 152 -162 81 192 96 -195 137 197 137
7387 137 119 72 -166 13 295 111 -182 -28 -22 138 310 -308 -20 143 17 -28 -72 -8 -82 -277 55 180 37
7410 37 285 -79 -155 66 -3 -252 -37 303 -348 -53 297 107 -165 30 -71 -63 237 349 316 8 -94 116
7432 116 0 26 -21 143 20 121 15 -15 -213 77 -165 4 -40 -338 -87 135 18 -199 108 87 -155 -361
7454 -361 -13 -388 -148 150 74 -319 98 -125 -46 107 229 -142 -364 -242 99 211 -6 -68 -287 -222 139
$$ packed form
7292c1n3m2K14j70J5K67r9l5K50k62j74r0K22JJ27j61L18o21L14M1nJ99o8j59
7316bL1L19m35J16k84L32l59N56L5k8r9j80k33n1J45K58j67J30q3P8j16K9J1k
7340AJ42j62l67K08N3J70k64L20n4J2k39R5P1k90L11O3K6m06K89k01K61l1l8p2
7364a02M23m71o5O6J68j61K29p7r6o5R7q9J92k17L20l14K43J11r6k91L32O0o0
7387A37j8m7k38J79K82j84k93J54OJ60J72o18K88J63j26m5m4O4p4j95L32J25j43
7410C7K48l64p6K21o9k49K15L40o51K95L50j90k72J95j01QL00J12l3l08j02K10
7432A16j16K6m7J64j23J01j06l0j98K90k42J69m4k98K51K22j17k17L07k1k42k06
7454c61L48l75K40K98p6l93M17k23P9J53J22l71k22J22L41J12k17o2k19O5L61
$$ plain form
7475 139 207 -55 34 55 207 74 4 -372 -229 298 245 -286 185 -25 -47 -22 -15 -35 230 -114 -88 46 144 174
7499 174 -231 13 -90 15 -59 150 -14 -457 -178 -109 -282 48 142 -19 93 71 -179 -174 138 153 168 -60 -12
7522 -12 -36 158 176 368 -9 261 76 -248 -187 137 -102 -239 -20 -199 11 437 362 -251 153 111 -8 92
7544 92 -211 -50 72 -309 -110 -10 9 270 -275 65 23 64 75 58 73 262 241 465 102 -173 541 -188 -123
7567 -123 33 75 95 263 11 6 -158 12 190 -150 -22 166 -149 -269 308 -98 172 -92 289 3 -66 -38
7589 -38 -207 -147 232 289 -141 521 119 -100 -23 241 -108 44 192 -340 -58 133 33 -22 10 -81 -14 202 394
7612 394 -43 -136 18 -55 -105 185 32 -69 250 297 152 204 53 78 -173 -37 187 -408 167 152 -243 43
7634 43 182 156 -1 157 -102 -170 118 199 -66 -37 142 100 -66 -140 183 -257 90 -16 -115 -222 161 -1 -275
$$ packed form
7475A39O8k62Q9K1J52j33p0l76J43N27n3n31M71k10k2K5Pk0K65l44K6J34R8L0
7499A74m05K44j03J05p4K09j64m43K79O9j73L30R4j61J12k2k50NL12J5J5k28M8
7522a2k4J94J8J92l77K70j85l24O1L24k39j37K19j79K10M26p5o13M04m2j19J00
7544I2l03J61J22l81J99J00J9K61n45L40m2M1J1j7J5J89k1K24l63k75P14p29O5
7567a23J56M2K0J68k52nj64J70J78l40J28J88l15j20N77m06K70k64L81k86o9K8
7589c8j69O0L79N7m30O62m02k19P7K64l49J52J48n32K82J91j00n5L2r1O7K16J92
7612C94m37r3J54p3n0K90j53j01L19M7j45N2j51K5k51J36K24n95N75j5l95K86
7634D3J39k6j57J58k59o8K88Q1k65K9J79m2j66p4L23m40L47j06r9j07L83j62k74
$$ plain form
7657 -275 -73 92 -8 -25 162 -115 -206 201 81 -161 275 -195 -213 -93 150 -201 -40 37 102 10 -3 15 74
7680 74 -72 118 -13 122 117 13 308 12 214 170 -192 -158 91 245 202 71 7 122 121 -140 -142 -86 -122 -121 29
7705 29 276 23 221 -52 -226 95 98 -16 -51 78 -8 -31 -140 21 -23 505 158 11 -91 108 48 -231 168
7728 168 -114 16 -170 -251 -204 28 -104 -203 -142 127 -31 195 39 -87 112 21 106 87 -91 -110 130 -90 22
7751 22 170 -15 -25 396 56 -173 -131 222 149 -43 297 -17 -169 -113 -120 -139 -208 106 -300 -142 62 -125 -105
7774 -105 -317 -120 142 -102 204 -82 333 327 -86 -50 -130 68 104 31 136 -134 -161 -56 -13 -323 -6 -11 54 157
7798 157 169 -123 -276 -96 35 -99 258 -11 -9 -69 71 144 -395 195 -44 -261 -79 -31 -101 81 264 -172
7820 -172 -63 -3 7 -193 -254 -17 71 63 72 -113 13 84 165 -164 -35 198 191 35 137 -100 34 49 75 -126 254
$$ packed form
7657b75K02J65j00j7J87k77r1M07j20k42M36m70j8J20K43l51J61P7O5r2j3J8N9
7680G4j46J90j31J35nj04K95k96K02m4l62L4K49J54m3j31o4J15jk61kN6l6JJ50
7705B9K47k53J98k73j74L21Lj14l5J29q6k3j09J61m4N28l47j47j02J99o0k79L99
7728A68k82J30j86q1M7K32j32r9O1K69j58K26j56j26J99r1Q5j9j78j9K40k20J12
7751B2J48j85j0M21l40k29M2L53p3j92L40l14j52N6pj9o9L14m06J58K04j87K0
7774a05k12J97K62k44L06k86M15om13L6q0J98L6p3J05k70k7J05M3l10L17nO5J03
7798A57J2k92j53J80J31j34L57k69Ko0J40P3n39N90k39k17J82M8p0J82J83m36
7820a72J09O0J0k00o1K37Q8qRj85J26P1Q1l29J29K33pj56J02k37J34J5K6k01L80
$$ plain form
7845 254 -3 -39 -241 142 161 -180 393 -8 -56 74 -79 183 24 -172 -96 187 344 46 -219 126 53 -152
7867 -152 17 263 -135 -20 -36 254 -267 -287 125 -145 -224 224 -18 -220 -170 81 -18 -61 214 312 96 142 54
7890 54 -159 11 -234 -349 -33 154 20 79 -163 15 7 159 64 120 221 52 -205 -150 382 179 -146 185
7912 185 170 -175 117 301 -99 -121 272 330 49 175 -305 -80 -46 314 -59 -255 181 17 -113 51 102 -73
7934 -73 135 -44 27 -208 35 3 -230 -124 156 -112 -183 -60 -402 -175 42 -96 166 70 186 -217 -291 -33
7956 -33 -4 -532 -83 281 -220 -35 146 -160 -55 -184 75 -62 37 -62 -88 -235 45 -130 67 223 9 -225
7978 -225 92 -278 -143 20 337 -291 -216 21 -84 -229 225 140 2 -57 68 123 -148 130 -331 -425 33 83
8000 83 128 227 108 -17 -29 163 155 206 -40 19 -139 252 294 -209 28 429 40 -129 -173 171 4 28 258 -217
$$ packed form
7845B54k57l6k02L83J9l41N73m01m8J30j53K62j59j96P6K83J57k98k65L45p3k05
7867a52J69K46l98J15j6K90n21k0M12k70p9M48k42k02N0K51r9m3K75R8k16M6q8
7890E4k13J70k45j15L16J87j34N9k42J78qJ52r5N6J01j69k57N5N32k03l25L31
7912A85j5l45K92J84m00k2L93N8k81J26m80K25L4L60l73j96M36j64j30J64N1j75
7934g3K08j79P1k35K43l2k33J06K80k68p1J23l42K27K17j38K62r6J16m03p4K58
7956c3K9n28M49L64n01J85J81l06J05j29K59j37R9r9k6j47K80j75J97J56k14k34
7978b25L17l70J35J63L17o28P5K37j05j45M54q5j38n9J25N5k71K78m61r4M58N0
8000H3M5R9j19j25j2J92qN1k46N9j58L91M2n03K37M01l89j69m4L44j67K4K30m75
$$ plain form
8024 -217 191 -34 -15 -130 44 112 -338 2 -144 -153 -83 69 -218 34 165 23 209 93 333 92 -122 155
8046 155 432 157 -227 114 95 -211 235 -64 330 -179 29 -209 -2 -292 34 -222 78 -257 180 233 -69
8067 -69 -384 -50 10 71 290 130 75 -24 340 -40 191 -40 -84 28 -182 257 1 -56 23 95 122 46 308 -83
8091 -83 -276 78 -124 -139 -36 1 -139 -53 47 -125 78 265 -23 -81 96 70 153 -167 127 -49 -101 118 222
8114 222 106 7 239 45 121 0 -177 65 97 124 -43 127 243 146 -381 89 -123 153 -190 -181 -255 -57 54
8137 54 -16 -66 -27 -11 105 33 80 32 -32 -107 -40 -48 364 -328 -16 470 135 -116 49 -248 -148 243 182 44 38
8162 38 91 117 -6 -64 123 -86 91 -72 -23 -40 24 -222 291 140 -105 -233 -1 75 -246 -22 -32 -69 -45 -275
8186 -275 -140 -27 -233 64 -363
$$ packed form
8024b17M08k25J9j15J74O8m50L40j46rP0J52k87K52J31j42J86j16K40k41k14K77
8046A55K77k75l84L41j9l06M46k99L94n09K08k38K07k90L26k56L00l35M37N3l02
8067f9l15L34O0O1K19j60n5r9L64l80K31k31m4J12k10M39k56n7P9P2K7p6K62l91
8091h3j93L54k02j5J03L7j40Q6J00j72K03J87k88n8J77k6Q3l20K94j76n2K19J04
8114B22j16r9K32j94P6j21j77K42L2K7j67J70J16r7n27M70k12K76l43Rp4J98J11
8137E4p0n0L9J6J16p2M7m8o4p5O7qM12o92L12M86l35k51J65k97J00L91o1j38o
8162C8N3K6j23n8J87k09J77j63M9j7O4k46N13j51k45j28K32P6l21K24j0l7K4k30
8186b75J35J13k06K97m27
8191c63
$$ Imaginary data points
##PAGE= N=2
##DATA TABLE= (X++(I..I)), XYDATA
$$ plain form
0 0 0 0 0 0 0 0 0 0 0 0 0 3 -8 8 -8 8 -9 15 -16 17 -22 24 -27 33 -37 43 -48 55 -62 68 -79 89 -98 109 -122
35 -122 137 -150 167 -185 206 -227 252 -279 309 -342 380 -423 473 -529 594 -673 768 -888 1040
54 1040 -1243 1527 -1954 2665 -4073 7882 -37190 -118767 -25082 26670 4349 -12063 -26189
67 -26189 -44430 16990 62207 -3930 -50288 7162 29275 -1652 4954 7150 -19252 12569 46164
80 46164 -3551 -20837 46284 51906 -2279 6928 36997 27784 44768 55776 -875 -12590 60383
93 60383 66764 3627 -731 18166 4778 25810 46721 -7245 -32437 25016 36945 -3787 9497
106 9497 26437 -7899 -1006 37047 14634 -5411 23052 7041 -30203 9842 39875 -13720
118 -13720 -36517 -3407 -6319 -10158 16986 -10355 -55855 -9097 40143 -273 -25558 1391
$$ packed form
0@%%%%%%%%%%%Lj1J6j6J6j7K4l1L3l9M6n1O0p0Q0r1J03j17J30j47J68j87K07k31
35a22K59k87L17l52L91m33M79n31N88o51P22q03Q96j002J123j267J441j656J928
54A040k283K770l481M619o738J1955m5072q1577R3685N1752k2321j6412j4126
67b6189j8241O1420M5217o6137m6358N7450K2113l0927O606K196k6402L1821L3595
80D6164m9715j7286O7121N622n4185R207L0069r213J6984J1008n6651j1715P2973
93F0383O381o3137m358J8897j3388K1032K0911n3966k5192N7453J1929m0732J3284
106I497J6940l4336O893L8053k2413k0045K8463j6011l7244M0045L0033n3595
118a3720k2797L3110k912l839K7144k7341m5500M6758M9240m0416k5285K6949
$$ plain form
130 1391 514 30 31749 12668 -28595 10255 43814 -4701 -20997 22520 19912 -2830 13238
143 13238 3500 -15969 31001 55629 -6466 -22329 40172 56424 31385 30934 16143 5700 62922
156 62922 87883 16611 -11516 45331 61910 37222 38001 22127 2271 46847 73454 18034
168 18034 -321 51172 56430 27957 40706 43081 25517 53057 67088 16881 12234 66673 57316
181 57316 9658 19504 34011 21033 37417 40611 -7817 -7491 50459 43019 -2885 9431 26877
194 26877 14249 31055 41169 -774 -2400 46496 32686 -9631 11489 29983 2577 3738
206 3738 17103 -8502 -5603 31117 7982 -30089 5552 34486 3820 -3092 13997 266 9936
219 9936 43508 14191 -25502 13267 44434 8477 -5264 11311 32 3876 30485 4084
$$ packed form
130A391q77m84L1719j9081m1263L8850L3559m8515j6296M3517k608k2742J6068
143A3238r738j9469M6970K4628o2095j5863O2501J6252k5039m51j4791j0443N7222
156F2922K4961p1272k8127N6847J6579k4688P79j5874j9856M4576K6607n5420
168A8034j8355N1493N258k8473J2749K375j7564K7540J4031n0207m647N4439r357
181E7316m7658R846J4507j2978J6384L194m8428L26N7950p440m5904J2316J7446
194B6877j2628J6806J0114m1943j626M8896j3810m2317K1120J8494k7406J161
206C738J3365k5605K899L6720k3135l8071L5641K8934l0666o912J7089j3731R670
219I936L3572k9317l9693L8769L1167l5957j3741J6575j1279L844K6609k6401
$$ plain form
231 4084 -28360 12283 38191 -2058 -9984 19966 14579 11433 31602 10757 -12213 30049 49177
244 49177 1170 -9863 25070 21503 8698 18974 -226 -17229 23716 37430 -12695 -18741
256 -18741 23323 20969 4493 17291 6979 -6137 29866 39637 -8230 -9897 32702 23794 -2473
269 -2473 8063 4574 -7369 19525 21698 -23165 -17298 28005 15236 -14426 1923 8995 -85
282 -85 20736 21922 -16242 -5260 38354 19990 -15331 2657 13498 127 11748 9994 -24130
295 -24130 -10703 29933 5782 -28870 -2641 15225 -826 5852 8926 -15587 35 36050
307 36050 8523 -24324 5012 22532 -1362 -1999 2970 -17753 -5311 22586 -8509 -37784 -1644
320 -1644 16974 -12286 -14481 -1562 -12750 -2327 20548 -7960 -31193 7514 22690 -12885
$$ packed form
231D084l2444M0643K5908m0249p926K9950n387l146K0169k0845k2970M2262J9128
244D9177m8007j1033L4933l567j2805J0276j9200j7003M0945J3714n0125o046
256a8741M2064k354j6476J2798j0312j3116L6003R771m7867j667M2599q908k6267
269b473J0536l489j1943K6894K173m4863N867M5303j2769k9662J6349P072r080
282h5K0821J186l8164J0982M3614j8364l5321J7988J0841j3371J1621j754l4124
295b4130J3427M0636k4151l4652K6229J7866j6051O678L074k4513J5622L6015
307C6050k7527l2847K9336J7520k3894o37M969k0723J2442K7897l1095k9275L6140
320a644J8618k9260k195J2919j1188J0423K2875k8508k3233L8707J5176l5575
$$ plain form
332 -12885 -17399 -40 -9862 -7114 7597 -19958 -38089 1013 12129 -27950 -29193 -2640 -8317
345 -8317 -10865 2344 -17470 -27456 11453 17449 -24243 -22540 8426 -39 -10675 -1774 -17824
358 -17824 -26168 7975 7788 -34402 -27855 8148 -1704 -17189 -6293 -12147 -15616 14549 12061 -26382
372 -26382 -14447 22855 7602 -14024 -1444 -3477 -9874 11587 6268 -30707 -16523 19431 -70
385 -70 -23383 -5246 -703 -7823 10051 6393 -22454 -4059 29060 5037 -18226 4803 11160
398 11160 -3192 6597 3441 -21249 -4335 22409 -6389 -28790 -251 9675 -9020 -2410 -125
411 -125 -16273 1941 25248 -4276 -22823 10765 19713 -4923 -2590 3292 -10555 1766 17432
424 17432 -12557 -28025 7114 13152 -16644 -14580 82 -7890 851 12712 -13555 -21084 17035
$$ packed form
332a2885m514J7359r822K748J4711k7555j8131L9102J1116m0079j243K6553n677
345h317k548J3209j9814r986L8909N996m1692J703L0966q465j0636Q901j6050
358a7824q344L4143j87m2190O547L6003r852j5485J0896n854l469L0165k488l8443
372b6382J1935L7302j5253k1626J2580k033o397K1461n319l6975J4184L5954j9501
385g0k3313J8137M543p120J7874l658k8847J8395L3119k4023k3263K3029O357
398A1160j4352R789l156k4690J6914K6744k8798k2401K8539R926j8695O610K285
411a25j6148J8214K3307k9524j8547L3588Q948k4636K333N882j3847J2321J5666
424A7432k9989j5468L5139O038k9796K064J4662p972Q741J1861k6267p529L8119
$$ plain form
437 17035 20477 -14376 -11085 8518 438 1724 7996 -16633 -22059 13231 11779 -25424 -19524 4172
451 4172 -3710 -6595 1401 -15806 -17442 16455 12740 -22150 -11230 15753 3504 -5978 2547 -9646
465 -9646 -11902 14367 6113 -28679 -14100 13507 -3163 -16010 -2797 -8313 -9849 14067 5896
478 5896 -23467 -3813 24938 4463 -10853 5779 4473 -545 15244 5364 -20288 -585 23720
491 23720 -1864 -17683 3734 5979 -2519 9813 4354 -14460 8131 30074 2234 -11576 15563
504 15563 19999 5542 11586 7407 -6219 13845 28166 -4667 -17816 13620 18332 -2095 980
517 980 1963 -6727 13387 26060 -5578 -15085 19577 24418 871 3628 8126 -372 13165 21639
531 21639 -8617 -15972 16515 15039 -12143 -6709 4079 -4420 3621 10943 -12513 -13592 19775
$$ packed form
437A7035L442l4853L291J9603q080J286O272k4629n426L5290j452l7203N900K3696
451D172p882k885P996j7207j636L3897l715l4890J0920K6983j2249r482Q525j2193
465i646k256K6269q254l4792J4579K7607j6670j2847J3213n516j536K3916q171
478E896k9363J9654K8751k0475j5316J6632j306n018J5789r880k5652J9703K4305
491B3720k5584j5819K1417K245q498J2332n459j8814K2591K1943k7840j3810K7139
504A5563M436j4457O044m179j3626K0064J4321l2833j3149L1436M712k0427L075
517I80R83q690K0114J2673l1638r507L4662M841k3547K757M498q498J3537Q474
531B1639l0256p355L2487j476k7182N434J0788q499Q041P322k3456j079L3367
$$ plain form
544 19775 16060 -13183 -4013 12594 3416 6392 11151 -10578 -11184 19154 11534 -19032 -8476 8715
558 8715 -2999 -3086 5999 -9501 -10669 16130 9438 -14585 2073 20035 2173 -1512 12169 3522
572 3522 1357 18632 6414 -15999 5597 23417 -1137 -11226 5010 2767 1812 15833 2792
585 2792 -16383 8659 28668 4070 -6207 11716 11190 6590 17885 6792 -10782 11038 24558
598 24558 -4112 -13126 10571 9741 -2902 2972 -2610 -10691 12340 21163 -10967 -16295 14822 17764
612 17764 1516 2846 -1921 -7899 14855 21276 -13373 -21056 8888 10631 -7393 -4525 -6808 -14333
626 -14333 4630 12547 -14570 -16710 11927 8701 -10009 -476 5212 -3320 7100 10999 -13134
639 -13134 -10398 17854 8133 -17288 -7402 3739 -3670 2572 4079 -17219 -11851 18603 10183 -13416
$$ packed form
544A9775l715k9243R170J6607r178K976M759k1729o06L0338p620l0566J0556J7191
558H715j1714q7R085j5500j168K6799o692k4023J6658J7962j7862l685J3681q647
572C522k165J7275j2218k2413K1596J7820k4554j0089J6236k243r55J4021j3041
585B792j9175K5042K0009k4598j0277J7923n26m600J1295j1093j7574K1820J3520
598B4558k8670r014K3697q30j2643N874n582q081K3031Q823l2130n328L1117K942
612A7764j6248J330m767n978K2754O421l4649p683K9944J743j8024K868k283p525
626a4333J8963P917k7117k140K8637l226j8710R533N688q532J0420L899k4133
639a3134K736K8252r721k5421R886J1141p409O242J507k1298N368L0454q420k3599
$$ plain form
653 -13416 -1665 10289 1252 7075 12780 -5423 -4366 18857 7790 -12675 2935 13187 -4724
666 -4724 -4725 4987 -4524 -2191 13967 -894 -17755 6253 21501 23 -5516 6391 1913 5740
680 5740 18928 1219 -17229 6139 19524 -3510 -10489 1621 -3106 -3599 7954 -4918 -18354
693 -18354 4391 14628 -9988 -11390 8659 4999 -1992 5143 -3220 -11014 11377 15366 -14730
706 -14730 -16746 6714 3998 -7110 -3281 -11556 -17006 6236 10824 -17753 -18219 7679 5136 -6530
720 -6530 452 -2944 -9819 7940 10268 -14889 -11909 11197 1443 -15269 -5677 -3861 -10799 976
734 976 320 -21943 -13935 12716 833 -18643 -6240 1594 -4445 3912 2694 -17515 -9010 14774
748 14774 519 -19816 -6722 222 -9662 -4457 -3762 -19893 -11455 9159 -6185 -23400 -4262
$$ packed form
653a3416J1751J1954r037N823N705j8203J057K3223j1067k0465J5610J0252j7911
666d724jR712r511K333J6158j4861j6861K4008J5248k1478n539J1907m478L827
680E740J3188j7709j8448K3368J3385k3034o979J2110m727m93J1553j2872j3436
693a8354K2745J0237k4616j402K0049l660o991P135q363p794K2391L989l0096
706a4730k016K3460k716j1108L829q275n450K3242M588k8577m66K5898k543j1666
720f530O982l396o875J7759K328k5157K980K3106r754j6712R592J816o938J1775
734I76o56k2263Q008K6651j1883j9476J2403P834o039Q357j218k0209Q505K3784
748A4774j4255k0335J3094O944r884N205O95j6131Q438K0614j5344j7215J9138
$$ plain form
761 -4262 5962 -6841 -5425 -899 -11040 -2065 13550 -4853 -20919 250 10008 -7880 -9819
774 -9819 -3879 -11609 -5136 8672 -8872 -22418 1061 11488 -7350 -8462 2688 -1972 1961
787 1961 12542 -3226 -12907 10173 16112 -7636 -8492 6616 363 -966 6203 -6794 -14060 9376
801 9376 13542 -11065 -9182 9601 5136 721 8089 -1261 -6138 15216 15510 -10657 -6342 13593
815 13593 4868 -5532 1932 -4451 -8969 8418 6448 -17836 -10410 11649 2263 -9114 -490 -1920
829 -1920 -4901 10374 7200 -15202 -6954 14537 1194 -12994 -2551 -2047 -8453 1337 -1701 -20269
843 -20269 -9828 10106 -5019 -18594 -3364 1343 -5978 1596 267 -14466 -2221 15042 -2575
856 -2575 -16586 380 5495 -5783 -2465 -2174 -14478 -4110 10420 -7580 -18098 2150 7097
$$ packed form
761d262J0224j2803J416M526j0141Q975J5615j8403j6066K1169R758j7888j939
774i819N940p730O473J3808j7544j3546K3479J0427j8838j112J1150m660L933
787A961J0581j5768r681K3080N939k3748q56J5108o253j329P169j2997p266K3436
801I376M166k4607J883J8783m465m415P368r350m877K1354K94k6167M315J9935
815A3593q725j0400P464o383m518J7387j970k4284P426K2059r386j1377Q624j430
829a920k981J5275l174k2402Q248K1491j3343j4188J0443N04o406R790l038j8568
843b0269J0441J9934j5125j3575J5230M707p321P574j329j4733J2245J7263j7617
856b575j4011J6966N115j1278L318K91j2304J0368J4530j8000j0518K0248M947
$$ plain form
869 7097 -6635 -2376 2925 -5193 3395 14709 -3291 -10983 11424 14259 -5129 -3393 5336 -1229
883 -1229 2980 9814 -7670 -13243 11333 12917 -8545 -5076 7673 2509 5434 11730 -3598 -5975
897 -5975 17819 16562 -6975 -2707 11502 4626 2282 6285 -6659 -7610 13878 9587 -14603 -7105
911 -7105 11515 3739 -995 4361 -3545 -3356 17177 11718 -12323 -3474 15485 5658 -3026 2503
925 2503 -4295 -5276 11198 4965 -17116 -6721 11543 356 -8165 1170 -1177 -3582 10576 6305
939 6305 -12192 331 16788 2085 -7377 4494 2672 -2892 6210 2327 -13214 -1808 12137
952 12137 -4493 -12910 3580 3964 -4553 3565 3308 -7929 3915 15039 -2638 -8843 9847 9300
966 9300 -4477 1218 2574 -7060 2417 9715 -9587 -13843 7967 6591 -10022 -3513 2450 -3871
$$ packed form
869G097j3732M259N301q118Q588J1314j8000p692K2407K835j9388J736Q729o565
883a229M209O834j7484n573K4576J584k1462L469J2749n164K925O296j5328k377
897e975K3794j257k3537M268J4209o876k344M003j2944r51K1488m291k4190P498
911g105J8620p776m734N356p906J89K0533n459k4041Q849J8959r827q684N529
925B503o798r81J6474o233k2081J0395J8264j1187q521R335k347k405J4158m271
939F305j8497J2523J6457j4703r462J1871j822n564R102l883j5541J1406J3945
952A2137j6630q417J6490L84q517Q118k57j1237J1844J1124j7677o205J8690n47
966I300j3777N695J356r634R477P298j9302m256K1810j376j6613O509N963o321
$$ plain form
980 -3871 3613 9172 -8154 -8837 13943 10225 -9614 -3592 5713 -1141 1548 4085 -12394 -11489 11272
995 11272 5463 -16562 -8815 4257 -1368 -131 2707 -10524 -7405 14755 8224 -13387 -4499 9131
1009 9131 964 -763 2670 -9486 -7679 11163 2771 -17325 -6289 7566 -2469 -5427 702
1022 702 -6251 -4034 12424 3999 -13948 -135 14199 1537 -4076 3322 -2420 -2138 10622 1220
1036 1220 -15741 -1275 11439 -3842 -9140 1939 -1647 -3562 7485 1235 -10823 4147 14624
1049 14624 -2979 -6397 8036 5312 -1923 5358 235 -9333 4731 11305 -8929 -11893 6358
1062 6358 4051 -5622 415 -1086 -7300 6797 12212 -7528 -8621 11470 8550 -3830 1678 2003
1076 2003 -4567 5651 8832 -10715 -10059 10179 4357 -10391 -3268 1214 -4235 3835 6359 -9957
$$ packed form
980c871P484N559j7326o83K2780l718j9839O022R305o854K689K537j6479R05K2761
995A1272n809k2025P747J3072n625J237K838j3231L119K2160o531k1611Q888J3630
1009I131q167j727L433j2156J807J8842q392k0096J1036J3855j0035k958O129
1022G02o953K217J6458q425j7947J3813J4334j2662n613P398n742K82J2760r402
1036A220j6961J4466J2714j5281n298J1079l586j915J1047o250j2058J4970J0477
1049A4624j7603l418J4433k724p235P281n123r568J4064O574k0234k964J8251
1062F358k307r673O037j501o214J4097N415j9740j093K0091k920j2380N508L25
1076B003o570J0218L181j9547O56K0238n822j4748P123M482n449Q070K524j6316
$$ plain form
1090 -9957 -6728 14263 7160 -9168 -482 6482 -544 3820 5039 -9924 -6684 11519 2938 -14196
1104 -14196 -4336 3964 -4131 -976 2286 -9815 -5350 12100 3136 -12277 773 9328 -1735
1117 -1735 -958 4189 -5590 -3308 10189 -873 -14614 -222 7726 -6305 -7280 652 -5386 -2983
1131 -2983 8385 -2506 -13544 4221 12849 -3689 -5598 4785 251 210 8390 -2327 -12402
1144 -12402 4950 10768 -7752 -9389 3802 -741 -3335 4293 -2814 -9711 7148 11584 -7354
1157 -7354 -5624 10436 5610 -1031 4970 -407 -5045 10352 10781 -10519 -8330 9674 4586 -4756
1171 -4756 672 -2087 -5819 8630 9852 -9391 -5836 12699 6476 -2938 4697 3420 -2423 8246
1185 8246 8570 -8128 -3826 12086 2165 -9562 860 3428 -3975 2635 3400 -9794 -2355 14690
$$ packed form
1090i957L229K0991p103j6328Q686O964p026M364J219j4963L240J8203q581j7134
1104a4196R860Q300q095L155L262j2101M465J7450q964j5413J3050Q555j1063
1117a735P77N147r779K282J3497j1062j3741J4392P948j4031r75P932o038K403
1131b983J1368j0891j1038J7765Q628j6538j909J0383m534m1Q180j0717j0075
1144a2402J7352N818j8520j637J3191m543k594P628p107o897J6859M436j8938
1157g354J730J6060m826o641O001n377m638J5397M29k1300K189J8004n088r342
1171d756N428k759l732J4449J222j9243L555J8535o223r414P635j277n843J0669
1185H246L24j6698M302J5912r921j1727J0422K568p403O610P65j3194P439J7045
$$ plain form
1199 14690 2991 -9599 2354 7970 1253 5224 4799 -8479 -1239 14144 1799 -11617 836
1212 836 5149 -4359 -244 2104 -8026 -2428 10364 -1216 -10643 5338 9694 -3816 -1275 4646
1226 4646 -1610 2285 10694 -4122 -12540 6017 10507 -6412 -6645 297 -4650 -327 7679 -5925
1240 -5925 -13727 4990 9925 -5604 -4143 4787 -1684 -552 7710 -2321 -9091 6021 6576 -10136
1254 -10136 -6191 5618 -2236 -6346 646 -5806 -8477 6955 4946 -13024 -6850 8847 2051 -3632
1268 -3632 2405 -3155 -5710 8257 6238 -11373 -6236 7233 -1361 -8077 320 -3109 -7508 3308
1282 3308 1903 -11572 -2975 10037 -1842 -9130 3142 4040 -1758 4864 2037 -9839 676 13775
1296 13775 -1164 -12136 7 2941 -2542 3149 -657 -12020 -810 13082 -1316 -10369 3231
$$ packed form
1199A4690j1699j2590J1953N616o717L971m25j3278P240J5383j2345j3416J2453
1212H36M313r508M115K348j0130N598J2792j1580r427J5981M356j3510K541N921
1226D646o256L895Q409j4816q418J8557M490j6919k33O942m947M323Q006j3604
1240e925p802J8717M935j5529J461Q930o471J132Q262j0031o770J5112N55j6712
1254a0136L945J1809p854m110O992o452k671J5432k009j7970O174J5697o796n683
1268c632O037n560k555J3967k019j7611N137J3469q594o716Q397l429m399J0816
1282C308j405j3475Q597J3012j1879p288J2272Q98n798O622k827j1876J0515J3099
1296A3775j4939j0972J2143K934n483N691l806j1363J1210J3892j4398r053J3600
$$ plain form
1309 3231 6034 -1141 4413 3760 -6555 2327 12738 -2358 -9661 5389 6572 -4828 -1839 488
1323 488 -6523 1178 9247 -6768 -12352 6397 8864 -3951 -1956 2141 -3723 3611 11022 -4227
1337 -4227 -10680 6315 7013 -5912 -2883 1495 -6574 -2519 5014 -6643 -10807 4848 3642 -9873
1351 -9873 -2718 5465 -2813 -2596 4247 -4358 -5950 7696 3740 -11935 -4364 5464 -3350 -5883 -68
1366 -68 -7145 -9044 4454 717 -13494 -4342 6158 -3574 -6021 1972 -2167 -5314 5580 1501
1380 1501 -11329 -934 8775 -4816 -9601 662 -1958 -5734 1918 -3492 -14228 -1401 9014
1393 9014 -5061 -10842 825 1150 -2182 4507 -550 -10351 2059 11630 -4308 -10042 2345 1949
1407 1949 -4000 1603 -2056 -10933 898 8363 -6591 -10469 4476 3905 -3881 1804 1147 -5475 5037
$$ packed form
1309C231K803p175N554o53j0315Q882J0411j5096p303J5050J183j1400K989K327
1323D88p011P701Q069j6015n584J8749K467j2815J995M097n864P334P411j5249
1337d227o453J6995O98j2925L029M378q069M055P533j1657m164J5655j206j3515
1351i873P155Q183q278K17O843q605j592J3646l956j5675P571R828q814k533N815
1366f8p077j899J3498l737j4211R152J0500r732k447P993m139l147J0894m079
1380A501j2830J0395R709j3591m785J0263k620l776P652n410j0736J2827J0415
1393I014j4075n781J1667L25l332O689n057r801J2410R571j5938n734J2387l96
1407A949n949N603l659q877J1831P465j4954l878J4945n71p786N685o57o622J0512
$$ plain form
1422 5037 10811 -4991 -7895 7630 6381 -4697 21 476 -5617 2286 7570 -7360 -9015 7044
1436 7044 4688 -6145 -77 3828 -2621 3322 8281 -4265 -4441 10218 5420 -6805 59 5390
1450 5390 -2423 -16 3928 -6326 -6095 8027 2093 -10269 -1366 6628 -1857 -623 4557 -3539
1464 -3539 -2465 10345 3404 -8936 790 8365 -2208 -3339 2359 -4408 -4079 6806 -631 -12245
1478 -12245 -564 7735 -3804 -5419 2360 -1885 -1826 7659 741 -9904 2641 10262 -2957 -5770
1492 -5770 3092 -845 -2736 4460 -2331 -11152 1684 8020 -6188 -7855 3510 617 -2565 4576
1506 4576 78 -7387 4797 10348 -4641 -5639 6468 3040 -3273 2532 -217 -6929 3518 7141
1520 7141 -7804 -7154 6521 2385 -5255 1476 1696 -4197 5331 7917 -5291 -3995 10210 4891
$$ packed form
1422E037N774j5802k904J5525j249j1078M718M55o093P903N284j4930j655J6059
1436G044k356j0833O068L905o449N943M959j2546j76J4659m798j2225O864N331
1450E390p813K407L944j0254K31J4122n934j2362Q903P994q485J234N180q096
1464c539J074J2810o941j2340R726P575j0573j131N698o767L29J0885p437j1614
1478a2245J1681Q299j1539j615P779m245N9R485o918j0645J2545P621j3219k813
1492e770Q862l937j891P196o791q821J2836O336j4208j667J1365k893l182P141
1506D576m498p465J2184N551j4989r98J2107l428o313N805k749o712J0447L623
1520G141j4945O50J3675m136p640O731K20n893R528K586j3208J296J4205n319
$$ plain form
1534 4891 -4507 1691 2994 -2783 3407 4988 -7411 -4660 8888 2354 -7587 715 4050 -1757
1548 -1757 3202 5121 -4569 -653 12235 4072 -6240 3222 7219 -244 2227 4527 -4862 -1592
$$ packed form
1534D891r398O198J303n777O190J581j2399K751J3548o534r941Q302L335n807
1548a757M959J919r690L916J2888q163j0312R462L997p463K471K300r389L270
$$ [...]
8191a02
##END NTUPLES=NMR FID
##END=
